##TITLE=1H_CA-9076xy
 CDCl3
 8 sc, 
 18.10.2022
##JCAMPDX= 6.0         $$ Bruker NMR JCAMP-DX V2.0
##DATA TYPE= NMR SPECTRUM
##DATA CLASS= NTUPLES
##ORIGIN= UXNMR, Bruker Analytische Messtechnik GmbH
##OWNER= root
$$ XWIN-NMR		Version 3.5
$$ Tue Oct 18 13:56:24 2022 Russian Standard Time (UT+4h)  she@DPX200
##.OBSERVE FREQUENCY= 200.1313499994
##.OBSERVE NUCLEUS= ^1H
##.ACQUISITION MODE= SIMULTANEOUS
##.ACQUISITION SCHEME= undefined
##.AVERAGES= 8
##.DIGITISER RES= 18
##SPECTROMETER/DATA SYSTEM= spect
##.PULSE SEQUENCE= zg30
##.SOLVENT NAME= CDCl3
##.SHIFT REFERENCE= (INTERNAL, CDCl3, 0, 15.7337)
##AUDIT TRAIL= $$ (NUMBER, WHEN, WHO, WHERE, WHAT)
$$ ##TITLE= Audit trail, XWIN-NMR		Version 3.5
$$ ##JCAMPDX= 5.01
$$ ##ORIGIN= Bruker BioSpin GmbH
$$ ##OWNER= she
$$ F:/spectra/data/she/nmr/H-F/1/pdata/1/auditp.txt
$$ ##AUDIT TRAIL=  $$ (NUMBER, WHEN, WHO, WHERE, WHAT)
(   1,<2022-10-18 13:55:21.46 +0400>,<she>,<DPX200>,
      <created by zg, POWCHK disabled, PULCHK disabled
       configuration hash MD5:
       00 E9 B6 7A A2 85 ED C7 34 08 36 98 17 FE 4E 26
       data hash MD5: 16K
       B6 22 D8 9C 1E FD E2 BD 8E DB 72 61 9F 52 C0 AD>)
(   2,<2022-10-18 13:55:24.25 +0400>,<she>,<DPX200>,
      <Start of raw data processing
       efp BC_mod = 2 LB = 0.24 FT_mod = 6 PKNL = 1 PHC0 = -18035.74 PHC1 = 11.4007 SI = 16K 
       data hash MD5: 16K
       24 E6 AA 0F 32 0D 4C 7E 31 7E 43 9C 4A 55 7B BD>)
(   3,<2022-10-18 13:55:38.06 +0400>,<she>,<DPX200>,
      <pk PHC0 = 1.198985 PHC1 = -1.2 
       data hash MD5: 16K
       D9 29 6A 7B 06 F2 59 4D 44 B5 76 1D 55 D7 41 61>)
$$ ##END=
$$ 
$$ hash MD5
$$ 83 79 86 5C 81 6B 91 6A A1 F0 E8 B8 AD 63 6B BD
##$RELAX= 
##$RELAX= 
##$RELAX= 
##$RELAX= 
##$RELAX= 
##$RELAX= 
$$ Bruker specific parameters
$$ --------------------------
##$DU= <F:/spectra>
##$EXPNO= 1
##$NAME= <H-F>
##$PROCNO= 1
##$TYPE= <nmr>
##$USER= <she>
##$AMP= (0..31)
100 100 100 100 100 100 100 100 100 100 100 100 100 100 100 100 100 100 
100 100 100 100 100 100 100 100 100 100 100 100 100 100 
##$AQSEQ= 0
##$AQ_mod= 1
##$AUNM= <au_zg>
##$AUTOPOS= <>
##$BF1= 200.13
##$BF2= 200.13
##$BF3= 200.13
##$BF4= 200.13
##$BF5= 200.13
##$BF6= 200.13
##$BF7= 200.13
##$BF8= 200.13
##$BYTORDA= 1
##$CFDGTYP= 0
##$CFRGTYP= 5
##$CHEMSTR= <none>
##$CNST= (0..31)
1 1 145 1 1 1 1 1 1 1 1 1 1 1 1 1 1 1 1 1 1 1 1 1 1 1 1 1 1 1 1 1 
##$CPDPRG= <>
##$CPDPRG1= <>
##$CPDPRG2= <>
##$CPDPRG3= <>
##$CPDPRG4= <mlev>
##$CPDPRG5= <mlev>
##$CPDPRG6= <mlev>
##$CPDPRG7= <mlev>
##$CPDPRG8= <mlev>
##$CPDPRGB= <>
##$CPDPRGT= <>
##$D= (0..31)
0 1.2 0 0 0 0 0 0 0 0.06 0 0.03 0 0 0 0 0.0002 0 0 0 0 0 0 0 0 0 0 0 0 
0 0 0 
##$DATE= 1666086920
##$DBL= (0..7)
120 120 120 120 120 120 120 120 
##$DBP= (0..7)
150 150 150 150 150 150 150 150 
##$DBP07= 0
##$DBPNAM0= <>
##$DBPNAM1= <>
##$DBPNAM2= <>
##$DBPNAM3= <>
##$DBPNAM4= <>
##$DBPNAM5= <>
##$DBPNAM6= <>
##$DBPNAM7= <>
##$DBPOAL= (0..7)
0.5 0.5 0.5 0.5 0.5 0.5 0.5 0.5 
##$DBPOFFS= (0..7)
0 0 0 0 0 0 0 0 
##$DE= 6
##$DECBNUC= <off>
$$ [...]
##$SUBNAM2= <"">
##$SUBNAM3= <"">
##$SUBNAM4= <"">
##$SUBNAM5= <"">
##$SUBNAM6= <"">
##$SUBNAM7= <"">
##$SUBNAM8= <"">
##$SUBNAM9= <"">
##$SW= 18.0517283424941
##$SWIBOX= (0..15)
0 0 2 0 0 0 0 0 0 0 0 0 0 0 0 0 
##$SW_h= 3612.71676300578
##$TD= 16384
##$TD0= 1
##$TE= 0
##$TE2= 300
##$TE3= 300
##$TEG= 300
##$TL= (0..7)
0 120 120 120 120 120 120 120 
##$TP= (0..7)
150 150 150 150 150 150 150 150 
##$TP07= 0
##$TPNAME0= <>
##$TPNAME1= <>
##$TPNAME2= <>
##$TPNAME3= <>
##$TPNAME4= <>
##$TPNAME5= <>
##$TPNAME6= <>
##$TPNAME7= <>
##$TPOAL= (0..7)
0.5 0.5 0.5 0.5 0.5 0.5 0.5 0.5 
##$TPOFFS= (0..7)
0 0 0 0 0 0 0 0 
##$TUNHIN= 0
##$TUNHOUT= 0
##$TUNXOUT= 0
##$USERA1= <user>
##$USERA2= <user>
##$USERA3= <user>
##$USERA4= <user>
##$USERA5= <user>
##$V9= 5
##$VALIST= <valist>
##$VCLIST= <CCCCCCCCCCCCCCC>
##$VD= 0
##$VDLIST= <DDDDDDDDDDDDDDD>
##$VPLIST= <PPPPPPPPPPPPPPP>
##$VTLIST= <TTTTTTTTTTTTTTT>
##$WBST= 1024
##$WBSW= 4
##$XGAIN= (0..3)
0 0 0 0 
##$XL= 0
##$YL= 0
##$YMAX_a= 274261
##$YMIN_a= -256992
##$ZGOPTNS= <>
##$ZL1= 120
##$ZL2= 120
##$ZL3= 120
##$ZL4= 120
##$ABSF1= 0
##$ABSF2= 0
##$ABSG= 0
##$ABSL= 0
##$ALPHA= 0
##$AQORDER= 0
##$ASSFAC= 0
##$ASSFACI= 0
##$ASSFACX= 0
##$ASSWID= 0
##$AUNMP= <proc_1d>
##$AZFE= 0.1
##$AZFW= 0.1
##$BCFW= 0
##$BC_mod= 2
##$BYTORDP= 0
##$COROFFS= 0
##$CY= -3
##$DATMOD= 1
##$DC= 0
##$DFILT= <>
##$DTYPP= 0
##$F1P= 0
##$F2P= 0
##$FCOR= 1
##$FTSIZE= 16384
##$FT_mod= 6
##$GAMMA= 0
##$GB= 0
##$INTBC= 1
##$INTSCL= 3.70164e-10
##$ISEN= 128
##$LB= 0.24
##$LEV0= 0
##$LPBIN= 0
##$MAXI= 10000
##$MC2= 0
##$MEAN= 0
##$ME_mod= 0
##$MI= 1.114404
##$NCOEF= 0
##$NC_proc= -8
##$NLEV= 6
##$NOISF1= 3.799351
##$NOISF2= 2.8
##$NSP= 0
##$NTH_PI= 0
##$NZP= 0
##$OFFSET= 15.73367
##$PC= 1
##$PHC0= -18034.54
##$PHC1= 10.2007
##$PH_mod= 1
##$PKNL= yes
##$PPARMOD= 0
##$PSCAL= 0
##$PSIGN= 0
##$REVERSE= no
##$SF= 200.130007578436
##$SI= 16384
##$SIGF1= 3
##$SIGF2= 2
##$SINO= 5.538805
##$SIOLD= 16384
##$SREGLST= <1H.CDCl3>
##$SSB= 0
##$STSI= 16384
##$STSR= 0
##$SW_p= 3612.71676300578
##$SYMM= 0
##$S_DEV= 0
##$TDeff= 16384
##$TDoff= 0
##$TI= <>
##$TILT= no
##$TM1= 0
##$TM2= 0
##$TOPLEV= 0
##$USERP1= <user>
##$USERP2= <user>
##$USERP3= <user>
##$USERP4= <user>
##$USERP5= <user>
##$WDW= 1
##$XDIM= 16384
##$YMAX_p= 328654328
##$YMIN_p= -2107323
$$ End of Bruker specific parameters
$$ ---------------------------------
##NTUPLES= NMR SPECTRUM
##VAR_NAME=  FREQUENCY,     SPECTRUM/REAL,   SPECTRUM/IMAG
##SYMBOL=    X,             R,               I
##VAR_TYPE=  INDEPENDENT,   DEPENDENT,       DEPENDENT
##VAR_FORM=  AFFN,          ASDF,            ASDF
##VAR_DIM=   16384,         16384,           16384
##UNITS=     HZ,            ARBITRARY UNITS, ARBITRARY UNITS
##FACTOR=    0.220516191357247, 1,           1
##FIRST=     3148.77954330316, 0,            0
##LAST=      -463.937219702624, 0,           0
##MIN=       -463.937219702624, -2107323,    0
##MAX=       3148.77954330316, 328654328,    0
$$ Real data points
##PAGE= N=1
##DATA TABLE= (X++(R..R)), XYDATA
16383 -2107323 -1563166 -1673735 -1929913 -2100177 -1607442 -1304209 -2038439 -1718260 -1522636
16374 -1522636 -1416772 -1591158 -1882456 -1342619 -1875252 -1883333 -1799017 -1737372 -1389606 -1228831
16364 -1228831 -1476562 -1423095 -1357656 -1345008 -1232678 -1743976 -974137 -800278 -1507374 -1869495
16354 -1869495 -1796098 -1391243 -1191020 -1285742 -1346747 -1274885 -1214024 -1138504 -1075439 -1035241 -1463901
16343 -1463901 -947774 -1133634 -1326355 -926912 -776098 -959324 -879117 -700025 -852821 -1018309
16333 -1018309 -1001273 -888977 -1065818 -1240952 -735413 -1223043 -1546155 -1550976 -1147871 -947518
16323 -947518 -1152055 -1074927 -1155336 -955868 -1270512 -837339 -393659 -827276 -910747 -731676
16313 -731676 -328455 -572347 -1007150 -849513 -974679 -1450936 -1562651 -1330353 -1121319 -587385
16303 -587385 -318988 -179581 121488 303048 93646 -147800 -456332 -737225 -955123 -1192104
16293 -1192104 -430826 -128207 -221901 147719 -605046 -1066152 -712941 -365526 -237152 -605275
16283 -605275 -979615 -494977 -276524 -236027 -408989 -211634 -377698 -576269 -553244 -312796
16273 -312796 -478056 -505695 9 -217783 -67684 26851 -97922 -120506 144284 -131324
16263 -131324 -201503 172866 -634665 -514212 -778177 -813340 -634935 -51690 -218015 -345087
16253 -345087 -446078 -103786 97902 471224 269487 -351733 -566175 -579264 -242322 -309691
16243 -309691 -646504 -535408 -678167 -263417 -105391 -308879 -135992 258220 166116 340983
16233 340983 222269 -82477 -116713 -439431 375759 721361 142728 -851488 -698320 -265086
16223 -265086 -217647 143106 -244273 -688589 -735943 297910 301096 -373813 -786676 -856976
16213 -856976 151321 -110363 -4532 -218466 -104676 -325617 358224 357409 -209086 -313760
16203 -313760 -55850 -323631 -447476 67670 274196 245081 288912 384942 258247 520211
16193 520211 445462 173978 271832 33241 -283301 117542 536425 312553 -281784 -377793
16183 -377793 -545916 -85506 -35386 -292357 331615 -113301 -28108 231516 392993 246564
16173 246564 99509 -210444 434910 797836 685745 1081113 1102125 680722 985406 951367
16163 951367 712214 606287 80306 -17010 -178863 -220404 -12485 526472 690257 529826
16153 529826 269579 170958 420013 356211 883165 805752 956705 884020 676259 1152441
16143 1152441 995231 616258 462799 249951 376781 529594 282285 109679 303416
16134 303416 567948 576800 526900 457971 263032 351403 500935 -71203 265851 715110
16124 715110 596377 541786 703886 473551 -226781 213755 431490 418912 782003 360490
16114 360490 280787 870017 132339 332857 196400 471724 363452 -72702 -271410 144500
16104 144500 446504 378993 196687 234603 127818 -241207 187928 39428 258780 514983
16094 514983 733491 705626 288854 244625 882945 416890 208672 -193346 469717 252995
16084 252995 421849 134481 61560 611400 581505 172720 331418 -100011 -419141 326539
16074 326539 603164 420790 976665 1047519 570991 278651 108300 9571 198237 102813
16064 102813 435372 748453 94122 228549 206808 495109 411013 301371 458723 85343
16054 85343 239271 380167 -71396 -8931 796994 950825 1041082 778013 795418 602129
16044 602129 642273 834306 1122318 553487 20704 963332 758632 210340 409705 189705
16034 189705 165986 630959 694497 908835 1403260 1274271 1067124 934474 641873 604484
16024 604484 756954 653393 326352 -89820 -564780 245405 384271 -147346 347714 90042
16014 90042 -539420 -572045 -281105 -110001 322797 794280 860914 701642 329403 963559
16004 963559 1070696 638002 269833 -490778 -652170 303744 611631 239783 878881 1068309
15994 1068309 508818 494496 901370 979669 177220 442711 304020 66664 79060 208521
15984 208521 43221 -213772 37495 337822 552429 47319 29500 116386 639875 900545
15974 900545 933882 1079524 723141 288746 -54103 -403934 -500515 145844 128122 -153171
15964 -153171 -191074 310901 715843 275304 419556 364912 203078 -236654 -62533 614188
15954 614188 210145 243112 463713 206918 200900 -136842 551424 700697 -194100 532080
15944 532080 1088316 1224004 1036880 426381 113794 592392 480997 582352 676074 737972
15934 737972 981033 673206 -8095 -260210 288754 172563 527895 1260250 195092
15925 195092 305712 993730 1068181 998492 875630 508984 342565 636396 1067644 -7821
15915 -7821 -25823 176405 341661 150600 357623 140887 -34471 477649 636179 924320
15905 924320 519999 -336038 49327 227787 47092 -252586 103828 298473 382747 1132287
15895 1132287 1377971 1316674 888892 1266197 1071337 1679868 1863442 1465593 942148 595628
15885 595628 766770 241448 30476 305003 481627 761100 373731 102531 502228 331478
15875 331478 -221031 -360731 432644 508519 259195 62376 -370335 103882 2923 516073
15865 516073 427985 525997 873480 534504 595304 814070 341591 130904 425578 946492
15855 946492 609381 1034457 705805 236459 214279 635322 866005 951418 681792 56443
15845 56443 -376675 -273633 405742 776773 762821 439107 594395 146989 103194 690460
15835 690460 836437 570293 48730 422521 280962 359303 1020268 1251916 416600 705322
15825 705322 659230 389646 979314 1314955 1168339 1173044 1172409 956465 455971 921594 887219
15814 887219 607018 433942 1108112 508545 347672 621023 864793 1160747 273510 233116
15804 233116 258908 637481 863219 586158 459401 892516 865812 450961 529805 597971
15794 597971 723635 651035 1132509 921379 345983 566517 479452 643272 879289 1119597
15784 1119597 941877 1013366 558493 958247 1195883 719237 316749 510344 -105959 292160
15774 292160 394323 614990 598264 817974 380890 74109 122261 76105 60463 164927
15764 164927 74255 74895 -43403 325248 579866 846590 639581 181295 -73628 480517
15754 480517 603530 701710 777860 467316 283236 1313888 1021189 653090 672122 476419
15744 476419 755951 777988 921360 508636 715942 216381 623767 1046331 1329839 1321299
15734 1321299 582590 43823 256713 720309 987854 375233 121423 -18787 -334007
15725 -334007 216054 443867 334123 535459 865949 1018170 1042816 504225 406463 726345
15715 726345 799156 1083231 1443475 1163165 576149 267512 430452 684779 383652 65992
15705 65992 -482616 -251347 575718 1257916 665616 367102 303833 895270 855563 396397
15695 396397 661039 713131 343431 585217 375462 482963 180538 197994 373990 658566
15685 658566 861515 451208 158576 335414 1419828 1492394 1247821 1100667 1458583 1345900
15675 1345900 1425019 1252361 605161 705487 787852 853040 834424 765466 730744 112876
15665 112876 500130 335198 606487 673761 61076 426806 475879 378819 337571 411047
15655 411047 -4156 96753 629295 483824 532240 653650 806726 902073 639943 163684
15645 163684 415233 33734 264891 1064102 1278658 1092913 843548 155631 408509 632433
15635 632433 1015699 1333239 849977 812084 825602 517902 300403 126394 -9942 683331
15625 683331 440932 723989 914776 1625411 1740054 701710 320958 577655 298659
15616 298659 581038 925307 637713 788642 638599 212851 779020 214313 361685 694029
15606 694029 1212819 1304613 979421 427465 311632 544247 775979 713627 115417 1266025
15596 1266025 1619622 1186433 1195750 746008 255080 177404 525696 1295907 1262246 640319
15586 640319 292910 174836 638579 741560 639474 488133 430635 126160 -219126 88951
15576 88951 -13464 -75524 -176509 -154374 118006 995657 1018845 678412 1029900 975118
15566 975118 883775 1257225 923376 1361447 949468 1124569 1166924 1055362 1065901 528433
15556 528433 681495 529453 387177 379852 594980 801174 1008039 880691 347314 156284
15546 156284 -232828 -469041 -357193 427946 452587 254273 533854 669270 801320 308292
15536 308292 465076 401506 354812 103612 245204 498398 -5785 -241929 281271 815963
15526 815963 959611 658700 441102 747353 899176 492412 475839 575655 328550 193709
15516 193709 474960 30655 576288 1052325 987968 745675 282904 -50804 592026 682548
15506 682548 119942 390650 533893 328798 450102 430646 450741 500119 753611 1168988
15496 1168988 1593043 805860 546597 409971 281691 991320 721027 766207 890068 654662
15486 654662 898257 1148612 610022 492699 197642 641738 -31645 860474 454401 -231209
15476 -231209 219295 764379 414064 361332 667117 731698 1457937 1650164 1569359 1719624
15466 1719624 1368815 1473790 620222 406350 567654 -144845 646 1121021 1032364
15457 1032364 956279 1705899 1791731 523696 542320 836082 844398 924127 713058 696321
15447 696321 801150 891756 889289 976023 1632200 1301833 311926 1038502 276696 373818
15437 373818 601098 488877 227367 501772 515260 555991 540520 728661 1047348 1316988
15427 1316988 1043495 302176 260896 595965 536986 949885 351010 105110 649699 759752
15417 759752 1833820 1183342 86576 157376 393703 605190 242261 548264 1031773
15408 1031773 1546647 1374627 1489757 1574182 958990 1008681 954924 620632 760945 297921
15398 297921 387636 838905 812391 384945 365735 -180428 849035 1249297 1035170 443092
15388 443092 419144 190968 34234 339072 778125 953657 934942 1546719 1289976 968920
15378 968920 1243482 948389 664953 672759 357711 702451 1017223 812429 509129 754706
15368 754706 857961 1369756 1052526 1350988 732672 204133 437173 737647 1100224 1682277
15358 1682277 1337561 1234512 1241299 1556759 1319658 676648 259247 604689 444232 290569
15348 290569 1053346 984233 419691 517669 500500 241807 554720 665758 1009022 878185
15338 878185 710847 1333639 1642822 1544927 735508 1118360 1033042 1078239 1202216 434698
15328 434698 197406 712720 437674 651718 905238 329358 714738 453511 646945 11771
15318 11771 625553 1360764 682878 568216 687961 908297 895879 212608 26000 90091
15308 90091 458348 811523 934186 418877 464830 608291 380964 -181059 426184 -37707
15298 -37707 -45110 332081 496588 -50757 542215 984661 635321 518121 502923 676476
15288 676476 223265 -79713 409642 320283 745681 1150936 818471 1375432 1178155 1107394
15278 1107394 1003753 905864 803035 893325 239991 300768 592979 361216 488433 563504
15268 563504 302522 605352 974699 1050899 642993 1000215 720445 1309556 738193 747661
15258 747661 1170324 686880 689128 437455 -55634 -231430 -294605 701569 960118 1233632
15248 1233632 1166036 875462 738540 140873 260909 726494 713887 -237954 190204 483468
15238 483468 897112 283935 181723 214464 754368 1346903 863910 793744 225251 828526
15228 828526 622460 466030 -11410 80785 458206 799732 1014915 986786 1468166 1970237
15218 1970237 1591929 1533459 1976967 1389440 987692 1166617 1238655 1183350 1320786 1563511
15208 1563511 1551822 1329389 856893 973674 1081442 1618412 1177572 905098 736199 86885
15198 86885 502686 1056099 836058 588973 949038 684893 492494 646079 889925 1090216
15188 1090216 1022083 904913 758238 87516 546654 621779 709912 749783 1067785 1677810
15178 1677810 1605746 1225066 810773 418997 154579 675504 1227548 1158773 641942 795707
15168 795707 731263 983732 1308390 365999 527531 284914 587194 252178 209130 242511
15158 242511 649888 592033 60419 349358 1024772 1047867 1228129 1186350 2328047 1254592
15148 1254592 1040442 728379 760122 825951 1067861 738886 768467 567815 219344 620904
15138 620904 853922 1118099 228728 206896 331868 608399 446698 1419081 1173589 1108060
15128 1108060 1183656 459893 351530 924388 733111 965431 1127734 1473809 1502694 911264
15118 911264 752964 1333655 848412 432087 704816 1072171 1161494 704333 919388 876437
15108 876437 849589 728808 422284 513078 207224 794855 1357544 658671 749377 998061
15098 998061 516247 1042509 1241835 989195 1322720 1364607 682636 952014 1089663 790640
15088 790640 323855 652980 330487 457834 413180 455259 583807 544666 168325 240759
15078 240759 576452 1169038 1650734 1451062 1345912 1437971 1457265 1418874 1136325 707365
15068 707365 1057572 1456849 1671426 1405503 1089897 844373 859604 1082338 1494196 1335681
15058 1335681 1266812 1092354 1378913 1454298 1476674 1539918 651565 906409 777141 1012523
15048 1012523 1564263 1094285 1036669 1505696 752704 812913 1147756 1042276 959159 431630
15038 431630 280658 502023 855146 1221916 1601342 948466 951990 514767 751753 1635813
15028 1635813 1227050 536220 240365 226369 749807 295306 292972 638783 982127 875340
15018 875340 674984 219234 -182783 -117090 289342 216788 230761 783995 448397 328602
15008 328602 821963 1535776 1252306 1273887 1459560 2007028 1658376 749904 1418293 1828924
14998 1828924 951573 691394 661909 588526 952907 755801 920577 867681 559588 339973
14988 339973 626798 654585 573394 945040 819632 540840 360986 -64630 255293 363502
14978 363502 1017418 1109984 481047 573910 1084588 1340591 1030519 936688 1190167 980258
14968 980258 223366 631640 519089 386830 301566 732386 719860 1211685 1003182 1425716
14958 1425716 1600133 824031 1316965 735348 1051521 1354279 1186797 600133 553554 1016238
14948 1016238 1095592 936463 734093 1314274 1595863 1470401 1811193 1745004 810467 892639
14938 892639 574108 1148087 1156232 1090550 1258878 1246180 823316 858376 697330 652461 1228190
14927 1228190 1572433 1350161 36873 421549 751472 637856 615730 905957 652157
14918 652157 689539 539400 864611 585938 458376 715624 783240 1242627 1257045 1331413
14908 1331413 1394936 793751 823592 656146 648906 1151655 664114 580055 1087061 399252
14898 399252 1104881 1579989 1308476 1558585 1588519 699375 1691951 1495552 904855 741855
14888 741855 758593 930993 787854 440244 436161 936934 891701 549224 434705 765398
14878 765398 556359 -136927 -1167 289744 -75985 597016 766076 416103 540511 790390
14868 790390 194831 679825 868440 780905 714561 956965 628581 416433 801669 1048104
14858 1048104 570587 286903 -50319 362879 375554 693380 873118 1035905 772246 1426707
14848 1426707 984985 605978 584777 412257 400497 544998 1422158 774262 1138907 1295220
14838 1295220 1013698 1148546 971611 1313689 1450231 832000 940013 640221 1058338
14829 1058338 1877077 1517734 821633 1204054 1358044 960582 880068 742746 445932 751549
14819 751549 1404137 1343850 1329701 1132007 1230283 965629 778837 842841 627268 866587
14809 866587 1225713 507251 897056 1513808 1064979 786337 869191 821595 1346271 1446359
14799 1446359 771209 809745 927727 811415 1359185 1418715 252457 544131 840065 617474
14789 617474 915094 935340 431074 633554 494954 427309 590606 418288 1039757 1485489
14779 1485489 1015652 533704 713517 915274 1065976 789255 775389 662235 766275 455210
14769 455210 463491 1263221 652637 367471 1308809 2081556 1311846 889197 1596496 2098088
14759 2098088 1568341 1112848 1240161 1060712 648691 582981 1237306 1125545 1358262 1519584
14749 1519584 1517746 880664 1136631 1019192 1025493 1129203 882760 958577 968006 1408404 1175528
14738 1175528 1072816 884680 1694760 1396141 1083250 720105 491127 582751 720932 732480
14728 732480 1233893 1379314 1392097 1671923 1061184 645667 1287390 1540207 1719275 694271
14718 694271 744521 1267717 1148240 898068 965284 1202797 1197403 818123 603875 603461 940849
14707 940849 1044960 1017089 847764 1543392 1674240 1404824 1241780 1005411 1481890 1181520
14697 1181520 1247290 637783 863403 895002 488133 921723 814660 913389 1050707 857644
14687 857644 1003159 1899444 2021901 1583007 1318065 1215268 713983 714986 1471826 1417233
14677 1417233 1295244 589458 935696 806315 1256812 1726106 1045989 936388 720546
14668 720546 1299187 2181332 1807807 1778826 1288411 1242658 2090941 1411603 1062688 1212915
14658 1212915 1361048 1454973 892132 1308050 1058293 799056 320870 446510 878831 746703
14648 746703 760460 889269 1083477 929247 1029310 951457 1026338 1135777 698286 610021
14638 610021 1065312 1497108 1038058 975163 1129201 1372069 1045786 1151656 1301885 1712370
14628 1712370 1804505 2480034 1884929 1432144 1256135 231149 842603 788791 745309 1063631
14618 1063631 1242032 1234504 1138715 1268473 1384278 965341 1226272 1441622 2074759 1597126
14608 1597126 1057708 792090 933395 1684316 1349273 1801965 1772928 1206400 761106 1066521
14598 1066521 940408 988731 971217 1186704 1249952 846924 1087224 1169599 656411 1207492
14588 1207492 1419022 1361211 1609569 1633440 1945698 1018432 901812 777673 501046 -229888
14578 -229888 445313 1170157 759156 522908 637738 963470 851485 712255 1250703 973819
14568 973819 686129 927688 651081 572358 660984 688794 573994 711922 1112678 643741
14558 643741 734832 1241847 1024118 1367479 1616815 1141138 1038783 363172 729588 715104
14548 715104 702670 738630 634978 1084076 1418457 1151329 718041 846130 909564 1445925
14538 1445925 1620176 1117586 1895272 2002508 1819319 1066710 510697 1373547 1214723
14529 1214723 1369397 1639739 1574934 1855381 1575406 1180832 1850333 1576944 856971 1036985
14519 1036985 1144011 1199252 1431199 1303321 219025 165407 626648 709479 767132 209922
14509 209922 14630 1013862 665849 821905 1581866 1614594 1011545 828823 1033625 1198787
14499 1198787 1662366 1306246 1409917 1130324 1201746 1321732 1256506 727324 1530215 1763961
14489 1763961 2172060 2008563 1667632 1347879 1501160 743737 1261816 1655824 928357
14480 928357 522586 860939 855448 1054138 1241523 1501834 1956302 1661921 1595128 956364
14470 956364 1095349 1470469 1628468 1646122 1794613 1632043 1093199 1263420 1426128 1196475
14460 1196475 1158507 1477651 1656620 1489362 1753827 1430839 1391945 1373779 1507038 1631494
14450 1631494 1141779 741675 720678 1073958 1271371 935442 1692327 892806 506652 642770
14440 642770 757258 2001022 1987812 1608866 1535789 1384760 1233089 1044011 1339269 1047727
14430 1047727 1097247 1242605 1796780 1760374 761236 1419259 1833246 1032158 1073046 1383310
14420 1383310 1388867 1321875 1056863 865155 732259 1104260 944864 1123925 1209253 1009162
14410 1009162 1532235 1034279 786654 984792 1428654 2025356 2154407 1148519 1124428
14401 1124428 1614150 1633408 1611884 1316364 1576410 1528114 1183789 1750008 1479679 1005969
14391 1005969 966025 1057294 1328521 1390241 1491638 1519314 1527048 1471333 1054844 601626 1168517
14380 1168517 1311521 902992 1012448 1142015 758868 1118878 1225046 1644978 1804259
14371 1804259 1904573 1360194 2177302 2507276 1829733 1581989 1274178 968563 1351378
14362 1351378 1773645 1366408 1461608 1824421 2136695 1704657 1858778 2002586 1431713 998559
14352 998559 1134366 1809200 1650343 1168592 1396565 1142267 1326501 930694 560606 1485313
14342 1485313 1678192 1781029 2249580 1770587 1244014 627245 869776 1439161 1710613
14333 1710613 1998020 2125848 1901875 1686468 1386912 1660340 1788704 1278121 836359
14324 836359 1646044 2316292 1682397 1670313 1429950 1899348 1745861 1678988 1773736 1712260
14314 1712260 891116 1088627 1265129 1230146 1762035 1593607 2344684 2416433 2407418 1923311
14304 1923311 1420978 1433465 1355481 1355401 795087 1205990 1547021 592018 1163738 1922597
14294 1922597 1412269 1660708 1334435 1910481 1658802 1374837 1157494 1358111 1960255
14285 1960255 1550046 1349502 699343 1002863 1402948 2022500 1519313 1730916 1299657
14276 1299657 458622 797750 1431973 1099539 1235400 1394229 786966 840002 1521187 1430833
14266 1430833 1104049 937211 1495951 1560671 1364703 1763770 1675142 1512918 1213199 1303241
14256 1303241 1727273 2339203 1935176 1065172 830910 1835948 1452179 1663304 1504439
14247 1504439 1373992 1885797 1461207 1297639 1587465 2233289 1966304 1219238 1174855 555224
14237 555224 559137 687129 1313692 1500872 1038248 1104912 1135367 1273746 1460409 1858680
14227 1858680 1951711 2052528 1837541 1328295 1606068 1545089 1640560 1950218 1721842 1238970
14217 1238970 1108763 1544581 1451862 2032964 1465540 1258723 1235890 1262035 1551803 1295934
14207 1295934 1956381 2142844 1826011 1311990 1290638 1772386 1571384 1508351 1868248 1364729
14197 1364729 1682652 1593268 2019319 2733482 1810562 1434546 1230222 1430138 1422651 1116224
14187 1116224 760845 935616 1526132 2154907 1699252 1626972 1845863 2282802 1840978 1349821
14177 1349821 1946321 2104538 2261736 2427964 2339126 2274502 2319865 2256315 1858815 1942483
14167 1942483 1942129 1816054 1220934 1778227 1732635 1204250 1054041 1013026 922966 1194821
14157 1194821 1273256 1835643 2178468 1690911 1839016 1603778 1917556 2118144 2363349 2140106
14147 2140106 1859156 1468862 1917605 1914545 1567083 1264455 1874643 1927552 1649659 2213513
14137 2213513 2290519 1530525 1423145 1190061 1602403 1494749 1129842 1044584 1421048 1944565
14127 1944565 1822377 1745010 1361000 1271886 1176325 1773029 1732273 1310919 904021 1980519
14117 1980519 2333474 2086611 1824366 2048118 2754951 2710822 2612668 2852580 1963440 1317653
14107 1317653 1507846 1138099 1564910 1533358 1772440 1407774 1668603 1727033 1973145 1786540
14097 1786540 1439734 1801076 2241260 1868064 2167667 2364391 2043911 1335112 1491376
14088 1491376 1231836 1137400 1549980 1126987 1991308 1395762 1125597 1368928 1319969 1235449
14078 1235449 1577387 1749523 1512010 1731925 2288255 1886572 1759305 2182959 2425029
14069 2425029 1556994 1569756 1920493 2055035 1931448 1812213 1201140 1017947 1084783 945088
14059 945088 1155232 1386567 1946591 1643195 1434642 1763778 2217848 1757178 1960955 1703926
14049 1703926 658362 169602 534441 1289774 2005870 1686175 2055871 2393940 1994283
14040 1994283 1941410 2327992 2251952 1968038 2193604 2251392 2168807 1784425 1673663 1757256
14030 1757256 2514827 2127771 2219833 1645026 1035030 1485561 1751107 2031459 2056207 1889959
14020 1889959 1625750 1409224 1003477 1448166 1692286 1228529 921232 748925 1245582
14011 1245582 1567807 1742996 2049103 1674918 1617094 1676849 1746120 1555497 1912526 1259179
14001 1259179 1509019 1188847 1325892 1697433 1520293 2099677 1694074 1885870 2114971
13992 2114971 1934138 1607461 1355765 1458972 1655608 1238955 1729006 1774202 1262767 1447433
13982 1447433 2274278 2519230 2382890 1930625 2403173 2678936 2446875 1987675 1473984
13973 1473984 1530391 1438059 1315877 1594224 2214518 2186337 1735070 1470933 2051356 2014536
13963 2014536 1835499 1862348 2219529 2664402 2141877 1918020 1976935 1913414 2052663 2404549
13953 2404549 2652423 2588051 2596870 3123763 2805580 2117403 1881910 2522638 2335309 1859058
13943 1859058 2233161 2239098 2431916 2283241 1743539 1671941 2310928 2230661 1612095 1749793
13933 1749793 2015438 1794816 1754181 1970011 1772415 1799013 1728120 2116219 3061166 3311688
13923 3311688 2834010 2735887 2426639 1760474 2045716 1834664 1666038 1722509 1462291 1926986
13913 1926986 1865403 2032392 2133883 2286036 2496145 2293450 2417833 2523279 2136521 1293403
13903 1293403 1340857 1494318 1848819 979190 1484794 2131120 2062275 2537912 2693595 2637747
13893 2637747 2129136 1874964 2109209 2444419 2543529 2920539 2344152 2226502 2298704 1937033
13883 1937033 1656225 1928828 1720297 1802052 1692908 1834703 1748954 1859908 2235189 1962283
13873 1962283 2264005 2398687 3010045 2872719 2932175 2278328 1970796 1955164 2040559 2129408
13863 2129408 2500340 2358581 2559737 1860467 1540916 2016718 2687492 2299147 2135807
13854 2135807 2499425 2297662 2544307 2241667 2130914 1645265 1412374 1709616 2255695
13845 2255695 2373149 2437023 2201393 2214187 1510222 2346641 2194373 1921724 2346981 2321394
13835 2321394 2318809 2036878 2221137 2767487 3656078 3428307 2663021 2508785 2200196 1923851
13825 1923851 2302703 2486570 2174541 1935877 1686188 1532357 1696336 1477402 1880445
13816 1880445 2173393 2397885 1941197 1443163 1687344 2146883 1579161 2008631 2293284
13807 2293284 1765601 2050208 1905994 1866842 2156372 2211877 2394619 2548582 2467703 2758206
13797 2758206 2698966 2312181 2514125 2583237 2457778 2468275 1706915 2010448 1690121 1873634
13787 1873634 1850810 1937226 1958743 1865668 2118171 1945855 2281875 2693384 2200593 1663230
13777 1663230 2036142 2428361 2631550 3076258 2881962 2292986 2138925 2322283 2486842
13768 2486842 2590829 2719810 2784692 3072244 2545075 2406379 2338677 2839259 2441093 2574108
13758 2574108 2932755 2763303 2612846 2128281 1897923 2120253 2433427 2714543 2476799
13749 2476799 1843747 1869415 2367886 2649059 2951549 2371817 2705460 3007662 2487767 2418641
13739 2418641 2667280 2612879 1888359 2340772 2585961 3038847 2072897 2115142 2391051 2348727
13729 2348727 1646304 1844394 2369592 2531886 2284858 2692240 2769916 2683652 2861684 3077211
13719 3077211 2228328 1752620 2183312 2212009 2650334 2166091 1970435 2289453 2238352 2465305
13709 2465305 2440646 2965510 2560703 1892811 2186660 2489078 2304712 2693123 3001481 2960058
13699 2960058 3300850 2788639 2617680 2612176 2872977 2542127 2614837 2604801 2419006 2484422
13689 2484422 2997037 2534554 2887628 2762440 2824005 3035193 3375926 3386370 3138728 2703061
13679 2703061 2875113 2270811 2800901 2844616 2440212 2672640 2287211 2286316 2546557 2156070
13669 2156070 2384182 2592600 2243597 2058998 2838448 3174182 3212384 2563594 2467921 2782611
13659 2782611 2161045 3019549 3042918 2299422 2443898 2714091 2647094 3190422 2791106 2675117
13649 2675117 2964136 3207253 3087375 2633719 2543390 2544514 2624590 2856960 2937991 3276724
13639 3276724 3402902 3113477 3108095 2928699 2591359 2631439 2557951 2659932 2964790 3104890
13629 3104890 2923417 2503214 3021814 2889169 2861382 2839120 3391753 3596203 3336550 3364643
13619 3364643 3338443 3283186 2936267 3007334 2558833 2804312 3066131 3027985 2845988 2966867
13609 2966867 2342887 2775583 2670370 2853442 2678438 3367948 3143934 3373128 2873384
13600 2873384 2934044 2570562 2527408 2998918 3024970 3068463 2980206 2792834 2696778 2950762
13590 2950762 3491996 3554193 3048005 3330673 3223469 3296173 3271083 3489686 3566284 3517564
13580 3517564 3362910 3194787 3352059 3387685 3013761 3292209 3420948 4038164 2925611
13571 2925611 3311441 3815615 3248611 3153114 3210057 3028193 3247952 3158370 3371085 3021579
13561 3021579 3104641 3527419 3392914 3589286 3391067 2905585 3120002 3384936 3361434 3046760
13551 3046760 3260545 3478583 3577733 3657940 3245652 2977962 3485587 3769172 3571074 3128606
13541 3128606 3623416 4199807 3937405 3256579 3227168 3039270 2994859 3196625 3409443 3954109
13531 3954109 3807831 3747156 3352696 3031398 2958938 3440588 3704021 3446308 3456929 4155508
13521 4155508 2922933 2628062 2819931 3196068 2963625 3019561 2981797 3359493 3863613 3286655
13511 3286655 3239629 3027780 3539920 4093783 3989443 3095354 2593548 2681038 3188632 3114930
13501 3114930 3606290 3344307 3280542 3052205 3190277 3267696 3542760 3582145 2975743 2626182
13491 2626182 3303975 3755048 3249261 3851775 4099292 3185347 3638303 3899796 3604805
13482 3604805 3683344 3682592 4009138 3504002 2903222 3090379 3687311 3310029 3409255 2910462
13472 2910462 2993403 3804564 4014702 3879116 4267733 3840821 3888694 3500707 3678360 3629677
13462 3629677 4075935 4260439 3485494 3752966 3809028 3399174 3503551 3682371 3585432 3733370
13452 3733370 3611155 3809861 3596415 3033026 3029759 3516542 3561772 3747496 3860772 4291252
13442 4291252 4551533 3898871 3773079 3673694 3153186 3339505 3249372 3453596 3646113 3552965
13432 3552965 3894019 3917010 3856598 4173993 3832158 3337436 3366159 3732568 3839554 3515712
13422 3515712 4324032 4627057 4590867 4070337 4246008 4503649 4553032 4445361 4051823 3794949
13412 3794949 3796038 3739345 3498699 3800264 3707124 4092601 3996215 3925869 4069909 3817517
13402 3817517 3942017 4259560 4561213 4053819 4127789 4600417 4691026 4233860 3569683 4116956
13392 4116956 3847672 4187050 4626415 4048607 4341988 4237710 3874682 4294951 4162126
13383 4162126 4239721 3604688 3735926 4625026 4905833 5017587 4834452 4828621 4797782 4067292
13373 4067292 4164743 3972198 3664162 3703390 3587591 3317940 3866397 4387863 4496749 4272755
13363 4272755 4112430 3963755 4503528 4453595 4057924 5058235 4963291 4255358 4093065 3982859
13353 3982859 3855169 4397566 4101134 4358666 4494817 4247485 4345096 4161622 3732988 3983324
13343 3983324 4359941 4778952 4206925 4028187 4484065 4517845 4760972 4587723 4524158 4253542
13333 4253542 4139797 3642024 3634434 4239204 3860736 4143508 4438121 4126683 4643446 5794894
13323 5794894 5516662 4606578 4308560 4435692 4320297 3832540 4435587 4776671 4851193 4971527
13313 4971527 5001984 4513944 3554490 3584380 4647392 5483628 5031942 4216244 4202178 4416632
13303 4416632 4017571 4211281 4261613 4847651 5219623 5039903 5275622 4974845 5055006 4983339
13293 4983339 4528698 4919645 5138340 4365774 4476909 4533545 4891801 4928937 4913028 4440300
13283 4440300 4365206 4232738 4296159 3844413 4239261 4864505 4721310 4611670 4482358 4270680
13273 4270680 4113099 3903566 4555220 4908579 4660271 4342615 4036426 4456929 4609521
13264 4609521 4889187 4367040 4862142 5106056 5261720 5067785 5511558 5584795 5075876 5249921
13254 5249921 5343012 5510062 5368576 4939654 4710448 4935732 5200160 4806071 5122655 5015223
13244 5015223 4797295 5214851 5334822 5161488 5212499 5698915 5906951 5502238 5781899 5944338
13234 5944338 5218903 5241712 5490356 5448654 5225517 5279231 5363456 4796814 4816784 5203981
13224 5203981 5326114 4475590 4909154 4661101 5065711 5412793 5452182 5487768 5342078 5719446
13214 5719446 5153970 5138592 5220682 4837063 4461026 4928521 5072136 4221595 4315337 4814299
13204 4814299 5609812 5080219 4949258 5469023 5296453 4705841 4407949 4721309 4458323
13195 4458323 5200459 5964074 5487199 5734771 5473249 4917880 5278310 5608494 5307464
13186 5307464 5120216 5473866 6404357 7359947 5684669 5540526 5090231 6057900 5810200
13177 5810200 5495134 5735776 5501028 5683496 5345235 5649519 5208146 5292538 4961387 5010336
13167 5010336 5028617 5471444 5870054 5839972 6244860 6287709 6046213 6462757 6420661 6316174
13157 6316174 5975428 5457092 5182271 5616372 6001231 5391615 5768241 5316701 5252716 5271435
13147 5271435 5944657 5821643 5434721 5727231 5650720 6373008 6425353 6255924 6465465 5665039
13137 5665039 5155067 5834476 6228274 6551850 7080903 6585264 6411306 6530792 6390435
13128 6390435 6738190 6710974 6278404 6100708 6665709 6789796 5992179 6151339 5960113 6416769
13118 6416769 6738848 6576544 6290058 6564962 6490240 7019730 6726899 6513117 6267683 6330834
13108 6330834 6380130 6258161 6371707 6036552 6188522 6423759 6585731 6521628 6998813 7119439
13098 7119439 6721844 6986249 6809596 6708595 6099297 6360467 6539180 5846923 6504552
13089 6504552 6670123 6914782 6613648 7383581 7618249 7415971 6903244 6781080 6765186 6633368
13079 6633368 6134668 6242711 6779044 6535874 6716953 6953514 6846707 6780973 6614239 6806663
13069 6806663 6735073 6580486 6435818 6350420 6768784 7419470 7049474 7333935 7369436 6334399
13059 6334399 5977970 6633365 6589635 6601584 7441554 7386702 6938602 6512148 6223351 6994611
13049 6994611 7583628 6609214 6387111 6436414 6440442 7477932 7699641 7310388 7103341 7135456
13039 7135456 6874345 7466987 7689777 7445498 7522265 7609404 7502126 7481732 7095675 7066206
13029 7066206 7037480 6972511 6614403 7423102 7707046 8382634 8618225 8244885 7579730 6976910
13019 6976910 7197138 7361412 7448547 7781316 7574581 7509457 7661058 7271033 7419736 8102583
13009 8102583 8293871 7636136 7501228 7901227 8581946 7714493 7499729 6968468 6956339 7784895
12999 7784895 8316453 8352898 8093595 8186686 7887084 7880086 8016001 8340041 8317246 8174126
12989 8174126 8174982 8188226 7998778 7886074 8241914 8287040 8704701 8770071 8931596 8327186
12979 8327186 8686041 9232218 9180193 8678473 8338991 8510020 8575743 8766619 8365242 8083369
12969 8083369 8188474 8373095 8578620 7760097 7933510 8065947 7945533 7937412 8114569 8224948
12959 8224948 8520929 8680408 9241715 9235667 8786897 9355988 9646826 9009491 9046553 9328795
12949 9328795 8965168 8564583 8626697 8764018 8658360 8599704 8534606 8836195 8966649 8971152
12939 8971152 9436277 9394642 8867346 8691098 9218670 9950503 9511827 8995266 8980556 9467978
12929 9467978 9724932 9333682 8845056 8826681 9367172 9813553 9654720 9733996 9512343 9466895
12919 9466895 9668202 9788155 9921346 9415767 9535028 10199368 10062943 9947537 10237377
12910 10237377 10180401 10434923 10364546 10097392 9767694 10051796 9568269 10029911 10356618 10364600
12900 10364600 9787827 9544813 9982271 9893898 9829295 10838694 11097014 10457668 10663453
12891 10663453 11033589 11204263 10864448 10227744 9869790 10925018 10278872 9882842 10386896
12882 10386896 10382625 10395925 10388933 9892731 10308661 10368460 10323676 10614806 10340696 10516847
12872 10516847 11150253 10932380 10907176 10701511 11073689 11134252 11014701 11251163 11450966 11770690
12862 11770690 11583748 11492145 11417598 11338086 11877874 11376461 11613475 10995309 10878581 11723852
12852 11723852 11649947 12084139 11846052 11618710 11392071 11675059 12155120 12160662 11464577 11565106
12842 11565106 11524461 11799983 12388770 12158096 12554928 12256568 11791851 11684097 12037036
12833 12037036 12627227 13115692 13096153 12661828 12789698 12632387 12240752 12403186 12099737
12824 12099737 12560819 13027832 13474800 13276050 12990445 12576143 12035120 12160193 13056628
12815 13056628 13664882 13517679 13032927 12640966 13065242 13678870 13086937 12731374 13258053
12806 13258053 13502494 13193127 12782487 13110229 12954248 13284093 14028248 13942032 13234970
12797 13234970 13569803 13845626 14162315 14177489 13954303 13999551 14179526 13962831 13634662 13701892
12787 13701892 14184087 14142019 14097325 14562181 15049030 14545551 14743577 14253254 14411019 14749462
12777 14749462 14724968 14759284 14353536 14496406 14400742 14698251 14621449 15252347 15224715 14694836
12767 14694836 14663178 15193089 15527165 15413717 15041160 15314952 15380575 15457836 15355273 15391438
12757 15391438 16214362 16087415 15498576 15389824 16178842 16451578 15897506 15642817 15967137
12748 15967137 16439423 16687041 16939186 16953034 16794624 16825242 17375848 17402801 16970205 16687104
12738 16687104 16853435 17095660 16784107 16838640 17117332 16869611 17312134 17707290 17098196
12729 17098196 17126946 17469520 17400259 17638809 18111520 18112918 18559303 19097716 18687183 18010737
12719 18010737 18010039 17840440 18217933 18573552 18253267 18501027 19172145 18539321 18609682 18923667
12709 18923667 19173086 19630664 19441310 19229204 19559395 19810581 19258029 18943471 19540293
12700 19540293 19596768 19913625 19853279 20008018 20056375 20292842 20632276 20602346 20483035 19928619
12690 19928619 19786887 20237572 21266943 21251519 21491329 21621880 21076555 20814273 20883333
12681 20883333 21254396 21624481 22034886 22199819 22477173 22130771 21646067 21625081 22267066
12672 22267066 22542497 22339741 22178405 22244681 22628077 22797214 22907226 22707848 23199416
12663 23199416 23666556 24191924 24120035 23644124 23459652 24105125 24429991 23883716 23973740 24634155
12653 24634155 24763618 24077228 23893219 23968320 24127715 24682559 25123493 24513831 24478807 25136272
12643 25136272 25956942 25675311 25749161 26409055 26023448 26776399 27433219 27398513 26787568 27159981
12633 27159981 27010401 27196662 27562355 27085846 27229165 27842540 28376309 28748058 28757876 28668751
12623 28668751 28671104 28186738 28863196 29774172 29565168 29108469 29782405 30210167 29621589 29802035
12613 29802035 30505763 30879290 30994317 31231490 31441213 30805518 30714404 30886402 31088444
12604 31088444 31291044 31823216 32011867 31980295 32490953 32752371 32950379 33072551 34009242
12595 34009242 33942950 34068990 33779787 33562812 33734179 34140562 35179050 35058473 34763970
12586 34763970 34827945 35002077 35180551 35709194 35748948 35730635 35839176 36243266 36031416 35715002
12576 35715002 36891352 37107116 37374315 37386092 37796794 37961328 38902767 39231038 38935252
12567 38935252 39149572 39029189 39266537 40084023 40276059 40136660 40570442 41540167 41458042
12558 41458042 42378256 42181306 42402085 42523584 42745453 43299492 43460033 44184190 44388800
12549 44388800 44478000 44224049 44384358 44975859 45128613 45173298 45128382 45896408 46699525 46421391
12539 46421391 46443710 47608153 48131025 47628931 48318736 48316204 48766960 49047849 49528455 49483321
12529 49483321 49790764 49445185 50391666 51587175 51937058 52444958 52424524 52845975 53550712
12520 53550712 54156723 54360423 54579894 55346335 55039460 55289859 55617290 55922568 56449310
12511 56449310 57036878 57698624 58131273 58505526 59233949 59790186 60230794 60029318 61178921
12502 61178921 61465289 61431948 62092623 62296114 62537000 62917335 64146537 64793622 64932945
12493 64932945 65392684 65714965 66722285 67777708 67668226 67531276 68413585 69313257 69993012
12484 69993012 70239119 70201988 70973189 72132521 72563625 73028930 73721475 74176512 75296530
12475 75296530 75453962 76008312 76796162 77483889 78397880 78494091 78684158 78908427 80316217
12466 80316217 80939204 81543165 82227087 83048532 83878055 84731929 85828339 85705650 86074470
12457 86074470 86755517 88028489 88808105 89358678 90162921 90811594 91728003 92782757 94004589
12448 94004589 94968653 95536517 95880583 96872240 97221333 97399193 98795933 100508185 101132656
12439 101132656 101887070 102350834 103248002 104256594 104572697 105665101 106940336 108209324
12431 108209324 109541308 110828183 111806346 112854128 113569525 114240572 115475098 116623869
12423 116623869 117282121 118560157 119664525 120963775 121818578 123516278 124913484 126082674
12415 126082674 126962519 127951294 128657226 130449343 132241261 132743235 134193105 135227534
12407 135227534 137324871 138541130 139529639 141148826 142389816 143638559 145166180 146777865
12399 146777865 147994539 148966768 150373968 151799175 153012786 155141650 156467469 157603957
12391 157603957 159209384 161474927 163021750 163816684 165309703 167533308 169323205 170667745
12383 170667745 171999917 173794403 175288192 177407830 178354326 179731069 181643662 183930589
12375 183930589 185815601 188096548 189530906 190920436 192780494 194962258 196881582 199272751
12367 199272751 200823749 202637310 204755763 205992120 207556212 209871654 212159023 213704883
12359 213704883 215944671 218337149 220871140 222375695 224398901 225917097 227218867 229364414
12351 229364414 232160842 234335520 235949744 237821067 240158376 242678231 244932142 246790816
12343 246790816 249053922 251088524 253148162 255042642 257459775 259489412 260733493 263171147
12335 263171147 265637899 267679151 269572890 271405021 273344377 275360500 277790261 279884773
12327 279884773 281901492 283623698 285353785 287752965 289665028 291340372 292952126 294317503
12319 294317503 296347655 298007537 299106822 300612443 303374588 304893278 306063302 307902267
12311 307902267 309722702 310982205 312417449 314027309 314369621 315416915 316381386 317469287
12303 317469287 319073524 320093853 321635734 322783189 323397750 324036988 324626961 325115246
12295 325115246 325688654 326647779 326840630 327135934 327904434 327470399 328033732 328606747 328351901
12286 328351901 327867451 328202402 328654328 328329360 327516721 326729139 327264300 326733022 325974723
12277 325974723 325504137 324638570 323530384 322740689 322219927 320933173 319981746 319669435 318877211
12268 318877211 317320242 316037818 315075464 313798400 311725796 311383437 309537277 307851967
12260 307851967 305684734 304307443 302308117 300864245 299520874 298273136 296459213 293850326
12252 293850326 292085159 290690746 288716475 286377266 284270807 282089404 280133595 278313595
12244 278313595 276273693 274423525 272586180 270068852 267896776 265658401 263097389 260972523
12236 260972523 259366927 257567374 255145806 251904872 250174873 248134401 245739223 243737159
12228 243737159 242324292 239623522 237282440 234585835 232511391 230759167 228320314 226084048
12220 226084048 224093625 222278351 220000989 218190219 215943607 213215029 210970596 209271118
12212 209271118 206969440 204893620 203557668 201276450 198950284 196772591 195335550 193724121
12204 193724121 191921224 189425077 188127063 186294296 184231874 181968685 179873394 177738866
12196 177738866 176196573 174458718 173003450 170800883 169016759 167699033 165601587 163644105
12188 163644105 161980612 160466203 158390273 156738634 155566386 154235463 152639120 150362145
12180 150362145 149180085 148028998 145900522 144020645 142517675 141528966 140227754 138451647
12172 138451647 137179844 136132501 134957426 133817013 132190124 130265050 128927387 127767839
12164 127767839 126846096 125635635 124097196 122437586 120895706 119741791 118734384 117773410
12156 117773410 116673585 115593771 114104181 113297347 112634866 111688395 110421433 109299746
12148 109299746 108138864 107028785 105389101 104829768 103366016 102591715 102274504 100337037
12140 100337037 99442634 98305988 97297807 96906615 96218223 95410989 93952928 92321491
12132 92321491 91721548 90646974 89927484 89525023 88250422 87505444 86729076 86142454 85137393
12123 85137393 84939258 83611815 81980346 81502111 80755322 79965823 79653801 79018457 78441422
12114 78441422 77509919 76286600 76154939 75527372 75123952 74129064 73386953 73350566 72647281
12105 72647281 71866370 70716724 70704662 70251189 69153283 69202947 68499328 68124318 67545116
12096 67545116 66253371 65170923 64784050 64777998 64090906 63255390 62461963 62172582 61302663
12087 61302663 61017283 60611813 60126561 60169308 60479738 59198875 58720342 58311119 57600369
12078 57600369 57510820 56621727 56575276 55880549 55262919 54829596 54631926 53530812 53316568
12069 53316568 53039844 52369382 51875310 51436143 50619067 50690047 49910471 49610383 49295939
12060 49295939 49294036 48678252 47693307 48229559 48224001 47875705 46803688 46718946 46434357 46466766
12050 46466766 45771321 45565282 45149876 45077653 44778145 43715976 43105050 42667582 42816767
12041 42816767 42856806 42049594 42230694 41451770 41352869 41111379 40665483 39812456 39460645 39493408
12031 39493408 39558934 39291995 38735037 38421448 38327487 38009939 37117918 36775304 36678632 36575048
12021 36575048 36516876 37348521 36813536 35936276 35535800 34981842 35269091 34785978 34680780
12012 34680780 34362714 34251355 33456075 33166190 33248511 33262664 33291256 32893889 33045973 32151886
12002 32151886 31144168 31500826 31227024 30293441 30420134 30674457 31075365 30979995 30791255
11993 30791255 29875783 30167650 29668849 29510212 29439842 29162351 28945608 28569113 28437297
11984 28437297 28439539 28718974 28470306 27582614 27280753 27417572 27174769 27519057 27594911 27116299
11974 27116299 26722502 26442629 26184345 26108455 26059915 26124297 26029546 25585063 25559555 25542348
11964 25542348 25322973 25067472 24998001 24028652 24249192 24300283 24399414 24539740 24273221 23740684
11954 23740684 23927920 23429667 23534777 23248265 23111371 23095880 22501911 22568873 23094361 22252708
11944 22252708 22272078 22425893 22042429 21880295 21988910 22299104 21322054 21382521 21423888 21687990
11934 21687990 21506636 21787648 22099263 20989352 20428271 20628635 21130007 19938798 20203523
11925 20203523 20152269 19628574 19795966 19919218 19774901 18869623 19279476 19291888 18929731 19156764
11915 19156764 19313806 18957595 18145826 18567042 19000972 17839086 18341511 18646643 18627755
11906 18627755 18072360 17721783 17982717 17957200 17565812 17569862 17326834 17003440 16573798 16937461
11896 16937461 17076669 16910476 16710057 17377528 16714061 16793834 16673981 16182372 16312136
11887 16312136 16169742 16571538 16006344 16112990 16090132 16507629 15985716 15987470 16046986 16048360
11877 16048360 15989375 16454035 16531837 15562103 15108235 14790068 14602089 14424350 14888338 15151211
11867 15151211 15329740 14928089 14753635 14529094 14587035 15128674 15047220 14694083 14584625 13808696
11857 13808696 13659957 13496361 13892346 13847845 14257705 13713996 12970811 13333900 14132603
11848 14132603 14339082 14769883 14639474 13759864 13606067 13637989 13602164 12794724 13602109 12884228
11838 12884228 12481228 13042882 12731145 12758842 12807348 13151462 13128178 12681008 12478206 12407208
11828 12407208 12247924 12249515 12112387 11979243 12196186 11922665 11531171 11395292 11492350 12037329
11818 12037329 11742715 11273871 11971068 12500758 11712175 11716280 11232412 10920615 11223430 10963829
11808 10963829 11327921 11161079 10956781 10640683 9920454 10161954 10697600 10437775 9732039
11799 9732039 10281902 10487784 10976436 10719249 10527901 10321519 10056038 9607261 9572241 9721135
11789 9721135 10125022 10463420 10020101 10188096 10229699 9952097 8957800 9158647 9649415 9983256
11779 9983256 10074193 10025641 10061708 9690992 9979123 9553551 9303556 9613795 9294079 9382440
11769 9382440 9603424 9572257 9503723 9558873 9423101 9047983 8339011 9211746 8810379 8731100
11759 8731100 8494010 8461330 9383791 9143108 8418976 8804699 8792155 8864212 8602031 8483475
11749 8483475 8848956 8597780 8169988 8656510 8823908 8993086 8625012 8237494 8083055
11740 8083055 8462613 8745316 8669394 8286088 8016615 7619874 7791522 7703557 7855691 8293152
11730 8293152 8208333 8411466 7887999 7307066 7722034 7698708 7647480 7963200 8205698 7634116
11720 7634116 6937046 7233935 6998813 7171988 7641145 8035829 7456681 7593661 7404559
11711 7404559 7678587 8050457 8250073 8151101 8025193 7983056 7102712 7555268 7842931 7969583
11701 7969583 7644843 7752838 7261602 6649363 6889686 7214575 7491840 7463685 7299995 7054005
11691 7054005 6586949 6621208 7089865 7503794 7019237 6862554 6552713 6287924 6759342 7244022
11681 7244022 7470791 7069398 7044973 6447076 6704855 7282053 6995801 6834890 7260840 6635823
11671 6635823 6413589 6596980 6752817 6370375 6531620 6402848 6218335 6644736 6441938
11662 6441938 7051654 7337764 6693090 6424896 5830519 5760231 5880451 6153115 5967027 5832839
11652 5832839 5247855 5563834 6080553 5479312 5705431 6395473 6229682 6270306 5757962 6052431
11642 6052431 5848501 6132236 6166671 6051590 5911822 5973904 6176888 6072763 5869147 6334236
11632 6334236 6601108 5422711 4975939 5449315 6501477 6220856 6167094 6080928 6166519 6124610
11622 6124610 5537815 5778868 6282299 5914675 5177281 5292837 5440868 5373327 5348394 5169165
11612 5169165 5058372 5706901 5737996 5240377 5023668 4687525 4678482 4892047 4656269 4979322
11602 4979322 5504860 5484476 5238849 5388716 4979169 4782358 4493133 4562766 4960722 4575012
11592 4575012 4956676 4859279 5118356 5213860 5149632 5030546 4361603 4680700 4920292 4923304
11582 4923304 5112747 4876308 4617876 4512386 4884923 4743680 4509459 4477544 4592907 4873084
11572 4873084 5375672 5205538 5116142 4755507 4816884 4046219 4359310 4553195 4181049 4574583
11562 4574583 4902029 4277407 4652562 5007554 4633350 4221509 3394335 3846907 4163901
11553 4163901 3982714 4493162 4383076 3732387 4063770 3633219 4093063 3570216 3144951
11544 3144951 3689328 3692997 3882379 4196129 5012561 4498907 4173620 4306604 4210691 3761011
11534 3761011 3865758 4219280 4398000 3774065 3959244 3815321 3801718 4327430 3916337 3791000
11524 3791000 3697224 4144562 3928351 4545983 4563297 4091912 4123041 4934072 4702001 4270215
11514 4270215 4355420 4033190 3925311 3843048 4506951 4573008 3578196 3855524 4093490 3834001
11504 3834001 3319548 2651765 3279100 3772445 3892156 3476974 4170275 4024033 4377151
11495 4377151 4204881 3888796 3810658 4016083 4055419 4373547 4776492 3749963 3572887 3937989
11485 3937989 3803637 3605226 3261667 3171555 3729872 3745870 3695234 4117018 4235355 3654120
11475 3654120 3861657 3952915 3617862 3785700 3469555 3688977 3994976 4222339 4836421 4684624
11465 4684624 3786444 3615676 3702285 3977193 3627806 3943191 3955987 4026581 4033530 3544630
11455 3544630 3408430 3006985 3043136 3539843 3302355 3218435 3017670 2635274 2857502 3071343
11445 3071343 3631392 3849442 3276026 2886251 3309978 3375582 3773034 3616128 3784702 3900220
11435 3900220 3770620 3450216 3392202 3221606 4199510 3847573 3406919 3067255 3055066 2435302
11425 2435302 3191649 4191977 4173746 3545862 3677623 3273225 2849812 3287977 3036956
11416 3036956 3002954 3696143 3156631 2917581 3183566 3550533 3536181 3375244 3511390 2903258
11406 2903258 2817542 3167993 3114125 3350962 3297335 2701861 2625487 2601919 2861764 2470807
11396 2470807 2200009 1929562 2334067 2704992 2250594 2592239 3620213 3856528 3408368
11387 3408368 3535457 3879853 2866600 2131288 2212891 2561677 3270316 2734131 2974902
11378 2974902 2933944 3330731 3358524 2971624 2420634 1965332 2717209 2804483 2585322 2716563
11368 2716563 2492134 2640357 3394374 3419319 3251602 3099861 2511283 2500876 2999937 2770469
11358 2770469 2502917 2218644 3028268 2643514 2796750 2530009 2351337 2853061 3010436
11349 3010436 2713776 2272535 1817615 2034128 2424885 3377533 2893193 2690905 3074628
11340 3074628 2991435 2930339 3437369 3244825 2619658 2367216 2616656 2421657 2651998 2842545
11330 2842545 2940422 3097282 2713283 2606863 2528191 2270807 2558651 2794421 2963908 2576114
11320 2576114 2627975 2559366 2522001 2582946 2737326 2672802 2500779 2978431 2780288 2731637
11310 2731637 3212336 3081347 2170978 2392125 2813835 2913772 3039040 3140863 3233666 3038021
11300 3038021 2886070 2465829 2265902 2709807 2356428 2710955 3047763 2811628 2686517
11291 2686517 2572645 2092738 2206896 2197304 2375523 2713032 2749339 2407253 2414236 2142519
11281 2142519 1215653 1688204 1883023 2316880 2635043 2733845 3160374 2172684 2170168 2922122
11271 2922122 2800080 2272718 2121749 2232774 2422293 2143130 2164236 2373317 2708469 2210814
11261 2210814 1950339 2560328 2433851 2128117 1659674 1701164 1780888 2059754 1812809 2412992
11251 2412992 2029083 1777093 1928775 1748086 2391590 2325134 2369661 1893475 2147573 1824529
11241 1824529 1840505 1981882 2622055 2634202 2657892 2170838 2162255 2358642 2368910 2166144
11231 2166144 1867683 2145890 1424497 2133819 2304479 1859803 1901323 1687768 2066698 2458996
11221 2458996 2292341 2026227 1717924 1737030 1929789 1762795 1623188 2263643 2372466 2707662
11211 2707662 2700507 2130352 2182661 2281804 1986064 2218015 2456659 2207190 1660442 1690579
11201 1690579 1633321 1276215 1416087 1569067 1729917 1847627 2488360 2474162 2784290 2512667
11191 2512667 2933288 2845241 2249475 1973949 2273230 2556622 2325421 1951737 2422054 1897827
11181 1897827 2015357 2103346 2170183 2246800 2233729 2348975 1931801 2012054 2255210 2100427
11171 2100427 2238645 1660304 1366527 2212584 2199549 1936093 1651369 2035730 1923548 1066937
11161 1066937 1038426 1342974 804837 1807552 2623827 2902992 2809810 2602615 2935030 2880170
11151 2880170 2704504 2778267 2601007 2601753 2199806 2084026 1650858 1406292 1754881 2254046
11141 2254046 1812424 1844948 2011932 2335889 2471662 2139615 1817609 1705575 1212344 1345350
11131 1345350 1370769 2263628 2271309 1573691 1680783 2148799 2250613 1680302 1623856 1887913
11121 1887913 1595488 1423029 1359858 1905705 2083109 1482578 1763261 2228346 2242463 2762116
11111 2762116 2241204 1600925 1287287 1572836 1610228 845796 1234647 1530065 1672697 1874083
11101 1874083 2291391 1887262 1951185 1918169 1870887 2309219 2345695 1956263 2326907 2054178
11091 2054178 1258639 1454576 2092499 1474534 1467764 1594859 2177749 1944090 1526199 1768293
11081 1768293 1832269 1864577 1898663 1729898 1981480 1606874 1583885 2006435 2148998 2640026
11071 2640026 2462147 1685009 1852952 1918771 1972374 2576820 1389613 1831830 1968203 2180144
11061 2180144 2092408 1916784 1905073 2043122 1422505 1644063 1965818 1598608 1924400 1546250
11051 1546250 1315927 1278365 1211100 1345246 1632797 1567800 1887690 2016001 1934922 1693103
11041 1693103 1672802 1607019 1764990 1784690 2119815 1730173 1989878 2520090 2204020 2230016
11031 2230016 2539164 2278434 2073755 2122832 1746913 975186 1222858 2020070 1475496 1115034
11021 1115034 1259854 1383426 1753383 2326420 2347368 2023373 1689478 1889820 1665237 1419503
11011 1419503 1403798 1693923 1985307 1498830 1677286 2145416 2288320 2238328 1547410 1761678
11001 1761678 1807333 2024792 1799635 1443464 1234779 767540 1309419 1760918 2307547 2406800
10991 2406800 1823275 2087473 2064327 1194620 1634176 1833486 1841635 1911556 1968694 1546903
10981 1546903 1376509 1122296 1657516 2084504 2128998 1511826 1761323 1681749 1371822 1517378
10971 1517378 1791357 2437298 2235944 1522081 1225356 1355460 1187344 1509018 1394234
10962 1394234 1013144 909057 1024222 1212063 1317317 1679742 1833166 2177769 1920665
10953 1920665 1547593 707036 1408591 1050117 1434557 2134968 1743966 1484199 995507
10944 995507 938293 437828 1156013 1861676 2007637 1721039 1257103 1175610 1580291 1510397
10934 1510397 1523829 1032396 1675983 1578078 1720449 1958141 1516825 1470584 1072095 986434
10924 986434 1188979 1316143 1480519 1163272 1415677 1833008 1679621 1471488 1383782 1206384
10914 1206384 1383562 1440688 1406808 1465602 1269088 1264360 1582815 1502076 2128225 1709818
10904 1709818 1575100 1488211 2345228 2108922 2064919 1683057 1618363 1761184 1605129 1787917
10894 1787917 1854511 1730071 1428065 1529156 1864835 1406874 1433171 1411448 1073758 1066131
10884 1066131 1178361 1935820 1572329 1042910 733486 718908 791414 1216392 1185692 1857895
10874 1857895 1683499 1374385 1146761 1466311 1595618 1872338 1491574 1380049 1173468
10865 1173468 893790 1326181 1795010 1729000 1280457 1440345 1483443 1892963 1875395 1344421
10855 1344421 1367524 1256834 1339926 1171668 1479561 1329013 1732761 1515009 1432506 1561611
10845 1561611 1527142 1896920 1241877 1256602 1381969 1096832 1448354 1115452 1426435 1782512
10835 1782512 1496261 1072230 1171130 1333156 1350529 1707205 2042935 1974513 1876249 1611985
10825 1611985 1736083 2026663 2002037 1981538 1407825 1428112 1506977 1649493 1999122 1805128
10815 1805128 1250221 1067014 1605632 1682098 1351136 1422350 1356089 1962581 1486819 1242683
10805 1242683 1198865 1395842 2083454 1538767 1711180 2106178 2216293 2709185 1945554 1767643
10795 1767643 1364812 1589782 2374466 2929128 2652052 2383003 1018814 879168 2039000
10786 2039000 2166857 1915775 1775456 1444816 1512974 1748796 1576261 1462963 1832163 1307621
10776 1307621 1066324 1508019 1811569 1915772 1540696 1462585 1335112 2011239 1492444 1786046
10766 1786046 1864495 1591605 1521145 1111773 656597 309135 810270 1413008 1748392 1052266
10756 1052266 754414 1248584 1684264 1196628 895541 1649267 1473994 1005427 1516112
10747 1516112 1703369 973036 363490 936279 1019757 838653 1313590 746910 1139082 1129296
10737 1129296 1353365 1622240 1912297 1926932 1752375 1095769 720703 806494 1042550 921681
10727 921681 1606723 1873484 1761967 1589916 1242862 1196338 1515907 2081207 1965738 1128932
10717 1128932 898034 1097365 958093 753008 673281 915978 1431229 1719769 2324999 2443961
10707 2443961 1635086 1125458 940957 887162 620823 985866 1858539 2003745 1537763 1472283
10697 1472283 1494597 2020923 1415404 1452450 1187920 1451845 1647900 1684644 1792527 1563464
10687 1563464 2233039 1983784 1903222 1442071 653345 1306449 2172587 1989473 1418446 2057585
10677 2057585 2271191 1835721 2330919 2147505 2052142 1865974 1560291 1427880 1654641 1787443
10667 1787443 1255193 1341251 1232253 1253890 1106721 1176872 1477127 1257394 2098277 2371616
10657 2371616 1845902 2061950 1830864 1706956 1673357 1628733 1289144 827592 1110127 1068408
10647 1068408 1009370 1343697 1529663 1999581 1410992 827704 840463 1783036 1709640 1223850
10637 1223850 1546471 1668991 1412560 1997065 2009680 1395125 1730489 1882166 1945524 1886551
10627 1886551 904657 1892599 2311760 1905221 1747239 1567130 1729017 1430807 1152669
10618 1152669 1432343 1435604 1534633 1250180 1109986 1457962 1353424 1408360 1937211 2162493
10608 2162493 1618142 1746520 1617515 1803336 2040868 1876690 1933018 1907644 1514010 965963
10598 965963 1478582 2016191 2245349 1981622 1332576 799685 718274 823566 1179862 1612333
10588 1612333 1984526 1552868 1246014 1826325 1515952 1544580 1358212 1189104 1069821 1279788
10578 1279788 971062 710058 1033764 1577161 1223114 1164483 1400478 1652471 1288614 1238793
10568 1238793 1429716 1701977 1437300 1529636 1987009 2073291 1551916 1618509 1276343 1175625
10558 1175625 1484880 1534120 1445072 1787564 1329228 726206 713906 744254 1476758 1504139
10548 1504139 1623837 2387362 1741664 1420585 1555162 1946449 2199059 1813135 1321598
10539 1321598 940484 1136388 1369657 1550348 1795326 1748627 1357682 1579675 1848929 1284176
10529 1284176 1403498 1049999 936723 1069509 1239490 1216737 1103870 1313944 1405677 1637853
10519 1637853 1653278 1673734 1333389 1269323 1172294 1460297 1565632 1572452 1813319 1806950 1299098
10508 1299098 1777528 1474989 1221425 964076 1047711 895805 1026176 1041922 1490664 1639294
10498 1639294 1413834 1402839 1539500 1836750 1467868 1839983 1928015 1168594 1425179 1241488
10488 1241488 1599506 1539230 1311755 1179841 1544134 2255004 2235537 1947024 1817274 1953615
10478 1953615 2032795 1975430 1429694 1722472 1345136 2057885 2368904 2113503 1306710 1064615
10468 1064615 1192637 568951 1299057 1430686 1570965 875715 1595198 1987606 1794738
10459 1794738 1860243 1792068 1882482 1645774 1892098 922295 1080856 953648 909127 860875
10449 860875 1359739 1550054 1509173 1656593 1574909 859920 818443 774134 1475456 2233929
10439 2233929 1786501 1879313 1983334 2213957 1815817 1857172 1639266 1947557 1865511 1852898
10429 1852898 1730608 1442997 1976405 2424862 1774529 1137974 1197773 1704371 1627884 1974105
10419 1974105 946561 768073 877935 1182502 1046760 1142288 1755192 1154946 1606164
10410 1606164 1517890 1478086 1584477 997004 1064776 757631 1070001 1879460 1524010 1503321
10400 1503321 1490318 2231806 1655241 1317999 1747253 1414279 1417938 2003012 1834328 1706475
10390 1706475 1688974 1450900 1351298 651063 652110 1490495 1608603 1701460 1655514 1503104
10380 1503104 1780775 1650446 1640248 1654984 1929162 2002791 2303250 2242570 1985367 1797865
10370 1797865 2108810 1724135 1730712 1953354 1736625 1361748 1523186 1619598 849138 1205990
10360 1205990 1431454 1855651 1910996 1801786 1811885 1272351 1293179 1218025 1179662 1567136
10350 1567136 871702 1364853 1645553 1534815 1318913 1340385 1125102 1493354 1535286 1698603
10340 1698603 1550104 1197001 1016619 1006673 1150746 1381038 1150787 1750525 1930572 1809668
10330 1809668 1981505 1537136 1581254 2046410 1814097 1122321 944709 1209875 1727755 1717664
10320 1717664 1911471 1467027 1575347 1790324 1654974 1470844 1544152 1394758 1236509 1639249
10310 1639249 1879404 1483463 1057734 1426464 1490303 1879790 1985658 1905246 1900229 1417927
10300 1417927 1595753 1379392 1078204 1985649 2324119 1954053 1624537 1657515 1778371 1601445
10290 1601445 2044048 2066362 1508487 1281869 1316330 1847504 1727520 1251876 1974497 2132202
10280 2132202 1297718 1602134 1901593 1752479 1630995 1713599 1650247 1832120 1839461 1933721
10270 1933721 2088324 1701262 1243429 1360986 1155544 1026339 765031 851180 1079493 780308
10260 780308 1390601 1794987 1879113 1748620 1674134 1494009 2022347 1836585 2009707 1731800
10250 1731800 1752585 1228822 1576752 1980080 1547493 2070695 2394110 2480581 2529617 2015814
10240 2015814 1857294 1497760 1259576 1168399 1484311 1702192 1542729 1139159 673748 1116660
10230 1116660 1938891 1932974 1566177 1362213 1623240 1543871 1769656 1912146 1800548 1949396
10220 1949396 1999379 1737950 1667459 2020367 1657036 1674169 2642853 2512926 1748575 1524886
10210 1524886 1415031 1486969 1531036 1534163 1551561 1479857 1403205 918355 1185082 1808364 1922170
10199 1922170 2165829 1557730 1405602 1493972 1742115 1815182 2333488 2394603 2026104 2180670
10189 2180670 2040277 1737352 1614871 1696668 1822046 1455694 1692845 1369823 1658722 1645208
10179 1645208 1255634 1533849 1203343 2048447 2604162 1613800 2043884 1912343 1526730
10170 1526730 1867512 1723406 2300436 2556459 2386290 1806894 1999136 2061816 1304300 1368156
10160 1368156 1954890 1764637 1158914 1778093 1562678 1352897 1824548 1643898 1973043
10151 1973043 1784012 1520902 1136828 1751748 1871750 1899976 2115619 1439836 1633529 1395533
10141 1395533 1292762 1601210 2114481 2194809 1655297 1879965 1943234 1821582 1113374 1129539
10131 1129539 1024977 1367921 1652359 1571835 2154252 2292338 1780822 1510651 1540614 1476102
10121 1476102 1418941 2009204 1744515 1386541 1772253 1672565 2286091 1958950 1933478 2241456
10111 2241456 2187888 1846062 1608935 921613 1718832 1421032 795025 956057 1281246 1692839
10101 1692839 1932545 1462113 1845894 1886543 1518448 1368371 1706086 2226247 2220666 2151949
10091 2151949 2410156 1843705 1482230 1076713 1495002 1907395 1729560 1783389 1897202 1940333
10081 1940333 1917814 1772109 2061696 2192176 1676876 2125069 2233815 1794548 1859023 1647435
10071 1647435 1369037 1381331 1910468 1936804 1801026 1925576 2116352 1772004 2119370 2178542
10061 2178542 2337466 2686307 2493046 2408010 2060572 1650297 1624361 2186223 1796155 1982773
10051 1982773 2118866 2204547 1583701 1777673 2192263 2150382 1496373 1953453 1848411 1803200
10041 1803200 2413330 2496715 2119923 2395825 1807589 2191902 1482217 1505680 1856643 2098664
10031 2098664 2094614 2544451 2543725 1739086 1222418 1409231 1569785 1437587 1660491 1457557
10021 1457557 1473100 1115204 1266489 1527131 1848044 2205074 1734371 1621417 1903003 1963376
10011 1963376 1777995 2094836 2106497 2515533 1685296 1297615 1813344 1754506 1560056 1236924
10001 1236924 1572374 1665127 1816444 2248346 2374856 2691854 2463198 2117111 2200242 1553191
9991 1553191 1565819 1713848 1208169 1600245 1679295 1571002 2091926 2198583 1123500 1568663
9981 1568663 2433469 2729261 2593402 1591448 2354016 2863589 2525999 1749656 2479052
9972 2479052 2063643 2487729 2512539 2730031 2531907 2887640 2135761 2087641 2630574 2805080
9962 2805080 2592734 2683277 2649801 2257536 2138537 2080025 2263459 2372206 2521023 2212929
9952 2212929 2077861 1915034 2416535 2639567 2464280 2103079 1981875 2671847 2686530 2263310
9942 2263310 2105240 1844053 2359719 2313333 3022570 2838424 2655318 1624736 1350182 1859963
9932 1859963 2145617 2002978 2318368 2535297 2203989 1907076 1864438 1885024 2144491 2789156
9922 2789156 2632013 2224641 2127157 2834943 2401564 2529143 2469263 2634141 2220309 2265387
9912 2265387 2419339 3040038 3104199 2702642 2752048 2432292 2807966 3036368 2927286 3091293
9902 3091293 2843712 2007856 1820816 2171370 2346894 2360098 2868222 3157712 3503966 3046164
9892 3046164 3094265 3385490 3271470 2878608 2225363 2456685 2098258 2217797 2519945 2700536
9882 2700536 2443825 2434547 2279973 1781276 1820190 2148167 1876339 1591281 1573882 1879565
9872 1879565 2011115 2118434 2078280 1949101 1859678 2169943 1914980 2336391 2577227 2334170
9862 2334170 2222066 1986714 2561965 2453112 2545226 2707462 2993321 3312567 2547352 2207541
9852 2207541 2494486 2368881 2589717 2701767 2727198 2683202 2349155 2063654 2709519 2365381
9842 2365381 2033653 2180959 2382296 2607102 2440226 2255474 3133052 2955670 2800395 2770572
9832 2770572 2674565 2601489 2374855 2971463 3408802 3138140 2809910 3197329 3813849 2900169
9822 2900169 2295088 2892800 2794964 1919684 1516786 2192454 2804387 3364616 3047788 2407255
9812 2407255 2502460 2945711 3280264 2851149 2435356 1605098 1786637 2130323 2324230 2096855
9802 2096855 2402584 2766279 2595423 2215763 2417592 1931627 1897452 2541430 2032214 2650966
9792 2650966 2546856 2608799 2912196 2863162 3248880 2875571 2827609 2776166 2298749 2497131
9782 2497131 3006737 3332740 3623394 3235661 2875716 2553053 2682512 3327580 3415288 3469025
9772 3469025 3008853 2649351 2846669 2870065 2558531 2840452 2238488 1876318 2294000 2691494
9762 2691494 3117293 3201471 3015528 2527560 2638591 2791091 3223492 3599686 3502999 3033395
9752 3033395 2947050 3606088 3481443 3103894 2608603 2617913 2684489 2816122 2638037 3156233
9742 3156233 2849161 2527015 3090311 3044349 3303679 3010623 2952533 3057029 3078634 2674445
9732 2674445 2602860 2658085 3080954 3142123 3486406 3588355 3484321 2946725 2932135 3396291
9722 3396291 4007415 4409590 3539214 3247150 3778410 3655723 3491688 3066229 2991932 3625368
9712 3625368 3330441 3826931 3495177 2769326 2704149 3046531 2594342 3037300 3314430 3653299
9702 3653299 3128448 3110857 3174678 3318054 3968060 3516484 2816873 3695535 3722637 3699684
9692 3699684 3381124 3308697 3026342 2669467 2473633 2625465 3231875 3335661 3465442 3455885
9682 3455885 3032682 3470045 3495147 3052446 3162625 3153486 3534236 3315367 2868488 2732782
9672 2732782 2501851 2709141 3537467 3437167 3274856 2730679 3142537 3667198 3465917 3384300
9662 3384300 3873270 3840226 3364591 3416242 3706387 3534480 3757640 3556957 3510777 3450785
9652 3450785 3407089 3311249 3086313 3093623 3564691 3606242 3428788 2800868 3193784 3353193
9642 3353193 3407112 3867831 3143801 3586044 3958924 4159477 3656664 3427693 3565585 3444007
9632 3444007 3391138 3779561 3842350 3386109 3188976 3249989 3611610 3043864 3652154 3738435
9622 3738435 3319035 2894138 3123714 2970754 3194045 3377737 2706784 3186761 3681155 3453307
9612 3453307 3072981 3238332 3717231 3985216 3680011 3456235 3625879 3463440 3474669 3309705
9602 3309705 3432220 3650445 3651939 3947832 4193373 3896110 3413118 3148944 3977273 3840148
9592 3840148 3209757 3146034 3416109 3750920 3602886 3712477 3522076 3454307 3436049 3959057
9582 3959057 3772971 3667577 3827248 4353074 4333197 4407664 4327200 4013608 3827754 3982745
9572 3982745 4150581 4129512 3811873 3773175 3816727 3711224 3987999 4117073 3954176 4091035
9562 4091035 3926872 3736176 3730669 3761666 3873724 4023959 3839178 3587278 3839011 3920623
9552 3920623 4425814 4421648 4070472 4586113 4501081 3530171 3797312 3924122 3469324 3779314
9542 3779314 4255290 4663053 4926919 4299685 4268527 4455027 4388902 4725663 4491372 3712214
9532 3712214 4325593 4803203 4745973 4649533 3911874 3428519 4250008 4877740 4366628 4542889
9522 4542889 4686103 4909122 4893194 4496936 4524209 4210596 4241782 4015735 4584425 4992478
9512 4992478 4428116 4709717 5285795 5490506 5458024 5214988 5248384 5384483 5055980 4866433
9502 4866433 4804386 4684728 5116578 5276142 5342283 5158432 4837328 4636813 5251175 5792130
9492 5792130 5184946 4998694 5555610 4805375 4755612 5211538 5295415 5252979 5746855 5353457
9482 5353457 5599687 5466873 5114774 5776175 5325448 5354834 5105805 4951677 4932199 5317579
9472 5317579 5480531 5211548 4930789 5284875 4933354 5221624 5517277 5816309 5539691 5205386
9462 5205386 5338184 5424665 5568941 5603382 5526661 6012933 5467515 5796749 5635993 5390286
9452 5390286 5552118 5407521 5587217 5451972 4790902 5390247 6227656 6230159 6011636 5898540
9442 5898540 6103948 6288028 6137071 6401157 6336905 6528952 6063900 6009500 6743626 6440496
9432 6440496 5948610 6240716 6249962 5676669 5313921 5952639 6477316 6331404 6523645 6288118
9422 6288118 5973896 5843057 6557172 6450889 6469342 6714192 6295463 5850145 5606460 6167033
9412 6167033 6352425 6675174 6976454 6986903 6461547 6546171 6776830 6466414 6644966 6173012
9402 6173012 6171494 6748593 6885886 6594226 6534110 6683320 7099463 6481355 6570067 6939833
9392 6939833 7032079 7064610 7281470 7322292 6887698 6497136 6546180 7397441 6998720 6897436
9382 6897436 7939242 8639308 8216089 7890412 7406924 6324675 6670200 7351422 7024653
9373 7024653 7036706 7461335 7882538 8582808 7644669 6977078 6711062 7031765 6830607 7173258
9363 7173258 6835121 7574132 7512458 8287068 8215906 7623139 7474856 7356103 7741424 7831031
9353 7831031 7350967 8152412 8098566 8169559 8025829 8024462 8298705 8168062 8401781 7959087
9343 7959087 7601041 7478570 8009881 8345150 8686765 8411171 8266789 8694709 9320677 9174696
9333 9174696 8799978 8763340 9492098 8790599 8563268 8787647 8727881 9230365 8955855 9055751
9323 9055751 9130657 8700709 8814900 8722020 9343961 9383891 9286693 9313988 8868414 9059670
9313 9059670 8916915 8732582 9308994 8915823 8696905 9015329 9187086 10172665 9985696 10039145
9303 10039145 10709107 10408227 10504857 9805265 9642558 9982176 10414775 9442222 9295025 9230683
9293 9230683 9567883 10012856 10533437 10541831 10601316 10982360 10461963 9963387 10681422 10724278
9283 10724278 10339915 11104928 11102486 10762691 10237198 10394948 10267362 11039192 11642562 11159461
9273 11159461 10802641 10817980 10851278 10547099 11406656 11667555 11788042 11942557 12554724 11851364
9263 11851364 11341885 11592938 12101915 11606031 11100347 11433229 11472498 11277423 11650469 11905562
9253 11905562 12089743 12126374 11710090 11686268 12437701 12440345 12379051 12458188 12256044 12253077 12016978
9242 12016978 11632407 11560917 11713430 12563088 13153069 12788968 12755753 12660290 12739860 13056583
9232 13056583 13529937 14275899 13679976 13228612 13199488 13527270 14134836 14152968 13672485 14171036
9222 14171036 14206548 13395607 13915161 13430984 13982782 14288662 14218568 13846135 13972248 14353621
9212 14353621 14699107 14351872 14517747 14630690 15017673 15211761 15432169 15414927 15504264 15273579
9202 15273579 15334705 15126927 15226424 15425179 16043282 16112802 15643541 15239139 15891153 16053285
9192 16053285 16461646 16382413 16588765 16852525 17057699 17357498 17000652 16912384 17362968 17034057
9182 17034057 16827449 17320448 17342101 17709533 18425102 18697463 18579406 18796379 18823421 18903008
9172 18903008 18812991 19588814 19326015 18929878 18978464 18934468 18880832 19389448 19639340 20018957
9162 20018957 20340758 20649926 20722275 21418166 21536470 20704448 20382840 21242595 21625732 21643329
9152 21643329 21194796 21492517 21961805 21674674 22122613 22423469 22282762 22473366 22701706
9143 22701706 23134303 22352456 22698287 23390315 23518003 24263042 24130817 23961703 24869513
9134 24869513 24690335 24872416 25313389 25447891 26088087 26052133 26116847 26572416 26966195 27042698
9124 27042698 27351277 27629918 27448253 27358644 27769793 28248085 28521669 28768836 29435675 29157508
9114 29157508 29150822 29487191 29857137 29828802 30175788 30646374 31331931 31846983 31529655 31878471
9104 31878471 32418347 32691378 32940165 33163447 33873949 34479125 34846477 35096229 35993201
9095 35993201 35834162 36465660 36480200 37107234 38117694 37901640 37769270 38505364 38962495
9086 38962495 38949105 39626888 39905699 39776389 40113520 41109495 41533636 41704279 41455242 41497896
9076 41497896 42496880 43107372 43339454 43671911 44226690 44506683 44558936 44696005 45009528 46042941
9066 46042941 46220699 46381017 46257474 46361398 46329337 46863828 47145001 48168153 48705927
9057 48705927 48517618 48533585 48953696 50202683 50557502 51133412 51427616 51622520 51944899
9048 51944899 51771933 51770671 52627260 53367601 53341889 54411459 55313001 56545337 56448444 56396630
9038 56396630 56894748 58054707 58840889 58629261 58999957 59934968 60881813 61035308 62189898
9029 62189898 62586513 62871963 64180139 65482479 65912132 66719771 67727135 68658241 69322812
9020 69322812 69007118 70185112 71682957 72461813 73896152 74834704 75371557 76342275 77895344
9011 77895344 79139937 79915703 80736895 82052282 83653228 83748878 84533785 85842702 87122631
9002 87122631 88113781 89642469 91067913 91738720 93393136 94722424 95829424 97142827
8994 97142827 98778794 100307589 101184455 102482257 103765197 105346309 106592266 108697575
8986 108697575 109987624 111636763 113395429 114641688 115995125 117250696 118975707 119941972
8978 119941972 121478991 122774414 123991722 125209540 126047596 126995971 128780096 130007261
8970 130007261 131157497 132409712 133388850 134222174 135106032 135654932 136030086 136769166 137477951
8961 137477951 137921622 138384453 138901886 138976522 138712733 139406261 139378926 139249993 139239788 138916211
8951 138916211 139233543 138771201 138018722 137868425 137763827 137727365 138021080 137339762 135319534
8942 135319534 134888165 135114105 134879358 134409243 133926147 132570643 131887499 131259876 130517133
8933 130517133 130121387 129477695 128504194 128240273 127024055 125904735 125484774 125395849 124237022
8924 124237022 123363166 122369257 121264406 119799954 118840737 117674984 116929789 115399174 113759646
8915 113759646 112431101 111477381 111154130 110351722 108767915 106917213 106193820 104656377 103673047
8906 103673047 101194438 99821400 98549938 97690591 96545790 95086198 93806440 92497815
8898 92497815 91595350 90407535 88794885 88399385 87046703 85929273 85302712 84078728 82113413
8889 82113413 81459756 80388292 79289655 79063712 78462648 77485821 76662765 75267061 73866040
8880 73866040 74057112 73328867 72048533 71496282 70505224 69015287 68149987 67070005 66636009
8871 66636009 65399323 64437088 64063608 63790630 63046904 62541823 61931189 60974685 60890999
8862 60890999 60100251 59226606 58260793 57928040 57994682 56724419 55708865 54888242 53974590
8853 53974590 53998913 53316589 52797942 52559786 51724116 51202506 51264583 51575950 50627590 49869085
8843 49869085 49516913 49401032 48889805 48108681 47951455 47922868 47940175 47855601 47559658 47326107
8833 47326107 46559036 45392934 44932263 45094891 43970927 43099475 43397495 42781393 42005689
8824 42005689 41791890 41990352 41599179 42189054 41579105 40558435 40679217 40683915 40444620 40887919
8814 40887919 39769405 38915199 38792014 39178621 38770037 38501353 37847395 37346866 36773934
8805 36773934 36097929 35791832 36047387 36276537 35869606 35413174 35122707 35475142 34981484
8796 34981484 34797695 34844460 35317370 34423209 34181344 34098781 33885149 33785832 33205273 33344790
8786 33344790 33202097 33583986 33497774 33192424 32986439 32473105 32524788 32082195 32013270 32211054
8776 32211054 32682406 32108857 31731129 31771358 31587686 30963169 31055014 30498304 30066482 30675667
8766 30675667 30828203 30106434 30304921 30253815 30521481 30610039 30112665 30344488 30012523 29447952
8756 29447952 29795332 30065701 30106601 30601548 30177966 29715335 29778040 29582271 30008921 29867824
8746 29867824 29906145 29960642 30077188 29908866 30599332 30402724 29736207 30167878 30343677 30699985
8736 30699985 30726823 30608073 31241818 31105865 31135603 32122416 32227248 32204677 33070026 33874866
8726 33874866 33581389 34364937 35100906 35131682 35685294 36592528 37294795 38746989 39964233
8717 39964233 40889027 41811529 43421613 44802932 46456914 48963584 51710112 54138128
8709 54138128 57954223 63283636 69245182 76193950 85108751 97265006 113490436 131618574
8701 131618574 148718413 160258964 161440630 148741918 127966824 108471253 92690916
8694 92690916 80149364 71049695 63956546 57124429 52116794 48058402 44492542 41450588
8686 41450588 39826260 37643830 34896652 33702777 32483913 31239787 30638283 29932176
8678 29932176 29071595 28142644 27915256 27155124 26282942 26656220 26174126 25320769 24512600
8669 24512600 24390381 24214730 23699634 23181870 23277604 23005353 22257668 22131393 22130084 21415252
8659 21415252 20572349 20358825 19840428 20145811 19848164 19281240 19836505 19429986 19293737
8650 19293737 18770385 18948678 19417427 18354839 18666212 18488567 18039052 18440394 19265101
8641 19265101 18508865 17803698 18368847 18195902 17526988 16927193 17428020 16925607 16231387
8632 16231387 16692776 16274435 16471619 15998554 16238594 16504278 15745285 15891451 15776207
8623 15776207 15688707 15494120 15718942 15417419 14571570 14445646 14399674 13981468 14163506 14554758
8613 14554758 14822095 14599616 14941179 14917210 14746071 14894187 15037987 14152679 13401754 13798702
8603 13798702 13650786 13522739 13439210 13837040 13204380 12590294 12565178 12625354 12918842 13197137
8593 13197137 13226650 13312402 13268271 13343550 13084985 12658984 12718274 12192989 12748113 13322005
8583 13322005 13188685 12761341 12244212 11746759 11981377 12257481 12354452 12581241 12351107 12178604
8573 12178604 12006996 12114783 11883216 12218614 12769834 12182677 11569559 11508855 11459831 11074808
8563 11074808 11235603 11425732 11089959 10978620 10961616 10629985 10097511 10922965 10651415 10617518
8553 10617518 10256558 10487482 10650050 10587347 11105332 11285317 11137392 11057190 11352528 10842845
8543 10842845 11126475 11208784 10139895 9655001 9994571 10095147 10231525 10005528 9706667
8534 9706667 9285431 9516435 10108816 10591330 10095942 10159249 9877964 10134482 10168301 10137904
8524 10137904 10470858 9749239 9916273 10034209 9652699 9771440 9587681 9489830 9531355 9283200
8514 9283200 9691594 9230606 9576633 9346130 9245657 8907003 8841098 9308604 9351784 10168238
8504 10168238 9726984 9232519 9335762 9559533 9989658 9586404 9262981 9160843 9472835
8495 9472835 9603623 9043447 8784169 8721291 8916256 8663272 9167342 9151669 8736976 8819414
8485 8819414 9063449 8664284 8309321 8810551 8660326 8255964 9011551 9264329 9132840 8635519
8475 8635519 8095724 8355368 8483798 8520843 8506545 8786768 8675193 9142701 9014434 8278176
8465 8278176 8673241 8303544 7846273 8409487 8367396 7693655 8109349 8709307 9164649 9123092
8455 9123092 8625425 8790255 8774444 8069568 7959877 8781016 8927228 8825308 8630910 7868110
8445 7868110 8025177 7692247 7521401 7662744 7990238 8640435 8372189 7937646 7846961 7931176
8435 7931176 7641172 8309436 8337923 8520075 8014936 7919552 7821464 7790472 8085153 7706499
8425 7706499 7472897 7938060 8394105 8232987 8426477 7936588 8291449 8103558 8183499 8243223
8415 8243223 8260467 8205792 8088274 7887516 7624955 8364756 8613096 7700421 7167830 7619347
8405 7619347 7977984 8761590 8543454 8168722 8513403 8335170 7810951 7687258 7585952 7963592
8395 7963592 7576615 7304254 7543715 7280409 6554428 7439231 7923902 8160228 7917099 8029797
8385 8029797 8010630 7577012 8006966 7628961 7498252 7428895 7781571 7621065 7189026 6945382
8375 6945382 7406792 7695410 7865035 7300605 7469541 7714707 7634583 7467426 7587222 7814058
8365 7814058 7554765 7204638 7383361 7429788 6907564 6783974 7181135 7009478 6614419 6560684
8355 6560684 6981112 7181820 7368869 7284073 7155402 6953673 7491742 7859544 7906193 7663252
8345 7663252 6904727 6931551 6916686 6640122 6755855 7019620 6747026 7563793 7396622 7014990
8335 7014990 7590165 7868230 7472794 7057554 7246244 7206403 7123005 7729093 7760454 7850168
8325 7850168 7188323 6956108 6427933 6515444 7030835 7409909 7121052 6852579 6809760 6706672
8315 6706672 7267315 7055320 7317427 7240856 6902516 7364815 7371862 6910118 6728827 6581752
8305 6581752 7078760 7243850 6719624 6773484 6816127 7055024 7171953 7034998 6816409 7395086
8295 7395086 7005628 6180708 6911478 7211406 7268674 6907496 6972982 7321097 7614616 7583986
8285 7583986 7347726 6959227 6679230 6658016 6231281 5874117 6581402 6285615 6544317 6559247
8275 6559247 6436458 6486360 6293628 6496533 6715274 6573882 6190627 5754784 6859719 6975685
8265 6975685 6265449 6745021 6817992 6439424 6475849 6482486 6550837 6968225 6443640 5842840
8255 5842840 6188035 6722266 7325735 6666361 6090094 6628528 6573548 6350646 6012785 6064514
8245 6064514 6109413 6056083 5595375 5564695 6423664 6408945 6608482 6848393 6529226 6414282
8235 6414282 5664193 5621696 5731904 5981786 5894145 6170491 6058467 6506128 6227143 6092570
8225 6092570 6364122 6234280 6742785 6475198 6240785 6269957 6089418 5835871 5751335 5634376
8215 5634376 5953591 5812230 5883559 5792946 5249060 5651818 5597479 5741673 4869764 5499000
8205 5499000 5323056 5481813 5991955 5750659 4951582 5112052 5078382 4840498 4652078 5089209
8195 5089209 4232120 4283222 1953813 2858715 7543838 6632155 6871154 6141959 6843157
8186 6843157 6600096 6402738 5437333 6087614 6207929 6321492 5804226 6006547 6303982 6284478
8176 6284478 5975375 5602234 6168591 5617687 5142640 5512877 5600021 5219902 5247857 4998600
8166 4998600 4904420 4931168 5116916 5223462 5981119 5694061 5327593 5035109 5259284 5809056
8156 5809056 5928797 6214294 6232994 6659380 5862472 5305410 6089117 5887550 5869635 6264745
8146 6264745 6140372 5755807 5747135 5604211 5287333 5061869 5021936 4823112 5027721 5320223
8136 5320223 5501265 5189887 5016703 5066974 5639499 5732187 5496718 5218343 5290537 5117281
8126 5117281 5082917 5042794 5330310 5105204 5150068 5097316 4748029 4501345 4262468 3681705
8116 3681705 4032607 4368118 4254816 5175289 5664980 5226391 4513181 4820004 4823044 4866679
8106 4866679 5348172 5602628 5615091 4904034 5223465 5091453 4685567 4610362 4734443 5392946
8096 5392946 5391795 5585192 5377621 5435365 5537825 5195249 4986241 5432131 5314484 5136658
8086 5136658 4332626 4621666 4871591 4960974 5015268 4539050 4256832 4564755 4456285 4315527
8076 4315527 4642514 5213968 5294684 4461197 4776488 4738840 5105906 4988306 4823109 4749023
8066 4749023 5109229 5925506 5707234 5680171 5672728 5347309 4771819 5264631 4963748 5462654
8056 5462654 5581001 5509024 4925320 4911122 5010108 5834499 5133677 4781865 4826644 4744122
8046 4744122 4619232 4225512 4822356 5314273 4834026 4325466 5178619 5086215 5700590 5217392
8036 5217392 5150017 5104062 5577592 5158103 4829890 5688839 5709589 5679886 5189224 4911592
8026 4911592 4903876 4903676 4592552 4132671 4666735 4408309 4605884 4763968 4807060 4557699 4764574
8015 4764574 5098784 4529502 4634001 4886679 4905712 5180583 5357023 5496865 5227612 5503183
8005 5503183 5880413 5796730 4977647 4727149 5051862 4542078 4689656 4707386 4918966 5462511
7995 5462511 5162343 5282563 4865809 4266213 4635703 4984406 5149760 5812352 5354643 5205408
7985 5205408 5224188 5707817 5390396 5485513 5206833 4874944 4677176 4492810 4927189 4586580
7975 4586580 4624335 4703536 5131346 4924121 5123238 5004907 4885889 4901153 4553861 4548399
7965 4548399 4942666 4708259 4562201 4755994 5037601 5067869 5337578 5441057 5431445 5239841
7955 5239841 5291968 5255606 4839722 5241814 5089608 5445091 5932379 6140859 5314968 4764476
7945 4764476 5499900 4818290 4965722 5728816 5331359 5451885 5555471 6085104 5852338 4753340
7935 4753340 4918872 5354254 5119856 5495410 5629400 6428643 6231802 5491576 5777188 5335934
7925 5335934 5836215 5680827 5706801 5595315 5961514 6200893 5396145 5254688 5785735 5390462
7915 5390462 5075486 5464325 5717363 5963509 6073712 5689244 5237155 5314372 5663405 4775233
7905 4775233 5390483 5804386 5936166 5547389 5668522 4891703 5332216 5915689 5317419 5810165
7895 5810165 5813246 5281326 5266313 5488746 5403850 5574988 6141769 5956021 5480028 5559474
7885 5559474 5492600 5886184 6057592 6081741 6224356 5662876 5305109 6036495 5938737 6168285
7875 6168285 5800815 5206095 6094790 6338112 5786517 5706103 5841857 6293521 6263559 6016038
7865 6016038 6021865 6245111 6483764 6498801 6489400 6518241 5912681 6480076 6408924 6048304 6014360
7854 6014360 5787896 5882287 6136486 6277451 6279739 6347133 6242927 6086864 6100028 6033453 6416031
7843 6416031 6901926 7246356 6453398 6810339 7165819 6972771 6597797 6674363 6095316 6065767
7833 6065767 6202680 6111283 6184186 6648193 6317776 5520831 6210589 6152420 6116997 6286276
7823 6286276 6039223 6834283 7459723 7160962 7251784 6874984 6941053 6927685 7377994 7342652
7813 7342652 7801987 7558996 7050524 7457043 7417968 7420345 7574026 7249050 6922572 7493433
7803 7493433 7455729 6671779 6466863 7467799 7037906 6509595 7186177 7355336 7213894 7459134
7793 7459134 8105819 8325805 7866748 7629756 7756345 7562743 7952854 7807821 7254133 7134732
7783 7134732 7417115 7342985 7348843 7479841 8021733 8588687 7996726 7590765 7490275 7702076
7773 7702076 8807633 8987010 8449963 8306306 8748407 9314235 8678691 8373073 7754473
7764 7754473 7400672 7969667 8250889 8200493 7816181 7383547 6991895 7558501 7855889 8217059
7754 8217059 7881200 7942760 8663564 8206978 7391330 7675612 8515540 8730716 8710163 8526941
7744 8526941 8547634 8403081 8864025 9396866 9158300 8522424 8737632 8530937 7863257 8433620
7734 8433620 9356667 9732957 9104598 8580422 8649546 8902077 9175418 9227947 9254582 9003456
7724 9003456 8782820 8821180 8617352 9015106 9097009 9625490 10066849 10082122 10113996 9755507
7714 9755507 9314730 9648758 9470814 9735582 10102253 10595468 10551992 10149869 10044768 10407520
7704 10407520 9976065 9690804 9404720 9123696 9564760 9899803 9817997 9490586 9833962 10061644
7694 10061644 10169452 10212506 10629301 10991665 10381024 9915623 9945720 10598194 10683046 9898788
7684 9898788 9749743 9593262 9916438 9661290 10236825 10600976 10311011 10303501 9845194 10488893
7674 10488893 10871231 9956586 10103078 10503590 10967825 11179887 11048931 10709535 10479392
7665 10479392 10437835 10565072 10241189 10577146 10094399 10786297 10986383 11319465 10725659 9945466
7655 9945466 10439612 10800441 11142815 11102050 10490890 10300413 10599904 10713330 10164254 10484169
7645 10484169 11029749 10338170 10416351 10063999 9860260 10475581 10677261 10460377 9903217 9693113
7635 9693113 10267671 10831644 10603043 10647905 10933136 10816784 10754874 11137064 10605956 10390538
7625 10390538 11006872 10565468 10395261 10400823 10459712 10182648 10393712 10400677 10637908 10912831
7615 10912831 10653880 9869479 10464895 10775419 10983229 10366100 9769783 9621602 10364285
7606 10364285 10464489 10499516 11060688 11394732 10681493 10133990 10205985 10095754 9869204 10312467
7596 10312467 10490512 10715905 10812770 10891785 10593338 10656360 11139233 10720353 10344054 9998433
7586 9998433 9823301 9918921 10468594 10293422 10645072 10704007 10755304 10651355 10740248 10092278
7576 10092278 9877917 10152245 10353238 10374961 10141339 9708774 9635494 9884458 9363846 9595512
7566 9595512 10049296 9825308 9676366 9471461 10083718 9651011 9399094 9405225 9983975 10079566
7556 10079566 9976440 9681163 9356416 9292435 8922897 8834575 8765137 8901285 8899483 8777073
7546 8777073 8316989 8876940 8838009 8545113 8910218 9245707 9196357 9152438 8709518 8293400
7536 8293400 8357265 8120704 8506831 8847479 8665746 8439108 8459415 8600068 8749134 8412996
7526 8412996 8427213 8138237 7982915 8072827 7390932 7105627 7023525 7450815 7512394 8058096
7516 8058096 8075267 7194695 7135432 6711126 6788214 6777199 6792394 7814907 7520088 7277992
7506 7277992 7256433 7291532 7293070 6952508 6850099 7294469 7134775 7208287 7340926 7538194
7496 7538194 7721746 6919189 6374066 6518426 5905554 6202871 6482410 5996447 5512975 6491690
7486 6491690 6159499 5840556 6064526 6139278 5991230 5426302 5714093 6130213 6245957 6197478
7476 6197478 6272450 5536020 6046910 5876417 5756595 6117032 6138216 6222457 6323752 6467949
7466 6467949 6486914 6254504 6578224 6096296 5972526 5553927 5466847 5743246 5917640 6361702
7456 6361702 6352070 6142215 6036943 5563211 5992065 6148574 6075882 5944609 5840692 5877607
7446 5877607 5830546 5729212 5855500 5093825 4813836 4956291 4911912 5518573 5224225 4952109
7436 4952109 5428772 5865764 5426159 5327015 5748159 5731496 5159998 5059195 4807516 5533262
7426 5533262 6031881 5523409 4803345 5108291 5624735 5519045 5775261 6021007 6028069 5654265
7416 5654265 5636127 5021816 5247809 5021607 4642131 4666705 4496227 4029894 4288583 4527692
7406 4527692 4859448 4884453 4659474 4550824 4269154 4485605 4268393 4941789 5168880 5390995
7396 5390995 5298922 5434146 5056133 5012649 4646397 4042278 3975649 4270102 4120894 3766256
7386 3766256 4234068 4890463 4027680 3910486 4424270 4143189 4242461 3930476 3732360 3901246
7376 3901246 4466828 4574635 3793990 4027427 4037110 3645394 3600370 3549417 3161787 3438601
7366 3438601 4198005 4243593 4130448 3738374 3942752 4242108 5086074 4827268 4638801 5332263
7356 5332263 4877432 4461687 3949075 4027874 4350047 4143828 4277718 3657736 3483084 3450384
7346 3450384 3271456 3517303 3677369 3619665 3447212 3234408 3368582 3895549 4042503 4193440
7336 4193440 3408012 3526627 3950079 4057684 3094834 3000534 3497606 4591871 4644318 3608844
7326 3608844 3807883 3672857 3383959 2937712 3512896 3605478 3167005 3102666 3936013 3764877
7316 3764877 3526101 4026747 4209335 3601197 3550958 4576998 4273811 3726823 4280244 3760047
7306 3760047 3390165 2991659 2883010 3419626 3647099 3753829 3586245 3174892 3376530 3566849
7296 3566849 3797070 3053566 3113882 3765932 4172102 3659195 3437551 3435569 3036411 3461525
7286 3461525 3946072 3949957 3636910 3563920 3377656 3538158 3357299 4150639 3592933 3477592
7276 3477592 3574612 4078756 3853314 3482369 3667459 4319459 4228324 3710755 3648022 3548469
7266 3548469 3743432 3539801 3628974 3650185 3963923 4364577 4033822 3752253 4232859 3721231
7256 3721231 3811034 3788837 3082220 2755750 3552733 3749778 3550209 3639425 3570322 3513164
7246 3513164 3375679 3018484 3373128 3329299 3623710 3865432 4172178 3981784 3658339 3529928
7236 3529928 3626684 3219139 3338591 4008229 4227976 4222910 3639104 3515114 3110410 3033257
7226 3033257 2571983 3536771 3591178 3865260 3363523 3549219 3955875 3774721 3796301 3120858
7216 3120858 3473322 3906727 3515374 3157518 3087394 3334633 3153947 2949509 3634953 3764178
7206 3764178 3631022 3071569 3040683 3205299 2837254 3506284 3145199 2735552 2921971 3144669
7196 3144669 3136795 3637509 3956820 3420533 3697182 4168541 4720111 4048243 3522971 3308199
7186 3308199 2929190 3000356 3168170 3348662 3399943 3138548 3044741 3429794 3527757 4099752
7176 4099752 4197701 3899846 3750570 3032094 3180276 3858617 3338467 3286357 3682190 3351259
7166 3351259 3338310 2913479 2726761 2717713 3049737 3088147 3614036 3584852 3358298 2849360
7156 2849360 3307749 3770980 3288031 3293739 3416561 3214793 3992276 3782228 3684952 3979774
7146 3979774 3773632 4182409 4005538 3634298 3830535 3625485 3492713 3690042 3505054 3196829
7136 3196829 3134986 3685923 3683521 3391539 2964510 4006924 3916509 3274491 2978538 2831659
7126 2831659 3337985 3352055 3434345 3640703 3153201 2572710 3011243 3379114 3632144 3361347
7116 3361347 3359833 3100918 3742404 3613808 2936313 3167722 3146018 3438087 3226281 3453337
7106 3453337 3632309 3239859 3149318 4051549 3447416 3413360 3491213 3465361 3358324 3676393
7096 3676393 4296148 4014529 3618762 3408623 3655876 3514509 3381793 3613009 3535296 3151527
7086 3151527 2963620 3947956 3117175 2911264 3207808 2558921 2805288 3669391 3304926 2675476
7076 2675476 2489232 2121681 2580158 2804023 2349604 2418455 2636115 2628432 2769336 2428648
7066 2428648 2545280 2597059 3001090 3086768 3442853 3583491 3047650 2924525 2739690 2996106
7056 2996106 2520424 2568189 3387326 4142429 4216024 3593945 3514582 3583044 3664734 3091773
7046 3091773 2862958 3288728 2846741 2783803 3384874 3484703 3036933 2912161 3337079 3326533
7036 3326533 3370473 3678692 3491003 3087283 3229569 3199293 3163670 3181113 3371373 3439634
7026 3439634 3472349 3615833 4166862 4082309 4166616 3202499 3081868 3795350 3977139 3554904
7016 3554904 3566588 3792243 3753866 3885327 4430780 4269678 4032929 3631952 3777405 3915371
7006 3915371 4063897 4447871 4034869 3592202 3321525 4046840 4144890 4460122 4524910 3615193
6996 3615193 3146400 3470717 3421586 3291773 3897709 3677732 3040255 3271289 3363471 3502563
6986 3502563 3462189 3177054 3078862 2965284 3652246 3650668 3313047 3865050 4209997 3856792
6976 3856792 3520938 3620015 3931200 3786243 3980135 3701180 3386981 3637391 3929093 4090343
6966 4090343 3755254 3711153 3512356 4018597 3596873 3207457 2984716 3526159 3733795 3585110
6956 3585110 4306476 4554616 3824187 3198366 3050865 3305519 3546137 3508626 3272492 3641418
6946 3641418 3666004 4047196 4153788 3837190 4494700 4531790 4424258 4365967 4317100 4275628
6936 4275628 4395090 4423886 4223555 4089320 4346283 3904445 4386772 3975084 3569270 4058742
6926 4058742 4029002 4142223 4346106 3942810 4002036 3992462 4207009 4220919 3816377 4608245
6916 4608245 4625748 4432067 4047721 3213786 3338727 3072818 3496615 4279271 4287325 4851846
6906 4851846 4470383 4556929 4246470 4570773 4377191 4098778 4307284 4102253 3730247 4097385
6896 4097385 4263828 4303675 3999209 4201222 3533569 3620514 4325453 4291166 3918606 4001068
6886 4001068 4087637 4368576 3996987 3925026 4790746 4724366 4137747 3917634 4320573 4437927
6876 4437927 4452688 4335514 4514891 4839929 5186017 4941497 4582462 4631244 4822274 4656039
6866 4656039 4487454 4363966 4513470 4926205 4882763 4220375 4564286 4620961 4599852 3647689
6856 3647689 4074309 4481770 4701830 4968962 4423014 4336944 4007710 3702662 3884520 3861365
6846 3861365 3673786 4048954 4622023 4866331 4586012 4528946 4680548 4788706 4841586 4559878
6836 4559878 4719412 4648087 4805867 5051342 5392224 5182210 5372619 5261490 5590081 5721284
6826 5721284 5434679 4655808 4478766 4278140 4572566 5087147 4610991 4110910 4113059 4551270
6816 4551270 4877584 4740915 4661190 4651736 4889178 4709851 5045442 4891954 5018952 5666642
6806 5666642 5628683 5704396 4921540 4856576 5063552 5446208 4790560 5254109 5407907 5087659
6796 5087659 5138926 5544329 5582136 5489811 5551577 5815357 5202660 5316862 5561942 5295393
6786 5295393 5420334 5801236 5404740 5155701 5574939 5914635 5581053 5265233 5470815 5716110
6776 5716110 5511367 5202640 5387504 5572776 5178825 5917014 5745559 5141832 5168867 4924382
6766 4924382 4997632 5348846 6056223 5609786 5560279 6219837 5938227 5802556 5525487 5869263
6756 5869263 6332821 6404491 6155620 5630125 5485220 6189459 6724178 6700321 6728320 6136112
6746 6136112 6386063 5997216 6350948 6380728 6143829 6174912 5695403 5777914 5822870 5883134
6736 5883134 5558788 5953880 7113447 6036718 5814411 5597259 5683161 5344447 5641148
6727 5641148 5526484 5702257 6277160 6225913 6511804 6132650 5914272 6099867 5883083 5803869
6717 5803869 5692622 6246924 6192803 6064509 7138981 7316079 6974455 6267951 6796937 7211153
6707 7211153 7190776 7198962 6677711 6592099 5985989 6631657 7242123 7002130 7053560 6691666
6697 6691666 6826782 6693307 7106952 6764993 6331049 6582159 6745891 6852331 6487421 6661732
6687 6661732 7340612 7135735 6949967 7074364 7682061 7511693 7329377 7381135 7396038 7887198
6677 7887198 7490531 6542641 6806337 7189079 7552630 7712206 7630958 7480405 7253459 6920721
6667 6920721 7146556 7380291 7570972 7130153 7666116 7605439 7665030 7612016 7892913 7567992
6657 7567992 7397031 8170424 8001425 7690383 8223830 8134355 7460742 7826802 7084834 6834677
6647 6834677 7074784 6782797 7055243 7860759 8253999 7972759 8130552 7766379 7826885 8640330
6637 8640330 8207231 8590920 8218407 7751104 8026011 8326979 8026743 7918506 8145205 8267140
6627 8267140 7753465 8404982 8881483 8411840 8580373 8478191 8334401 8785233 8779063 8795795
6617 8795795 9041106 8583502 8238164 8231991 8677607 8719284 8926594 9341434 9614077 8912486
6607 8912486 8920211 8798518 8826343 8829397 8712150 9017423 9371631 9311191 9699255 9639080 9349160
6596 9349160 9913443 9374890 8993415 9544450 9292391 8408598 9380928 9195252 9490473 10458693
6586 10458693 10358732 9920631 10479808 10034221 9572328 9359618 10029945 9558674 9909099 10095263
6576 10095263 9323789 9333930 9648357 9994363 10282333 10301405 9839625 10407968 9576471 9854829
6566 9854829 10399367 10560685 10111199 9794644 9951175 9568924 9886920 10163393 10045471 9963020
6556 9963020 10993411 11400058 11012466 11189456 10356962 9961361 10635766 10342912 10641626
6547 10641626 10539001 10651723 10932356 10571211 10304964 10411108 10248708 10057193 10285010
6538 10285010 10739069 10242802 10160029 10163709 10508528 11177673 11037453 11329143 11503917 11068545
6528 11068545 10806821 10292805 10489419 11226398 11213341 11454257 11496563 11132508 11139793 11869796
6518 11869796 11615653 11549573 11766967 11750495 11549130 10776869 10698815 11085608 11911359 11980385
$$ [...]
##END NTUPLES=NMR SPECTRUM
##END=
