##TITLE=1H_CA-9076x4
 CDCl3
 8 sc, 
 26.10.2022
##JCAMPDX= 6.0         $$ Bruker NMR JCAMP-DX V2.0
##DATA TYPE= NMR SPECTRUM
##DATA CLASS= NTUPLES
##ORIGIN= UXNMR, Bruker Analytische Messtechnik GmbH
##OWNER= root
$$ XWIN-NMR		Version 3.5
$$ Wed Oct 26 15:14:46 2022 Russian Standard Time (UT+4h)  she@DPX200
##.OBSERVE FREQUENCY= 200.1313499994
##.OBSERVE NUCLEUS= ^1H
##.ACQUISITION MODE= SIMULTANEOUS
##.ACQUISITION SCHEME= undefined
##.AVERAGES= 8
##.DIGITISER RES= 18
##SPECTROMETER/DATA SYSTEM= spect
##.PULSE SEQUENCE= zg30
##.SOLVENT NAME= CDCl3
##.SHIFT REFERENCE= (INTERNAL, CDCl3, 0, 15.7447)
##AUDIT TRAIL= $$ (NUMBER, WHEN, WHO, WHERE, WHAT)
$$ ##TITLE= Audit trail, XWIN-NMR		Version 3.5
$$ ##JCAMPDX= 5.01
$$ ##ORIGIN= Bruker BioSpin GmbH
$$ ##OWNER= she
$$ F:/spectra/data/she/nmr/H-F/1/pdata/1/auditp.txt
$$ ##AUDIT TRAIL=  $$ (NUMBER, WHEN, WHO, WHERE, WHAT)
(   1,<2022-10-26 15:13:36.84 +0400>,<she>,<DPX200>,
      <created by zg, POWCHK disabled, PULCHK disabled
       configuration hash MD5:
       00 E9 B6 7A A2 85 ED C7 34 08 36 98 17 FE 4E 26
       data hash MD5: 16K
       D2 06 AD 1A 09 79 78 19 7C 3B EA 1B F6 28 30 64>)
(   2,<2022-10-26 15:13:39.34 +0400>,<she>,<DPX200>,
      <Start of raw data processing
       efp BC_mod = 2 LB = 0.24 FT_mod = 6 PKNL = 1 PHC0 = -18398.32 PHC1 = 19.4007 SI = 16K 
       data hash MD5: 16K
       8A 50 49 17 4C 48 9B 82 DB C9 4E A5 99 F4 EB 71>)
(   3,<2022-10-26 15:13:56.07 +0400>,<she>,<DPX200>,
      <pk PHC0 = -1.316762 PHC1 = 2 
       data hash MD5: 16K
       AA 83 A1 70 78 9E 60 2B 2B 64 25 BF 21 81 A3 0B>)
(   4,<2022-10-26 15:13:59.01 +0400>,<she>,<DPX200>,
      <abs ABSG = 5 
       data hash MD5: 16K
       A6 83 78 9E F3 14 B5 DD 53 CF DE 2F D2 B2 1A 8C>)
$$ ##END=
$$ 
$$ hash MD5
$$ 6B AD 3E 3B D8 77 C8 F0 FA AA C6 09 31 B4 7C D8
##$RELAX= 
##$RELAX= 
##$RELAX= 
##$RELAX= 
##$RELAX= 
##$RELAX= 
$$ Bruker specific parameters
$$ --------------------------
##$DU= <F:/spectra>
##$EXPNO= 1
##$NAME= <H-F>
##$PROCNO= 1
##$TYPE= <nmr>
##$USER= <she>
##$AMP= (0..31)
100 100 100 100 100 100 100 100 100 100 100 100 100 100 100 100 100 100 
100 100 100 100 100 100 100 100 100 100 100 100 100 100 
##$AQSEQ= 0
##$AQ_mod= 1
##$AUNM= <au_zg>
##$AUTOPOS= <>
##$BF1= 200.13
##$BF2= 200.13
##$BF3= 200.13
##$BF4= 200.13
##$BF5= 200.13
##$BF6= 200.13
##$BF7= 200.13
##$BF8= 200.13
##$BYTORDA= 1
##$CFDGTYP= 0
##$CFRGTYP= 5
##$CHEMSTR= <none>
##$CNST= (0..31)
1 1 145 1 1 1 1 1 1 1 1 1 1 1 1 1 1 1 1 1 1 1 1 1 1 1 1 1 1 1 1 1 
##$CPDPRG= <>
##$CPDPRG1= <>
##$CPDPRG2= <>
##$CPDPRG3= <>
##$CPDPRG4= <mlev>
##$CPDPRG5= <mlev>
##$CPDPRG6= <mlev>
##$CPDPRG7= <mlev>
##$CPDPRG8= <mlev>
##$CPDPRGB= <>
##$CPDPRGT= <>
##$D= (0..31)
0 1.2 0 0 0 0 0 0 0 0.06 0 0.03 0 0 0 0 0.0002 0 0 0 0 0 0 0 0 0 0 0 0 
0 0 0 
##$DATE= 1666782816
##$DBL= (0..7)
120 120 120 120 120 120 120 120 
##$DBP= (0..7)
150 150 150 150 150 150 150 150 
##$DBP07= 0
##$DBPNAM0= <>
##$DBPNAM1= <>
##$DBPNAM2= <>
##$DBPNAM3= <>
##$DBPNAM4= <>
$$ [...]
##$SUBNAM3= <"">
##$SUBNAM4= <"">
##$SUBNAM5= <"">
##$SUBNAM6= <"">
##$SUBNAM7= <"">
##$SUBNAM8= <"">
##$SUBNAM9= <"">
##$SW= 18.0517283424941
##$SWIBOX= (0..15)
0 0 2 0 0 0 0 0 0 0 0 0 0 0 0 0 
##$SW_h= 3612.71676300578
##$TD= 16384
##$TD0= 1
##$TE= 0
##$TE2= 300
##$TE3= 300
##$TEG= 300
##$TL= (0..7)
0 120 120 120 120 120 120 120 
##$TP= (0..7)
150 150 150 150 150 150 150 150 
##$TP07= 0
##$TPNAME0= <>
##$TPNAME1= <>
##$TPNAME2= <>
##$TPNAME3= <>
##$TPNAME4= <>
##$TPNAME5= <>
##$TPNAME6= <>
##$TPNAME7= <>
##$TPOAL= (0..7)
0.5 0.5 0.5 0.5 0.5 0.5 0.5 0.5 
##$TPOFFS= (0..7)
0 0 0 0 0 0 0 0 
##$TUNHIN= 0
##$TUNHOUT= 0
##$TUNXOUT= 0
##$USERA1= <user>
##$USERA2= <user>
##$USERA3= <user>
##$USERA4= <user>
##$USERA5= <user>
##$V9= 5
##$VALIST= <valist>
##$VCLIST= <CCCCCCCCCCCCCCC>
##$VD= 0
##$VDLIST= <DDDDDDDDDDDDDDD>
##$VPLIST= <PPPPPPPPPPPPPPP>
##$VTLIST= <TTTTTTTTTTTTTTT>
##$WBST= 1024
##$WBSW= 4
##$XGAIN= (0..3)
0 0 0 0 
##$XL= 0
##$YL= 0
##$YMAX_a= 193567
##$YMIN_a= -275177
##$ZGOPTNS= <>
##$ZL1= 120
##$ZL2= 120
##$ZL3= 120
##$ZL4= 120
##$ABSF1= 15.75129
##$ABSF2= -2.300559
##$ABSG= 5
##$ABSL= 3
##$ALPHA= 0
##$AQORDER= 0
##$ASSFAC= 0
##$ASSFACI= 0
##$ASSFACX= 0
##$ASSWID= 0
##$AUNMP= <proc_1d>
##$AZFE= 0.1
##$AZFW= 0.1
##$BCFW= 0
##$BC_mod= 2
##$BYTORDP= 0
##$COROFFS= 0
##$CY= -3
##$DATMOD= 1
##$DC= 0
##$DFILT= <>
##$DTYPP= 0
##$F1P= 0
##$F2P= 0
##$FCOR= 1
##$FTSIZE= 16384
##$FT_mod= 6
##$GAMMA= 0
##$GB= 0
##$INTBC= 1
##$INTSCL= 3.70164e-10
##$ISEN= 128
##$LB= 0.24
##$LEV0= 0
##$LPBIN= 0
##$MAXI= 10000
##$MC2= 0
##$MEAN= 0
##$ME_mod= 0
##$MI= 1.114404
##$NCOEF= 0
##$NC_proc= -8
##$NLEV= 6
##$NOISF1= 3.799351
##$NOISF2= 2.8
##$NSP= 0
##$NTH_PI= 0
##$NZP= 0
##$OFFSET= 15.74469
##$PC= 1
##$PHC0= -18399.64
##$PHC1= 21.4007
##$PH_mod= 1
##$PKNL= yes
##$PPARMOD= 0
##$PSCAL= 0
##$PSIGN= 0
##$REVERSE= no
##$SF= 200.130005373304
##$SI= 16384
##$SIGF1= 3
##$SIGF2= 2
##$SINO= 5.538805
##$SIOLD= 16384
##$SREGLST= <1H.CDCl3>
##$SSB= 0
##$STSI= 16384
##$STSR= 0
##$SW_p= 3612.71676300578
##$SYMM= 0
##$S_DEV= 0
##$TDeff= 16384
##$TDoff= 0
##$TI= <>
##$TILT= no
##$TM1= 0
##$TM2= 0
##$TOPLEV= 0
##$USERP1= <user>
##$USERP2= <user>
##$USERP3= <user>
##$USERP4= <user>
##$USERP5= <user>
##$WDW= 1
##$XDIM= 16384
##$YMAX_p= 392151426
##$YMIN_p= -3051339
$$ End of Bruker specific parameters
$$ ---------------------------------
##NTUPLES= NMR SPECTRUM
##VAR_NAME=  FREQUENCY,     SPECTRUM/REAL,   SPECTRUM/IMAG
##SYMBOL=    X,             R,               I
##VAR_TYPE=  INDEPENDENT,   DEPENDENT,       DEPENDENT
##VAR_FORM=  AFFN,          ASDF,            ASDF
##VAR_DIM=   16384,         16384,           16384
##UNITS=     HZ,            ARBITRARY UNITS, ARBITRARY UNITS
##FACTOR=    0.220516191357247, 1,           1
##FIRST=     3150.98488257464, 0,            0
##LAST=      -461.731880431142, 0,           0
##MIN=       -461.731880431142, -3051339,    0
##MAX=       3150.98488257464, 392151426,    0
$$ Real data points
##PAGE= N=1
##DATA TABLE= (X++(R..R)), XYDATA
$$ [...]
8502 1867789 1499373 1030198 1566627 1242219 617025 1030003 1164756 1502554 1580873 1366868
8492 1366868 1712362 1561459 1076657 1038410 979347 1257849 1329553 1284025 632970 333947
8482 333947 714421 455575 494922 371949 -94177 266587 826952 1042171 1023053 1018438
8472 1018438 788156 326163 399142 205377 -48538 -160158 101806 -159464 -630523 384310
8462 384310 428048 -233270 -116693 161779 459295 528042 263574 -48808 -43262 36182 -722695
8451 -722695 -357108 -132282 289541 843165 589667 366395 -212624 138931 300401 45550
8441 45550 77231 110354 -138084 -786435 -657374 -253358 -448174 -275722 -322228 -259923 -40930
8430 -40930 128113 333090 -357092 -370217 -76574 -243330 -191354 -458551 -904034 -792724
8420 -792724 -633308 -411320 -675271 -519916 -635687 -549635 -1047861 -1257464 -1262658 -1190712
8410 -1190712 -913160 -920722 -810206 -1274220 -510258 -512506 -654157 -917455 -743207 -584142
8400 -584142 -1196629 -1197182 -803364 -906631 -1124431 -1081874 -768797 -1071839 -983462 -1056484 -812555
8389 -812555 -884568 -1073729 -524507 -707757 -1248222 -1444959 -1554493 -1335827 -1097718 -1040165
8379 -1040165 -1310131 -1732459 -1478849 -1300170 -1602272 -1653138 -1458234 -1458972 -1657783 -1594279
8369 -1594279 -1300958 -1579353 -1421360 -1313842 -1776785 -1386697 -1208760 -1227409 -1373202 -1369501
8359 -1369501 -1193519 -1250137 -1663348 -1740333 -1410050 -1202205 -1349692 -1246900 -1394315 -1432853
8349 -1432853 -1363880 -1790500 -1543364 -1659311 -1525715 -1801832 -1684452 -1590898 -1428276 -1294582
8339 -1294582 -861780 -870809 -958700 -714874 -1173810 -1173160 -917752 -1651230 -2154519 -1414572 -1331233
8328 -1331233 -1268333 -875387 -1008206 -1130960 -873318 -1190944 -1774935 -1626642 -1487302 -1058659
8318 -1058659 -821825 -1352129 -1391313 -1474217 -1328154 -1659497 -1752757 -1568955 -1207669 -808669
8308 -808669 -1074398 -1254298 -1434838 -1700006 -1600831 -1678754 -1578801 -1449701 -1614803 -1519046
8298 -1519046 -1067335 -1476455 -1395949 -1512852 -1651762 -1516928 -1839369 -1520194 -1433694 -1451016
8288 -1451016 -1313304 -1615598 -2031855 -1579602 -2097873 -1804937 -1619269 -1923444 -1848292 -1657883
8278 -1657883 -1664066 -1739749 -1617566 -1491258 -1371755 -1370079 -1593640 -1586992 -1547764 -1421502 -1636875
8267 -1636875 -1381910 -1093100 -683490 -599635 -1084813 -1345914 -1397072 -1462198 -1538623 -1870060
8257 -1870060 -2231341 -1798018 -2191546 -2231229 -1675766 -1309577 -1300252 -1655264 -1777683 -1823537
8247 -1823537 -1617809 -1451810 -1502123 -1705902 -1552518 -1358923 -1613771 -1767402 -1343581 -1231990
8237 -1231990 -1477959 -1503157 -1372602 -1758786 -1653994 -1416190 -1843382 -1513100 -1538013 -1563914
8227 -1563914 -1460549 -1268639 -1235613 -1103753 -793604 -1250729 -1256689 -1363855 -1451235 -1115691
8217 -1115691 -1278561 -1444367 -891550 -1263130 -1498115 -1211514 -1748954 -1707508 -1433835 -1638382
8207 -1638382 -1724317 -1799076 -2029486 -1569303 -1021012 -1218369 -1494778 -1952375 -2249870 -2052602
8197 -2052602 -2037584 -2088377 -1885311 -1405745 -856566 3715587 1838838 -430962 -568374
8188 -568374 -1592395 -1381850 -1293393 -1363417 -1999679 -1789221 -1988128 -1683985 -1694712 -1514777
8178 -1514777 -1677533 -1487809 -1364962 -1401057 -1915918 -1129477 -1395455 -1324665 -1299749 -2243046
8168 -2243046 -2035594 -1674341 -2084033 -1938838 -1758823 -1256081 -1434862 -1511663 -1618803 -1742713
8158 -1742713 -1998337 -2238877 -1970925 -1702249 -1942924 -2119096 -2006586 -1956166 -2003940 -2351246
8148 -2351246 -2210863 -2325432 -2271762 -1729238 -1914087 -2044738 -1771528 -1738258 -1961380 -2041463
8138 -2041463 -2176145 -2310277 -1990602 -2261383 -2316315 -2304908 -1832105 -2484580 -2143884 -1922510
8128 -1922510 -2122127 -2442318 -2369941 -2187647 -1930680 -1854869 -1555224 -1980638 -2653208 -2466478
8118 -2466478 -2171703 -1306118 -1356400 -1505683 -1777911 -1353194 -1116595 -1349119 -1107620 -1439160
8108 -1439160 -1584149 -1301959 -1534411 -1774779 -1751120 -1729075 -1682134 -1755828 -1400612 -1437308
8098 -1437308 -2249236 -2094642 -2183766 -1936242 -1834904 -2141730 -1888155 -2377526 -2293073 -2036811
8088 -2036811 -1607301 -1565341 -1943131 -2220706 -1750667 -1355440 -2011669 -2054319 -1898957 -1521089
8078 -1521089 -1425976 -1501238 -1897442 -2065291 -1850092 -1711549 -1780160 -2133217 -2142041 -1857684
8068 -1857684 -2408222 -2641954 -1979338 -1855348 -2054810 -1840673 -2232734 -2432736 -2161328 -2003934
8058 -2003934 -2088414 -1709868 -1899330 -2445935 -2166228 -1721919 -1958428 -1990559 -1979137 -2143081
8048 -2143081 -2640792 -2668864 -2344913 -2359700 -2206411 -2411205 -1792633 -1909153 -2288660 -2301555
8038 -2301555 -2130962 -2032329 -2375795 -2236884 -2130427 -2076587 -2041966 -2276824 -2227705 -1871201
8028 -1871201 -2147223 -1909369 -1807609 -2057983 -2103244 -1995979 -2122786 -2120448 -2182617 -1570025
8018 -1570025 -1550915 -1575244 -1935373 -2270180 -2109460 -2048602 -2064533 -2019735 -1444549 -1936753
8008 -1936753 -2200884 -2577911 -2241068 -1563969 -1460490 -1892307 -2343855 -2182733 -2194357 -2188976
7998 -2188976 -2225604 -2341944 -2587650 -2287518 -1874026 -1954394 -2114158 -2381654 -2044047 -1979539
7988 -1979539 -2206974 -2124532 -1790439 -1594578 -2085195 -2485140 -2497187 -3051339 -2487005 -2434289
7978 -2434289 -2478489 -2351363 -2068736 -1917784 -2511746 -2496914 -1839147 -2014385 -1857915 -1818207
7968 -1818207 -2009551 -2395320 -2048857 -1772343 -2271285 -2380681 -2041814 -1651278 -2113501 -2585424
7958 -2585424 -2520011 -2257791 -1960159 -1946693 -2126811 -2153479 -2028385 -2170429 -2173715 -2256349 -2569051
7947 -2569051 -2765073 -2442906 -2361462 -2478051 -2293742 -2626368 -2358729 -2156867 -2177974 -1984349
7937 -1984349 -2110848 -1956719 -2013114 -1790899 -1975986 -1725778 -1672014 -2074903 -2006179 -1745017
7927 -1745017 -1444790 -1618323 -1812889 -2232040 -2178767 -2100871 -2237767 -1837094 -1708966 -1940227
7917 -1940227 -2511552 -2578800 -2102109 -1932517 -1919421 -1987973 -1753877 -2068490 -1832740 -1931576
7907 -1931576 -1716749 -1886867 -1771864 -1545488 -2064472 -2392294 -2609314 -2797510 -2258256 -1775281
7897 -1775281 -1623583 -2101162 -2250052 -2484256 -2058278 -1977530 -2072912 -2335221 -1965986 -2106627
7887 -2106627 -2279192 -2437818 -2364321 -2178136 -2258988 -2042091 -2225856 -2011956 -1665513 -2209000
7877 -2209000 -1720534 -2019104 -2101721 -2298248 -2745591 -2061815 -2109081 -1985251 -1720187 -1495587
7867 -1495587 -2070939 -2389391 -1926349 -1585233 -1213165 -1252388 -1589300 -2169863 -2594299 -2046840
7857 -2046840 -2032960 -1994493 -1789031 -2141653 -2570593 -2504297 -2520349 -2594231 -2464410 -2247000
7847 -2247000 -1976821 -1815878 -2377117 -2358986 -2040898 -1867138 -1600620 -1443113 -1985701 -1786439
7837 -1786439 -1923774 -1750711 -1523789 -1896852 -1971906 -1947570 -2539231 -1999938 -1874266 -1814474
7827 -1814474 -1832080 -2058689 -2287821 -2167115 -2271216 -2134853 -1834142 -2233095 -2644351 -2230829
7817 -2230829 -1917502 -2195656 -1964667 -1588958 -1749895 -1592185 -1569045 -1384246 -2452326 -2519226
7807 -2519226 -2328519 -2667499 -2470929 -2487233 -2167935 -2053347 -1941468 -1796439 -1685827 -1559091
7797 -1559091 -1470140 -1661961 -1990862 -2010815 -2384829 -2198298 -1869795 -1921436 -1915837 -2326314
7787 -2326314 -2044958 -1810082 -1907731 -2346066 -2186116 -2200921 -1975452 -1653247 -1709091 -2330048
7777 -2330048 -2831274 -2643080 -1930136 -1741727 -1977718 -1607479 -1400415 -2011976 -2350115 -2627770
7767 -2627770 -2073812 -2028691 -1924583 -1463944 -1660149 -1731430 -1344809 -1950325 -1584136 -1712597
7757 -1712597 -2005566 -1497429 -1379206 -1547896 -1980656 -1739932 -1750487 -1861235 -1221293 -1825705
7747 -1825705 -1949715 -1972265 -2054772 -1977409 -1868001 -1794664 -1858687 -1985781 -2086752 -1959325
7737 -1959325 -1747294 -1874691 -2048089 -2181941 -1849493 -1768433 -1864825 -1594952 -2048322 -1978126
7727 -1978126 -2283951 -1982970 -1892042 -1796298 -2085883 -1607258 -1217144 -1389892 -1803793 -2057961
7717 -2057961 -2102878 -2416739 -2684941 -2943915 -2598592 -2140853 -2029526 -2349636 -2121541 -2008118
7707 -2008118 -2192890 -1636955 -1718923 -1835334 -2251759 -2433022 -2037949 -2285234 -2066373 -1277211
7697 -1277211 -1131853 -2121375 -1893309 -2136259 -2074739 -1945917 -1675882 -1764594 -1772103 -1602259
7687 -1602259 -1444004 -1349547 -2029556 -1591995 -1483647 -1829653 -2066249 -1969848 -2119442 -1685688
7677 -1685688 -1578268 -1843792 -1976539 -2021221 -2023422 -2188219 -2147405 -2007320 -1603943 -1635615
7667 -1635615 -1632857 -1209857 -1488615 -1646417 -1783713 -1772233 -1888732 -1888817 -1771878 -1979435 -1900688
7656 -1900688 -2174399 -2145960 -1997782 -2037417 -1885952 -1946104 -1683455 -1513633 -1472293 -1735462
7646 -1735462 -2160720 -1635717 -1751938 -2002425 -1686476 -1659003 -1755796 -2084178 -1609991 -1912830
7636 -1912830 -1986203 -1635688 -1820864 -1893831 -1343704 -1660593 -1720912 -1934120 -1953810 -1773245
7626 -1773245 -2046320 -1766086 -1787779 -1879538 -1611524 -1604172 -1443738 -1759771 -1879522 -1770686
7616 -1770686 -1570397 -1391640 -1725295 -1381248 -1424126 -1314512 -1221426 -1064361 -1573876 -1699136
7606 -1699136 -1989643 -1792336 -1404997 -1669821 -1569081 -1835076 -1612540 -1772000 -1954095 -1703393
7596 -1703393 -1816332 -1755517 -1348867 -1273205 -1785209 -1661219 -2017114 -2035450 -1593999 -1208657
7586 -1208657 -1733970 -1625144 -1461704 -1752330 -1750381 -2072843 -1853472 -1574567 -1699032 -1776781
7576 -1776781 -1736299 -1691069 -1516548 -1688660 -1821677 -2062572 -1550435 -1437620 -1642019 -1949431
7566 -1949431 -2082671 -1872653 -1875115 -2015703 -1704427 -1633304 -2058419 -2146374 -1916401 -1578883
7556 -1578883 -2066354 -2408414 -2832890 -2397679 -2319074 -2507158 -1986746 -1755711 -2175857 -1851526
7546 -1851526 -1521588 -1558967 -2128508 -2324088 -2027941 -1805036 -1426688 -1485139 -1513915 -1310462
7536 -1310462 -1321469 -2006617 -1891709 -1488801 -1652567 -1976406 -2130810 -2157392 -2524316 -2397435
7526 -2397435 -2147294 -2345052 -1854738 -1397463 -1578606 -1662462 -1420075 -1132779 -1376499 -1595898
7516 -1595898 -1125115 -1493138 -1566752 -1886769 -1914141 -1654125 -1812652 -2206782 -2221167 -1626791
7506 -1626791 -1255346 -1505118 -1618494 -1866555 -1857202 -1641303 -1466288 -1461553 -1904273 -1873428
7496 -1873428 -1682517 -1521860 -1709361 -1463179 -1240081 -1057944 -1034785 -1765460 -1857058 -1607753
7486 -1607753 -2035976 -2175997 -1924859 -1894192 -1603635 -1409759 -1842061 -1611616 -1555182 -1484939
7476 -1484939 -1690139 -1767457 -1781811 -1859269 -2045536 -1970893 -1508615 -1128254 -1468966 -1852016
7466 -1852016 -1361197 -1118915 -1493767 -1702546 -1519962 -1656299 -1936819 -1502054 -1808456 -1231787
7456 -1231787 -1166313 -1579339 -1399882 -1105381 -996990 -1018468 -1157140 -1078839 -868234 -1293711
7446 -1293711 -1327859 -1728591 -1278231 -1028223 -844482 -1055287 -818656 -1501722 -1528229 -1461025
7436 -1461025 -1496800 -1419643 -1909379 -1464384 -1008147 -1551092 -1489045 -1184535 -1105838 -1533957
7426 -1533957 -1402021 -1379612 -1919954 -1459835 -1317479 -1408895 -1372745 -1826110 -1557105 -1447732
7416 -1447732 -1303112 -1227187 -1538672 -1476989 -1257006 -782047 -644816 -1304495 -1047462 -862264
7406 -862264 -1277650 -1721073 -1148722 -986912 -1001487 -963901 -1109372 -1217947 -1268492 -1404784
7396 -1404784 -1671602 -1379684 -1249294 -1545037 -1627169 -920420 -1324666 -1114499 -1108234 -1201220
7386 -1201220 -1268284 -1661155 -2152288 -2220186 -1842361 -1327144 -1427029 -1200315 -1382245 -1086889
7376 -1086889 -1237170 -1651379 -1472383 -1323937 -1637370 -1399207 -1666680 -1461754 -1459591 -1128462
7366 -1128462 -1128034 -1340818 -1337323 -1443103 -1241768 -1204223 -1757797 -1660744 -1619149 -1051164 -1043318
7355 -1043318 -1335863 -1147017 -1527833 -1597398 -1495312 -1122417 -835249 -1240240 -1466197 -1126712
7345 -1126712 -1470904 -1603447 -1552999 -1184436 -1454526 -1596147 -1231617 -1093530 -1270910 -1226406
7335 -1226406 -855843 -1398201 -1706756 -1409242 -1593060 -1334979 -1620491 -1096688 -984918 -508014
7325 -508014 -531896 -869180 -691907 -845808 -1079183 -995766 -825025 -758298 -876758 -828897
7315 -828897 -356083 -493775 -742168 -768976 -462376 -390124 -800040 -937083 -848086 -552877
7305 -552877 -166703 -29142 -251907 -368725 -786621 -458615 -204156 -141273 -512449 -280694
7295 -280694 -83345 -276669 -208227 -91705 -251601 -7099 582088 71321 -117449 325707
7285 325707 537844 617921 20886 10496 303308 476139 667633 820361 731832 559606
7275 559606 675827 1020033 985260 542767 1007589 962833 490445 912502 1389888 1480275
7265 1480275 1437249 1524555 1413863 1120030 1697583 1615686 1925051 2433933 2424338 2634340
7255 2634340 2189451 2448852 2569670 2438235 2954591 3238515 3313519 3545376 3299078 3476569
7245 3476569 3860310 3805227 3800079 4182375 5061921 5019953 5226758 5542834 5890599 5898498 6051318
7234 6051318 6462511 7007876 7782207 8688006 8982385 9505571 9479898 10435831 11526319 11853136
7224 11853136 12643395 13497497 14125568 14722817 16113072 17461646 18913529 20219160 21539246
7215 21539246 23140488 25237050 26830980 28531861 31017652 32703909 34287046 36033002
7207 36033002 37383010 38747651 39292371 39474617 38960495 37619599 36138908 34280367 32409996
7198 32409996 30404071 28225025 26116863 24314043 22018774 20407841 19167452 17908430
7190 17908430 16346334 15325084 14612082 13530159 12042598 11634506 11041995 10095083 9502904
7181 9502904 9132355 8588236 8340144 8160618 7184755 6751582 6098389 5437162 5167069 5231575
7171 5231575 5421521 5504213 4858099 4393872 4493116 4274577 4046410 3621570 3868377 3786613
7161 3786613 3060549 2730934 3043116 2760861 2449730 3102084 2863824 2773308 2674377 2349658
7151 2349658 2013951 1972105 2605502 2636321 2105436 1886690 1792156 2112160 2271744 1982805
7141 1982805 1890146 2295554 2110199 1667796 2126244 2680402 2588271 2424564 2463854 2536725
7131 2536725 2394156 1875987 2355093 2995304 3592941 3345326 3265784 3859661 3953125 4415260
7121 4415260 4633298 5394123 5742639 6272443 6533514 7197591 7787617 8060750 7708785 7164631
7111 7164631 6462780 5620361 4663778 4581812 4613147 4728778 4556687 4535242 5449539 6340414
7101 6340414 6579307 6857887 6775867 6818340 5975735 4663781 4704996 4234082 3242249 2742784
7091 2742784 2225944 2329252 2561492 1908848 1809221 1162630 1424475 1665255 1194983 990748
7081 990748 911994 880937 287801 118305 555031 486530 404068 568219 504871 998976 569187
7070 569187 355014 504924 493387 700748 775487 722132 599446 478837 382517 609366
7060 609366 536672 695927 93413 124329 757358 457843 486685 210953 229512 409871
7050 409871 547105 309080 -200214 -31973 -327411 65023 257628 471827 199819 504404
7040 504404 987290 1128672 824164 631457 962573 1162356 706929 406777 753524 1099838
7030 1099838 1467970 1838616 1659415 900520 1396815 1548728 1199755 1336110 1313465 1103531
7020 1103531 1324130 1438309 1931591 1786921 1727753 1548670 1442601 1766348 1592068 1502584
7010 1502584 1572146 1616305 1267868 1644537 1676781 1151885 1531029 1824470 1317237 1635553
7000 1635553 1558315 995325 1866235 2117179 1519020 1821527 1773793 1398348 969998 943989
6990 943989 955680 1243988 1815759 1863816 1638489 1282725 943320 766223 340174 700818
6980 700818 866389 1198399 1027085 1261039 453033 477715 1097657 1155201 1307914 914286
6970 914286 413520 439498 654506 957845 813877 1052829 681044 831069 1239759 1469229
6960 1469229 1735716 1278044 1444715 1175986 990281 967336 1202191 960344 1148654 1206511
6950 1206511 1006018 1093523 806534 338008 784538 985423 787208 1175547 1328768 1299839
6940 1299839 1516867 2018850 2258719 1939961 1673727 1211332 916806 815525 1088052 493433
6930 493433 221531 65098 97775 117037 -25729 45117 243756 482200 449778 551268
6920 551268 664823 520216 239142 -406188 -72687 36639 -173634 125856 217982 202587
6910 202587 -92344 54585 229299 80558 209267 -252787 -360068 -61036 146085 -259987
6900 -259987 -447343 -757135 -400659 -319032 -303470 -653126 -505117 -933411 -925733 -716344
6890 -716344 -749719 -541076 -881667 -730299 -684673 -983248 -620622 -436092 -110517 -260588
6880 -260588 -461957 -585474 -1009635 -1493941 -1406314 -1603963 -1645409 -1305124 -1245832 -1651035
6870 -1651035 -1358995 -1059664 -1244744 -838678 -830997 -451568 -229719 -265322 -390434 -527663
6860 -527663 -720361 -663979 -1218173 -893064 -683316 -986516 -1117022 -1022330 -1295663 -888003
6850 -888003 -799061 -480581 -435616 -746062 -780462 -812947 -419592 -279760 -490002 -404838 -364080
6839 -364080 -44586 -408660 -363910 -680445 -1054844 -875154 -704484 -1018641 -566766 -505307
6829 -505307 -567809 -456135 -439977 -705393 -702939 -290386 -245747 -28485 -456748 -209901 -438658
6818 -438658 -738688 -524261 -452409 -494053 -433261 -313099 -741402 -633579 -362971 46946
6808 46946 327842 379338 -153875 14558 186289 -61650 -10894 94597 -325853 -680989
6798 -680989 65931 565794 415673 7722 266340 -106317 -121211 -212395 -259166 -247358
6788 -247358 -887184 -447376 -139240 -147869 -61295 16927 -97320 -39300 -572034 -853629 -728383
6777 -728383 -206794 -697510 -1136447 -552463 -163763 -321101 -723963 -863619 -791942 -697089
6767 -697089 -1010035 -666232 -814645 -667378 -408877 -952983 -976846 -273569 -521955 -768374
6757 -768374 -1221389 -1122931 -713843 -1117564 -1175576 -796987 -969881 -700118 -854422 -1316295
6747 -1316295 -1777408 -1210471 -742925 -1185960 -1031827 -1215334 -1494867 -1617103 -580201
6738 -580201 -445017 -334304 -165570 -86973 -305873 -357250 -527847 -806515 -566139 -467647
6728 -467647 -305896 -799930 -859719 -283094 -517955 -524761 -553369 -236684 -144301 -277271 -46600
6717 -46600 -239738 189990 419046 687318 1385633 1557598 1688995 2050902 2210200 2813777
6707 2813777 2769060 2908507 2035916 2113020 2825175 2714592 1935849 1740965 2144179 1877924
6697 1877924 983350 928532 725823 147073 -157796 -107050 -175537 -346366 -282471 -753830
6687 -753830 -279184 135388 -59121 34358 -253221 -637697 -278044 -394731 -155026 -339994
6677 -339994 -490886 -323480 -554165 -287792 -181335 -385747 -668438 -429165 -288333 -701958
6667 -701958 -740231 -943583 -816008 -901945 -1368075 -587353 -491014 -627007 -698751 -879495
6657 -879495 -1411851 -1182556 -1301746 -941471 -512758 -655876 -819039 -824797 -1327662 -1864623
6647 -1864623 -1608387 -932079 -394318 -571039 -775459 -766512 -652149 -749400 -878381 -788370
6637 -788370 -877186 -869162 -567933 -435257 -565246 -418763 -507410 -398472 -900429 -1217697
6627 -1217697 -747223 -1152186 -1260769 -839659 -606937 -717032 -799510 -851232 -933204 -999241
6617 -999241 -1297938 -1659938 -1503299 -1301341 -1359280 -1588293 -1887721 -1303150 -891872 -1412294
6607 -1412294 -1081236 -996754 -1317241 -1378278 -1139774 -1171410 -1063420 -783181 -248161 -386790
6597 -386790 -272443 -842434 -786675 -565200 -1254724 -1263667 -770362 -760016 -516108 -639524
6587 -639524 -884157 -1379386 -936718 -1041059 -1030791 -1632970 -867720 -813415 -918676 -933109
6577 -933109 -1379115 -1094835 -856814 -906099 -677857 -265723 -855256 -872484 -386129 -457072
6567 -457072 -1153340 -1383373 -969751 -903744 -478354 -718733 -876348 -555643 -538100 -802525
6557 -802525 -533457 -497048 -712509 -461914 -125430 171084 -25830 -496313 -171829 23483
6547 23483 -756307 -570136 -643700 -267665 -314992 -342046 -558754 -695036 -630105 -584855 -480663
6536 -480663 147793 60416 84299 107739 -52496 -277309 -414406 -484953 -647368 -336089
6526 -336089 -349966 -797477 -130528 176531 9753 -319476 -537754 -123510 -53426 116402
6516 116402 222126 322595 388928 348864 -22626 -462799 -128036 -83660 136773 238350
6506 238350 1069446 1076657 732755 1180937 1827821 1702042 1829727 2027543 1966131 1976605
6496 1976605 1331181 1196123 1783829 2106485 2352441 2274691 2271733 2162873 2369028 1822092
6486 1822092 2119708 2463555 2561479 1937868 1674753 1750574 1452006 1472580 1029296 987194
6476 987194 1143482 1004586 746000 736713 797059 801020 968581 644113 800835 908134 681441
6465 681441 911969 862235 869519 265279 213424 425272 407436 246966 359235 482225 338904
6454 338904 538999 541077 943920 853178 900400 833133 552893 708300 733519 1006301 787904
6443 787904 1148882 652369 704872 791167 1063502 1235733 1760851 1593482 999357 1340492
6433 1340492 1540896 1845970 2516378 2049601 1731802 1927556 1621186 1582029 2161890 2311434
6423 2311434 2587334 3015518 3276851 3610361 4079392 3954945 3610403 4670796 5166977
6414 5166977 5115159 4926610 4602655 4779209 4871931 5204151 4957694 4801947 5050282 4559006
6404 4559006 4145116 4018138 4179634 3643754 3528293 3180340 3194441 3903384 3947466 3691112
6394 3691112 3622203 3533240 3751509 4229370 4472697 3944582 4030436 4328155 4366313 4720043
6384 4720043 4994490 5577275 5077850 5086971 4775806 4941331 5095504 5997187 6102352 6030462
6374 6030462 6092114 6362242 6557453 6883834 7388394 7649017 8017250 7955011 8033153 8114658
6364 8114658 8445377 9014800 9524657 9696242 10300778 11030954 11520476 11748322 12076331 12501396
6354 12501396 12719577 13295256 14107941 14744148 15550354 16346296 16934585 17029244 17580222 18245065
6344 18245065 18460186 18401010 19013522 19758570 20422662 20802235 20939595 21533787 22500489 23296457
6334 23296457 23353592 23728762 24263742 24204494 24750188 25603248 26210217 26621632 26900044 27397645
6324 27397645 27654870 28057452 28760648 29144150 29587489 29831787 30059641 30540092 31465996
6315 31465996 31693792 31994440 32270869 32809580 33609622 33685234 33465985 33954327 34116002 34418369
6305 34418369 34582356 34649099 34253246 33603211 33740707 33149193 33025796 33015791 32170442 32136882
6295 32136882 31876703 30443037 30270546 30187715 29451283 29537298 29399894 28915410 28131779 27123438
6285 27123438 26879307 26799757 26534263 25856686 25626635 24920395 24444048 24539485 23786492 22935164
6275 22935164 22408058 21904138 21269582 20801458 20645646 19953858 19664788 19256491 18221456
6266 18221456 18157539 17248887 16575563 15986770 15508035 14806536 14043085 14028785 13856630 13339766
6256 13339766 13461319 12871036 12165528 11834035 11168986 11087726 11047686 10879949 10938672 10213887
6246 10213887 9763924 9586447 9891877 9759230 9487889 10009354 10386247 10359516 10048688 9904624
6236 9904624 9470091 9359910 8997834 8981386 8890577 8929520 8951935 8880924 8473047 8970317
6226 8970317 9182826 9435923 9612916 9479481 9424492 9322044 9244262 8950797 8736240 8513529
6216 8513529 8654645 8447902 8390678 8282860 8545475 8521430 8648310 8744806 8498382 8537132
6206 8537132 8596053 8506004 8251800 8128070 8033110 7743370 8085880 7893487 7744946 7773283
6196 7773283 7668879 7919605 7009586 6411873 6068633 6106103 5865891 5500095 5410322 5404801
6186 5404801 5187355 5046364 4970998 4284679 4359000 4376214 4100130 4301995 4106817 4050462
6176 4050462 4205089 3667878 3984427 4116368 3796315 3974338 3811454 4013420 3721736 3820621
6166 3820621 3964466 3891923 3191680 3238619 3191706 3225926 3121812 2584288 2408547 2764097
6156 2764097 2406632 1978551 2371446 2219248 2353418 2842425 2556472 2159617 1948385 1933098
6146 1933098 2354970 2177136 2275274 2353454 1760061 1464964 1414634 1539304 1429404 1625972
6136 1625972 1591782 1465302 1357725 1450791 2292198 2352948 2253595 2118201 1934780 1225811
6126 1225811 1359481 1348998 1318661 1286816 1534751 1725026 1463125 1565396 1860159 1687236
6116 1687236 1423494 1902317 1979719 1886166 1900314 2057381 2149574 1666727 1796368 1794382 2009234
6105 2009234 2729754 2689769 2333305 3287703 3095414 3147347 3241115 3242409 3695871 3665180 3437551
6094 3437551 3319435 3354196 3298905 3666813 3031804 2503881 2364824 2376059 2259488 2356913
6084 2356913 2469886 2546122 2251426 1748958 2033388 2789342 2189806 1611011 2155856 1469548
6074 1469548 1203253 1199702 1504465 1687062 1983910 1950489 1334959 1718676 1797401 2174995
6064 2174995 2102605 2063676 2256631 2625775 2815625 3038016 3334146 3602080 3388219 3302705
6054 3302705 3549012 3630779 4038438 4573476 4778728 5277780 5658069 5587339 5715850 6388270
6044 6388270 6501259 6630944 6505867 6693911 6736805 6931093 7130876 7039006 7076625 7083542
6034 7083542 6735696 6223235 6734552 6358205 6381385 6613125 6493463 6508618 7074761 7162817
6024 7162817 7307320 7616158 7496846 7368247 7389223 7690524 7505621 7786036 8271909 8610672
6014 8610672 8874211 8230804 7820368 7792309 7421190 6891981 6705180 6586338 6379483 5892695
6004 5892695 5634481 4856642 4647004 4337183 4013684 3304911 3791875 4121059 4095842 3792829
5994 3792829 4121932 4023797 3883745 4304346 4289940 4501297 4404584 4018977 3743244 3403879
5984 3403879 3454988 3172285 2952963 2608409 1812433 2624261 2653694 2546049 2310712 2607675
5974 2607675 2353558 2305409 2274951 2365092 2148224 2394037 2381849 2248741 2224231 2604841
5964 2604841 2687437 2451324 2499104 2307766 2544842 3361620 3487223 3659217 3368773 3439785
5954 3439785 3779497 3510723 3218927 3395523 3494706 3494383 3693924 3389108 3499017 3955214
5944 3955214 4158749 4218339 4563292 4208857 3959975 3789075 3574496 3711651 3959468 4053793
5934 4053793 4075878 3638670 4141752 4609827 4419974 4590903 4270566 3772968 3617667 4182227
5924 4182227 3960347 4026847 4296144 3929281 3935629 3790315 3840164 3274330 3054855 3363085
5914 3363085 3561620 3552749 3059673 2837164 3216411 3147858 2727490 2466397 2402552 2352195
5904 2352195 2591158 2611674 2515963 2016547 2102808 2296404 2301551 2381195 2377430 2288755 2139352
5893 2139352 1875656 1801120 1514256 1253312 1624915 1235514 1194495 1639675 1983558 2326807
5883 2326807 2273762 1702122 1229417 1096649 1312767 1149469 1222545 1488226 2008690 1601502
5873 1601502 1141435 1378441 1034123 1501712 1126751 1061179 1196141 843097 1115433 954257
5863 954257 873666 816404 889769 1054766 988619 799616 794638 877657 1189565 1236563 934481
5852 934481 534970 664869 173162 184731 350579 150792 422364 635898 900622 645518
5842 645518 1046675 1087037 613094 828842 845668 1283066 975331 698803 740700 962720
5832 962720 455298 136421 643965 390464 778178 801897 509090 296785 707163 452721
5822 452721 596340 1134292 725338 1197773 1157537 781740 894719 866060 690820 844858
5812 844858 1163378 1030360 1324669 587256 421646 892710 1118193 1034446 1153220 1642137
5802 1642137 1303176 1208551 1250376 1285227 1479113 1275056 898144 1172789 1268731 1252160
5792 1252160 1420148 1223524 1387321 1230396 1397933 1831089 1348288 1193988 1236313 1322570
5782 1322570 1586388 1694573 1303047 1302292 1505530 1474603 1759200 1612790 1328969 1183995
5772 1183995 1568779 2089663 2223219 2054211 1600720 1355796 1317821 1108672 1211252 1270726
5762 1270726 1284222 1499011 1436617 1713200 1669833 1353746 1604819 1513391 1887363 1987489
5752 1987489 1927954 2308135 2275164 2376554 2073822 2145031 2568339 2000429 1984258 1923588
5742 1923588 2240292 2396928 2072988 2219559 2268117 2620652 2690814 2478989 2338188 2430179
5732 2430179 3024611 2901683 2825055 2352926 1859100 2686287 2675339 2496014 2158674 1783795
5722 1783795 1617057 1912752 2162655 2118050 1975463 1876404 1806787 1788341 1545615 1843555
5712 1843555 2119188 2551278 2408622 1844020 1674845 2191058 2208883 1874720 1976897 2126061
5702 2126061 2061459 2163262 1920339 1282037 1383514 1356861 1651343 1750000 1338599 1709212
5692 1709212 1806170 1950291 1966310 2141070 1906841 1698068 2143724 1894241 1913763 1620508
5682 1620508 1960947 2318347 2615942 2516794 2046001 1517735 1545273 1833436 1794702 2214844
5672 2214844 2083896 2054203 1841776 2150157 2402773 1933362 1968618 2023435 2280591 2363614
5662 2363614 2586898 2647809 2764641 2652999 2587451 2744189 2476236 1847790 1973772 2337336
5652 2337336 2551139 2072370 2238680 2510944 2530030 2274828 2412423 2564111 2441303 2305644
5642 2305644 3179901 3083916 2882888 2996721 3024442 3092116 3294044 3319510 3446372 3566171
5632 3566171 2758404 2823989 2436620 2144743 2283633 2684508 2593833 2046249 1968085 2495382
5622 2495382 2280663 2516224 2257697 2105406 2647877 2758081 2661687 3002834 2639241 2242677
5612 2242677 2423330 2650355 2424636 2614110 3135953 3193700 3102552 3639255 3911630 3976239
5602 3976239 3867507 3649819 3604520 3726650 4158080 4595296 4846418 4832636 4790095 5082857
5592 5082857 5684299 6021846 6379961 6816913 6719423 7382511 7620393 8125730 7856705 7549120
5582 7549120 7495871 7218671 7136121 6803033 7165778 6502474 6367230 6256620 6163502 6093748
5572 6093748 5625932 6170209 6337698 5811750 6042376 5915085 6463568 6798795 6904920 7615230
5562 7615230 7371703 7619941 7719238 7060234 6621616 6482765 6425788 6299483 5524974 4988779
5552 4988779 4923521 4659516 3942232 3554278 3256554 3479960 3301437 2821734 2915630 2533184
5542 2533184 2858787 2818728 3373427 3791712 3845611 3883420 3915349 4021731 3878471 3867441
5532 3867441 3875081 3382527 3049006 3188196 2743618 2535334 2956317 2558150 2186817 1872141
5522 1872141 1745988 2358493 1833677 1567224 1844783 1863031 1564464 1584730 1723833 1903447
5512 1903447 2168400 1936847 1729711 1556820 1459016 1346106 1299290 1233574 1320227 881417
5502 881417 1266820 862025 774710 870355 552536 636182 701298 909896 1501849 1563725 1465713
5491 1465713 919678 821916 1015551 1067187 1133229 1009084 918704 1065843 632471 795053
5481 795053 741719 1332833 1544942 1252216 1463444 1585197 1735259 1450956 1412987 1499349
5471 1499349 947038 734950 842867 865172 992002 1330717 1460458 1124795 1398307 1347301
5461 1347301 1341105 1196854 1170735 1043875 1338904 1335849 1431995 902599 685169 376992 1170088
5450 1170088 2055234 2118911 1618101 1418211 1574441 1626003 1551433 1788345 1712999 1978972
5440 1978972 2156059 1640238 1657690 1788684 1432696 1624821 1935142 1699286 1764646 1892767
5430 1892767 2299821 2320822 2115424 2312476 1981957 2197798 2375275 2441183 2553638 2964477
5420 2964477 2948943 3035112 3003318 2862698 2858072 2801351 3002318 3060382 3457438 3175552 3143927
5409 3143927 3581832 3544739 3510670 3486760 3719142 4141867 4259786 4435948 4606803 4739289
5399 4739289 4536077 4097690 3924202 3705130 4146403 4412088 3963874 4102777 4028492 3820505
5389 3820505 4013370 4167974 4376628 4534635 4542700 4878320 4796753 4904958 4820822 5217578
5379 5217578 5386711 5477301 5757366 5358867 5375616 5687307 5288695 4863347 5061795 5578136
5369 5578136 5329693 5247175 5346634 4834635 5359414 5633152 5469602 5430125 5306503 5614281
5359 5614281 5760400 5888392 5859957 5559448 5594442 6069139 6407331 6426133 6552833 6791193
5349 6791193 7261494 7543836 7332822 7367996 7292175 6960535 7255039 7006038 6711167 6446948
5339 6446948 6128198 6160305 6314394 6535235 6406617 6148729 6197345 6362410 6403122 6400990
5329 6400990 6140059 6003637 6297072 6078477 6169447 6728181 7246864 6923446 6864470 7063677
5319 7063677 7163091 7649987 7938572 8008650 7893545 7762153 7766200 7902736 7161235 6629541
5309 6629541 6240756 6523635 6872493 6452026 6187864 5940046 5814708 5943333 5921882 6196331
5299 6196331 5872662 6222170 6258612 6377259 6000830 5658947 5980150 6363369 6175823 5859821
5289 5859821 5772244 5809924 6128258 6617830 6865986 6638026 6602261 6054843 6210532 6556281
5279 6556281 6099496 6059883 6465545 6517300 6137847 6369219 6472282 6378147 6492674 6297693
5269 6297693 5932006 5780491 5588613 6081101 5846502 5584673 5476839 5861520 6480882 5794265
5259 5794265 5498819 5837256 5938042 6203505 6092534 6099577 6499125 7007381 7347950 7115268
5249 7115268 7353966 7391168 7256262 7500404 7322670 7337248 7226382 7412462 7892953 8026508
5239 8026508 7972002 8226787 8460916 9106668 9624384 9935768 10164459 10623686 11510345 12090041
5229 12090041 13655569 14513588 15441219 16558314 18083419 18755455 19873532 20920173 21968103
5220 21968103 21725805 21480005 20408961 19616399 17948681 16665056 15339466 13962268 13191420
5211 13191420 11894554 11226090 10518715 9939410 9409068 8478439 8114205 7766609 7404978
5202 7404978 7428306 7432306 7453797 6969173 7007432 7022965 6928203 6671506 6244617 6397308 6401136
5191 6401136 6719428 6891119 6291929 6616098 6530554 6548553 6320511 6215444 5999345 5957963
5181 5957963 6024305 5856064 6552828 6173394 5663342 5959418 6069463 6278479 6569271 6703331
5171 6703331 6958911 6754473 6779111 7020233 6907793 6400826 6683124 6841218 6769458 7034815
5161 7034815 6567540 6895172 7470832 7707279 7609581 7059789 6957438 7346044 7498970 7727767
5151 7727767 8075423 8316153 8486585 8694198 8638887 9248648 9437326 9213086 9438128 9664686
5141 9664686 9880089 10305723 10818106 11133374 11275032 11674044 11978393 12038553 11604997 12088398
5131 12088398 12630740 13679610 14390539 15005115 15010070 15159657 15806547 16195869 17336916
5122 17336916 17692654 18201722 18888571 19313442 20310571 20877282 20949918 21693362 22308908 22660025
5112 22660025 23548427 24633873 25403346 25839359 26730502 27244264 27400452 27869925 28431674
5103 28431674 28764610 29424445 30205037 30527363 31204809 31832326 31914662 32273015 33008373 33177826
5093 33177826 33498485 33812154 34570100 35459531 36311772 37015481 37263644 37495174 37659534
5084 37659534 37743012 37940476 38477491 38791265 39003725 38721978 39107627 39536717 39150991 39481771
5074 39481771 39039881 38319515 37821825 37241814 36944649 36489979 36366407 36472781 35407193
5065 35407193 34633942 34058367 33709123 33635926 33301304 32586299 32046787 32043078 31566528 30359920
5055 30359920 29350831 29249440 28463891 27845695 27442461 27099587 26399918 26171846 25816420
5046 25816420 24819081 23968167 23479385 22952162 22442661 21703051 21018619 20345682 19679317
5037 19679317 18807782 18016587 17196490 16379880 15958732 15769749 15007693 14734922 14895774
5028 14895774 14362103 13960992 13232986 12655815 12529180 12524450 12208655 11516950 11283516 11202992
5018 11202992 10771496 10290492 9710873 9776225 9536608 9091410 9492699 9196827 9087905 9132476
5008 9132476 8417340 8206347 7954991 8221292 8483035 7896664 7733935 7660611 7447898 7578233
4998 7578233 7357552 7430046 7412180 7144297 7015709 6654727 6317445 6148839 6408261 6437907
4988 6437907 6741218 6811376 6779026 6450472 6016511 6349101 6786268 6766162 6296162 6444757
4978 6444757 6041920 6299176 6131444 6121122 6168777 6289907 6067832 5989644 6282995 5980733
4968 5980733 5351611 5404302 5605801 6055196 6172652 5920888 5762338 5398777 5594314 6115404
4958 6115404 5864180 5531953 5619284 5582718 5737721 5998376 5612278 5478933 5406585 5609227
4948 5609227 5922867 6521034 6122986 5951911 6117115 6319758 6493527 6745894 6903536 6894684
4938 6894684 6750718 6264034 6820022 7009375 7060371 7481843 6707956 6782814 7114981 7463878
4928 7463878 7821937 7739611 7766042 7955173 8097858 7644477 7849691 8532987 8818552 9073472
4918 9073472 9354842 9141247 8931455 9170605 10220159 10339349 10375426 10587752 11127994 11160418
4908 11160418 11618370 11918307 12495768 12835406 12958447 13314777 14400698 14809995 15346638
4899 15346638 16204155 17196131 18209589 19219752 19627646 19756028 19773997 19201497 18883661
4890 18883661 19714311 19716360 20138833 20212266 20767670 21202653 21500506 22273100 22992287 23797892
4880 23797892 24474048 25100562 25882173 27191037 28070180 29249015 30413496 31297916 32153948
4871 32153948 33464167 34372980 35241646 36505122 38068465 38989597 39584730 40287195 40554862
4862 40554862 40473714 40724276 40814133 40257338 39677484 39440869 38967624 38034107 37214812 36876025
4852 36876025 36250351 35752566 35124020 34228380 34059524 33431827 33231737 32879981 32816032 32481146
4842 32481146 31816228 31616310 31377500 31497406 31378356 31020580 30823783 30718510 30584062
4833 30584062 30583896 30511339 30350694 30091694 29792152 30102043 30094475 29889534 30464732 29821853
4823 29821853 30219363 30971579 30994839 31010659 30937928 30546630 31301455 31328885 31401346 31538625
4813 31538625 31499348 31718353 31155862 31089482 31414609 31214162 31036189 31249117 31417647 31204598
4803 31204598 31356772 32010841 31621385 30790621 30476493 30511253 30732774 30860427 30924585 30995381
4793 30995381 30802965 30704765 30298238 30278999 30272252 29857445 29728110 29534284 29123105 28380283
4783 28380283 28283557 28075232 28451469 27654100 27092362 27224898 27054533 27237751 26487305 26263835
4773 26263835 25691531 25868789 25870730 25569327 25559697 24718558 24354719 23957025 24044489 24018590
4763 24018590 23702371 23578311 23454864 23423017 23078408 22777971 22716048 22495718 22208763 21967564
4753 21967564 21800573 21532427 21045671 21174264 20858159 20543528 20507390 20915527 20843131 21338073
4743 21338073 22314080 22723577 23901925 25562316 27525527 29834650 32689925 34516601
4735 34516601 34951746 32927185 29577085 26276378 23313910 21152799 19503508 17659170
4727 17659170 16177559 15646342 14688137 14282254 13701056 12844532 12713303 12080663 11880303
4718 11880303 11705475 10471760 10139383 10173299 9794373 9005604 8709732 9169424 9144859 8688148
4708 8688148 8399886 8463250 8103047 7452468 7469536 7142897 7198669 7190368 6940031 6570781
4698 6570781 6544150 6381254 6266624 6361371 6393173 6823260 6255505 5665228 5572970 6157393
4688 6157393 5748316 5470722 5449156 5123812 5145581 4883755 4762852 4920868 4849402 5219513
4678 5219513 5524297 5275416 4770796 4825846 4858744 4895144 4743815 5028774 4853594 4767103
4668 4767103 4948756 4306198 4182681 4014677 4158966 3918901 4181330 4042795 3596915 3637752
4658 3637752 3133186 3365085 3915573 4121212 3949067 3660896 3665129 3961893 4257581 3864068
4648 3864068 3587308 3405962 3514723 3416155 2956814 2692835 3104451 3044188 2823018 2965018
4638 2965018 3353615 3735959 3630403 2812857 2552643 2785295 3007809 3143249 3431766 3492591
4628 3492591 2998456 2995317 2945317 3470556 3611939 3166654 3506577 2861853 2630511 2844196
4618 2844196 3002700 3052960 3332411 2880778 2809147 2722908 2523208 2824098 2880570 2840277
4608 2840277 3030419 2599172 2444608 2610033 2769272 2928106 2897708 2843761 2591731 2254742
4598 2254742 2611602 2659164 2462754 2396432 2325923 2525409 2228809 2484626 2460447 2282978
4588 2282978 1856321 1922376 2287972 2241812 2253590 2620098 2616167 2676524 2761228 3182714 2792771
4577 2792771 2392103 2448410 2382696 2073229 2371856 2755548 3103941 2790310 2538316 2507951
4567 2507951 2825572 3045846 2646281 2426312 2265957 2629380 2826459 2527870 3380743 3715693
4557 3715693 3671444 4144680 4574199 4261451 4069400 4196090 3441545 3275835 3552470 3525480
4547 3525480 3462815 3531994 3693233 3381734 3494090 3218726 3037947 3036021 2554125 2831164
4537 2831164 2835087 2892423 2906701 2815702 3220092 3095184 2961599 3043478 2812280 3040807 3042507
4526 3042507 2793509 2971301 3290563 3220195 2978016 2613000 2961285 2662089 2656522 2850108
4516 2850108 2905396 2990025 2932960 3087702 3043423 3024620 3297871 3293653 2849259 2969136 3126545
4505 3126545 3070556 3354710 3725137 3649916 3849228 3628709 3854112 4036402 4629546 4719838
4495 4719838 4568914 4335389 4195821 4675449 4720418 5203091 5798625 6302204 6489205 6705228
4485 6705228 7250648 7674561 8180107 9154354 10349152 11961941 13480958 15026381 17037096
4476 17037096 19122954 20080090 20066090 19629778 17823234 15645539 13276609 11289982 9783522
4467 9783522 9153186 8017335 7311450 7221133 6517746 6325710 5471965 4984540 4805655 4551153
4457 4551153 4620770 4422396 4508354 4626732 4155176 4042512 4091237 4497580 4097314 4341477
4447 4341477 3711430 3468185 3075148 2734443 3036577 2996371 2964791 3016966 3140783 3169171
4437 3169171 2882174 2956806 3062623 2985976 2724232 2548368 2781182 3507168 4058045 3486854
4427 3486854 3363703 3258023 2733570 3043017 3401987 3356669 3378576 3499749 3574116 3392292
4417 3392292 3902282 3693949 4146559 4337776 3740147 3392026 3755083 3947654 4167425 4277767
4407 4277767 4339104 4465970 4595465 4596313 4416820 4161676 4831356 5053604 4967446 4627568
4397 4627568 4830950 4685888 4567067 4776494 4797058 4779023 4504239 5027191 4950336 5074298
4387 5074298 4887294 4911424 5442628 5798483 5357777 5250292 5677276 5876181 5755291 5292655
4377 5292655 5406059 5826000 5743470 6170734 6151824 6084734 6046293 6261025 6162930 6260418 6596704
4366 6596704 6541603 7014305 7493790 7697269 7235327 7496946 7793864 7695758 8095167 8288350
4356 8288350 8626109 8996999 9382639 9787827 9937120 10425749 10930052 11105292 11326257 11379349
4346 11379349 11829161 11373429 10771600 10234369 9805311 9972799 10202877 10348799 10481591
4337 10481591 10357175 10574979 11144196 11526969 11473381 11558444 12019805 12605573 13030795 13356485
4327 13356485 14279858 14790366 15734977 17062156 18348230 18863484 19587559 19467844 18481009
4318 18481009 18473293 18452023 18412178 18731284 19212082 20015597 20970576 21695144 22117951 22616861
4308 22616861 23770234 24612420 24948844 25842255 26467012 26962996 27758783 28706086 30031098
4299 30031098 31318258 33050628 35302206 37337696 38163226 38746428 37669998 36170671
4291 36170671 34641934 33265233 32284033 31866404 32122198 32929783 34403261 35854195 37834113
4282 37834113 39518685 40041068 38918531 37646840 36521983 36185044 35194208 34530746 34619007
4273 34619007 35447106 36184962 36979828 37786506 39204420 40848151 42365331 44140354 45917994
4264 45917994 47229312 48536668 50433614 52531101 54652386 56812352 58894569 60566210
4256 60566210 61748263 63343061 64775585 66899638 69185926 71517417 74090017 76589911
4248 76589911 77749870 77384438 75147110 71696344 67768420 63536108 59524911 55623388
4240 55623388 53008187 51040123 49123082 46898805 45544275 44167740 42807839 42294669
4232 42294669 41653831 41109579 39822387 38836305 38467604 37867849 37532160 37560433 37210133
4223 37210133 36437404 36459188 36150832 35797446 35399977 35421269 35091598 35138668 35328302 34868233
4213 34868233 34641489 34368522 34109491 34406079 34099604 33396386 33294683 33821701 33445676
4204 33445676 32995299 33316760 33391642 33122118 33326252 33629987 33618082 33425166 33702694 34010930
4194 34010930 33621862 33496297 33341556 33462328 34419016 34787329 35409827 36580774 36814979
4185 36814979 36906040 37446328 38245836 38462874 39506034 40326165 41430784 43007242 43733635
4176 43733635 44713573 46426826 48210640 50078213 52310497 54728852 57608036 60497979
4168 60497979 63738309 67656399 72659397 77566745 81779324 85548910 87400443 87117867
4160 87117867 85434925 82694301 79875424 77070618 75813716 74070100 73256685 72201872
4152 72201872 71176087 70402028 69332544 69281095 68886844 69034667 69759295 70562760 71720317
4143 71720317 73273825 74655332 76115883 78434884 81322206 84373915 87224709 90251673
4135 90251673 93638799 97284077 101390690 105907504 110936672 116136219 121776612 127965956
4127 127965956 134608793 142281002 150906128 161015746 172576528 184610895 198081528
4120 198081528 211801738 224993353 236567213 243709964 244564927 238998693 228827407 216010284
4112 216010284 202539888 189510653 177455204 167188666 158827386 151667018 145785361
4105 145785361 141004933 137173976 133935418 132261922 131760141 131713131 132340602 134343311 136892093
4096 136892093 139497420 142290885 145485286 147904661 148399270 148008393 146571514 145090200
4088 145090200 143961091 142812456 142192603 142492250 143369638 144611399 146182748 148351536
4080 148351536 150562038 153119751 156131756 159094217 161777663 164949220 168488924 172626196
4072 172626196 176109841 179700603 183742589 187026091 190158453 193404992 196581440 198930570
4064 198930570 201614055 204258413 206198247 208940934 211190700 213201676 214912543 215941456
4056 215941456 216834869 217243624 217133616 217256305 217467066 216796393 215281831 214504710 213114469
4047 213114469 211896740 210487704 209793960 208773645 206839059 205051864 202758040 200815807
4039 200815807 198730686 195786130 193253456 190952417 188402692 186085762 183257598 179772225
4031 179772225 176955084 173449843 169846112 166119368 162418291 158561998 155217883 151122233
4023 151122233 147068781 143653581 140297591 137050885 134193768 131783458 128832273 125955398
4015 125955398 123314517 121055489 118664660 117109578 115152033 112770082 111524285 110682814
4007 110682814 109207745 107433376 106975135 106399509 105610912 105813909 106177605 106108963 106236169
3998 106236169 105799572 106292022 107230949 107869436 108892770 109781840 111667263 113217406 114367421
3989 114367421 116423052 118362542 120553104 123325574 125807794 129122153 131936673 136021181
3981 136021181 139779045 144336696 149037520 153140267 158052457 163014469 168400041 174267061
3973 174267061 180226720 186362084 192662600 199270397 205132382 211119163 217077665 222129322
3965 222129322 226832083 231439216 235507747 238818036 241922034 244444778 246933978 249498530
3957 249498530 251553015 253258485 254898704 256305896 257232539 258712966 259154929 260088182
3949 260088182 261093010 261488479 261938434 263022502 264255482 265590524 266127279 266819070 266209109
3940 266209109 265887171 265631424 266397607 265884922 264352644 262862287 260182490 256518304 253470928
3931 253470928 249889391 245835403 241918969 237209936 232094853 226698171 221650635 215666400
3923 215666400 209946374 203724395 197037258 190495808 183365960 176642321 169652760 163427908
3915 163427908 157527505 151315689 145409243 139735183 134587676 129700840 124861502 120332732
3907 120332732 116636926 112158184 108594214 105009340 101999218 98519368 95422370 92619215
3899 92619215 90338095 88079468 85329780 82884899 80466661 78412905 76299023 74065799
3891 74065799 72617599 70304476 68851045 66882239 65514839 64329229 63132148 61915965
3883 61915965 60496738 59120247 57650255 56669404 55208120 54070016 53020034 52270316
3875 52270316 51575320 50491606 50129213 49170237 48204094 47525550 46317006 45163374 44730743
3866 44730743 44138936 43583656 42800709 42187672 41262414 40278489 39359037 39178331 38554146
3857 38554146 37978860 37578339 37367182 36896788 36334125 36297444 35863412 36120696 35811680 35304644
3847 35304644 34973879 34335760 34047911 34036086 33997537 34296641 34253824 34118770 33948686 34203445
3837 34203445 34434617 34267645 34494752 34792056 34819069 35353240 35667424 35285343 35244696 35090513
3827 35090513 34547581 33926339 33577578 34059567 34274898 34463712 34110175 34539387 35241537
3818 35241537 35714260 36041820 35969579 36613232 37216380 37759418 37689961 37971012 37621297 37332378
3808 37332378 37307188 37130451 37782417 38663851 39172161 39658637 40596506 41455972 41924939 42393055
3798 42393055 43012766 43633359 44827661 46288087 47638267 48858552 49910503 51184654
3790 51184654 52490574 54061799 55554372 56040881 56499429 56669457 56278787 55095612 54602086
3781 54602086 54311186 53921219 53890557 53214502 52661794 53127410 53194617 52713822 52232805 51304226
3771 51304226 51253827 50975944 50053326 49688515 49491694 49641369 49065182 48253758 47418649 46483089
3761 46483089 45790581 45514643 45065720 44526379 43666213 43125732 42888997 42564737 42026463
3752 42026463 41889067 41490946 41270860 40412362 40346912 40290935 40155302 40133116 39893893 39794213
3742 39794213 39416999 39334465 38976131 38140595 38052721 37894146 37168539 37217992 37174411 37078246
3732 37078246 37050563 37245931 36796450 36623111 36661416 37172434 37484566 37836116 37882948 37908614
3722 37908614 37890784 37843374 37990781 37776822 37954427 38236157 38495590 39070599 39573743 39560087
3712 39560087 39514933 39442424 40245227 40670313 40725530 41391680 41954901 42517999 43582537 44356874
3702 44356874 44787354 45498030 46434564 47255408 48772453 49382331 49964394 50616042 51669506
3693 51669506 52884274 53481875 54467569 55597613 57121003 57887727 58859372 59136108 60418010
3684 60418010 61774595 62681901 63433040 64726686 65894564 67167655 68712831 70015860
3676 70015860 71122315 72788397 74311634 75195013 76606582 77912790 79987559 81310080
3668 81310080 83374867 85144599 87436592 89625817 91813383 93983182 96272940 98783123
3660 98783123 101604933 104914084 108103061 111481599 115364075 118815837 123054021 127863756
3652 127863756 132999399 138544485 143746989 150025844 157177654 165004859 172967203 181595188
3644 181595188 190757690 200252600 209891291 220203880 230722480 241174810 252004671
3637 252004671 262809540 273666660 284640237 295083711 305332661 315306726 325196205
3630 325196205 335248132 345325508 354193416 362594456 369299672 375598279 380855569 385321328
3622 385321328 388774787 390722279 391327908 392026669 392151426 391053266 389316456 386971425
3614 386971425 383753124 379733143 375025321 368930909 362481703 356338443 349028899 341608254
3606 341608254 333996496 325644145 317221765 309285013 300619427 291761543 283005670 274956517
3598 274956517 266502719 257640501 249832405 242177090 234183186 226865291 218971663 210941516
3590 210941516 203853647 196816455 189969985 183241813 176372311 170209547 164626769 158605911
3582 158605911 152275347 147185422 142429763 137986103 133479143 129100944 125599039 122039726
3574 122039726 118538264 115450922 112354076 109254116 106470710 103615626 101593536 99030318
3566 99030318 96562009 94440395 93129878 91515631 89713282 88026179 86450337 85844750
3558 85844750 85472813 83773983 82433484 81583678 80696973 79459781 78745139 77950591 77623768
3549 77623768 76645849 75936045 74927588 74579225 74207473 73241342 72528792 72142242 71507415
3540 71507415 71313503 70634883 69540781 68502719 68558391 68236425 67750274 67546025 67028617
3531 67028617 66462786 65664694 64776049 64829051 64476968 63711614 63444010 63227679 63481074 63425299
3521 63425299 63204376 63048440 63481079 64235300 64531062 64486663 64700519 65130053 66106935 67218243
3511 67218243 67629865 68108139 68800903 69440775 70200127 70706961 70997685 71389055 72554448
3502 72554448 73526876 73817921 74455956 75244007 75680238 76558461 77620503 78978903 80120281
3493 80120281 81289972 82843871 84056169 85412887 87263325 88307550 89544965 90273822
3485 90273822 91330039 92041299 92124008 92271686 92535530 92546270 92776165 93377774 93299029 93401509
3475 93401509 93704797 93604944 94031919 93583388 93493696 93049791 92780568 92728085 92888877 92896596
3465 92896596 93091092 94157006 95290303 96708449 98435806 100285279 102814460 104863865
3457 104863865 104550729 102882618 99356097 95505346 91592350 87697703 84458730 81309753
3449 81309753 78676858 75650206 73166682 71542544 69353980 67518746 66013207 64528121
3441 64528121 63266092 61032821 59165534 57409610 56301353 55296865 53791334 52848719
3433 52848719 51808206 50341325 49169823 48406450 46867446 45760162 44901504 44311970 43433088
3424 43433088 42610768 41966135 41197016 40481539 39979445 39584643 39248618 38267174 37613030
3415 37613030 37013821 36675500 36213785 36179867 36145923 36014863 35421746 35856093 35952630 35799607
3405 35799607 35854679 36370435 36852551 37248075 37345156 37974518 39072257 40405399 41816978
3396 41816978 42535843 44476033 46574033 49384992 53075114 57351455 60805677 63038433
3388 63038433 63234772 61042133 57667470 54908510 52008609 50371179 48666256 47078615
3380 47078615 45735958 44979439 44038453 43840098 43883984 43361154 43400120 43515620 43760549 43481533
3370 43481533 43794214 44439831 45242556 45589992 45871496 45468062 43458003 42119318 40799247
3361 40799247 39615830 39012163 38357563 37796165 37200582 36801903 36463159 36409318 36449505 36807439
3351 36807439 37217701 37500795 37640545 38113869 39049601 40170068 40974889 41933613 42847531
3342 42847531 43567029 44348435 44538003 45033555 45165988 45646199 46615822 47260198 47299052 48266393
3332 48266393 49137293 50003703 51148172 52629387 53910481 55700328 57062561 58556472
3324 58556472 60163932 61777175 63350247 64766521 65872804 66963844 68277359 68451104
3316 68451104 68394003 67958033 67518589 67306518 66887930 66331925 65796627 66178436 65906678 65278661
3306 65278661 65055896 65177472 64978574 64122149 64871074 65443445 65333448 65562875 66021742
3297 66021742 66683541 67986250 68903519 68779135 68360007 68001647 67157455 66487089 65969694
3288 65969694 66117566 65784344 65772777 64984866 64636013 64359886 63985152 63643220 63217579 62463992
3278 62463992 62281024 62160253 61938716 62025393 61347892 60075115 59436830 59645220 59419887
3269 59419887 58604809 58527911 58351522 57891774 56141783 54589041 53034873 51684634 50646422
3260 50646422 49987235 49093014 48614776 48701831 47849981 47425242 46605120 45894029 45562028 45432151
3250 45432151 45869780 46241190 46827964 47554007 47996808 48573761 49178564 50124400 51247954
3241 51247954 52088397 53542608 55302410 56853273 58121442 59505412 60609480 62040868
3233 62040868 62730314 61667361 60438172 58795822 57120597 55278865 53521198 50650492
3225 50650492 48701023 47464423 45899632 44160012 42068737 41129151 40515095 39371302
3217 39371302 38469360 37370114 36392003 35216706 34185843 33723601 33244864 32796725 32445529
3208 32445529 31694220 31367050 30568970 29743845 29279084 29164164 28644046 28075017 28430365
3199 28430365 28410186 27561286 27378373 27213222 26896771 26283980 25924445 25830126 25400875 25210693
3189 25210693 25303115 25761879 25475744 25302747 25009135 25328057 25645389 25764809 25969358 26399062
3179 26399062 26875239 27467602 27907833 28929227 29137904 29084618 30043948 30714527 31449605
3170 31449605 32189881 33017827 33259551 34189438 35277061 36062402 36787991 37633196 38272276
3161 38272276 38952520 39526798 40346830 40583399 41070624 42649043 43793305 45085348 46916207
3152 46916207 47651127 49572865 51016235 52394195 53486451 54641040 56016675 56925168
3144 56925168 57935038 58809198 59421328 60331342 60415539 60127370 59929782 59797660 59062255
3135 59062255 58905781 57869103 56275363 54728538 52149220 49848035 47431222 45263119
3127 45263119 43096628 41278463 39065288 37176936 35367051 33930791 32346630 30573214
3119 30573214 29543416 28985521 27831306 26801366 26124254 25227240 24519514 24110065 23348440
3110 23348440 22906461 22692096 22262986 21579375 20831051 20534427 19908911 19073162 18878385
3101 18878385 18310589 18177461 17670042 17262395 17180733 16790516 16427287 15667510 15638284 15575549
3091 15575549 15607195 15213493 14901074 14613163 15106549 15335584 14903260 14671629 14614681 14978414
3081 14978414 14975910 14348469 13813313 14452808 14430745 14476470 14518601 14274074 14025423 14190875
3071 14190875 14087623 13876543 13814807 14061608 13924687 13571796 13027801 12872925 12727698 12999587
3061 12999587 12751314 12841721 12350425 12817487 12816045 13075134 12898099 12007602 12227831 12394051
3051 12394051 12539655 12971831 13001628 12517328 12315396 12775536 13664895 13660860 13818682 14818227
3041 14818227 15116936 15203594 15256868 15897607 16353825 16413406 16484075 16309287 15844957 15977298
3031 15977298 15869808 15433401 15409260 15127773 14446290 13794397 13144790 12025663 11723998
3022 11723998 11502328 11075036 10631266 10918644 10896537 10633618 10141892 10467906 10573412 10208237
3012 10208237 10703256 10797048 10683356 10949122 10870723 10659395 10546092 10604729 10620017 10842375
3002 10842375 10605722 10532947 10702608 10556387 10487383 10187976 9941864 9533280 9528544 9827565
2992 9827565 9682017 9884052 9471574 9323437 9392912 9670744 9563730 9519484 9633560 9595330
2982 9595330 9376321 9170276 9683169 9786338 9669814 9972807 10107859 10272982 10591198 11019875
2972 11019875 11314372 11478906 11630329 11735771 11813071 11871631 11711203 12018161 12135627 12643469
2962 12643469 12479201 12357036 11861051 11893237 12617773 13060990 12950957 12956493 13519936 13131950
2952 13131950 12583292 12582131 12556504 13236207 13145262 13250419 13187552 13436984 13962584 14079590
2942 14079590 14602467 14942377 15485476 15380773 15778585 15768956 16325242 16866849 17115366 17091178
2932 17091178 17460115 18162398 18889039 19074182 19163020 19386238 19532226 19633565 20356638 21377044
2922 21377044 21570766 21967718 22348576 22724094 22860374 23127383 23226349 23657008 24184422 25152647
2912 25152647 25719427 26040771 26854000 27436514 27810367 28017128 27652372 28604791 29422345
2903 29422345 29791805 30012448 30867462 32061101 32597164 33088688 34109845 35112761 35919799
2894 35919799 37131749 37689219 38407605 39247328 40012990 40421924 41722015 43725608 45202676
2885 45202676 46759750 49328573 51073669 53231932 55251445 57009617 59791182 62542226
2877 62542226 64811711 67618921 70861778 74048320 77598225 82100075 87787603 93751075
2869 93751075 99852576 106763868 115119805 123477150 133024101 143000203 153277614 163561036
2861 163561036 172130745 179605777 184228718 185265717 181853022 174924425 166277247 156521521
2853 156521521 145499595 134752461 124425487 115659444 107295923 99401308 92558544 85849656
2845 85849656 80120712 75480699 71048607 66835764 62791957 58915276 55839262 52948245
2837 52948245 50037713 47320921 44832892 43119610 41555403 39862711 38376787 36579571
2829 36579571 34745443 33492894 32436685 31229627 29681628 28439737 27425569 26289990
2821 26289990 25560929 24430816 23447142 23360228 22272970 21940786 21055827 20387749 19484257
2812 19484257 18836453 18733344 18820257 17796993 17418650 17430150 17187802 16441104 16424780 15996977
2802 15996977 15307812 15154822 14919719 14581737 14306692 14044214 13855760 13339994 12835768
2793 12835768 13062723 12386658 12127655 12328651 12189233 11290455 11347792 11570002 11466150 11280780
2783 11280780 11504689 11111109 10812948 10190812 10077759 9734795 9802132 9735071 9055398 9044873
2773 9044873 8663583 8761218 9004903 8534625 8173152 8049568 8450861 7863887 7659076 7635661
2763 7635661 7261148 6845214 6908652 6709878 6623286 6430291 6370246 6301176 6436592 6323770
2753 6323770 6221655 6280925 6501835 6530391 6609649 5828792 6004589 5866291 6049363 6103316
2743 6103316 6034791 6142954 6448033 5776216 5877493 5974635 5793214 6066058 5670404 5584944
2733 5584944 4885473 4551950 4289865 4610658 4131067 3928249 4257724 4281309 4722987 4192822
2723 4192822 3667838 3843434 3906360 4104841 3794576 4271420 4239341 4062166 3570095 3740563
2713 3740563 4147736 3948542 4017490 3652310 3559708 3317202 3189221 3231111 2808729 3124110
2703 3124110 3453489 3100350 2694932 2727984 2847200 2795755 2644783 2714336 3106300 3146302
2693 3146302 3342001 2965345 2917310 2633189 2244730 2285661 2424881 2162918 2415438 2276272
2683 2276272 1951034 2522666 2205985 1928583 2268780 2635259 2378327 2490307 2146075 2361536
2673 2361536 2985731 2349412 1959366 2178428 2065732 1686423 1615513 1405745 1663781 1966512
2663 1966512 2012586 2046807 2046462 2127356 1397905 1483952 1638090 1701684 1465571 1536464 1585996
2652 1585996 1868335 1611320 1651791 1430064 1442368 1697191 1710878 1429796 1366173 1214370
2642 1214370 1200379 1190237 1246760 1248362 1584334 2010860 1892204 1494754 1210561 1106870
2632 1106870 1620918 1564462 1156901 768782 662504 1110190 961300 493445 833630 1258408
2622 1258408 961123 668280 948445 1004773 1500822 1539197 1276986 1396965 1121673 1213082
2612 1213082 1784225 1994916 1511998 1678725 1762643 1403378 1350128 753698 727448 948853
2602 948853 1270380 1377718 1304274 1370270 1582779 1506787 977292 1341163 953022 647833
2592 647833 929339 1589966 1195413 1449244 1677591 2017611 1634676 1313728 1314262 1227984
2582 1227984 1852064 1555269 828275 1095205 1467437 1743993 1656997 1514155 1323152 1688338
2572 1688338 1699877 1356984 1751561 1490316 1417531 1504819 1204710 1320019 1075151 930032
2562 930032 844474 1074021 1225488 1481093 1057754 947970 994988 833633 844745 843684 470641
2551 470641 383493 677687 743565 726510 313777 334204 528254 232578 133583 897467 877088
2540 877088 736554 529612 149659 654116 44790 52945 176382 430587 538802 873146
2530 873146 861500 636153 574244 27802 299926 96449 181769 638722 421757 293871
2520 293871 235416 3026 113861 -15019 90328 258747 627771 333711 747380 171941
2510 171941 272698 353519 222853 161880 -22071 236578 129953 142474 -389437 -438861
2500 -438861 -218712 -229580 -254011 -254729 34622 78010 -232139 -173326 -158194 142200 249371
2489 249371 420606 719700 736644 242333 -193115 -40953 190375 150461 -90815 -337971
2479 -337971 -111963 111984 110984 -18708 410509 619471 398642 493994 -25052 -107474
2469 -107474 -218259 -16181 51180 67706 48600 145090 532205 393310 320617 37645 -19087
2458 -19087 313120 199188 -186803 -237441 -27810 -110902 -570109 -528567 -672493 -314946
2448 -314946 105522 58427 -161153 -220625 7853 -15221 -520232 -507310 -136346 -103420 -268188
2437 -268188 -553523 -711209 -439412 -156569 -577974 -425745 -198181 -104034 93981 286145
2427 286145 -55977 -67 159517 89605 -21508 -163409 -500848 -506931 -327288 -20395
2417 -20395 -134420 -299054 23556 -463194 -846954 -348472 -429732 -437604 -717192 -782831 -603233
2406 -603233 21750 278535 -579997 -687835 -494444 -464154 -595146 -341206 -534383 -802060
2396 -802060 -828708 -161558 -360326 -465604 -219014 -74112 -141416 -285083 -168839 -187055
2386 -187055 -50267 -181194 -393115 -898571 -419759 -254945 -687116 -803610 -662315 -81440
2376 -81440 154639 118976 542829 653218 164669 89933 68704 -43416 99518 100470 -38934
2365 -38934 -297627 -53851 489719 1000421 545142 563432 297666 299135 672087 373821
2355 373821 -171887 -304128 -231747 -436430 -372021 -325172 66134 -61 -116002 -425694
2345 -425694 -321230 -359058 -436622 -373100 -332858 -1869 -314656 -823832 -458266 -128799
2335 -128799 -499187 -586032 -149027 -111213 37385 100472 -184565 -179115 78532 -157371 -424326
2324 -424326 261273 14949 -210629 -717947 -293785 -89183 -281853 -302832 -190033 -40595
2314 -40595 -200269 24151 -292987 19448 -93800 -353828 -695349 -442599 -467838 -372532
2304 -372532 -47446 -91795 -51809 -289634 -626789 -285496 -583790 -552386 -546161 -468594 -379609
2293 -379609 -50467 -173080 -37398 -235634 -442661 -453732 -68389 -199352 -787626 -444035
2283 -444035 -437886 -53305 -423656 -780379 -281146 -196829 -298779 -159582 -89443 -470145
2273 -470145 -557477 -628852 -194725 -163335 -619299 -581950 -606321 -405164 -471827 -392543 -86073
2262 -86073 -145713 -322561 -174199 -519061 -533926 -600600 -653264 -473927 -620869 -615871 -598143
2251 -598143 -333521 -336386 -629924 -646467 -888938 -671211 -622931 -926960 -686736 -736385 -488756
2240 -488756 -327417 -505422 69118 101776 -190290 -470127 -471994 -463305 -602923 -991368 -535956
2229 -535956 -257989 -675871 -908280 -540810 -286970 225263 100769 -179981 -93780 -147270
2219 -147270 288589 -140229 -571606 -365357 -407474 -109003 -239966 4532 -30545 -226527
2209 -226527 -314653 -231 -193717 -472821 -409036 166530 184434 246740 721940 465024
2199 465024 -31850 -130812 90889 -7057 231738 -145877 -65711 -152149 -60395 -109118 227756
2188 227756 -247923 174071 525821 220340 48812 -52645 513127 131550 -38174 173590
2178 173590 733690 1034135 1275371 1398739 1463476 1560605 1032001 1009520 1227275 1378893
2168 1378893 1516525 1701607 2304069 1764801 1813882 2330149 2499154 2336029 2035247 2051412
2158 2051412 2685239 2902340 2423556 2160531 2529708 2497410 2380682 2547161 2795582 3153946
2148 3153946 3525968 3654286 3692077 4303561 4182457 3786193 4098867 3780379 4125033 4040172
2138 4040172 3968237 4125175 4115550 4674053 5178519 4964172 5220934 5718948 5205527 5617083
2128 5617083 6317213 7378173 7110056 7595843 8234923 9547712 10018967 10471089 10850898
2119 10850898 11597581 12260821 13035648 14306767 14973060 15998198 17531448 19115023 20871703
2110 20871703 22418663 24370814 25555392 26869184 28887191 31975630 35452689 40460449
2102 40460449 46525724 53424103 62084880 73971267 90349523 111797560 137030206 158430978
2094 158430978 158719844 134664043 108786264 87192303 71387160 59342386 50504527
2087 50504527 43592139 38034559 34992410 31390247 28833430 26861885 26106000 25129369
2079 25129369 23278508 21444321 19346321 17955085 16568060 15375107 14205841 13223738
2071 13223738 12524246 11828597 11491311 11153784 10597779 10884719 10632846 9862622 9326403
2062 9326403 8769041 7875265 7752093 7554231 7221658 6665138 6469661 6395190 6235925 5873414
2052 5873414 5815824 5530149 5501282 5282280 4831763 4659788 4682343 3989851 4280206 4847097
2042 4847097 4494543 4176675 4195782 4301359 3911141 3931347 3486386 3743195 3684830 3919737
2032 3919737 3591139 3177860 2849279 3419119 2979200 2189199 2457232 2747221 2835628 2489838
2022 2489838 2059273 2436705 2860947 2703253 2669892 2224342 2072716 1648066 1594777 1888672
2012 1888672 1863187 2127657 2195331 1732657 1712884 1936663 1606530 1940440 1598553 1467518
2002 1467518 1552734 1258096 1466355 1654930 1672573 1076513 916973 944729 1028945 857749
1992 857749 1100252 1028272 1188506 1160610 1355981 1003044 953486 1122851 1119600 1082560 1003015
1981 1003015 1170099 760534 517637 605004 742170 183048 688186 531801 392300 468137
1971 468137 812047 822704 529570 338344 254778 480917 392423 22572 219593 418562
1961 418562 448832 545784 632744 560233 755354 903918 660863 486941 253477 463442
1951 463442 450175 245806 445966 458247 563058 341531 386213 192327 -194530 470534
1941 470534 488309 -6530 159171 7987 453361 327505 43629 76116 165137 533909
1931 533909 833613 585701 94600 25666 284842 92209 -131414 -42191 -601977 -68631
1921 -68631 315741 523981 623732 419772 130240 41026 -354896 -254785 -8658 -215470
1911 -215470 -112731 91701 -406220 -482539 -540008 -348921 40600 37058 -274287 -595843
1901 -595843 -511416 -451364 -470854 54874 77583 -32284 -365262 -86680 340484 -73147
1891 -73147 -182666 123548 80684 -104578 -521707 -241141 -121412 188697 291912 101540
1881 101540 -632432 -745407 -238828 -85518 210281 -296261 -400141 -171618 -125500 -184110
1871 -184110 -444504 -573996 -587476 -916244 -112000 349441 24707 -275036 -146261 -145870
1861 -145870 -580252 -682895 -57616 -467242 -465757 -795371 -493829 84030 -215036 -74651
1851 -74651 -597446 -308119 -8277 -181329 -341930 -389228 322654 436140 -151757 -510455
1841 -510455 -564482 -649702 -205685 332030 191931 29770 -73983 290166 481524 345169
1831 345169 278781 -19915 366193 782510 861318 450240 755854 757002 411801 302627
1821 302627 594382 459911 97779 378441 -20203 -97857 212895 348931 233969 359737
1811 359737 -81580 -435170 -344306 -298979 -428826 -644788 -396543 -338107 -259818 -176099 -382324
1800 -382324 75024 103122 -438963 -828307 -149441 204169 16328 -214346 -202060 -124569
1790 -124569 -566519 -366285 -784166 -1051303 -934269 -771446 -816699 -1209393 -983602 -171082
1780 -171082 -187571 -524144 -624314 -55028 77741 -176590 -170967 49622 -148642 -256597
1770 -256597 135637 641946 185806 -108914 116857 2732 -379438 -568358 -406009 -459037
1760 -459037 -251156 -612839 -541278 -325801 -253150 -594009 -283793 -75850 -488513 -218780
1750 -218780 -214389 -257940 -166733 -551871 -856053 -439414 -294516 -256050 -546300 -753514 -459776
1739 -459776 -71396 296357 214414 -22558 -210959 -546029 -597688 -187933 -184102 -529805
1729 -529805 -514481 -588909 -292135 -93311 -524142 -673011 -690181 -546059 -487814 -595971
1719 -595971 -670767 -1140946 -815194 -301172 -587854 -592990 -723306 -438911 -485647 -725272
1709 -725272 -626879 -483251 -663746 -1029190 -875811 -521458 -526019 -207146 -151430 -405486
1699 -405486 -535564 -201802 -458215 -150719 -381359 -854148 -667176 258174 9717 -86060
1689 -86060 -115971 -627845 -891457 -1152370 -877734 -562245 -947924 -1097499 -503854 -685689
1679 -685689 -1250452 -1068354 -377479 -75255 -47491 -247485 -727276 -479573 -692189 -782518
1669 -782518 -402773 -372600 -286282 -328091 -379213 -653971 93646 -98056 -299415 -704195
1659 -704195 -322585 202351 106342 -247409 -138255 -405219 -524226 -914399 -1218134 -1116004
1649 -1116004 -1041847 -770625 -963398 -1027067 -1091474 -1220320 -1106756 -741543 -1190118 -993461
1639 -993461 -1008984 -729260 -639056 -426334 -368368 -771167 -496988 -406673 -413935 -732038 -1189734
1628 -1189734 -585186 -790279 -644548 -145648 -271899 -237303 -354608 -410803 -425247 -658798
1618 -658798 -646035 -178738 -490546 -650533 -493732 -131988 -172958 202310 -202228 95746
1608 95746 -484824 -866268 -741689 -679833 -595841 45132 -216338 -665459 -445033 -523791
1598 -523791 -663852 -490108 -612301 -940416 -1018212 -698746 -623941 -928563 -561762 -444456
1588 -444456 -660359 -674615 -521133 -342580 -114170 -883576 -953720 -468008 -249214 -183177
1578 -183177 -209971 -560867 -834581 -698045 -637804 -1007207 -610247 -660501 -656415 -386854 -145729
1567 -145729 -456744 -721937 -1055892 -1116186 -1052615 -478017 -272368 -498811 -1054631 -583707
1557 -583707 -308584 -657642 -599467 -462802 -296286 -215807 -111498 19353 -178843 -914720
1547 -914720 -397000 -480827 -131293 -50215 -131098 -262806 -503111 -727854 -649413 -1067687
1537 -1067687 -912024 -995830 -1354319 -1213455 -494044 -238373 -289567 -305354 -397350 -189142
1527 -189142 -281524 -400202 -894997 -500001 -580870 -1206674 -907903 -458380 -405126 -490947
1517 -490947 -690969 -593200 -523791 -491032 81354 -356040 -200737 119162 -708385 -1020795
1507 -1020795 -855216 -393575 -430778 -583020 -257807 -228574 -489538 -409179 -660761 -938478
1497 -938478 -524298 -262807 -835906 -647998 -1220872 -731315 -486647 -1089413 -1102342 -949157
1487 -949157 -579722 -377321 -640569 -335048 -657917 -538270 -750863 -304826 -244090 -89480
1477 -89480 -296551 -601723 -697715 -1021666 -811103 -198109 -281412 -496592 -802196 -559635
1467 -559635 -424901 -422079 -1185864 -1455572 -474994 -174801 -602877 -853559 -186666 -382017
1457 -382017 -458896 -1034851 -927605 -808618 -613913 -347962 -196666 -322316 -7092 -282407
1447 -282407 11783 -199505 71481 -311011 -172838 -36441 -729360 -707819 -625154 -514157
1437 -514157 -319737 -399425 -548374 -603758 -640042 -923801 -757238 -938779 -566851 -706196
1427 -706196 -748014 -423686 -826500 -1056964 -140970 -83680 -300346 -166380 -477386 -753094
1417 -753094 -1163918 -652706 -610102 -855115 -833361 -547444 -319756 -329053 -400003 -271915 -352
1406 -352 -85048 -493684 -675610 -533342 -614796 203452 510363 -243897 -216443 -94283 -306316
1395 -306316 -514320 -623001 -503908 -574149 -843664 -766473 -664505 -695588 -711651 -736734 -725641
1384 -725641 -780248 -389665 -640092 -423322 -522071 -530757 -294813 -498580 -434617 -312699 -92428
1373 -92428 -278852 -480758 -1036621 -714727 -782805 -684800 -694283 -743695 -747831 -425022 -433978
1362 -433978 15983 -498006 -532377 -223772 -291282 -405162 -158455 141911 -719034 -287108
1352 -287108 57897 -261191 -104274 -184666 -245556 -669243 -1019119 -822217 -482432 -484848
1342 -484848 -720379 -650195 -829939 -734885 -802892 -766294 -705054 -453423 -526997 -378044 -752237
1331 -752237 -735945 -1061407 -1002649 -238597 -215685 -316218 -103240 -364136 -932668 -285946
1321 -285946 -214488 -106208 -509173 -607549 -267982 125564 -418879 -294076 -279710 -286440 -272945
1310 -272945 -121170 -529127 -625915 -702645 -258709 88398 434773 -18392 -1008557 -863055
1300 -863055 -282930 -217888 -554978 -742061 -602420 -427468 -455315 -518072 -854136 -871269
1290 -871269 -1052327 -877774 -853306 -658903 -1018089 -858429 -951442 -829711 -213409 -132423
1280 -132423 -486835 -553003 -918184 -459600 -221076 -427064 -522084 -871747 -680009 -178980
1270 -178980 -614730 -357693 -658034 -763528 -196137 -263063 -470152 -576058 -363792 -126495
1260 -126495 -554816 -363153 -498825 -542205 -590630 -813134 -562526 -370627 -555689 -179892
1250 -179892 -642025 -740897 -385314 -569947 -781352 -694689 -486401 -179995 -134858 -25641
1240 -25641 -209427 -534363 20447 -249433 -309355 -698046 -595751 -231596 -504763 -655418
1230 -655418 -600902 -663515 -562413 -633615 -385348 -637841 -393798 -341752 140985 312167
1220 312167 -67027 -141705 -576908 -496542 -517518 -282699 45148 -105483 -299173 -299430 -105888
1209 -105888 -677391 -435140 -372304 -499825 -376414 -265789 -181088 -75081 -315398 114019
1199 114019 -209588 -572229 -583889 -696247 -175996 26507 -300273 -621536 -550632 -365213
1189 -365213 -389609 -553593 -842066 -115946 143050 -114583 -298679 -136915 129352 -159670
1179 -159670 -598590 -946503 -758367 -674786 -668118 -603968 5963 -464973 -1224770 -1040450
1169 -1040450 -839578 -823598 -305859 -315192 -479770 -507325 -322347 -405383 -236016 -276302 -159866
1158 -159866 -193136 -388844 -801560 -403293 -349687 -242716 -572585 -393045 -728419 -717516
1148 -717516 -505861 -619752 -288564 -524663 -541776 -240719 -209049 -331187 -523733 -515684
1138 -515684 -62294 -133352 181411 417604 278305 -277713 -837837 -938732 -601199 -248651
1128 -248651 -359366 -346801 -270520 -237331 -443770 -464867 -47591 -410880 -541657 -799652
1118 -799652 -511793 -480117 -631237 -444466 -497825 -475280 -312774 199693 345574 27588
1108 27588 -583313 -508171 -93053 110178 -365266 -296983 271604 -216592 -9011 191667
1098 191667 -160347 -170482 33938 -119180 -173113 -469181 -585841 -602492 -599153 -925285 -694338
1087 -694338 -797605 -664446 -1004209 -991260 -967857 -877185 -566775 -512625 -482779 -694516 -504361
1076 -504361 -482167 -464089 -249337 -166795 -483505 -38147 273811 -1463 377767 116472
1066 116472 377952 -57630 -361311 -123842 -232786 -286502 -668548 -702163 -815082 -458134
1056 -458134 -155942 348658 177270 64497 299920 266632 -20263 16534 69445 -180887
1046 -180887 -279428 -448357 -206994 -254000 -187983 277476 -264254 -315210 -150241 23282
1036 23282 -260418 -59423 -134198 179685 -230231 -480486 -496213 -307799 -428157 -758666
1026 -758666 -618360 -285238 -203726 -516471 -425132 -354234 -481179 -850344 -656464 -757780
1016 -757780 -592941 -106860 253066 -190059 -171750 -183973 -281102 -402426 -64993 -217086
1006 -217086 -356092 -234755 -527951 -565253 -410779 -277992 -538673 -259987 111431 -421299
996 -421299 -522726 -724894 -796187 -321624 -182994 -283618 78390 277045 91291 119829
986 119829 24701 21490 -251887 -311108 -404930 -586933 157364 541334 -186761 -265821 -18245
975 -18245 -20202 -250610 1981 -9567 -504169 -255440 -459633 -125177 -366681 -618651 77182
964 77182 -122984 -120066 -80072 223523 179165 -25111 -239123 -370142 -311514 -466653 -339594
953 -339594 -212928 -144982 53781 -488838 -303223 -164582 -466148 -114481 52648 -38613
943 -38613 -294340 -591203 -672132 -527437 -197801 -408460 -704545 -732631 -531254 189827
933 189827 332767 192278 -215662 -468594 -623066 -618940 -630534 -446732 21561 124810
923 124810 -22375 -92245 28106 2813 -210903 -282522 -161819 -276353 -554308 -347713
913 -347713 -114182 -37738 -66497 -546421 10905 296378 31546 312527 213081 337027
903 337027 21058 -99774 454103 114240 -190006 63825 275428 63291 179436 222556
893 222556 -15634 286719 490490 213803 13666 -217262 -469645 -352669 -561192 -151908
883 -151908 243102 320660 -125533 62622 276359 -287188 -325325 -330232 -202153 -445560 -240383
872 -240383 -247441 205073 216495 83253 403962 278437 242666 -197392 -94766 443411 -169103
861 -169103 -235340 -520152 -226877 143690 -127913 -66347 -129752 -144569 -237377 -64600 -90643
850 -90643 136689 -72394 160167 -85688 -194638 1008 350527 78996 -507941 57274
840 57274 541349 87903 2094 296939 295172 -83073 610698 612461 -17797 -195649 -203207
829 -203207 66351 71704 -490874 -461901 -452863 -679063 -190460 663778 283216 110130 97250
818 97250 151133 242162 115166 301431 432314 598463 252883 -138443 -325849 -21618
808 -21618 3479 168763 135771 51837 165156 240007 599276 353588 148829 -46192 -140197
797 -140197 272872 353630 250672 593781 152603 -512118 -289205 -54482 176443 10339
787 10339 527328 448757 460910 216529 119652 483249 41777 -97613 46733 -195219 -90991
776 -90991 -95840 311345 193586 -37035 -44573 430800 82334 306158 174188 -72241 319507
765 319507 580455 407735 131591 29290 -314674 -100526 -64236 -175604 -122357 254568
755 254568 183292 -250022 -33240 -171452 -251609 298690 415524 190613 111444 167109 72554
744 72554 -270068 -301454 184328 55135 -296256 -354072 140392 507462 402399 181971
734 181971 325504 5821 104085 424593 210718 368535 68100 -117808 260644 345601
724 345601 645054 442062 363712 546369 302809 129238 -57930 279865 524013 792970
714 792970 446947 471264 519213 467180 63081 -334810 -285928 -518650 -425562 -487983 -15471
703 -15471 84793 359989 478243 182783 254469 471663 447050 -36105 -411595 174975
693 174975 460620 344808 185671 157564 160752 -159987 448061 490308 -4840 410388 706202
682 706202 501696 503272 806890 826236 624543 118829 554692 792346 235122 231685 518460
671 518460 320448 197905 336045 338724 613455 715414 589668 588715 149261 -1260 44495
660 44495 297028 547029 762313 530744 491027 491240 434224 221687 -207428 397957 445060
649 445060 99255 520142 350455 273379 496478 223690 391618 242526 238865 410698
639 410698 565669 586690 563820 777150 731166 607729 554200 460910 783166 703905 321909
628 321909 634003 321899 599434 874824 604852 182586 387356 20375 -152729 93764
618 93764 438741 393115 505418 704337 464393 11559 -69361 730911 872553 367225
608 367225 207967 528362 851182 829183 338874 -55885 -23813 190448 362275 776878
598 776878 881766 723040 259179 86098 145979 452479 591967 828988 867524 694370
588 694370 161527 137300 -300828 -188134 158786 264242 181613 371452 413432 401028 736806
577 736806 1005743 1093404 797902 308675 610400 793767 579587 229683 -128838 -138100
567 -138100 86603 312744 324112 105261 261619 735514 746302 79944 64037 -108109
557 -108109 10508 639578 104875 -14917 662874 689397 281490 -15685 -9956 216788
547 216788 442150 895170 529207 317653 13842 242910 537352 783009 392045 413556
537 413556 896732 862854 965396 785833 590612 281136 373535 358529 219239 635887
527 635887 647035 515980 765802 912606 349545 91730 602827 560316 571163 878305
517 878305 1005141 845482 1284231 991072 594478 1252951 1107770 511254 852911 995393
507 995393 656344 700208 823774 339084 175970 442463 183899 -77602 216592 758733
497 758733 528072 231450 124751 654138 800700 947268 1046957 514917 504634 416167
487 416167 621540 526850 749702 654948 635222 368902 147575 152246 105498 675120 84955
476 84955 115973 415168 757916 964375 948819 899646 619748 397160 577889 562347 457988
465 457988 381248 843188 358672 332284 808857 869112 299882 288919 847989 1141940 767812
454 767812 552995 765532 766182 351289 52552 620080 529092 464127 442048 549758 821675
443 821675 1178629 574346 624417 532955 788346 263554 406500 1007062 1061023 1389932
433 1389932 1100868 497021 451970 977596 647058 346518 171132 347165 637022 618386
423 618386 690481 896620 980622 1154652 879855 980966 674735 792979 918413 784027
413 784027 674508 569867 493143 877166 396062 397430 791195 881167 923551 613457 518292
402 518292 744432 1103455 692336 620484 652920 886620 996492 736391 462706 466456 186759
391 186759 455628 893619 608118 419145 862182 1073637 516771 551689 793737 690499
381 690499 1032406 1311584 840789 773499 1222754 932726 815626 687920 835889 838867
371 838867 588327 588066 776075 685558 506284 567263 1031400 1096534 615096 467619 1123630
360 1123630 1395101 1553588 1424522 1243405 790724 1149125 1135936 1215367 1038817 716961
350 716961 917448 774429 1051648 683924 602547 777171 1113120 1213750 1052209 1044516
340 1044516 780477 829294 779577 606615 847350 981414 860970 654415 649857 531390
330 531390 801962 908098 1033366 579226 893807 1092012 824347 610504 380731 285039
320 285039 -50508 307579 1156716 914329 1265540 863511 1105980 1361259 748244 553464
310 553464 744051 1158758 874789 939628 403084 546453 757059 670506 570809 831554
300 831554 356844 480530 564520 491589 757870 634498 615297 919519 683165 698714 733270
289 733270 689603 827503 675516 678888 285342 553820 617130 356908 258836 680212 800654
278 800654 1131053 1030889 987507 1267620 1154856 1456554 1562749 1379728 1184586 1809009
268 1809009 1771812 1314313 1067695 1023545 951846 1002901 803294 778128 933618 887356 1108692
257 1108692 1199756 847657 1195316 1157964 1089918 1140906 1280889 1101591 667774 826400
247 826400 927343 1096936 1072616 1360184 849991 698971 765944 953525 1023982 1100015 758208
236 758208 918193 1413840 1395272 1111094 1179997 1105066 1184235 1194107 1114192 1330423 1029750
225 1029750 572042 768430 651066 602430 1440634 1881886 1801365 1473831 1046960 989454
215 989454 1328106 760226 707259 1295761 1085960 937933 1252297 1159463 1020973 1124438
205 1124438 1282645 1659820 1294539 1054223 933802 939678 1014584 1284915 1346766 1345439 1359307
194 1359307 1495201 1674451 1077084 1340599 1189866 1099063 1290059 982908 868784 1045977
184 1045977 619628 188397 770969 1030176 981841 911072 1118058 1572456 938754 611364
174 611364 725162 699298 410955 570411 646025 177652 532302 821763 1485648 1771196
164 1771196 1385973 1098695 1191241 727710 825437 1003179 409701 612891 986715 1079605
154 1079605 998760 678271 951768 1420010 1748112 1499479 775810 825629 730323 875052
144 875052 1493578 1641868 1295103 703780 725740 1201252 1083307 1135596 1009427 1331142
134 1331142 1635127 1369357 1011060 897808 801995 780339 1074070 1277563 1043441 1433831
124 1433831 1499507 1683994 1201678 747212 1114881 983011 713300 800096 765094 919305
114 919305 862328 927167 1364256 1471308 1247520 1004598 1260001 1124637 1388250 1479155
104 1479155 1614468 1262712 1241421 1282825 1464874 1133115 1155324 1303958 1506094 1289770
94 1289770 1008118 1301535 1453140 1227382 945263 1103824 1300820 1231726 1335320 1303327
84 1303327 1397240 1536625 1715188 1574545 1608222 1739791 1665009 1901230 1493425 1407832 1600886
73 1600886 1512359 1351207 1549713 1632478 1461603 1033479 1180818 1063571 1354243 1629940
63 1629940 1361939 1114334 1171238 1011042 777097 985487 1257027 1289255 1168431 1192392
53 1192392 1447190 954791 1142342 1021645 1166442 1401498 1527567 1532396 1259240 1183458
43 1183458 1063570 781262 1115285 1036608 1142293 1072268 1098340 1081983 1133948 1447000 1403646
32 1403646 1344529 1302002 1318879 1501727 1701858 1392030 1047139 999840 1189153 1136936 1374331
21 1374331 1227410 1174067 1146392 1281000 1051823 877107 1103722 1457620 1179485 1232731
11 1232731 1182004 1144721 1385579 1574287 1429462 1328316 1584113 1926504 2050293 1796497
1 1796497 1275379
0 1275379
$$ Imaginary data points
##PAGE= N=2
##DATA TABLE= (X++(I..I)), XYDATA
16383 -3978916 -3556426 -3538226 -3588751 -3566713 -3872764 -3693575 -3354442 -3311372 -3418776 -3454089
16373 -3454089 -3542615 -3100123 -3058521 -3080611 -2862115 -2964387 -2653803 -3012300 -3182210 -2725138
16363 -2725138 -2302162 -2303416 -2034926 -1901721 -2239952 -2138221 -1868045 -1851189 -1775190 -1694871
16353 -1694871 -1921833 -1867850 -1699952 -1696163 -2015248 -1755519 -1818452 -1625867 -1713886 -1495205
16343 -1495205 -1480651 -1290715 -1165918 -1267352 -1534827 -1355888 -1155673 -1127051 -889411 -792514
16333 -792514 -854778 -798817 -344957 -695249 -745403 -467285 -770680 -651673 -379253 -459550
16323 -459550 -655576 -347416 -365050 -343711 225330 232417 170298 64433 -31629 428583 744923
16312 744923 568204 278241 271531 546531 1269497 882794 810895 574013 328141 776611
16302 776611 1064010 1008633 1004289 1382676 1222675 1227153 1016086 957404 721042 1009989 1093174
16291 1093174 1229683 1316629 1366223 1236609 1372934 1596089 1619007 2192591 2097736 1888417
16281 1888417 2146390 2249149 2026171 1841385 2266099 2302811 1882489 2102896 2383904 2357882
16271 2357882 2273559 2269420 2378892 2624317 2667685 2858166 2641620 2703336 2685099 2628430 2914952
16260 2914952 3223551 3024029 2926165 3000110 3280701 3295772 3067749 3345892 3724799 3520184
16250 3520184 3717054 3833172 3431094 3368917 3326011 3469853 3440818 3228387 3343310 3623961
16240 3623961 3992343 3881423 4136099 4329100 4268705 3840408 3487366 3890043 4012185 4121315
16230 4121315 4494538 4444931 4058494 4149438 4507810 4570678 4599604 4858952 4993039 4837490
16220 4837490 4497082 4583929 4256488 4016454 4078171 4273015 4342114 4068660 4350906 4648616
16210 4648616 4559108 4512712 4538947 4528901 4669578 4714931 4552521 4512055 4672974 4811597
16200 4811597 4855732 5067382 4569160 4787458 4914077 5049170 5497938 5425053 4617504 4784790
16190 4784790 4660156 4801402 4903753 4789696 5051218 5198534 5584591 5248370 5341573 5375445
16180 5375445 5332286 5633966 6059179 6034084 5702144 5369702 5350612 5485419 5403843 5925906
16170 5925906 5365386 5184655 5360344 5573906 5498907 5552667 5270725 5350822 5394880 5634177
16160 5634177 5864780 6127087 5867913 5652004 5846102 5633174 5621454 5593840 5732727 5447143
16150 5447143 5588642 5840981 6161506 5932079 5497113 5710782 5604046 5813211 6067204
16141 6067204 6343361 6198680 5359182 5217296 5389457 5930690 5647944 5788301 6029870
16132 6029870 6272376 6006616 5865716 6104461 5775579 5589414 5812219 5691570 5650676 5815863
16122 5815863 5837939 5267522 5324868 5609698 5786726 5802888 5820266 6191372 6182060 6021751
16112 6021751 5642938 5937603 6205424 6044726 5767115 5763335 5945231 5834876 6112923 6525301
16102 6525301 6333987 6058665 6332198 6393438 6218742 6615072 6379909 6117104 6470979 6127705
16092 6127705 6467478 6289595 5776082 6233798 6347114 6160815 6424882 6517885 6269597 5862125
16082 5862125 6333883 6344935 5818124 5992459 5811913 5778260 6061262 6013259 6175723 6746037
16072 6746037 6329725 6010030 5914714 6184419 6494455 6468166 6334692 6363162 6562176 7004607
16062 7004607 6719432 6428510 6177642 6030284 6636064 6727084 6891285 7033564 6755431 6383153
16052 6383153 6395468 5457657 6050956 6211023 6451583 6490968 6484617 6545366 6507178 6612069
16042 6612069 6740577 6513807 6442399 6268643 6543141 6361642 6298681 6116298 6223367 6465262
16032 6465262 6491849 6426564 6437658 6519936 6419133 6553334 6255192 6115303 6257775 6379285
16022 6379285 6010159 6130481 6125313 6225187 6505009 6537864 6289637 6161128 6247821 6520825
16012 6520825 6199470 6088162 6256206 7022156 6480569 6293137 6271590 6550029 6399605 6238783
16002 6238783 6532564 6453361 6257304 6064787 5967205 5866710 5886746 5566611 5467784 5760751
15992 5760751 6553526 6221031 6033116 6167857 6023458 6398037 6164873 6613000 6610290 6540925
15982 6540925 6052118 5832754 6292830 6293288 5851298 6043368 6265670 6774113 6530827 6299613
15972 6299613 5911681 5869742 6278393 6673384 6392816 6074125 6265061 6139602 6124490 6012070
15962 6012070 6048444 6224159 6455985 6569567 6323399 6262052 6291925 6237197 6273140 6265909 6186001
15951 6186001 6356645 6181439 5997409 6177383 6810263 6804822 6381337 6429978 5838153 6114045
15941 6114045 6160959 6195474 6582387 6508733 6642502 6943187 6434396 6439581 6791027 6406510
15931 6406510 6440290 6262889 6891639 6584016 6273634 6533807 6573768 6209567 6621499 6989814
15921 6989814 6694271 6415138 6348600 6524487 6569164 6860274 6936308 7026348 6230481 6064774
15911 6064774 6231129 6468298 6483150 6365707 6327963 6076790 5627765 6020275 6499345 6645048
15901 6645048 6244190 5892656 6003692 6180870 6118620 5908684 5454354 5594035 5543431 5812501
15891 5812501 6228825 6355837 6256268 6409723 6466150 6689949 6729000 6718740 6369321 6561125
15881 6561125 6296962 6141350 6091277 6636248 6619420 6227439 6239388 6547808 6736744 6702475
15871 6702475 6295378 6355201 6179657 6037139 6217334 6548343 6401689 6537642 6391693 6369655
15861 6369655 6442446 6037922 6243025 5622916 6560319 6674632 6095856 6151082 5977793 5525851
15851 5525851 5677251 6030400 6316110 6161967 6374956 6333491 6012243 6020390 6067644 6141157
15841 6141157 6349956 6606174 6247128 5812428 6202340 6514834 6304549 5779161 6166284
15832 6166284 6240224 6293575 6521309 6439506 6253658 6768121 6767226 6206553 6200028 6472155 6397198
15821 6397198 6116291 6114818 6394898 6652101 6702784 6612464 6485567 6261999 6031297 6269212
15811 6269212 6484802 6867985 6692746 6633291 6051612 6088575 6435957 6547450 6168217 6251817
15801 6251817 6816556 6554882 5768686 5701583 5982727 6100531 6349965 6384420 6153780 5933627
15791 5933627 6197804 6098098 6524386 6777846 6722084 6639876 6175485 5996375 5918861 6439445
15781 6439445 6529081 6378692 6477704 6264854 6581419 6633916 6657910 6395493 6302080 6684447
15771 6684447 7076080 7193508 7192382 6890658 6332842 6204304 5782519 6177392 6563288 6686566
15761 6686566 6458403 5986729 6595720 6495108 6317458 6114362 6038632 5795319 6172917 6527656
15751 6527656 6543529 6504328 6100286 5980383 6826786 6406262 6260337 6461880 6759193 6746495
15741 6746495 6739378 6663206 6869359 7139874 6810815 6709393 6711970 6754234 6678083 6753319 6536507
15730 6536507 6612280 6483852 6471878 6712511 6199968 6346423 6285514 5886344 6318079 6425262
15720 6425262 6380103 7049817 7100646 6603911 6632247 6268720 5984495 6403049 6506711 6588622
15710 6588622 6735417 6574206 6321676 6170750 6525739 6099227 6002953 6122878 6080332 6154762
15700 6154762 6328894 6896230 6428295 6043788 6194850 6201655 6130332 6535943 6828070 6773154
15690 6773154 6560067 6360416 6895113 6889129 6675830 6148106 5803237 6064482 6372185 6366291
15680 6366291 6480181 6304080 6407029 6460803 6416238 6700675 6812190 6967104 6977931 6759044
15670 6759044 7016798 6838819 6743122 6753594 6798445 6358285 6194852 6731770 6910789 7304635
15660 7304635 7507272 6544696 6702840 6790664 7015446 6750371 6480847 6378640 6294626 6347481
15650 6347481 6781539 6699845 6473955 6336943 6371431 6320581 6113347 6318406 6698996 6933809
15640 6933809 6510820 6755471 6905546 6678330 6566774 6315729 6203586 6212939 6329390 6922609
15630 6922609 6895455 6291532 6254611 6175334 6453324 6392744 6683976 6539509 6407891 6229261
15620 6229261 6398402 6488182 6469735 6664254 6235355 6692661 6549238 6328519 6274155 6623370
15610 6623370 6057912 6216245 6711524 6490622 6378155 6436025 6404678 6334537 6408473 6675002
15600 6675002 6549624 6484731 6346051 6182020 6540425 6430938 6440634 6500956 6455798 6493383
15590 6493383 6402078 6712156 6383988 6170752 6432294 6572903 6337767 6660901 6731375 6785433
15580 6785433 7243179 7005315 6362540 6502336 6643774 6401237 6706727 6940295 6783415
15571 6783415 6538798 5984486 5887915 6284594 6728829 6359928 6637698 6802063 6447034 6327804
15561 6327804 6080880 6119240 6320117 6719685 6675681 6717742 7106408 6996517 6874387 6564189
15551 6564189 6675975 6523663 6416662 6667149 6873971 6573752 6353601 6568156 6783388
15542 6783388 6751368 6361485 6165913 6493045 6369913 6172664 6467217 6430755 6270253 6325867
15532 6325867 6092324 5686619 6060645 6251006 6503832 6857122 6595050 6552033 7071515 7131982
15522 7131982 7395313 7499068 7243493 6366450 6354648 6368027 6915535 7201970 6647147 6497679
15512 6497679 6619508 6749828 7025540 7262892 6552290 6549984 6718903 6843504 7071118 6690300
15502 6690300 6354993 6118462 6167698 6717792 6760984 6976781 7133489 6978565 6915691 6460563
15492 6460563 6683086 6874361 6974378 7077355 6925310 7462702 7388802 6937401 6913692 6798169
15482 6798169 6669087 6596266 6424744 6759108 6882003 6838134 7118846 6604146 6650627 7072192
15472 7072192 6694886 6516575 6952735 7149338 7156786 7217051 7346886 7197790 7172261 6811461
15462 6811461 6476334 6967161 7403058 7210978 6959579 6860763 7260169 7381955 6927705 6944555
15452 6944555 6689899 6296148 6317752 6293524 6544575 6685944 6483517 6825886 7392659 6657062
15442 6657062 6873961 6558122 6427502 6832127 6418983 6567178 6531270 6553590 6732646 7045046
15432 7045046 6474822 6223520 6392509 6908393 6972172 6794989 7250603 7059504 6577556 6772524
15422 6772524 6277314 6595685 6688558 6599374 6757553 7004530 7006090 6945255 6776956 6443459
15412 6443459 6649254 6950951 7079096 6975786 6874980 6344016 6351575 6574346 6766386 7055004
15402 7055004 7202313 6681861 6382360 6486701 6973121 6754088 6828830 6775280 6795379 7071898
15392 7071898 7168898 7177570 6667384 6468346 6771329 6857650 7140907 7463373 7203362 6686794
15382 6686794 7010274 6818207 6754245 6744656 6462399 6984299 7005752 6682901 6454464 6342297
15372 6342297 6750880 6835723 6868466 7002744 7123352 7307621 7745691 7292244 6644217 6497522
15362 6497522 6605734 6505164 6761623 7343956 7007320 7031801 6686634 6728343 6488148 6616349
15352 6616349 6581076 6806681 7108605 7001768 7039221 6574767 6887160 7070926 6814917 7070498
15342 7070498 7156891 6774006 6823069 6704598 6792543 6602280 6270231 6601630 6490082 6798128
15332 6798128 6859210 7086207 7264098 6812001 6484534 6625607 7030042 6903817 6617603 7285432
15322 7285432 7541660 7069197 6984023 7083888 7098024 6791275 6659616 6705389 6443702 6835030
15312 6835030 7180871 7550321 7649674 6910287 6394067 6963666 7414295 7163431 6976922 6889038
15302 6889038 6848082 6632919 6945848 7074815 7097089 7136105 7018837 7127877 7055998 7096414
15292 7096414 7372486 7143150 6931481 7118030 6953185 7231699 7439637 7127780 6721320
15283 6721320 6896635 6979191 7486196 7106293 6672738 6720943 7139228 7342887 7133080 7109320
15273 7109320 7127407 6919737 6419561 6152489 6292210 6425092 6970885 7018023 6888932 6780166
15263 6780166 6858359 6863477 6611087 6904393 7117687 6978930 6830323 6509024 6403897 6592323
15253 6592323 6346786 6623198 6800004 6578123 6825202 6838534 6730014 7102697 6760917 7352856
15243 7352856 7003845 6463397 6551719 6225782 6596170 6574728 6341793 6359063 6369884 7061643
15233 7061643 6789837 6797357 6697700 6681459 7227090 7049831 7125735 6961274 6997978 6851580
15223 6851580 6348749 6322188 6736227 6710024 6839582 7350986 7284979 7273670 7207884 7341755
15213 7341755 7354858 7110112 6782174 7013318 7120699 7085227 6459504 6507437 6917266 7072112
15203 7072112 7012197 7103685 7032980 6745178 7065086 7352067 7265113 7465177 7030323 6615269
15193 6615269 6600421 6967095 6902941 6850533 6978906 6587028 6733338 7030932 6673234 6959408
15183 6959408 7636928 7771250 7490016 7203144 6936629 7072753 6929778 7301379 7509225
15174 7509225 7464249 7232762 6773281 7162469 6786170 6935433 6809906 7151072 7444627 7447631
15164 7447631 6934866 6671536 6563114 6606877 6827491 6644676 6561695 6708757 6631117 6849644
15154 6849644 6853895 7138578 7646285 7420799 7003778 6674670 6872365 6945077 6984129 6655234
15144 6655234 6873948 7073150 6949764 7126715 6817481 6416271 6523191 6924578 6980348 6583286
15134 6583286 6461058 6420907 6741738 6403493 6313079 6473298 6538195 6632782 6896546 7490428
15124 7490428 7709324 7312575 6550053 7009983 7315713 7149663 6860981 6439626 7014559
15115 7014559 7321533 7520251 7342092 7030596 6828267 6917995 6824414 6549174 6719367 6806759
15105 6806759 6909309 6735492 6666110 6703990 6854036 6578301 7403727 7615724 7590267 7200911
15095 7200911 7229494 7093484 6678691 6671394 7041170 6678308 6294857 6237878 6625875 6778438
15085 6778438 6875655 7048863 6788405 6993272 6980751 7064247 6907459 6570592 6577188 7157812
15075 7157812 7353435 7227967 7134244 7290403 7474120 6628596 6546296 6519249 6825003 6931648
$$ [...]
##END NTUPLES=NMR SPECTRUM
##END=
