##TITLE=1H_CA-9076x3
 CDCl3
 8 sc, 
 25.10.2022
##JCAMPDX= 6.0         $$ Bruker NMR JCAMP-DX V2.0
##DATA TYPE= NMR SPECTRUM
##DATA CLASS= NTUPLES
##ORIGIN= UXNMR, Bruker Analytische Messtechnik GmbH
##OWNER= root
$$ XWIN-NMR		Version 3.5
$$ Tue Oct 25 14:15:01 2022 Russian Standard Time (UT+4h)  she@DPX200
##.OBSERVE FREQUENCY= 200.1313499994
##.OBSERVE NUCLEUS= ^1H
##.ACQUISITION MODE= SIMULTANEOUS
##.ACQUISITION SCHEME= undefined
##.AVERAGES= 8
##.DIGITISER RES= 18
##SPECTROMETER/DATA SYSTEM= spect
##.PULSE SEQUENCE= zg30
##.SOLVENT NAME= CDCl3
##.SHIFT REFERENCE= (INTERNAL, CDCl3, 0, 15.7491)
##AUDIT TRAIL= $$ (NUMBER, WHEN, WHO, WHERE, WHAT)
$$ ##TITLE= Audit trail, XWIN-NMR		Version 3.5
$$ ##JCAMPDX= 5.01
$$ ##ORIGIN= Bruker BioSpin GmbH
$$ ##OWNER= she
$$ F:/spectra/data/she/nmr/H-F/1/pdata/1/auditp.txt
$$ ##AUDIT TRAIL=  $$ (NUMBER, WHEN, WHO, WHERE, WHAT)
(   1,<2022-10-25 14:13:50.15 +0400>,<she>,<DPX200>,
      <created by zg, POWCHK disabled, PULCHK disabled
       configuration hash MD5:
       00 E9 B6 7A A2 85 ED C7 34 08 36 98 17 FE 4E 26
       data hash MD5: 16K
       60 70 6A FA E8 79 F5 6A 08 7E 3A FB 38 82 62 87>)
(   2,<2022-10-25 14:13:52.51 +0400>,<she>,<DPX200>,
      <Start of raw data processing
       efp BC_mod = 2 LB = 0.24 FT_mod = 6 PKNL = 1 PHC0 = -18033.38 PHC1 = 8.8007 SI = 16K 
       data hash MD5: 16K
       15 2A 74 C4 FD 22 5B B3 2C 34 A8 64 66 BE 61 FE>)
(   3,<2022-10-25 14:14:11.68 +0400>,<she>,<DPX200>,
      <pk PHC0 = -7.691382 PHC1 = 9.599999 
       data hash MD5: 16K
       55 86 BA A1 D9 41 75 56 EA 4E 13 12 AD 51 C3 1B>)
(   4,<2022-10-25 14:14:14.62 +0400>,<she>,<DPX200>,
      <abs ABSG = 5 
       data hash MD5: 16K
       16 62 B1 F6 96 15 72 27 93 EA 48 DA 81 6C 09 65>)
$$ ##END=
$$ 
$$ hash MD5
$$ 9A 3A 34 F0 B9 31 41 8B FC 36 A7 98 AE F5 C0 D3
##$RELAX= 
##$RELAX= 
##$RELAX= 
##$RELAX= 
##$RELAX= 
##$RELAX= 
$$ Bruker specific parameters
$$ --------------------------
##$DU= <F:/spectra>
##$EXPNO= 1
##$NAME= <H-F>
##$PROCNO= 1
##$TYPE= <nmr>
##$USER= <she>
##$AMP= (0..31)
100 100 100 100 100 100 100 100 100 100 100 100 100 100 100 100 100 100 
100 100 100 100 100 100 100 100 100 100 100 100 100 100 
##$AQSEQ= 0
##$AQ_mod= 1
##$AUNM= <au_zg>
##$AUTOPOS= <>
##$BF1= 200.13
##$BF2= 200.13
##$BF3= 200.13
##$BF4= 200.13
##$BF5= 200.13
##$BF6= 200.13
##$BF7= 200.13
##$BF8= 200.13
##$BYTORDA= 1
##$CFDGTYP= 0
##$CFRGTYP= 5
##$CHEMSTR= <none>
##$CNST= (0..31)
1 1 145 1 1 1 1 1 1 1 1 1 1 1 1 1 1 1 1 1 1 1 1 1 1 1 1 1 1 1 1 1 
##$CPDPRG= <>
##$CPDPRG1= <>
##$CPDPRG2= <>
##$CPDPRG3= <>
##$CPDPRG4= <mlev>
##$CPDPRG5= <mlev>
##$CPDPRG6= <mlev>
##$CPDPRG7= <mlev>
##$CPDPRG8= <mlev>
##$CPDPRGB= <>
##$CPDPRGT= <>
##$D= (0..31)
0 1.2 0 0 0 0 0 0 0 0.06 0 0.03 0 0 0 0 0.0002 0 0 0 0 0 0 0 0 0 0 0 0 
0 0 0 
##$DATE= 1666692829
##$DBL= (0..7)
120 120 120 120 120 120 120 120 
##$DBP= (0..7)
150 150 150 150 150 150 150 150 
##$DBP07= 0
##$DBPNAM0= <>
##$DBPNAM1= <>
##$DBPNAM2= <>
##$DBPNAM3= <>
##$DBPNAM4= <>
$$ [...]
##$SUBNAM3= <"">
##$SUBNAM4= <"">
##$SUBNAM5= <"">
##$SUBNAM6= <"">
##$SUBNAM7= <"">
##$SUBNAM8= <"">
##$SUBNAM9= <"">
##$SW= 18.0517283424941
##$SWIBOX= (0..15)
0 0 2 0 0 0 0 0 0 0 0 0 0 0 0 0 
##$SW_h= 3612.71676300578
##$TD= 16384
##$TD0= 1
##$TE= 0
##$TE2= 300
##$TE3= 300
##$TEG= 300
##$TL= (0..7)
0 120 120 120 120 120 120 120 
##$TP= (0..7)
150 150 150 150 150 150 150 150 
##$TP07= 0
##$TPNAME0= <>
##$TPNAME1= <>
##$TPNAME2= <>
##$TPNAME3= <>
##$TPNAME4= <>
##$TPNAME5= <>
##$TPNAME6= <>
##$TPNAME7= <>
##$TPOAL= (0..7)
0.5 0.5 0.5 0.5 0.5 0.5 0.5 0.5 
##$TPOFFS= (0..7)
0 0 0 0 0 0 0 0 
##$TUNHIN= 0
##$TUNHOUT= 0
##$TUNXOUT= 0
##$USERA1= <user>
##$USERA2= <user>
##$USERA3= <user>
##$USERA4= <user>
##$USERA5= <user>
##$V9= 5
##$VALIST= <valist>
##$VCLIST= <CCCCCCCCCCCCCCC>
##$VD= 0
##$VDLIST= <DDDDDDDDDDDDDDD>
##$VPLIST= <PPPPPPPPPPPPPPP>
##$VTLIST= <TTTTTTTTTTTTTTT>
##$WBST= 1024
##$WBSW= 4
##$XGAIN= (0..3)
0 0 0 0 
##$XL= 0
##$YL= 0
##$YMAX_a= 130038
##$YMIN_a= -179698
##$ZGOPTNS= <>
##$ZL1= 120
##$ZL2= 120
##$ZL3= 120
##$ZL4= 120
##$ABSF1= 15.73477
##$ABSF2= -2.31708
##$ABSG= 5
##$ABSL= 3
##$ALPHA= 0
##$AQORDER= 0
##$ASSFAC= 0
##$ASSFACI= 0
##$ASSFACX= 0
##$ASSWID= 0
##$AUNMP= <proc_1d>
##$AZFE= 0.1
##$AZFW= 0.1
##$BCFW= 0
##$BC_mod= 2
##$BYTORDP= 0
##$COROFFS= 0
##$CY= -3
##$DATMOD= 1
##$DC= 0
##$DFILT= <>
##$DTYPP= 0
##$F1P= 0
##$F2P= 0
##$FCOR= 1
##$FTSIZE= 16384
##$FT_mod= 6
##$GAMMA= 0
##$GB= 0
##$INTBC= 1
##$INTSCL= 3.70164e-10
##$ISEN= 128
##$LB= 0.24
##$LEV0= 0
##$LPBIN= 0
##$MAXI= 10000
##$MC2= 0
##$MEAN= 0
##$ME_mod= 0
##$MI= 1.114404
##$NCOEF= 0
##$NC_proc= -9
##$NLEV= 6
##$NOISF1= 3.799351
##$NOISF2= 2.8
##$NSP= 0
##$NTH_PI= 0
##$NZP= 0
##$OFFSET= 15.74909
##$PC= 1
##$PHC0= -18041.07
##$PHC1= 18.4007
##$PH_mod= 1
##$PKNL= yes
##$PPARMOD= 0
##$PSCAL= 0
##$PSIGN= 0
##$REVERSE= no
##$SF= 200.130004491632
##$SI= 16384
##$SIGF1= 3
##$SIGF2= 2
##$SINO= 5.538805
##$SIOLD= 16384
##$SREGLST= <1H.CDCl3>
##$SSB= 0
##$STSI= 16384
##$STSR= 0
##$SW_p= 3612.71676300578
##$SYMM= 0
##$S_DEV= 0
##$TDeff= 16384
##$TDoff= 0
##$TI= <>
##$TILT= no
##$TM1= 0
##$TM2= 0
##$TOPLEV= 0
##$USERP1= <user>
##$USERP2= <user>
##$USERP3= <user>
##$USERP4= <user>
##$USERP5= <user>
##$WDW= 1
##$XDIM= 16384
##$YMAX_p= 394969748
##$YMIN_p= -6988687
$$ End of Bruker specific parameters
$$ ---------------------------------
##NTUPLES= NMR SPECTRUM
##VAR_NAME=  FREQUENCY,     SPECTRUM/REAL,   SPECTRUM/IMAG
##SYMBOL=    X,             R,               I
##VAR_TYPE=  INDEPENDENT,   DEPENDENT,       DEPENDENT
##VAR_FORM=  AFFN,          ASDF,            ASDF
##VAR_DIM=   16384,         16384,           16384
##UNITS=     HZ,            ARBITRARY UNITS, ARBITRARY UNITS
##FACTOR=    0.220516191357247, 1,           1
##FIRST=     3151.86549140486, 0,            0
##LAST=      -460.851271600922, 0,           0
##MIN=       -460.851271600922, -6988687,    0
##MAX=       3151.86549140486, 394969748,    0
$$ Real data points
##PAGE= N=1
##DATA TABLE= (X++(R..R)), XYDATA
$$ [...]
6811 2733747 3026867 2402165 1370576 2290273 1639542 2744810 2854687 2731264 2559627
6802 2559627 2935523 3494557 3043488 2375228 1542522 2041701 1421702 1454304 2636788 3164304
6792 3164304 3282094 2545110 2631471 1899177 2001939 3073961 2771284 1631990 2048743
6783 2048743 2460524 2035249 2000286 1438848 3460521 3473854 3498752 3114522 2698899 1372078
6773 1372078 1214119 2195975 1384545 542594 753792 624506 1694728 2010736 1693278
6764 1693278 2351722 1678150 1112146 1073785 2882134 2820168 2238482 2470300 2225668 2820513
6754 2820513 2097089 2190487 3404855 2840625 2173166 1193555 1837517 2362889 1567654 2063532
6744 2063532 2803668 2539288 2081796 1716269 888336 1941962 2264670 2932037 2626323
6735 2626323 1967921 2833799 2792945 2804104 3593400 3584850 2175866 2351587 3096201 2490690
6725 2490690 3094088 2607562 817754 1694151 2803308 3048432 3053462 2486747 4127275
6716 4127275 4703378 4143970 3034834 3552665 5009709 4296336 2310806 2076040 2293559
6707 2293559 2303520 3443163 4160118 3371723 2962153 3136447 2659596 1878610 1722728 2680694
6697 2680694 1005442 713954 2740244 3520873 3812404 4136538 3053922 3435886 4116920
6688 4116920 3877646 1851525 2183930 1732675 929846 998306 877461 2047581 2480119
6679 2480119 3355888 4416076 5481376 3720580 2217726 1435759 1342941 2674728 2982607
6670 2982607 3163217 2966253 2892879 3298670 3981194 3214247 4567758 4895135 3154216
6661 3154216 3509755 3700257 2848541 3647195 3569569 3966005 2682061 2277659 2419526 3397791
6651 3397791 3749242 2466008 2849709 2758161 2013729 1958015 3120128 3417435 2612240 2380155
6641 2380155 2384202 1857808 1861777 2440548 2693604 2760199 2834649 3591839 3241932 3773660 4399623
6630 4399623 3169216 2908984 3244211 3253754 2756361 3264235 3202115 3523038 2749234 2610116
6620 2610116 2889812 2401540 3504446 3646157 2472221 3271699 2498856 2219614 1547902
6611 1547902 3257537 3530158 2226781 2243406 2304424 2430570 3346354 3455640 2613233 2718790
6601 2718790 3539609 3123140 3667505 4649919 3669964 3775657 4386784 3745734 3041465 2820484
6591 2820484 2697374 1817624 2478699 2583240 2202259 2049813 2803350 3408837 4062990 3536864
6581 3536864 1900034 3224005 3508866 3514639 2389558 3272911 2853529 2747002 3549784
6572 3549784 3648203 3842694 2810275 2419562 2804328 2538138 3371961 3514298 3619517 2933335
6562 2933335 1984604 3894758 3147970 2808197 2849285 3370430 4303179 3274589 3081357
6553 3081357 2709832 4280217 3306458 4002299 4489660 3061759 2723089 3563507 3351673
6544 3351673 1970829 2468882 2478111 3193482 3403901 3837941 3341440 2501296 3061959 3383926
6534 3383926 2768941 1901680 3092722 3140860 2314281 3203897 2759797 3166339 3405909 4344643
6524 4344643 3874105 3269401 3577521 3805786 3366041 4143737 3429239 2224117 3717900
6515 3717900 3083457 3335673 3521558 2759281 3548355 3514067 3070504 3750000 3085027 3072126
6505 3072126 2381681 2209129 3240448 2066883 2064971 3170685 3513348 3745756 3369892
6496 3369892 2308155 2571426 2981887 3040866 2017436 2515658 2507205 2741406 3010205 3368187
6486 3368187 3530511 2473458 2377263 2015726 2174369 1591161 875220 1201889 2306033
6477 2306033 2979718 2831599 3179365 3027949 2509095 2465323 2533772 3250986 3006728 3202893
6467 3202893 2405473 3638482 3426663 2744772 2088455 1874887 3534779 3065198 2287667
6458 2287667 3764040 2540245 2657431 3015890 2415923 2225694 1840884 1748112 2199444
6449 2199444 2242707 2764027 3008579 3085385 2741567 3916304 4791634 3385841 3954174 2530767
6439 2530767 2186273 2968568 3248562 2537900 2217560 1987582 808341 473374 1878297
6430 1878297 1516962 1529489 3362315 3772322 3453146 2932983 2965485 2559915 1622096 2443458
6420 2443458 2416424 1642006 1103131 2114788 2823842 1557039 1832350 1783829 1527069 2001496
6410 2001496 2098942 2017137 1935855 1846158 2113089 2720336 1644301 1858578 1705201 1733651
6400 1733651 1843007 2932339 3380329 4124638 3698328 3433291 2172182 1414898 2914490
6391 2914490 3173227 2612184 3181843 3237796 2783356 2836844 2790277 3386810 3494715 2734481
6381 2734481 2067797 2136837 1984680 938927 1629646 2339262 1725802 222571 213906 1944367
6371 1944367 2093916 2931466 2607264 3029625 2757690 1546252 2004717 1749167 1787783 1029507
6361 1029507 1690295 2246048 1021411 1889337 2616123 2581995 2776994 2088648 1095723 1190026
6351 1190026 3034867 2956681 2748116 2372701 2769456 3161104 2646529 3047484 2313406 3043330
6341 3043330 3597785 2574205 1990916 2849853 632559 1209337 1004942 1729952 3246869
6332 3246869 3163762 3127366 3246184 3167840 2457280 2111808 2217451 2220366 2882621 2983888
6322 2983888 2934297 2535535 2946684 2220122 2406900 2233532 1419414 926719 1271047 1501627
6312 1501627 2854555 3653044 2730267 1852671 2386823 2560402 3205732 2873491 3242640
6303 3242640 2865228 1606517 2589717 2768107 3189838 3763483 3676943 2465808 2293944
6294 2293944 2474110 2050962 2625426 4185646 3004964 2040485 1875836 3328898 2841827
6285 2841827 2643045 3360010 2478721 1731847 3062562 1854434 2124298 1161067 400227
6276 400227 2547301 3188504 2884855 2779555 2721730 2453457 2314121 2223855 1870758 1964487
6266 1964487 2648169 2597441 1633266 1308234 1320880 2120215 1962378 2361455 2119203 2237087
6256 2237087 2011229 883256 994615 1944908 2730057 3248619 2428035 1893536 2678203
6247 2678203 2809670 2743515 3453499 3735356 3592861 2654925 1296181 908966 1367541 551727
6237 551727 1031431 2392010 2812417 2203246 1817823 2832021 2492797 2686031 2132595
6228 2132595 1566145 1766962 1126080 2693570 3431531 840757 1000404 2494961 2696677
6219 2696677 1108618 1614042 2515161 2699645 2858472 2648467 1732894 2379079 2449404 2721842
6209 2721842 3194107 2131749 1296080 1999589 2556916 2911845 1466557 822290 1917965
6200 1917965 3005341 3513917 4230136 3154823 2205432 2551377 2411405 2349906 2582082
6191 2582082 2044129 1786424 1846661 560438 470282 -90159 460886 977456 1679831 1047575
6181 1047575 1274643 2338738 1730083 2166820 1213170 1229529 1590712 1190629 750184 1060503
6171 1060503 2884703 2249500 2331970 928294 -1034573 150827 1757711 2087729 2156557
6162 2156557 1285803 1929543 899198 1181478 723632 596279 2079418 1944546 1187612
6153 1187612 855277 996288 866874 1404503 1654097 1605830 936609 1708231 766883 175893
6143 175893 1127721 716350 -132931 -145839 -437153 1104983 1057955 29702 332152 692672
6133 692672 1359588 1371908 1255481 1682217 1908431 1615543 582579 940647 500809 1047938
6123 1047938 1361254 1750733 2220220 849289 483466 1467708 1830496 1563640 1301154
6114 1301154 1251324 243259 1131742 2193590 1716298 1469499 1703340 1489720 1151190
6105 1151190 1847538 1197849 1360989 1499401 1607541 2505443 1930003 1293808 -72763
6096 -72763 -111556 1099611 767877 213993 175751 400364 -8594 670803 1227373 2240003
6086 2240003 1490864 910543 357924 517376 35361 -95361 1901827 1011661 -600066
6077 -600066 -808889 -831200 489318 -539629 -1935698 -281387 1319800 1393135 2265248
6068 2265248 1322116 1259756 2513104 2238016 2448901 1970206 2344589 980319 214689
6059 214689 511248 535859 353792 2034938 2169959 690866 218387 538900 135669 187837
6049 187837 839663 451948 460601 145776 -476306 -1090477 506374 302422 -221945 -1056664
6039 -1056664 -460035 -749357 -777982 1105688 1474028 1049975 879725 1000325 543621 -750913
6029 -750913 -647453 -517695 9742 133694 -201091 685471 172613 166383 455755 387889
6019 387889 1036488 1270743 62466 -80284 -245381 8017 362613 1041778 896856 -185589
6009 -185589 180 540710 284134 -145300 49726 1368119 927126 679612 1398997 1166649
5999 1166649 1125956 1571805 84835 -929685 629333 455416 -496081 -398878 -368595 1731
5989 1731 1065080 1389932 764402 519636 1570 365398 759225 -186393 -421 628979
5979 628979 589650 1292397 889401 429209 694955 -237959 105633 -270251 -53162 -1101510
5969 -1101510 527247 888729 -403037 325889 1073198 648000 237336 -3242 1008262
5960 1008262 569873 1008539 1061195 420116 99909 987837 875022 15834 736092 -393504
5950 -393504 190792 1463143 1754345 314188 1034464 1208915 1259443 1751503 2404411 884462
5940 884462 -593830 573869 931795 1738256 2111213 1738660 1374941 375412 1127000
5931 1127000 2148203 1950938 572184 2209424 2078730 1625682 795003 1709353 1255022
5922 1255022 562262 787514 -279299 143560 -488480 -333465 1260439 758694 437671
5913 437671 -197423 -149648 -211838 -122693 510185 1421850 977978 336937 14156 -761525
5903 -761525 -1095155 -73334 1438202 1536653 695860 1356912 1666989 881777 1231351 1682187
5893 1682187 1106835 828808 1040245 -58587 1054347 1345645 1360499 352645 584270
5884 584270 -87363 834892 995061 314134 1130772 1685423 862864 -421243 1217999
5875 1217999 1176604 530665 245291 1766754 1689179 1554573 1031910 1520076 1972570 457155
5865 457155 -624919 -307589 1152214 1824327 1110564 759453 868423 1033086 1696886
5856 1696886 723362 1064012 195763 736176 214686 971767 1196345 317178 67445 309465
5846 309465 -630229 1767109 1417642 2225402 2416738 1534519 691807 1452105 1824470 1597669
5836 1597669 1061579 875108 2132072 1340961 1168350 1508686 1148263 660250 -192401
5827 -192401 -317539 870208 2644898 2560697 2159126 1396857 475369 644683 1469814 1063379
5817 1063379 354272 1341674 1323588 1919123 1491593 1337423 1078670 2912433 2348964 1484686
5807 1484686 1928199 1839303 1118045 847935 179131 1183041 1779218 2192183 2363467 1167023
5797 1167023 248314 1368706 1882059 1300702 441287 767429 1155311 1134318 1018126 1608842
5787 1608842 1459638 749358 1068883 1068684 560108 940330 1281662 2717283 1069810 729512
5777 729512 1769098 2146007 2961993 3135741 2110212 2343246 2748494 1634788 2248410
5768 2248410 2104040 1957808 1221373 236260 817873 500760 513301 821994 1169008 1736491
5758 1736491 1053784 662848 1450967 605030 308601 894862 1677455 1756342 1948687 279330
5748 279330 993731 2904501 2884943 2367994 2305182 2758199 1706660 1518793 2687697 2947195
5738 2947195 2782964 3029981 2632984 2283357 2919736 3069984 1566233 1681592 1681801 2156095
5728 2156095 2545888 2464634 1954771 3026748 1602927 2379411 2463055 1667314 1474001 1078347
5718 1078347 1248368 1346400 797965 778141 1018823 69297 993311 1676345 1047249 1256589
5708 1256589 1957241 3141347 2296434 2850306 2987108 2030742 1515132 2141431 2699479
5699 2699479 1824235 2251100 1571994 -293507 742007 1636108 1821968 2052713 2678814
5690 2678814 2418396 1967565 2139428 1149290 846670 1966742 2436521 1932925 926844
5681 926844 1603971 2312565 2154448 2083749 1902894 3124796 3980784 3299121 1813851 2449928
5671 2449928 3034300 2617396 3178555 3614909 2788626 2016737 1746846 2532794 1338112
5662 1338112 3050179 2563246 3113604 3808723 4185233 4658718 2806978 2883540 3314831
5653 3314831 2553744 1145347 1689313 2800850 3344708 3528288 3596158 3755695 3712555 3091879
5643 3091879 3287630 2811817 4375484 3575515 2504998 3634316 3284071 2387886 2322155
5634 2322155 2283640 2980103 4048193 3260039 3571747 3153364 2866844 3081130 2939994 3384084
5624 3384084 3516895 4212699 4242876 3600296 3536855 3390813 3397740 2386273 1938998 2578537
5614 2578537 2966134 4157477 4748749 4925522 5408691 4936085 4168235 3727887 4301978
5605 4301978 4246553 4826259 4556559 3277250 2485862 3420580 3813291 3293157 2336773 3811819
5595 3811819 4918122 4744699 4350943 3341705 4254815 3445878 4649754 5511697 5423390
5586 5423390 5460879 6388912 5217925 5062884 5063544 4833284 4196771 3289837 3827199 4060172
5576 4060172 4737656 4778889 4820521 5448474 6028355 4791794 3345050 3946183 4950451
5567 4950451 4806243 5415718 4733827 5196361 5574891 4643212 4689584 4916143 4558100 4590780
5557 4590780 4185583 4029946 4056909 4488844 4342869 4194431 4711474 3418458 3369425 4488700
5547 4488700 4440311 3474482 3593561 4253911 4118660 4932792 4272771 4077181 3861312 4024932
5537 4024932 3434787 2986441 3955272 2797270 3685832 4618198 4241763 4033854 4055873 3809413
5527 3809413 4436669 5401388 5144857 5163794 4498009 4415467 4286740 4339106 5610506 5529512
5517 5529512 5123175 4996753 4521216 4022343 4495337 5206597 5700064 4589786 3692135
5508 3692135 3309314 4572549 4926642 5034165 5307640 4216913 4227127 4723058 4206516
5499 4206516 4775529 3964830 4486726 5188245 5069759 5904428 5368837 6348886 6492066 5648054
5489 5648054 5347197 4943730 5473830 5841722 4397408 4645863 4895921 5306877 4644192
5480 4644192 6537941 7552465 7070720 6498024 5491993 5443395 6819787 7294071 6739425
5471 6739425 6616920 7717796 7710383 6422842 7107995 7483531 6815571 6609034 6551245 6395385
5461 6395385 5677291 6793733 7021455 5858851 5910546 6193360 6215912 5792785 6381081 6252765
5451 6252765 6500262 6695155 5587781 5868765 5808282 7600907 8198643 7660781 7127018
5442 7127018 6147632 5974403 5645457 5910387 6050298 6625859 6663377 7496770 6565080 7285551
5432 7285551 7518664 6629238 6606516 8431653 7163447 6902795 7540719 8343094 8915073
5423 8915073 8517025 7767496 8087048 8042984 6643359 7600682 6854231 6334035 7423788
5414 7423788 6819256 7233295 6781952 6893401 6736844 7640330 7291474 7665222 9241094
5405 9241094 9922377 10063851 8540034 8996512 8207608 7074700 8247329 8402432 7372382
5396 7372382 5804579 6910436 7419809 8002774 9672701 8925446 7838779 7794075 8679863
5387 8679863 8578339 9492431 9250864 9610896 10084143 10460298 10186585 8985736 8340149
5378 8340149 8132642 8348930 9318982 8701757 8252143 8114519 7776541 8374985 7872156 8747830
5368 8747830 8501258 8289540 7775219 8465617 8278952 8431162 9898025 7902151 8977725
5359 8977725 8852942 8509962 9199873 9065716 8994635 9753971 10258738 10039418 10173402 10104371
5349 10104371 9548059 11277283 11555222 10285197 9646406 10846865 10738294 11120355 10633954
5340 10633954 10293991 10202072 10896504 11080517 11043212 11468549 10891625 10476246 10826949 10496334
5330 10496334 9712092 10473222 10360770 10186062 10781148 10569915 11270548 11855939 12055134
5321 12055134 12675810 12283225 11739387 11924918 12062693 11380588 11778486 10963964 10389342
5312 10389342 11714055 10698494 11536866 12733465 11364961 11208890 11199890 10817822 11295106
5303 11295106 11225653 11795244 10806855 10671795 11540789 12073684 12375051 12660559 12735193 12665410
5293 12665410 12532941 11900327 11417280 11522935 11974892 11417914 12065951 11678176 12635579
5284 12635579 13003544 12898852 13067567 13101678 12424181 11804144 12118865 12250573 11885188 12922207
5274 12922207 12026998 11444917 11308066 12103365 11512910 11323410 12315405 12121302 11981114
5265 11981114 12396101 11651869 10453059 10922460 13296001 12233974 11947744 12067009 10683744
5256 10683744 11005701 12603452 12810487 12211994 12468917 12316694 12791638 11837334 11497333
5247 11497333 12439222 12252758 12344272 12685016 12826884 12769561 12047548 11902490 11716292 12254926
5237 12254926 12860016 12191666 12008973 13428212 14015010 13061744 13147095 12929715 13120594
5228 13120594 12444432 12132383 12942113 12772824 12404332 13238936 13401785 12938398 14064311
5219 14064311 13870880 14251244 14587722 15269790 14324754 13880646 14753030 14082577 13930127
5210 13930127 13719904 13720747 13371562 13297987 13660753 14102456 14474252 13365866 13508297 13822293
5200 13822293 13008037 13278295 12421968 12840170 13914992 12979389 14218482 14698159 13736731
5191 13736731 12871781 12422290 13513655 13135357 12108921 12255862 12360563 12409273 13102754
5182 13102754 13091492 13370968 13801433 14110341 13833540 13609961 13316211 13004552 12112489 12153775
5172 12153775 12681278 12428221 13345716 14279378 13308372 13130966 13752812 12876989 12673965
5163 12673965 13142579 13722367 11888317 12419551 12154532 11798740 12926874 12429346 12570768
5154 12570768 12591079 11828456 12562267 13127827 12513829 12184944 12212439 11662712 11885262 13445597
5144 13445597 14384393 13278786 13109564 13378261 14601553 14576552 12620584 12608276 14873284
5135 14873284 14835552 13450563 13059613 13317724 13334549 13224482 13928477 14045755 12417952
5126 12417952 12572730 13266801 13504431 13234270 13729900 13869245 13835239 13651202 12814197 13424594
5116 13424594 13167788 13035864 13735823 13181635 12994000 13581433 13511903 14305190 15201650 15770358
5106 15770358 15117085 14103327 14846147 14577563 13267856 13839625 14180815 14532249 15024598
5097 15024598 15308064 14270420 15191130 16684893 14975136 14684150 15920847 15192446 13865262
5088 13865262 13981779 13556116 13843621 14418793 15005791 14326525 14104432 14516599 14773985
5079 14773985 15110849 14687029 13751014 14179186 15348669 14841793 15567608 15138302 13641776
5070 13641776 15024017 14417525 14158346 14495596 14763970 15028919 13987110 13684074 13467577
5061 13467577 13188588 12951981 14664864 14882612 15080952 14281219 15206719 15801328 16164885
5052 16164885 15495340 15607381 15324668 15445179 16746676 16532652 15490817 15515920 15061790
5043 15061790 14692277 14823563 14997498 14737366 16199517 14948942 15630268 15941265 15599616
5034 15599616 15323009 16596361 17100110 15764633 16393735 16464223 17730937 17396043 17094787
5025 17094787 16515844 17006495 17138455 16949551 17800458 18289666 17300531 16931285 17532573
5016 17532573 18042682 17705358 17004103 16777382 18142014 18830316 18161988 18210524 18096628
5007 18096628 18819522 19713558 20579343 20785027 20942812 21330838 21158791 21731167 21864365
4998 21864365 22220399 22722144 22505109 22200344 22383123 23739475 23644816 23114046 24839298
4989 24839298 24620916 25325951 24991681 24872730 24932299 24921510 25405049 25707161 26590292 27813188
4979 27813188 28404507 29847952 29765358 28374286 27220620 26775406 27282667 27149213 27954522
4970 27954522 28964887 28662611 28168032 29225284 28411152 28169046 28231102 27964021 28062295
4961 28062295 27308319 27488197 27347428 28139069 28122654 26996197 26501813 26283184 27064287
4952 27064287 26348596 25505503 26315055 25770646 25411793 24551000 24583467 25816317 25215133
4943 25215133 23870478 22685096 24131121 22983588 21732687 22561549 21826533 21478574 21105148
4934 21105148 20920032 21287827 21870558 21557575 20894438 20760344 21804374 21554936 20325450
4925 20325450 20220787 20299911 18898643 19778598 20618899 20679643 19623573 18440283 18527662
4916 18527662 17820885 18884597 19492144 18770632 18666966 19700817 20762164 20497385 20411885
4907 20411885 19893426 19230074 19283615 19102811 19958983 20087634 19095283 20730276 20390343
4898 20390343 20042984 21189486 20249373 19253286 18801003 18841067 19759798 19745539 19871265 20056348
4888 20056348 21075621 21165654 20195279 20547916 20653588 20070324 20177152 19611394 20740944
4879 20740944 21086487 20858828 20641951 22311067 21414094 21736504 21034314 19880546 20751020
4870 20751020 20237401 20849777 21812727 20668716 21239290 22285230 20631153 20686612 21743588
4861 21743588 23580726 24001971 23231017 22448531 22929222 22928759 23980243 23988825 24455744 23384531
4851 23384531 23152386 23468524 24656395 24021806 24476221 24596721 25829748 25883383 24092018
4842 24092018 24484880 26400568 25024978 24671961 25296565 25357669 26028595 26761870 26592988
4833 26592988 27210730 26502001 26598330 26727569 26668188 27146593 26712661 26852062 27353008 27714638
4823 27714638 27352841 27642539 26927692 27777653 27885081 28374176 28160532 28240727 29339518
4814 29339518 29223091 28132339 27872137 29080664 29074812 29368161 29693850 29909875 30514749
4805 30514749 30075155 30060237 30475458 32075180 33181482 31837421 30400482 29553067 30678241
4796 30678241 31673106 31761851 31587222 31079166 30592714 30834591 30955660 31893238 32346898 32395600
4786 32395600 32183057 31530083 30799158 31638505 32999451 32409827 32115690 32588105 30870647
4777 30870647 31329939 31864074 31226781 31113236 31113474 30338687 29968695 29831949 28913663 28682762
4767 28682762 29661700 30755797 31217449 32139197 30519688 30029006 30409686 31196658 29952050
4758 29952050 29665110 29146626 28289440 28077873 28812336 29709438 30231076 28991012 28209922
4749 28209922 29424075 28065554 27601674 27792202 26636759 26646577 27118239 28536679 27428791
4740 27428791 26375105 26325217 26223912 26604415 27451139 26808439 27050271 26849083 26525864
4731 26525864 26196971 25221573 26251133 27179854 26237375 25847049 25078373 24867572 24133877
4722 24133877 24645061 24598367 24626245 25597929 26463781 26208890 24280455 24166103 24981984 24181411
4712 24181411 25005498 25045246 24632236 24838020 24329250 23186166 24365534 24699811 25170743
4703 25170743 25332360 24693342 24416242 24677949 25195075 24811968 23371297 23310271 23974438
4694 23974438 22941190 22088889 21226532 22371945 23179874 23374241 22284638 22197777 21973962
4685 21973962 22306020 23192635 23765749 22775288 22654921 23380869 22581315 23036013 22750612
4676 22750612 22345622 22260893 22652211 23280340 22902410 22447505 22023743 22698144 22965678 23254721
4666 23254721 22750126 22879519 23722752 23930915 23428792 23293364 22850779 22397719 22630970
4657 22630970 23585756 23743164 23320403 22530968 22752196 23212144 23533338 22978205 22746465
4648 22746465 22470095 24357182 23605126 22763200 23236572 24263747 23357233 23641778 24143227
4639 24143227 22918609 24447326 25499810 24811583 24594461 23531576 23666368 24918551 25701504
4630 25701504 25710576 25969575 25929025 25278558 25731473 26004809 24171600 24009250 25367957 26197829
4620 26197829 25950068 25740157 25751776 24580343 24742803 25444822 25911052 25947458 25448470 25755030
4610 25755030 27050503 27377704 27971462 28084164 27430121 27165467 26678162 27112851 27971016
4601 27971016 28231280 27628035 27118417 27717750 28313963 27587676 28308277 29490885 28685075
4592 28685075 28884283 29067114 29705636 29782080 29623095 30793601 30352780 29870725 30289232
4583 30289232 30261166 30085150 30614851 31373410 30960627 31253506 31771405 31967327 31400377 32848773
4573 32848773 33657945 33381218 32053080 32569492 32652979 32013653 32136817 32339511 32948358
4564 32948358 33451266 35078034 34489578 33681077 33653340 33390883 35321756 34446640 34220348
4555 34220348 34233776 33974882 35055571 35594704 36040262 36140124 36285284 36488201 36692073 36576554
4545 36576554 37122271 36495043 37104329 37824312 36711954 37255988 37002817 37571851 38852597
4536 38852597 37263328 36281241 37018535 36716292 38256304 38136053 38426399 39023749 38394704
4527 38394704 39054192 37982059 37587810 38690957 38309940 38866196 39167848 39172997 39302828
4518 39302828 38260774 38260725 38834105 39686364 40096082 40549815 41394199 41595177 41148007 41693885
4508 41693885 41499364 41698259 42426566 42426938 42357822 42320183 42645705 42798849 43012687 43363165
4498 43363165 43718438 43121416 42737768 43161336 44418844 44578755 45341579 45455651 44763198
4489 44763198 45353014 46170056 47310323 48783550 48511313 49178405 50473049 50389750 51522117
4480 51522117 53106011 51682192 53485176 55381998 56031053 57365613 56325997 56344601 55305383
4471 55305383 53675473 53148502 53151657 53417798 52893521 51935420 52218247 52405277 52809095 52622761
4461 52622761 52855406 52118656 51260474 52057649 52847921 52586199 51908860 51335004 51209248
4452 51209248 52177075 52579084 51456373 52438181 54379485 54461171 53553576 53609125 53786269
4443 53786269 53826156 53864279 54577459 54299184 53826101 53937991 54983653 54687440 54482326 55332227
4433 55332227 56421975 55783360 55707596 55818785 55877288 56017719 57320006 56216104 56432119
4424 56432119 57295811 56636609 56962227 57438547 59023173 59274645 59840601 59782763 60355281
4415 60355281 60433606 58767526 58820591 59256812 59511496 60168184 59397957 60279934 62288228
4406 62288228 62369484 61141830 61409548 60685439 61673333 62482436 60947868 62315137 62202604
4397 62202604 63134248 63491035 62077879 61028816 62262274 62941636 63225716 62903277 62354788
4388 62354788 63644512 65036372 65112822 65374083 65994209 63770488 63878716 64619727 64965173
4379 64965173 66499258 67094813 65920949 66148117 67071613 67470576 67747478 67411357 66900463
4370 66900463 67266851 67298951 68370217 69590754 70496822 70492066 70531551 69887484 69765729 70921140
4360 70921140 71028061 71180934 71967475 71860404 72070931 72339474 71705405 72662028 73303111
4351 73303111 74064105 76179252 76428321 75422116 75441280 76514884 77764623 78467599 77144131
4342 77144131 78356093 79261116 79804917 79830911 80967836 81497190 81043923 81606573 82185491
4333 82185491 84444716 85283610 84506439 85406158 86829133 86869926 87955684 88994486 90713456
4324 90713456 91214306 90666774 91290955 91654871 92567801 92727880 92739587 93069525 93484724 93777809
4314 93777809 93066107 93246807 92238897 92328429 91826648 91788646 91535402 90299477 90370708 90275381
4304 90275381 89278575 89225624 89507637 89711815 91180443 91654493 93053706 92892869 91530317
4295 91530317 90670465 89805284 88258962 86610080 85368490 83827549 82351129 81986850 80929880
4286 80929880 80791871 80004079 79014328 78595402 77942569 77037963 77335860 76975354 75824927
4277 75824927 76008385 75770797 76403310 76480574 76450748 76034401 75848833 76693758 76587581 78497332
4267 78497332 79193211 77678759 77807103 77679111 77329427 77531360 79112026 79210881 78839838
4258 78839838 78828433 80382261 80413749 81590642 82903402 83905398 83425211 82291170 81178126
4249 81178126 80662566 80216657 77908291 77979221 77598122 75192512 75062429 75263143 74953413
4240 74953413 75423579 75187232 74715518 74827758 74060429 73402442 74127129 74626269 74369784
4231 74369784 74149057 73528085 73019979 73679267 73098062 73856447 74862244 74191702 73938933
4222 73938933 75088571 75489265 75188581 75138660 76496092 76764722 75654624 76614304 76198239
4213 76198239 75142525 75784670 76505999 76797158 76895867 77517272 76557076 76673249 76745915 77777233
4203 77777233 77757780 78153634 79301647 78640065 79487047 80219077 80580667 80162960 81349575
4194 81349575 80646047 80638242 80964584 80987651 80862269 80781060 81250820 82005408 83500960 83785163
4184 83785163 84358310 84429526 84719061 85991396 86859915 87315221 87794087 87603246 87516266 86711502
4174 86711502 88242611 89984816 90149334 90121210 89964331 91276261 91547126 91903195 92936809
4165 92936809 94049828 94519486 95270484 95626025 96527928 97456426 98271241 98841324 98868703
4156 98868703 100390686 100581089 100490252 101881296 103351290 104744077 106505425 107052801 105950228
4147 105950228 106629963 107733901 109439434 109425148 110151796 110900506 112210099 113966398 114048529
4138 114048529 115332170 116295087 117556527 117808927 119545244 119713138 119866717 120434966 121857983
4129 121857983 123588256 125111562 125717113 126552523 126955527 129202996 131008289 130896554 132754184
4120 132754184 133916819 134911589 137335044 138984114 139131162 139836923 141361114 143500551
4112 143500551 145135842 146961674 148966170 151345868 151954283 153097749 155239525 156814142
4104 156814142 158876329 159917160 161287699 163180728 165677923 167867440 169188231 171119944
4096 171119944 172259755 173444833 174839193 176630782 177972502 179584541 181737422 183828196
4088 183828196 186160858 186866300 188576493 190088913 191611055 193264412 195721447 197461757
4080 197461757 198740740 201358058 203629278 203198991 205876895 209048511 210045330 212655515
4072 212655515 215509965 216408890 217924060 220835554 223242990 225561977 226531826 228369886
4064 228369886 229304977 229454705 229179400 231334733 231512592 232040233 233252605 234745624 235503457
4055 235503457 235853347 236759240 236090337 234693782 236113628 237557311 237351595 237227348 237629671
4046 237629671 238502601 236776946 235569598 236930248 236273710 236665609 236842694 235985710 236055192
4037 236055192 235824452 235140199 233183934 231981793 232023708 231792993 230195606 229157896 227966298
4028 227966298 226329194 224793259 222883789 221425465 219189937 218115368 216980709 216009954
4020 216009954 215083319 212609481 211521498 210776522 209023604 207625200 206449904 204914914
4012 204914914 203941985 202739296 200524227 199161182 198016802 196247365 196061716 196453176
4004 196453176 195029963 194347347 192451250 190786030 190516018 189232093 188794231 187188819
3996 187188819 186609529 186612328 185695972 184100085 182575697 181384211 182498303 182397637 182848618
3987 182848618 181495796 181562534 181336226 179971635 180087447 180321377 179795582 179028444 179525005
3978 179525005 179482594 177356542 176213784 176421978 175880204 174675756 176201508 176689852 176819938
3969 176819938 175875283 174992793 174908874 175345287 175399700 174461415 172739193 173121661 173975103
3960 173975103 174225689 173447349 172100440 173021350 173150581 174176792 174391781 176395387 176044751
3951 176044751 176028630 175930254 176175476 176466961 176455807 173980914 173050112 173782259 174039029 174025369
3941 174025369 173771659 172719069 172144684 170011938 169358047 169061750 169225224 166798874 166377243
3932 166377243 166259216 164620984 163213830 160917992 160442932 158539084 157607289 156607947 155705939
3923 155705939 153701781 152647575 150548551 150177151 149388387 147364436 145160286 145018977
3915 145018977 143456073 141827550 140136723 138933895 138779878 135509584 134204489 133120580
3907 133120580 131228318 129791232 127936117 126838311 126866433 125043993 122895284 121063887
3899 121063887 119769294 118746990 117722914 117311439 115812119 113055106 110820856 110630236
3891 110630236 111312584 109885914 107997753 106749363 106740188 106238156 104788694 103627064 102597443
3882 102597443 101848107 101235062 99705067 98805265 98207347 96110763 95762542 94228642 93009012
3873 93009012 93135313 92725847 93215908 91795171 89722626 89686815 88817984 87583377 88166166
3864 88166166 86839014 86307267 86266611 86083897 84747466 84229067 84712154 83190392 82019312
3855 82019312 81606675 81012714 81429151 81987658 80009849 79092957 77796200 78506284 78634884
3846 78634884 77701725 78762909 77908928 76489902 75757254 76244870 75756652 74281706 74721800
3837 74721800 74710594 74117628 74550274 74870389 74689784 74242870 73373192 73265450 71992652
3828 71992652 73105648 72682817 70833976 71206038 72404002 71686235 70686214 69757817 69652383
3819 69652383 69772434 69786730 70112492 70298904 69996538 69344812 70036595 70320283 69529085 69105060
3809 69105060 70347275 71176175 71090875 70358723 69739222 69606666 70564150 70878771 70644651
3800 70644651 69892013 69546135 69333516 69290579 68986056 68558743 68080580 66813893 67230552
3791 67230552 68729702 68268973 67984596 67230690 67988104 67747861 67714239 68261828 68564762
3782 68564762 69985560 70162451 70736620 69190815 68578947 69642231 68961401 69002305 69092935
3773 69092935 70454430 71760250 71659248 71911723 72243538 71957977 71112889 71687993 72804666
3764 72804666 72279138 72491391 72749271 73087986 73548955 73747651 74429623 73391238 73154737
3755 73154737 74038912 74169402 74936011 74623129 76204690 78052895 78239933 77604677 78392223
3746 78392223 79438313 78698878 79044373 78535821 78901283 80046455 80765895 80962341 81235333
3737 81235333 81316052 82812230 83127615 84264140 84324618 84779474 85526274 85806484 86690821
3728 86690821 86836527 87210891 88618340 88857325 90476753 91425966 92140710 94503881 95285375
3719 95285375 95849727 96855698 98375942 99739874 100863259 101268771 102658101 104350266
3711 104350266 105306900 106262378 108502903 109381751 109438571 111695225 114060920 115206987 115409663
3702 115409663 116631430 118904599 119916363 120722050 122566531 124227641 127235099 129383010
3694 129383010 131444754 133612549 135222939 136486504 138953852 140681341 143676772 145792743
3686 145792743 148144923 149593367 150715521 154155542 156283267 159209762 161315121 163466051
3678 163466051 165339852 167751574 169914589 173294195 176256375 179367513 181927485 184966781
3670 184966781 188165722 190792812 194490805 197701771 199935426 201852115 203676105 207722019
3662 207722019 212732031 216271558 217258670 220835257 223649191 226979095 230288642 233756490
3654 233756490 237675651 240763609 243785793 246913670 250352809 254113480 257358606 259982219
3646 259982219 263491188 267839990 270162704 272345125 274940067 278634358 281310269 283862734
3638 283862734 285768119 288606062 292396280 296083795 298737446 299200109 301189521 303589035
3630 303589035 303839680 305162919 306756206 306280436 307625384 307973160 309096444 308443896 307194114
3621 307194114 306593413 305511309 304264871 302024841 301180497 298708298 295954164 293792661
3613 293792661 290409264 287383477 282347901 277973868 273778010 270817221 268129410 262686723
3605 262686723 257346963 252532136 248318918 243021008 239049251 235171499 231455770 226359786
3597 226359786 222283622 218967134 213122499 208970461 205134356 201851720 197172808 192821297
3589 192821297 190551665 186962739 182634738 180002401 176121036 172351961 169812820 164892248
3581 164892248 161744133 159594854 156706178 154920227 151920766 149460466 144865394 143621023
3573 143621023 141769897 138911818 136217861 134380771 132377648 131681289 128507002 126882983
3565 126882983 125573306 124750261 122579400 121106557 118871784 116496265 114176025 113415510
3557 113415510 112286224 111238954 110288353 107777835 106345097 104973827 103874237 103257235
3549 103257235 104092877 102808311 100267484 99140478 98894758 98476784 97310040 96113737
3541 96113737 95638513 94681604 93703414 91768675 91651777 90846431 90975494 89296629 88863614
3532 88863614 88829449 86708027 85634225 85571948 84280695 83637503 82207613 82686393 82162490
3523 82162490 81271408 80502299 79524323 78981438 79341244 78649618 77349975 75982615 74707588
3514 74707588 73669248 73126466 74138695 74922433 73738144 72887384 71734655 70559943 69881531
3505 69881531 69868994 70489052 70389209 70313498 69269414 67737112 68160527 68074839 69011242 68584537
3495 68584537 67346120 66426945 65714566 65874639 64972971 64772844 65659107 66296586 66760754
3486 66760754 67091156 66006680 64263922 64077309 64140173 63456919 64819372 64645752 64341232
3477 64341232 64837912 63826076 63325500 63775006 65185745 65238228 65646525 66122125 64805252
3468 64805252 64809159 63608887 64007270 64517000 66277791 65717937 63726892 64507857 64332612
3459 64332612 63846287 63856941 64205047 63365190 61891233 62109368 64182365 64303198 63484453
3450 63484453 63788341 65228016 65212129 64605145 63395264 64468537 63214816 62845703 63289235
3441 63289235 63135897 62960303 62777569 61985296 62106765 62330261 61656413 61231494 60362123
3432 60362123 60377728 59716393 59451637 59083546 58507934 57853936 57645179 57198949 58076021 57289338
3422 57289338 56664359 56954862 56390930 55616830 55407443 55593176 55316486 54261484 55268771
3413 55268771 54509077 53970778 54679256 54019398 52786942 53172994 52377659 51095684 51725096
3404 51725096 53077411 51594362 50570100 49815822 49468344 49987452 49894611 49271670 48423533
3395 48423533 48980468 49408615 47655834 46754626 46803701 46614828 46698808 46655006 45948521 44650976
3385 44650976 44431516 44352363 43042633 42473347 43755059 43377596 41331681 42052666 41341250
3376 41341250 39876773 38974053 40073796 39729518 38380408 39261594 38815887 38470929 38203312
3367 38203312 38871022 39255405 40085428 39123415 38435149 37708315 36619316 36217319 35687592
3358 35687592 34959833 36189690 36312985 35944715 35885342 34342623 33737904 34530179 34274529
3349 34274529 34332848 34885226 34125303 33974660 34929269 33854539 33771709 34185227 33823869 33963559
3339 33963559 32959137 33295670 32760358 31406672 31183878 30813424 32218733 31512648 31982225
3330 31982225 31751096 29807162 29536844 29625511 30393406 29273116 27999396 28564099 28510493
3321 28510493 27473469 27992715 27735603 27816610 27501425 27350019 28955672 28380368 27956911
3312 27956911 28162591 27934794 27041749 25611106 24970723 25805004 25787860 26261966 26707027
3303 26707027 27133781 28686673 27800503 27125780 26803607 26920687 26072828 26971121 27487643
3294 27487643 27893022 28234527 27317311 27223808 26352134 26703771 26218454 25769179 25973365 25507720
3284 25507720 26030794 25605939 26285555 26864116 26608036 26014957 27125541 27072638 27148655 26360400
3274 26360400 26134171 26999990 26703361 26012915 26658795 26387714 27126197 27617959 26347950
3265 26347950 27793221 28151966 28671978 29209229 28677985 28389475 27372096 26494124 27471158
3256 27471158 27985831 27636628 27039367 28419983 27656329 26759681 27965176 28557450 28012113
3247 28012113 28450639 28286843 29091387 29128344 29153939 30191357 31042633 31906911 32735706 32701301
3237 32701301 33316872 34832704 35279610 35644027 36683426 36767335 37791476 38307170 37957894
3228 37957894 37230462 35911567 34371428 34429286 33000508 31168841 31015889 30186599 29765490
3219 29765490 27953113 27098442 25918726 24742329 23601624 23072392 23489121 23480081 23591736
3210 23591736 21521278 21441041 21944519 21689549 20728843 19264864 19619860 19931644 20839328
3201 20839328 20592047 18966364 18695452 18339208 18546881 19582671 20462633 18478183 17275633
3192 17275633 17885436 18305689 18858353 16966254 15803236 16123105 16654842 15485518 16178188
3183 16178188 16411121 16198371 17546255 17689865 17552798 16570754 15880904 15003005 15748328
3174 15748328 16480462 15617859 15327162 14483769 13727645 13770978 14723268 14719051 15800360 15109395
3164 15109395 14158081 14218740 15266974 15191940 15849374 15010225 15246322 15637887 14897508 14152526
3154 14152526 13343541 13861464 13902421 13511939 14364322 14317062 12944856 13065200 12555558 12013964
3144 12013964 11685390 12276973 13242507 13318539 13273838 13680563 13086251 11919663 11984488 12704816
3134 12704816 11962984 12128410 13134858 12865602 13167265 13770549 12779697 12196665 11573452
3125 11573452 12068829 11549542 11985585 11988875 10677594 11024920 12668318 12514327 11636226
3116 11636226 10877477 11117914 10716055 9845471 9995173 10586160 10576717 10298953 10445408 9679380
3106 9679380 10114561 10441907 9940175 10351758 10440350 9596912 11082933 10349004 9324136
3097 9324136 9524343 9724924 9404118 9502146 9944535 10605349 9695828 9948637 10076606 9305474
3087 9305474 10003045 9694155 8465958 9005409 8504887 9159163 9619087 9552099 10211287 9424596
3077 9424596 9935405 10153626 9330281 8569777 8583167 8271752 8299417 9613191 10111727 8942726
3067 8942726 7747847 8253626 7816727 8148240 8205926 7898094 7325875 6455203 7801686
3058 7801686 7700135 8613287 8395226 6548680 7166067 8515434 8347802 7727116 7385003
3049 7385003 8027277 7449996 7127732 7399013 7332282 8008948 8098184 8036520 7497261 6985162
3039 6985162 7173697 7109778 7453034 7171535 7667246 7271394 8646296 8968999 9146965 10117495
3029 10117495 9531028 8053367 8230608 8286236 7049616 6933469 7426536 6820397 6804966
3020 6804966 6608839 6661803 6935368 5918893 7788323 8313962 6462509 7185157 8272116
3011 8272116 5985658 4847939 5234574 5635169 6459742 6264005 5510322 5574491 5888922
3002 5888922 5814263 7072599 6536492 6060010 5735589 5600538 6176186 7570751 7142747
2993 7142747 7779763 7113861 5737024 6521377 5933840 6131554 4803648 6024243 6519141
2984 6519141 7092421 7255356 6290782 6251525 6785573 6615972 5510849 7353250 7585680
2975 7585680 7085109 7044163 6124384 6275399 6096426 4517746 4158728 4773491 5346984 5300975
2965 5300975 5645655 6768875 6715931 7250945 7294356 6284764 5908656 4797732 4442062
2956 4442062 5944507 5116677 4651911 5314950 5971580 6383475 5279753 5230472 5946457
2947 5946457 5877057 6179472 5415815 4903416 4551918 4657003 4955651 5202513 4838162 5025853
2937 5025853 5812916 5422010 5739320 5084479 4895130 5235889 6074921 7310854 6421627
2928 6421627 5236168 6047836 6382760 6911955 7248995 5968627 4832545 4611126 5128971
2919 5128971 6208335 6307800 6106858 5843880 5788873 5811251 4412304 5545537 6604151
2910 6604151 6805863 5620568 5731890 6075291 6131173 6018933 6032767 5219792 5302836 5787760
2900 5787760 5194318 4743053 4563803 5600770 6203765 6780073 7252130 6283305 6650910
2891 6650910 7118497 6365239 6492506 7314360 6835381 6553598 6740292 6787332 6039060 4539659
2881 4539659 4291831 5696485 5611893 4261276 4589116 4775287 5504339 5299773 4779671
2872 4779671 4942589 3497217 3594884 3959233 5136128 5460131 5762139 5637580 6225077
2863 6225077 5508622 5174686 5881549 4574503 4476976 5879048 5787122 4810957 3461558
2854 3461558 3862018 5561464 5588843 4614788 2893045 3466445 3661813 4129885 4270904
2845 4270904 4294580 3123298 3457966 2994814 2955856 2331819 2564433 2870220 3758625 3701015
2835 3701015 4634838 3425592 2017270 2477150 3831813 3530578 1920219 2876712 3403442
2826 3403442 3278915 2647158 1258838 2363437 1910466 2333029 2972794 2561688 2490831
2817 2490831 2262762 2847003 3686144 2448833 3368547 3787612 2675833 2541734 1772018
2808 1772018 2358573 1914987 3395303 2778163 1864952 1302252 447315 1073286 765390
2799 765390 1586922 1571974 1158866 1847617 1315091 1429033 1730748 2147380 1899854 1794978
2789 1794978 1561334 2865643 3025848 1755273 2169530 3176925 1597467 1084952 1894936
2780 1894936 520305 388820 420030 1315633 980943 1068076 1485533 734934 374904 1113938
2770 1113938 1096268 751438 -340737 -591510 335797 404308 825153 596014 1072449 44458
2760 44458 532138 -787842 42858 808503 702962 997194 1202400 1302103 823905 -343821
2750 -343821 155035 -737348 -740378 -101156 955653 559067 1581398 812398 -320782 -1196
2740 -1196 634466 1010094 -415702 -463619 459884 1098898 873557 572773 -1139105 -722103
2730 -722103 -468800 -91067 275961 921508 590656 -504631 -766510 -790371 -1369564 -1012664
2720 -1012664 -1135102 -1022672 -1620382 -1492355 -922823 353129 376445 119716 109867 1272101
2710 1272101 431484 -594530 -1553817 -1656826 -968526 -1324381 -208168 -319084 -518799
2701 -518799 -539540 -431539 530831 401721 337830 72973 258608 -457715 -443666 92383
2691 92383 1259593 1484635 1328668 1263075 -709483 -1435182 -454985 869555 809375 1957803
2681 1957803 1089177 1138918 130289 507914 366562 239359 -444677 -1790116 -1347590
2672 -1347590 -1170325 -2021206 -1196743 -216785 -480221 -625773 -1278286 -1248883 -1538024 -217494
2662 -217494 285896 -981431 -698559 306118 -789962 -826211 -1399938 -979844 -199359
2653 -199359 987257 -20067 321249 196004 333681 126212 -784328 161398 445112
2644 445112 1624024 291518 -691708 -432084 -1102743 -219213 17873 -472689 -708519
2635 -708519 477746 1938009 1626519 1215509 604091 222001 -370017 -230372 -888267
2626 -888267 -1573786 -1506818 -1514281 -1042169 -825588 -1117482 -1118447 -1024951 -1038016 128947 577892
2615 577892 244356 208338 1119035 1687459 847697 630231 567792 662298 -214800 -199309
2605 -199309 -149234 124711 -1308252 -975531 -514965 -255162 -116305 -812232 -1355174 -568802
2595 -568802 -499156 -498473 184459 -454907 122599 141677 -166039 925538 454001 -476115
2585 -476115 -592376 -892321 -843157 -712509 -986478 -175221 -1180191 -1559122 -816870 171926
2575 171926 812090 229761 695560 -881571 -278718 -247391 -1743342 -2011468 -2050444 -583219
2565 -583219 -985062 -266491 356128 7035 -819856 -661235 231729 526829 -18880 -1431865
2555 -1431865 -1347460 -856519 -1603494 -966092 287537 -204548 -34096 -509140 210246 -116585
2545 -116585 -488719 -655217 -1455781 -2612510 -1090247 -978071 -1092093 -1406883 -346120
2536 -346120 36798 -577222 -468078 -1228292 -930827 -646766 -503651 -632298 -468254 -122979
2526 -122979 -1256213 -410887 -350262 -857345 159008 789900 -112236 -534542 -1713741
2517 -1713741 -716005 -911791 -705030 -631287 -1628388 -1099274 -1125810 -1251428 -1575924 -1467654
2507 -1467654 -573749 -834659 -1834729 -1117442 -598751 -1230164 -1620403 -1241830 -552381
2498 -552381 -236837 -644878 -108841 -284316 -1760259 -2068345 -1750623 -937456 -949914 -253104
2488 -253104 -63607 -132220 244615 -915735 -1103597 215039 1033118 295395 649814 358657
2478 358657 -378623 -1452349 -454309 -421536 -157518 299771 -1057947 -1234333 -805840 -1500933
2468 -1500933 -1161997 -1154439 -640269 -771974 -650356 -510007 -288196 -419079 392286 554272
2458 554272 -90258 -445834 -1183062 -1989281 -1316948 -1180197 270288 -552237 -423849 -1545877
2448 -1545877 -1447422 -1530976 -1235176 -639695 -73105 447604 675160 -290360 -747719 272263
2438 272263 -129265 -1163448 -348623 451379 1065167 1461981 -212897 -456627 -189497
2429 -189497 194103 -509029 -515343 -1147020 -727058 -755363 -933330 -1380559 -182100 543749
2419 543749 -410422 -95076 991475 213810 -256095 -434408 -322842 -236997 777603 78298
2409 78298 -835078 -1616982 -1967792 -2120673 -1728155 -1535149 -1142206 -1263404 -437527 -1210719
2399 -1210719 -1397719 -1272562 -103185 -113591 -1757458 -1207850 -250178 -401332 579264
2390 579264 202711 -1189438 -1187170 -1192986 -1253752 -1390855 -1096702 -1468679 -1703530 -1227694
2380 -1227694 -1076825 -745390 159874 387328 186912 497756 385071 280689 621105 899799
2370 899799 463507 -188735 1146598 849565 503899 36198 104353 206616 19253 239881
2360 239881 851091 568227 565293 580940 725146 -42643 -247387 -649376 -353894 -1425422
2350 -1425422 -1949375 -931393 -1187178 -1309929 -957615 89893 364237 51927 373350
2341 373350 855027 -19719 -637483 -322020 -494904 -1329654 -1227829 -1250323 -466990 -401053
2331 -401053 -1122093 -1162910 -502174 -666976 14500 435326 1014615 30697 -629259 -61877
2321 -61877 -395518 -335580 -193649 -41045 -902522 -1428140 -1516175 631781 -24595 -667767
2311 -667767 -303787 -132953 815511 -191612 -158224 -306315 507370 406696 553796 -742382
2301 -742382 -676705 -404233 -969517 -1121564 -587587 -177372 -557400 -886355 -1813870 -603540
2291 -603540 -782049 -343703 378795 -8865 595005 328012 446434 996102 236419 372066
2281 372066 17169 -178337 -30904 632288 560850 146538 -367454 -493022 508949 753227
2271 753227 263677 205393 119159 203068 51916 452173 1171480 -181230 -597789 273767
2261 273767 143932 678622 1561940 704590 281211 307189 -108256 48117 -39066 -13738
2251 -13738 48173 543715 725205 -62368 -592578 1137220 1175836 547233 -188268 1100262
2241 1100262 356334 -665163 -169583 482182 1097219 855081 1430171 356532 134148
2232 134148 1085645 501089 99447 -113703 -222877 -4734 -553344 -102758 1715381 1822981
2222 1822981 887279 1123932 1111166 851321 177596 1221546 2221594 2510288 1164481
2213 1164481 909010 1053499 264171 1144702 1667646 3477459 2601811 1529013 1781940
2204 1781940 1347279 1155879 2287504 2444202 2010241 2922904 3218690 2714457 2467914
2195 2467914 1965177 1599958 2352969 1436190 2626208 1763096 1172697 1225686 2075686 2704620
2185 2704620 3811355 3115848 3515333 4571173 4669113 4316051 4149276 4023017 3119263
2176 3119263 3598659 4046284 3607050 4050398 4556794 5468529 5990521 5507455 5705209 6281648
2166 6281648 7357404 6175040 5581466 7074701 8323468 8241904 7672226 7291668 8348994
2157 8348994 9037274 8436500 8283105 8476035 9548866 9564480 8747247 9513886 9329432 9321993
2147 9321993 9392307 10340178 10591753 11189636 11215195 11502150 11397521 11016132 11459011 11969339
2137 11969339 13587910 13578398 13759384 14412658 13135039 14468177 15949855 17426131 19523933
2128 19523933 18755212 17969822 18925456 20455678 20924594 22011367 23464991 24880392 26800504
2119 26800504 27223910 27345771 28801089 30828450 32482811 35046005 37962955 39747228
2111 39747228 41873866 46462366 49204081 53653301 59527060 64019928 68713410 72289561
2103 72289561 76319048 82130410 90814524 100318157 114329812 131099415 149286047 171884082
2095 171884082 202747463 242629750 294191483 350766845 392795126 394969748 350705240
2088 350705240 288868116 233566448 191222791 160341529 137649736 118556198 104200218
2081 104200218 92500584 82838709 74952406 70357596 66304672 62975589 59540502 55002219
2073 55002219 52102163 48441158 44318042 41248700 38926520 36362145 35519476 33839923
2065 33839923 31280391 29293526 27627915 24269479 22771763 21970444 23565747 22563051
2057 22563051 20873426 19401749 17978375 17453300 16567692 15550346 15103265 15851797 14544591
2048 14544591 13574970 14052400 13387298 12634276 12116403 11569078 10944436 10070884 11101671
2039 11101671 9795685 8465294 8329502 9460916 9517400 8815388 8673383 7527691 6923116
2030 6923116 7656647 7307408 8687566 6822590 5725682 6358040 6653179 6448079 6744579
2021 6744579 5520757 4936293 4051457 3973710 4940517 5190856 5253001 4035138 5039318
2012 5039318 4272217 3850418 4056849 3254667 2577947 3084251 2540552 2843387 2097202 2462794
2002 2462794 2963679 4422418 3692464 3319047 2906681 2425968 2428979 3435470 2937473 1933112
1992 1933112 875318 918735 1222694 2644973 2887933 2333942 1789531 2444470 700270
1983 700270 452036 1182602 917283 831891 688678 536587 346438 1593854 1197348 1436155
1973 1436155 925444 2281241 2629535 1417867 44023 643578 1000653 1906640 1032207
1964 1032207 1962031 2004690 418889 288615 981071 1240867 2526378 2300550 953182
1955 953182 76834 270756 577580 1338385 758722 658577 -12789 933939 -153451 -548197
1945 -548197 -591036 -1169246 95638 2306956 2445488 903729 -769897 -587269 -476845
1936 -476845 -712947 554586 290805 -741055 -250127 486411 542412 -101303 141641 666006
1926 666006 152700 -69268 521589 474539 42678 671484 -17092 81491 -224910 -283627
1916 -283627 37477 687329 446416 689069 63386 -407614 -384495 -80547 -553554 -488791
1906 -488791 -159803 182891 -161459 -231530 -219532 -319896 -577220 -267541 -1126668 -1601630
1896 -1601630 -711840 -1363923 -1474515 -1117894 -438185 -98828 366607 414785 32938 -597095
1886 -597095 -769109 -522201 -1340926 -847882 625446 1327784 669410 512836 -143675 -244346
1876 -244346 -1870888 -1110211 -1453869 -1909851 -1873161 -1798619 -198320 -1022326 -823540 -1190270
1866 -1190270 -1568490 -1421250 -2215823 -1534551 -883806 -811325 -1022750 -880045 -100139 1092700
1856 1092700 633660 664865 190092 295457 311216 -189374 -265933 67408 687974 472473
1846 472473 139634 -474730 -576692 187153 207037 645562 -218177 151961 808779 654957
1836 654957 -756483 -761762 594330 676364 1674898 1923190 1518289 1461922 2173893 1908350
1826 1908350 1117252 419328 527098 911891 742339 1394454 2923845 1435965 998749
1817 998749 1186940 351660 -999669 20184 -17284 -774258 -769545 -718003 -799869 -308215
1807 -308215 -746902 -916904 -671762 56692 -1053152 -890926 -964215 -226859 466948 135121
1797 135121 191095 -909635 10790 -287608 -664905 -358136 -175892 -166303 52235 1121207
1787 1121207 83778 -437628 463550 -85438 -1114564 -2064600 -1898325 -2031247 -1456249
1778 -1456249 -598993 1148583 -330029 -1443424 -233150 -801873 -511123 -800956 168600
1769 168600 -325738 -584352 -155827 -464887 -425845 -665435 -1289264 -1002011 -1269420 -425233
1759 -425233 612268 608544 -239532 -399550 -1255631 -1229564 -1441656 -1220282 -709455 -696996
1749 -696996 -873081 -919696 352080 1482475 1652492 739209 -254054 -1304873 -758958
1740 -758958 -483331 -1111277 241752 363154 -516372 -400805 -886560 -2089773 -1522187
1731 -1522187 -985671 -671899 240773 -850362 -625050 -65724 51960 -990697 -63165
1722 -63165 -724371 -1166054 -1680577 -783013 -639544 -373724 -682905 -137064 440119 -90024
1712 -90024 -252065 211973 819104 387244 -77881 899905 -474463 -332007 873184 438159
1702 438159 296515 -640406 -797257 -1565236 -337163 -32027 93919 -447614 -462545 980670
1692 980670 62040 -1276360 -1076986 -321434 -42707 -559735 -1584740 -2108640 -1516796
1683 -1516796 -517481 -603765 -853197 -681572 -1464774 -864732 -1655562 -2543906 -1356242 -973431
1673 -973431 -889904 -1510768 -1893625 -1531148 -110525 -176969 118438 1466217 655173 630528
1663 630528 -106677 -97844 -60097 -537773 336836 -206655 -51295 779308 -1099414 -1489992
1653 -1489992 -374092 77187 -1226276 -1093797 -786946 -1501231 437825 207901 269169
1644 269169 -950037 -2325636 -2119688 -2719844 -1964616 -1268723 -864071 -515798 -2040793
1635 -2040793 -1874258 -1272666 -2008141 -1228960 -1141252 -941780 -1523614 -1027633 90999 -79004
1625 -79004 168197 210449 364864 -271728 139777 -418734 -949228 -1368219 -1544454 -1990453
1615 -1990453 -1040358 -52399 -183346 280692 -344787 -398432 57205 29683 232531 800447
1605 800447 95107 640581 495583 507461 -222077 -1176016 -1115016 805199 1442330 1066134
1595 1066134 380860 1031998 -122935 -1443619 -329178 -750610 -519370 -1171786 -1916047
1586 -1916047 -1620292 -1280861 -353639 -245862 272754 409574 -1016020 -1214561 -2191214
1577 -2191214 -2192208 -1601925 -1664096 -1288367 -1531210 -1845957 -1280273 -1107608 -1629649 -1560519
1567 -1560519 -281735 115835 532272 -82666 -771777 -960011 -1091217 -182917 -1142958
1558 -1142958 -1372708 -769424 -1304208 -2263120 -1804970 -1449239 -1954554 -1059792 -1067312 -70146
1548 -70146 119723 -548533 -218298 -636030 -608439 -176285 -75366 -553426 -1385315 -1001735
1538 -1001735 -928961 -1524169 -976722 -1435293 -1070471 -1354131 -712141 -1894783 -2188336 -131020
1528 -131020 718303 936277 -315694 -1234014 -1039870 -1826400 -1523391 -1195499 -1891886 -2279725
1518 -2279725 -1863457 -474520 -433246 570657 314345 13425 -871688 -929059 406017
1509 406017 -1235178 -508960 -272145 5267 -221529 -127305 -576636 -1200672 -621981 -787072
1499 -787072 -498942 -965336 -205822 484882 94945 457929 491876 -1644509 -1951369 -992056
1489 -992056 61298 213382 -456186 144504 958774 385538 214936 500820 -306341 -1376192
1479 -1376192 -964548 -2229289 -2507673 -639221 69502 550713 737216 586278 779581
1470 779581 -476283 1207279 -767259 -1226830 -1871968 -1417102 107252 1034381 1171353
1461 1171353 510033 -496014 -847122 -405777 392028 2205903 292239 -141885 -1086691
1452 -1086691 -1979815 -2237117 -2678954 -1416451 -992934 -2435044 -1951604 -839841 -1509334
1443 -1509334 -1768410 -791609 -503832 -737891 -149636 194191 53019 256675 -6672 -419648
1433 -419648 -177429 622470 -82922 559582 -764878 -1246362 -819707 -1200058 -466958 -244021
1423 -244021 -1609931 -708569 -167262 374076 -622112 -1028776 -34696 146429 -110741 464688
1413 464688 -934338 -1202137 70408 339502 1094822 1082393 -214466 -497629 228382
1404 228382 -404900 -676587 886432 1114131 -1246318 -144071 37697 -978169 -765289
1395 -765289 -1489246 -1681951 -1450768 -1253554 -855756 -1680262 -1063905 886851 1439498 1527500
1385 1527500 1069202 645345 -95948 -762248 -804787 -266450 108031 310277 500725 336840
1375 336840 355228 -1054237 -607966 -1341219 -474360 1179187 579797 -1104779 -458754
1366 -458754 -765530 -528699 239521 -1874316 -866289 148687 398285 354144 477215
1357 477215 -1213064 -1075348 -1333857 -1540209 -1586482 -451267 157074 -1623590 -1468238
1348 -1468238 -950387 -708 1006686 481405 -276349 172875 -162557 -200998 -68105 139459
1338 139459 -624466 292521 -127617 -431677 653198 -338264 322211 -139445 -520678 523751
1328 523751 786743 640857 175178 911908 9742 71473 -45681 -737993 -391869 -241970
1318 -241970 -977409 -191350 -515539 -240499 24667 460591 -200060 -619227 -314261 -521341
1308 -521341 29443 -680187 -499517 -44496 -1420274 -2473254 -1829421 -1597598 -1778952
1299 -1778952 -2124291 -1511911 -1731104 -664730 270491 -1120476 -791597 -7376 154928
1290 154928 -432954 -485178 -389940 -239914 -856090 -1080905 -2068520 -1415974 -279309 -1038444
1280 -1038444 -21418 -630489 -754889 -12609 -158404 -365127 -373627 -1148397 -728909 -428358
1270 -428358 768641 310969 345041 835147 209285 219488 -474613 -1287679 -1277632 -1178265
1260 -1178265 -293269 -671077 -748145 -1283477 -893238 -785355 -210910 -988263 -999769 -976089
1250 -976089 -504924 -325171 -912557 -1142873 -1061795 -1081371 -600329 560127 490394 1184200
1240 1184200 82086 -416938 107509 441726 -525018 -242785 364019 -646092 -215112
1231 -215112 228365 705525 850184 221117 1123296 282528 -1573194 -864655 93895 -562056
1221 -562056 -751784 -1068969 -1051815 -431553 -856809 -256236 991630 -607743 -1197851 -1176210
1211 -1176210 -754671 -476514 -318483 -753890 -295674 -601538 331077 -216094 52319 -524609
1201 -524609 300411 181769 -844315 182303 -441557 -188308 -943441 -409300 472970
1192 472970 162012 -56519 1045918 -143246 539580 1407675 869983 -328190 -579248
1183 -579248 792548 -113607 -392418 -372042 -16493 68138 -1295011 -299781 -813180 -827513
1173 -827513 71222 62268 -540959 -744233 -1191480 -1499687 427572 437394 -31688 -381192
1163 -381192 -502390 169583 -334771 -458885 -380212 -1427621 -291482 402031 100073 -133436
1153 -133436 -353327 -484297 -353386 -570809 -449725 -269343 -391523 48250 -655627 -166068
1143 -166068 -237280 -1369628 -1895065 -1984904 -748068 -128068 345852 -43103 -1473698 -1078375
1133 -1078375 -1313716 -1365319 -1988899 -1707032 -713350 -1035664 -1066410 -940544 -434042 767235
1123 767235 757347 1033929 821875 -466941 70110 -1122517 -1228836 -1167168 -811124 -365413
1113 -365413 15231 422148 -200931 352506 289208 754859 292533 -491200 -992137 -170088
1103 -170088 823394 299333 469062 -1042527 -1023986 -725670 435632 -119028 -1174205
1094 -1174205 -260106 -475790 -307101 -373349 -447833 -513989 856699 221707 -651615 237605
1084 237605 -502479 -274539 786151 127310 446062 -233093 -1082270 -827990 -1255728 -124490
1074 -124490 179474 620422 908522 1080626 876074 825158 1075961 1587805 661509 -125192
1064 -125192 -1069790 -999531 -1113711 -1678374 -726303 -2252985 -289452 -21606 14014 -720411
1054 -720411 11420 1156456 -921486 -1313622 -1178118 -985947 -1235529 195819 587134
1045 587134 200197 857716 81368 -464431 -911864 328042 -1166240 -824920 -102900
1036 -102900 -1142320 -154884 330494 -693183 -571531 32483 -237181 378201 -223852
1027 -223852 -1408242 -6690 498542 -1180012 -1072136 -697172 -468783 -1107272 -1012575
1018 -1012575 -1325451 -525094 98490 -642613 -1769632 -1277836 -440644 -446441 -813209 -792468
1008 -792468 17901 891095 553173 840653 266306 -361917 1211669 1064312 1376707 1219408
998 1219408 -635068 -1278385 -993843 526252 -287112 -777478 1350935 1324744 310347
989 310347 298813 322717 882206 645368 327611 769486 490180 898479 550346 620436
979 620436 878927 75370 -725124 -1469339 -1266477 -127969 1181702 1371269 892413 700102
969 700102 129606 -258330 -167953 -197281 684471 1421025 46785 670101 982813 83468
959 83468 332230 -202871 748594 1089625 479506 202214 191247 951866 -41935 -1733915
949 -1733915 -1535748 39085 123227 -633839 -169805 289347 -247426 186065 -173798 -1390412
939 -1390412 -660588 830698 -174993 727293 175329 -702570 455491 1241363 411564
930 411564 33639 501116 60639 -1106977 -1674447 -1319650 58701 616 -501346 -786237
920 -786237 -1220230 1108395 953146 800800 365183 167912 -841870 -1077719 -925029 -572501
910 -572501 -317304 -114515 529659 711750 219837 -1516047 -1384213 -692189 -777490 313756
900 313756 1101864 894295 287692 -781207 -859298 114584 1265732 1961020 776406 1064137
890 1064137 347055 -61874 247100 250852 712504 273323 -883106 -1470565 -1471716 -624498
880 -624498 1579850 1567321 349082 1198920 669694 664813 -538086 163170 893927 359137
870 359137 640055 -224033 -714828 -1416775 -802636 -632741 -437995 412505 8465 -97765
860 -97765 -1492 -1361004 -590125 -628427 167947 -471546 -1024156 437928 -331088 -273236
850 -273236 269838 -1793299 494239 651870 75591 854346 425893 166789 -1126012
841 -1126012 -1319887 -768157 -45830 319733 -599444 -916181 -476498 227838 55955 -68928
831 -68928 134284 -847226 -2008734 -1515865 -462014 -443635 244008 -320614 333337 -55501
821 -55501 -908864 251521 1331413 818612 1061682 597213 899436 1251139 871648 -221805
811 -221805 -138581 395209 458750 758062 791050 1612825 429845 234143 -154579 -1064859
801 -1064859 -133422 498330 264504 -148780 110519 -197035 -543715 -1398523 -1439705 -321547
791 -321547 -444284 474360 694784 881192 549432 681060 352274 -518252 -730141 -396668
781 -396668 -238215 -504438 -80380 -421343 -814877 462851 349679 1140890 1747065 1511961
771 1511961 -98917 -516332 362604 475773 1165078 253891 -378555 329691 579486 366952
761 366952 -255136 -486072 -650535 -332773 279891 -444351 -1166716 -508265 -76940 94308
751 94308 -729454 -1183541 -893132 -415137 295482 -679526 334908 634219 -535102 -1829706
741 -1829706 -828706 -342367 -784758 -248710 -104411 -118677 -504094 -1146076 -569744 -203696
731 -203696 -167532 1426715 1427991 619661 200710 -713685 8893 931979 314129 -131503
721 -131503 -170033 621796 977121 -194321 -791960 -346872 689623 -537664 -563532 598156
711 598156 324140 -43101 -586795 -180678 -25450 -147708 745 -484124 483946 -139353
701 -139353 17011 1187473 1656896 893649 1490868 2149494 1789628 1518490 658425 3227
691 3227 639743 934335 -1281763 -194452 -103526 -370882 479656 390454 212196 687345
681 687345 189336 -1545465 -61942 883065 1262003 1980477 726078 1223910 849011
672 849011 56434 135324 -177693 587702 801479 1612843 743818 420351 369689 -299081
662 -299081 711235 -104213 104892 1459575 1510310 342280 -252785 -69436 207373 794720
652 794720 180590 -877239 -1538541 -665763 -394914 -466640 -1787693 -1460228 41955 60822
642 60822 982014 121095 140696 1362588 1266286 1119142 699711 894622 1436149 171716
632 171716 969858 885698 -201953 820871 302005 -62397 645705 355244 779545 1045973
622 1045973 1220486 778626 1255268 1806809 2071306 1015491 384967 461750 -150945 146126
612 146126 400042 -216926 -1328875 709805 395533 475902 -272199 -1162741 -473485 -494405
602 -494405 -680571 -661731 -697086 -936323 -768923 -176739 488077 -88443 564789 373661
592 373661 1419370 669325 460768 -727558 -626535 904980 1064198 846222 916855 1156793
582 1156793 449998 235755 -333133 -67561 620660 136146 158751 1007160 452191 -350054
572 -350054 154520 -558511 372800 400150 327163 1207490 1125730 715299 846741 498439
562 498439 617444 578770 453216 174296 210569 392183 -856391 519989 77857 231553
552 231553 -1074102 -371254 480706 473981 -402559 -350848 223894 635035 378628 136371
542 136371 -134886 -1256710 -1424030 -422662 -226792 815461 1167340 756888 1380895
533 1380895 -336146 692268 667511 95613 1570320 1504073 1202600 1723309 1998330 1389683
523 1389683 -452218 -709299 -952120 -1101485 -324523 -2099 -572363 929137 2074899
514 2074899 1497132 1523662 422784 54038 -56671 743270 98603 616597 2110243 2269720
504 2269720 1825625 210118 293377 716719 788693 271020 880188 830897 601130 -65144
494 -65144 -123692 107352 218877 298430 -762537 -316848 323860 664549 1676132 460647
484 460647 843990 1310363 1180821 1397125 91873 272726 -64993 -264550 736017 347575
474 347575 -729105 -93681 58691 -126839 -412553 -478164 921082 1347417 580607 -1073188
464 -1073188 -673948 -1425801 -1560663 -151462 -17279 1153091 1609746 1055696 -852114
455 -852114 -848438 -321837 -413422 -204601 -301035 408282 -382380 -307254 376376 538285 441761
444 441761 1120950 440616 -410112 -97710 -307318 477197 529734 -120090 -321058 690268
434 690268 440038 1825879 1222539 1237862 544998 231945 535768 996983 439249 471640
424 471640 1253511 1662296 707175 24397 486450 527367 -448246 473510 542238 346826
414 346826 53844 -293523 437504 971023 762855 155036 1286244 1849171 1479815 817960
404 817960 1865957 2208377 2086363 1921634 1100518 702872 483498 40990 577582 -284564
394 -284564 -380653 -404427 -681851 -341568 795319 1071772 625898 781481 149406 231111
384 231111 1763041 1257078 485840 1097591 1258801 1431402 1669551 1138137 644085 -384390
374 -384390 -639113 -889686 -973022 294813 1335289 427188 -35132 -336257 -692260 -670139
364 -670139 516537 844642 227245 558723 718832 782405 39301 -485314 1236737 1040133
354 1040133 710008 -223959 1061511 1191532 719045 1191644 1478047 1747327 1312700 284510
344 284510 357198 1219785 1227339 1002468 871556 1245309 1449836 1140113 1807398 1792099 1078973
333 1078973 2339031 1776723 550410 -406009 927718 1577460 1275777 883427 749344
324 749344 1039889 -94694 250477 1825135 1734270 1396288 2344893 1091933 1265471 305052
314 305052 875178 1183975 70723 469665 514160 1066820 1802604 1468571 -292175 -416366
304 -416366 669030 517417 250062 720874 -150789 -699892 -29730 135722 203514 1289150
294 1289150 2125216 1192537 -32234 780892 533053 1928925 1224117 720831 1152413
285 1152413 1503656 1783282 1869840 1506583 1168106 403539 -531390 -197620 -583174 323995
275 323995 1256327 529241 591752 6463 953156 1786686 3148948 3187728 1959202 921312
265 921312 1315724 1440107 701763 726778 1235521 603333 1036770 1282901 1466805 1933528
255 1933528 1534108 615486 544189 -384938 785804 870898 503570 688647 651601 781896
245 781896 80787 891067 1450955 768493 -804627 56127 -3332 707692 923400 818096
235 818096 -59651 -742452 -861942 131290 1225384 419577 157061 1183575 -1191546
226 -1191546 138341 1211961 1099310 1912600 1347369 1080657 491867 788277 1358521
217 1358521 2250905 1908732 2725383 2918657 1240229 1152309 494458 1234086 1357486 313049
207 313049 663233 933354 813747 830048 1709735 1012032 -37459 612191 389209 499121
197 499121 495459 -570457 -693909 -753185 767447 736197 333136 1455597 2053402 2463033
187 2463033 1661604 848022 2080219 1753135 1109111 447867 -12801 732972 724883 330644
177 330644 912379 442673 527014 688809 708889 1031806 606100 347045 1046185 1669505
167 1669505 1899026 770268 1267122 1484156 756305 632593 411174 251752 57183 1209274
157 1209274 799762 1322339 1613986 2000659 1409826 1537724 1564221 1409641 962241 -102221
147 -102221 -264717 590861 316327 1433951 1677533 1826384 1665900 2143208 614654 459906
137 459906 2380647 2310177 -83795 138341 574464 1833534 1793294 825915 661321 505809
127 505809 1409299 517874 608056 176458 478307 868170 520192 -571797 -487303 269000
117 269000 1878407 1124626 913834 602486 525325 -51827 -180399 290867 612277 786616
107 786616 995675 682254 816217 1485386 1348711 1462408 1860743 1958696 1032851 901851
97 901851 1981078 2494441 860511 240228 -247567 488137 788901 460098 726753 767761
87 767761 947488 1341882 1101348 455964 1328451 801130 954502 1316680 1350454 1162455
77 1162455 1556682 2476589 1279837 1030273 459006 111693 1017804 1230519 605069 650529
67 650529 853814 879588 1465956 506103 1717213 2199948 1689416 1996174 1964309 1675004
57 1675004 1048087 1762358 1791002 829256 1059499 757219 341411 -591515 -259610 234596
47 234596 471431 564948 506860 686111 830341 1023377 1295916 1180176 1070233 852131
37 852131 179390 570339 829792 1470046 1774748 1461275 2214990 1091395 1004838 875265
27 875265 821439 1311495 1194606 1218218 556811 56782 1449858 1593413 1391007 1051262
17 1051262 796979 999743 997593 2061860 1549547 1372846 1385763 1171503 609556 381185
7 381185 338324 56201 493547 1356201 1250252 1182637 917920
0 917920
$$ Imaginary data points
##PAGE= N=2
##DATA TABLE= (X++(I..I)), XYDATA
16383 -4457871 -3916109 -3920680 -4315497 -4267336 -3772208 -3460303 -3423302 -3876301 -4539472 -3221082
16373 -3221082 -2408883 -2565970 -2658176 -3126744 -2794243 -2886129 -3503541 -3401785 -2761339 -2662602
16363 -2662602 -2701499 -3892906 -3241608 -2704218 -2611304 -2658047 -2101323 -1566501 -1326582 -1967851
16353 -1967851 -2130964 -1273656 -1496357 -1952708 -1395153 -693760 -451121 -666533 -781505
16344 -781505 -1864691 -1995254 -1228502 -1508665 -1338829 -126380 45396 248719 1189421
16335 1189421 116732 -321464 -298293 254238 122587 442911 505567 389241 -146321 585759
16325 585759 410704 821883 687671 679998 1783096 1040674 708678 1962750 2422583 2058780
16315 2058780 2342644 1721562 1340183 1720323 1648228 2582239 3095431 2745227 2788804 3047944
16305 3047944 3434504 3359932 2571884 2966610 2892987 2873278 3316858 4203333 4953597 4164527
16295 4164527 3241803 3419177 4116264 3473354 3494947 3881058 3701360 3867867 4111770 3875243
16285 3875243 3321458 3601712 4855989 4615323 4636503 3949440 3300296 3461960 3668398
16276 3668398 3018364 3638335 4622737 5731955 5502236 4739910 4320565 5251158 5994498
16267 5994498 4951762 4985228 5743708 6330285 6041867 5539182 5608790 5596925 5589833 5507723
16257 5507723 6220785 6928115 6285941 6005518 5730730 5545360 6735845 7663734 7002793
16248 7002793 7504057 7656287 6997162 6270850 7362740 7170265 6928409 6262302 6522245
16239 6522245 7050576 8003483 8446517 8271012 7897630 7820112 8501799 6971887 5722948
16230 5722948 7512121 7812295 7679485 8337353 8449179 8641871 8813127 7830867 8064694
16221 8064694 8050207 6799537 8096244 8186774 6611953 7002570 7032499 6135195 8395210
16212 8395210 8227898 8210442 9060144 7344257 7095583 7721024 8248906 9228493 9177398 9354592
16202 9354592 8857378 8152922 7451883 7904766 8153485 8037314 8833250 8983289 8638184
16193 8638184 8224504 9586287 9319204 8922352 9821187 9829578 9260349 10230321 10687940 9719470
16183 9719470 9156633 8970056 9304409 8752666 7866819 8480535 9380537 9701189 9278437
16174 9278437 8366428 8534410 9073548 9246881 9476867 9294228 9165438 8283612 9220795
16165 9220795 10138573 10504190 11217879 11754950 11132727 10756029 10995208 10963330 11105967 10664136
16155 10664136 10729157 11223081 11303226 9662990 8938556 9243570 10669305 9949471 10715667
16146 10715667 10158484 9471825 9051024 9616333 9170116 9501856 11212812 10739020 11218792
16137 11218792 10546556 9655145 10163764 10231556 9988922 9142871 10348522 10399920 10434252 11444301
16127 11444301 10986181 11941618 12186277 11408767 10363429 10897271 10436002 12162667 12917600
16118 12917600 11362150 11451420 12173581 11592976 11726371 11590538 9993864 9941729 10940994
16109 10940994 10465059 10178529 10383545 11199115 10751321 9233195 11265561 11615954 11804585
16100 11804585 10727199 10936069 10860583 11658428 11435261 10857028 11017732 12367515 12374585
16091 12374585 10796253 10881852 10744780 10993748 10574281 10566960 10399725 10750010 11029753 11026110
16081 11026110 11257973 10528864 9700511 10910282 10998445 10012161 9934475 9792392 9989246
16072 9989246 10510312 10879986 10411719 11016445 10229043 9384586 10048497 9853269 12350809
16063 12350809 12072518 12124062 12220361 11369811 11052914 11259261 11351818 11754178 11573252 11107179
16053 11107179 11652482 11535800 10637044 10348138 10249237 11074080 10775421 11088608 10493312
16044 10493312 10692746 10472410 10794428 10535703 11416662 11373088 11234900 9825078 9635125
16035 9635125 12417597 11550583 11511365 10208656 10887439 11617380 12121876 12341341 11847113
16026 11847113 12511123 12188627 11964197 11594496 10158550 10364964 11390860 11371601 10886868
16017 10886868 11101772 11315501 11071122 11027383 11290107 10863064 11037640 10628639 10189441
16008 10189441 9830403 10276754 9399104 9789313 9320288 9685929 10650414 9830504 10779843
15999 10779843 10984224 11519260 11832196 11242999 11236717 10989009 10662413 10709031 11259368 12256845
15989 12256845 11847597 12220552 13029152 12967003 11938032 11748907 11164055 9257671 10101459
15980 10101459 10953345 11975367 11963896 10903658 11385493 10647885 10983946 10632561 9514650
15971 9514650 9773180 9934288 9970593 11301074 12009341 11548162 10381244 9929499 10252389
15962 10252389 10021330 9744225 10093413 10705375 11162622 12953857 12978060 11086704 11438788
15953 11438788 11633305 11929263 11812872 12432487 12750170 11789739 12865285 11260695 10996870
15944 10996870 10843017 11477152 12678058 12700962 11993182 11338968 11557981 10931658 10026941
15935 10026941 10454489 9811502 7815330 8680812 9627162 9660468 9048898 10111777 10405714
15926 10405714 10735602 11227153 11291412 10743326 11364893 10564346 11561744 12182241 10455812
15917 10455812 12118578 13270678 12677123 11606437 11683396 10873867 10145728 10797767 11832622
15908 11832622 12071135 10889772 10771975 11179287 10474986 11309639 10725261 11486082 10713057
15899 10713057 10850437 11738753 11289530 11635216 10109896 10310261 11475414 11534241 12267629
15890 12267629 11318079 10773111 11389240 10846612 10419318 10722570 10388061 11356569 12015712
15881 12015712 11380200 11168178 10862150 10573117 10368683 11444000 12263087 11695794 11172256
15872 11172256 11847910 12338236 10710415 10119937 9569541 9766203 10378167 11165646 10933689
15863 10933689 11339239 11094988 10516911 10755801 9855926 9502880 10451266 10531612 9527364
15854 9527364 10148197 10322695 11691544 10778773 10645464 11164743 10958031 9770488 10462168
15845 10462168 11553174 10527415 10814161 11385593 11509648 10782536 10978153 11393711 11689032
15836 11689032 11563266 11276707 10649389 10409238 12219699 11664244 11201616 11763016 10653401
15827 10653401 10233125 10262839 10395788 10958782 10168508 10823687 11669827 11151781 11390162
15818 11390162 11646986 11269583 11234299 11396327 10978788 11964173 11931119 11398247 11873201 11854880
15808 11854880 11662849 11105943 11286691 10474964 10764619 9540677 11312374 12264625 12853500
15799 12853500 11149499 11115849 12033823 11676848 11393314 10887069 11757450 12170839 10658846
15790 10658846 10315902 10794924 11183075 11863200 12250941 13193229 11427883 10970464 12021739
15781 12021739 12676879 11094279 10811267 10118680 10958075 12147734 12381167 11859460 12558581
15772 12558581 13081079 11468108 11418089 10582730 10257966 10620261 10810729 13606760 12516384
15763 12516384 11728665 11465462 11792728 12781414 11702842 11610566 11193339 10364371 10018912
15754 10018912 10668710 12452985 11511964 11655331 12003163 11484450 10560901 11138366 11628738
15745 11628738 12625160 11982316 12321750 11390114 10689895 12747778 12952004 12837085 11768205
15736 11768205 10931090 11368058 10730851 10310337 10966760 10846967 11502107 11848686 11614122
15727 11614122 12225830 13028155 11397048 11710295 11716481 11820244 10652380 10804691 12574318
15718 12574318 12144748 12147644 12665130 12465930 11729248 11111588 11017813 11403676 12752484 11769360
15708 11769360 10848087 11318762 10568093 9945323 11080520 11852461 11099234 9779820 9910102
15699 9910102 10879078 11462113 10353089 10253434 11542097 11630223 12649181 12574721 10779943
15690 10779943 11392513 11527368 12076063 11835547 10947985 11766562 11576184 11977704 11490824
15681 11490824 11788171 12303769 11851067 12127321 11877805 11415298 11346966 12087695 11950654
15672 11950654 12053187 12795348 13202852 11758518 10824418 11429623 11486149 12670602 14055129
15663 14055129 12679262 12226941 13650879 13188754 11992149 11523213 12372268 11752966 11515799
15654 11515799 11152729 9719014 10995433 10482976 11206830 11531357 10091312 10603935 10665640
15645 10665640 12124009 12074694 12304623 12293318 12223212 11119605 11400484 12479722 12113168
15636 12113168 12509544 13122601 12802093 13443735 11743927 9505950 9718015 11682768 12259549
15627 12259549 11422452 12497294 11917767 11119023 10718127 10722982 11851609 11575527 11958739
15618 11958739 11803118 10866235 11587200 13391629 12526937 12394269 12000810 11017523 10894528
15609 10894528 10723594 11189969 10448850 10439465 10563754 11101220 11190321 10779083 11339728 11287602
15599 11287602 11235466 11643377 11344317 10317623 11055878 11135912 10529889 11346607 11317380 10840012
15589 10840012 10201518 11476167 10634363 11313812 12478987 12157634 11820063 12377000 11826979
15580 11826979 11881631 12137294 11710790 11538889 12060075 11908266 12188725 11540501 11387369
15571 11387369 12085290 11338400 10545907 10656125 10431452 11047332 10671932 10197606 10238217
15562 10238217 10003293 11151423 10115584 10489425 10249699 9054648 10268402 11083667 10922244
15553 10922244 11485881 11165064 11856054 11088940 12146497 11845041 10529711 10162795 10946201
15544 10946201 10808335 11973640 12335019 10427129 11517956 10202279 10076608 10116659 10593729
15535 10593729 11377730 10249926 10546707 10350589 10905206 11137148 10827831 11577576 10762869
15526 10762869 11641830 11414437 10701929 10766770 11182790 10274231 10390964 11797548 12625598
15517 12625598 11847139 11688029 12095825 12012858 12779901 12979437 11526916 10820070 11763908
15508 11763908 12883667 12279039 11783581 10628512 10008983 11248488 11003796 12163994 12168137
15499 12168137 11297218 10964389 11290619 12796195 11947100 11082476 11490552 11951271 11303859
15490 11303859 11021312 13063364 12081503 11111994 11644078 11441581 11920053 11901334 11731150
15481 11731150 11875638 11405399 12087607 11448377 12188835 11076762 11604228 11325491 11475027
15472 11475027 11827924 11549348 11555689 11933247 11232809 11019253 12191711 12022045 11759111
15463 11759111 12239299 13316307 12068776 11398856 11588913 12430692 12229179 11343816 12444631
15454 12444631 12048469 11470696 12576344 13061935 12236229 11908953 12303532 11877633 12493559
15445 12493559 11351566 11565582 11970388 11566168 10720454 11376078 11540703 10466895 11389841
15436 11389841 11539528 11179016 12867200 13100682 13294496 13434092 13222776 12906136 12642303
15427 12642303 13376494 12647777 12088703 10833888 11915966 11959436 11082101 12107017 12656671
15418 12656671 11819584 10989962 11927168 12525421 12353097 12255575 11484319 10439521 11359231
15409 11359231 11997178 12430572 12576723 11909503 11364325 12959366 11437401 11239642 11479617
15400 11479617 12336126 12607416 12249234 11719581 12222950 11832721 11399900 11116295 10660185
15391 10660185 12025593 12295336 12926127 12585122 13215616 12994215 13014236 12066466 12066440 11976340
15381 11976340 11468280 11094974 11503869 12423901 13119328 12095333 11292526 11303140 11430249
15372 11430249 10987498 11562946 10665495 10864880 11722698 12505224 12109828 11028052 11094338
15363 11094338 12028719 12758957 11801235 11601451 11866646 12895252 13532232 12547371 12044217
15354 12044217 11580568 10931105 10819173 11331398 11759351 9806884 9767736 9794801 10278228
15345 10278228 11868625 12937867 12748164 11789465 12000734 11491431 10855845 11740697 12486721
15336 12486721 11994562 11840403 12360847 11496956 11152797 12005137 12428591 12126893 11663420
15327 11663420 12155959 13004113 11177332 10664636 11991006 11568760 11550060 11682733 11180695
15318 11180695 12632849 11230970 11529010 12466956 12378406 11937907 10501283 10861789 11488604
15309 11488604 11590481 10748284 10193641 11056622 12128097 11686237 11463561 11807819 12629497
15300 12629497 12709334 12630811 12956990 13109656 12362356 11019152 10900310 10663551 10610519 11150219
15290 11150219 11868963 11779532 13318340 12876150 12379238 11887468 11392711 13001616 12106564
15281 12106564 11483789 11301942 11849436 12309127 11238990 10367888 11376707 11254684 11818625
15272 11818625 12451544 13276217 14416383 12888277 11454069 11982124 11826405 12252751 11421094
15263 11421094 11341355 11658084 12763684 12859890 13324546 12405004 10571614 10619747 10858600
15254 10858600 12002966 11783159 12333775 10969044 10277599 11775124 12020901 11894585 12365119
15245 12365119 13023939 12746965 11231115 11800087 12834131 12003987 11907191 12641860 12129034
15236 12129034 12462214 14039350 13685327 12534974 12228916 12803556 12498302 11916519 12053327
15227 12053327 11835660 12314080 13229408 12942166 13368665 12755064 11641041 12273659 12640839
15218 12640839 12450665 11524110 11485123 11672535 11168165 11421781 12079131 13382038 12934753
15209 12934753 12025617 11993408 11151852 12414075 13622565 13209039 12820136 12595756 11979836
15200 11979836 11800849 12346377 12202805 11861746 11869192 12061074 11946652 12647458 12719840 11949598
15190 11949598 11742822 12051196 11915816 11334674 10902741 11859599 11743126 12021141 12046882
15181 12046882 11888545 12372595 12440981 13094847 12382539 12006494 12134490 11632087 11764739
15172 11764739 11256387 10211492 11377961 12069864 11318184 11670436 12391087 12056439 12333374
15163 12333374 12225083 12808758 12717581 13047844 12850073 12537278 11648308 11708911 12011350 11698909
15153 11698909 11823323 12946404 12869314 10281455 11899711 12890197 13027194 13610874 13509078
15144 13509078 12854682 12355905 11888093 12180329 12083567 12182830 12244153 11161980 11421542 11343703
15134 11343703 12600176 13003096 12320171 12075368 11789845 11984094 12436798 11737290 12503129
15125 12503129 11855310 11490200 10891439 11953376 11565952 12456504 12866840 12169276 12015499
15116 12015499 12731073 12072155 11733852 12672334 12127806 12297303 12017168 12823661 12088304
15107 12088304 11966500 13012540 13228213 12905782 12350058 10410987 11566919 12819616 12986708
15098 12986708 11838534 12962929 12580642 11525142 11081637 11336130 11954310 11374927 12337783
15089 12337783 12107874 12107377 11670609 11203943 11502850 11823522 12959355 11660435 11324743
15080 11324743 11488088 11542241 10849369 11120634 10880983 10692997 12181064 11972132 12015605
15071 12015605 11814059 10816301 12238807 12713968 12723096 12973436 12474920 12238433 12388451
15062 12388451 12744111 13113416 14295357 13302265 12735779 13258938 13327532 13505956 12560647
15053 12560647 11569450 11654206 12018906 12719265 12875102 13107028 13333778 12795520 11872024
15044 11872024 11937685 12102215 10922126 11207877 12845347 13620800 11865250 12078674 13683526
15035 13683526 14246573 14328409 13317113 12561818 12407208 12102651 12306083 13016499 12757469
15026 12757469 11744438 12285691 13066732 13046087 13167194 13306709 12066175 11559240 11635810
15017 11635810 10554433 11464073 11839242 11248253 10979124 11801805 11772545 11827950 11992137
15008 11992137 11063641 11022487 12771304 12366576 12070656 12205341 12460043 12467996 13274129 13070799
14998 13070799 11844586 10959723 10338987 11864482 11955467 12580757 12090127 11931465 12303313
14989 12303313 12262025 12587349 12530128 12744118 12901347 12564872 12049152 11991489 12146320 12132543
14979 12132543 11466307 11734522 11818380 12176235 11834259 12489500 12089891 11574283 11910259
14970 11910259 12486816 12905332 11775833 12318900 11816781 12063017 11860245 12839782 13248997
14961 13248997 13577737 13642750 11236258 10362806 13013131 14581142 13242773 13743683 13228018
14952 13228018 12757709 12217500 12364536 12540408 13179002 13162391 12906608 13135660 13192641 13083292
14942 13083292 14134058 13406030 13533643 12967923 12672672 13498104 13641177 13536317 12078400
14933 12078400 10846292 11802593 11352544 11998666 12840543 12664984 12072915 11054420 11023757
14924 11023757 11199887 12170479 12272556 12290406 13219236 13111022 11553163 10705552 11184573
14915 11184573 12027329 11402358 11576072 11454963 11561091 12172558 13039623 13414236 14129429
14906 14129429 14564354 13319719 12881700 13795762 13237567 12984063 12608200 13234010 12746325
14897 12746325 13638081 14002721 13851202 12101668 12217824 13503237 13607047 13742858 14174312
14888 14174312 14265884 12412663 11819831 11612855 12783243 13667687 12769167 11599268 11922016
14879 11922016 11464704 11949216 12833729 13329736 13851418 12996318 12405127 12703451 13389305
14870 13389305 14092659 14157717 13576116 13482645 12677217 11755041 11610226 12243872 13227592 13529790
14860 13529790 11805040 11993000 12485904 12801159 13371027 13335062 12792011 12141107 11566861
14851 11566861 13457052 13543575 13545884 13742987 12676290 12047448 11920188 11857401 12297332 12171951
14841 12171951 11697900 12989558 12867435 12994144 13459156 13987720 13187616 13235216 13833136
14832 13833136 12133698 12492563 13939497 13867433 13100039 13585903 12209786 11747319 13353789
14823 13353789 13740241 12798534 12499928 12402144 12411746 12679397 12835192 13978634 15692809
14814 15692809 14838653 13834468 13608315 12473712 12663030 12212902 11848938 12301817 12801124
14805 12801124 12210299 12449585 12715540 13871077 12975339 13175701 12874058 13450285 14025262
14796 14025262 13016963 12503144 13845743 12917402 12991704 13428381 13095275 13619762 14378135
14787 14378135 13254764 11561968 11925648 12513830 13154625 13435605 13492059 13333475 12270887
14778 12270887 11921223 11736759 11539804 12264524 13031911 13108052 13821639 13287402 14100819
14769 14100819 13628420 12864730 12964466 13906260 13929687 13380753 13346832 13610008 14150806 13367561
14759 13367561 13314508 13534615 12858200 12808903 13205259 12973994 12319439 12755903 12968608 13969967
14749 13969967 13996657 12821749 12845492 12580404 13004963 12971589 12869493 12022740 12541130 12782243
14739 12782243 12441791 12870045 12593330 11762527 12616134 13041413 12797716 12636062 13888915
14730 13888915 13829271 13159704 13017144 13003201 12766981 12318611 11816483 12857402 12707998
14721 12707998 12614580 12673788 12900845 12526806 12277011 11323932 11272760 12171651 12397467 12417091
14711 12417091 13162741 12877500 11491212 11938225 12418646 12188110 12541217 12599681 12733103
14702 12733103 12679099 12524910 12915071 12303199 12950702 13505997 12447887 14030366 13836988
14693 13836988 13776216 12581891 13351901 12559481 11767095 12448231 12054314 12269458 12254157
14684 12254157 13288553 13275847 12827930 12292206 12888815 12555558 11380799 11847377 12923483
14675 12923483 13119357 13048662 14116331 12669844 11567580 12971439 12428913 12719390 13520539
14666 13520539 13890864 14103197 12796813 11814169 12555996 12790679 13538052 13112788 13256628
14657 13256628 12992556 12661287 12511171 12666184 12697760 13911065 14059047 13363147 11567230
14648 11567230 12465040 12920396 12331156 12723033 13299815 12829842 11687760 11795509 12687660
14639 12687660 12390276 12327945 12976449 13227933 13277365 13634432 13702611 13357544 12938149 11910263
14629 11910263 13008447 12999735 12735930 11571681 12047359 12708248 12560269 12143609 12288462
14620 12288462 13123068 13541186 12454379 12588918 12669943 12473766 13071815 12803021 13896470
14611 13896470 13765333 13341417 12578471 12918933 13621424 13344819 13152769 13636163 13622838
14602 13622838 12887172 12567148 11452778 11785129 12694476 13474140 14052772 12857225 12526883
14593 12526883 13351425 12392567 12996471 13223107 12946915 13223074 13866829 13623286 13158980
14584 13158980 12310349 12850066 13648543 13426702 12795401 11522209 11654825 12671338 12309186
14575 12309186 12201423 13666705 12944997 13853360 14875186 14468887 13447266 11818735 11607786
14566 11607786 13079712 13905815 12307954 12884758 12742699 11173501 12489308 12358051 13006782
14557 13006782 13260804 13756224 13080055 12814752 12964647 12634942 13073823 13201492 12744776
14548 12744776 13120077 13089300 13832057 12953844 13595934 14383553 14925182 14452965 13879969
14539 13879969 13405033 13210146 13517010 13229435 14830717 13294507 12392528 12393383 13182344
14530 13182344 12959149 13610559 14004926 12691449 11671982 11984147 13214078 13556846 13414962
14521 13414962 13640097 13553123 12272104 11308531 11686916 12673170 13168444 13467008 13173895
14512 13173895 13835193 13545106 13588254 13500093 13595961 14189400 13688779 13200569 14500731 13738834
14502 13738834 12929797 14128363 13459703 13814546 13497374 13345353 12683600 13623419 13623455 12851868
14492 12851868 12922160 13081572 12361172 12545075 13568324 13247483 13286631 13692214 13900518
14483 13900518 12370048 12068372 12923683 12372442 11613600 12545851 12771332 13097862 13404708
14474 13404708 12128108 12755005 13915292 14263702 13977005 13585915 13201411 13464923 13634707
14465 13634707 12360513 13396259 13794607 12505509 12258459 12150223 12361939 12261228 13476433
14456 13476433 14541115 14098248 14271581 13773843 13003184 13823006 13888260 14614539 14305909
14447 14305909 13114805 13156328 14338066 14108093 14127468 13111088 12976020 12300834 13497578
14438 13497578 14694048 14455437 13946243 13483306 12935170 12995941 13671845 13058320 13046297
14429 13046297 12648938 13184937 13170382 12059715 12424328 11490815 12293598 12419267 13123313
14420 13123313 14221522 13288459 13602062 12800231 12778628 12858856 13671079 13487789 13495755 13568240
14410 13568240 13834768 13649585 12083543 12326107 12995962 14752855 15600893 15014694 14682137
14401 14682137 14717254 14768814 14581990 13890626 12648631 13530868 14310869 14808611 14094537
14392 14094537 13682035 13169346 12235878 12628650 14045938 14126093 13417049 13271861 13647893
14383 13647893 13940543 13811113 13329377 14179970 15071586 15026968 13261838 14173740 14909348
14374 14909348 14425806 13669805 14519527 14959492 14109204 14876768 13980248 14248697 14986102
14365 14986102 15340672 14525009 13280781 13605978 12484873 13516091 13829404 13953913 14770697
14356 14770697 14586100 14231906 13588487 14038173 12949591 13095443 13559940 13100941 13004591
14347 13004591 12380792 12621527 12102455 11794689 12234996 13432670 13653304 14614297 15098162
14338 15098162 14549611 13911406 12574267 12770784 13097212 12674849 13759454 14517061 14726028
14329 14726028 14159608 12232027 12876675 12482917 13421356 13545781 12942276 14013671 13480502
14320 13480502 14285428 13520911 13654245 13586548 13453193 13783786 14084315 14108286 13408133 13381603
14310 13381603 13605080 13817676 13712295 13565192 12616809 14500195 14546325 12690081 13237232
14301 13237232 14602965 14072710 14111021 15207847 14674270 15365833 15222625 13556432 12505332
14292 12505332 12949642 14373020 13887367 14624092 13965588 12768744 12958213 13667547 13436899
14283 13436899 13685070 13997968 13182651 13354306 13298061 13687690 13697223 14605656 14333818 14104385
14273 14104385 13215505 14065061 13634315 13030740 12963961 12910594 13604228 12618568 13877156
14264 13877156 13928614 13931380 13513207 14478429 13763251 13011877 12510707 12533328 12558232 12885911
14254 12885911 14507386 14976651 13954214 13471978 12907252 11191834 12791648 13232972 12178970
14245 12178970 13852511 14349739 15133202 13809215 13449414 12846019 12789913 13186323 13701502
14236 13701502 13353172 12633517 12081300 13437079 13240624 13399795 14506106 14730257 14930970
14227 14930970 14638853 13882436 12696245 12675450 13008609 13206724 13813658 15878252 15133695
14218 15133695 14958779 13934136 12481868 12086167 13438494 15290268 15963990 15323623 14733565
14209 14733565 14400523 15325924 15308045 15132977 15175368 15244663 14707732 14473933 13758585 13372429
14199 13372429 13651437 13990472 13596410 13650238 14377939 14485880 14715933 14685225 13760962 13588005
14189 13588005 13654841 14777183 15085244 14134709 14143857 15275203 15017084 14528064 14587051 13364350
14179 13364350 14547453 14480940 13101245 12339223 13258393 13263489 14674149 14473725 13532505
14170 13532505 14788056 15192450 15832387 14960538 15023744 14928804 14454128 13888371 13331470
14161 13331470 13505289 13920196 13880861 13531500 13539257 13323044 13324415 12977222 12705042 12804562
14151 12804562 12648894 12461349 13445553 13375775 13165881 13810144 12798484 13217322 14366035
14142 14366035 14080752 13488559 14074673 14556996 15077362 15710984 15236826 14897138 13914520
14133 13914520 13376892 14859074 14829784 14210140 14096656 13322648 13293743 14634572 13610115
14124 13610115 13043812 14020091 14312599 14588300 14751043 15274468 14184072 13323669 14393704
14115 14393704 14817692 14246180 15147372 14953057 14235103 13660924 13698080 13377773 13399088 13724710
14105 13724710 12415665 13747325 14455643 13406116 13229565 14523359 13397637 13354462 13124555
14096 13124555 14278565 13004167 13581016 14609794 13511397 13875164 13431236 13722222 13417226
14087 13417226 14535577 14986467 14362151 14875451 14045521 13717055 12568205 12644832 12727598
14078 12727598 13536526 14261601 14003225 13539935 12047567 12886708 12729581 13664425 13393104
14069 13393104 13253199 12561095 13152497 12619481 11818154 12553322 13312722 13368408 13567617
14060 13567617 13522242 13431701 13103554 13190663 14726352 15776438 15339893 14578987 14355886
14051 14355886 14513781 14859211 15072183 13842450 12322217 12314959 14058956 14450778 14978552
14042 14978552 15109006 14068704 13917563 14121421 14119919 14277730 14377520 13615321 14240940 13527380
14032 13527380 13271222 12950244 12742058 13837291 14397750 14100003 13060025 14225035 14833064
14023 14833064 14826881 13882193 14039662 14930929 14149909 13761354 14682587 14137552 14388268 14401392
14013 14401392 14860146 15290976 14017840 14386649 13156695 12145891 13977188 14164322 15263291
14004 15263291 14904568 14207339 16247540 15344442 15247177 14442895 14029502 15202922 15175791
13995 15175791 15415968 15588529 15901747 14964808 15037225 14547049 14488812 14755610 15202204 16203956
13985 16203956 16091339 15682166 14715549 14804903 14045511 12077026 12859346 13929220 15373957
13976 15373957 14835895 14137252 14110485 13841823 14125649 15291272 15568013 14570284 14165407
13967 14165407 14136413 15273397 15110234 13656753 13307136 14092569 13871378 14246157 13637070
13958 13637070 13738538 13881595 14600733 14720332 15123564 14166018 14975659 15409684 15267991
13949 15267991 15484461 14984511 14690030 14268262 14688617 15338203 15332417 13567346 12911214
13940 12911214 13004831 13508075 13851179 13713488 13789567 14850676 13480561 13023771 12434068
13931 12434068 13891398 14726378 13424835 13967165 14574855 14639123 14544281 14471634 13963795
13922 13963795 14215812 14417181 14800520 14902939 14196638 12378967 12260669 13927295 14502262
13913 14502262 14244400 14016324 14257992 15194280 14269886 16157990 15374570 14512017 15203462
13904 15203462 14713327 14701293 15681471 15010539 14697851 15183360 14725292 14496442 15007856
13895 15007856 13794208 14500211 14149866 14004899 13750614 14453548 14305264 14484680 15264444
13886 15264444 14629184 13874322 13187194 13008768 12944375 12850391 12588404 13679321 14723418
13877 14723418 15272023 14163314 13783945 14679701 14867163 14781473 14976578 14305931 15634929
13868 15634929 15913773 15354905 14708378 14287000 15086585 15384142 14931599 14559514 15097883
13859 15097883 15692678 15447540 15967562 15261770 14108450 14290257 14238303 14889633 13629974
13850 13629974 14301544 15096544 13744581 15214127 15619167 15531685 15489340 14796973 14590649
13841 14590649 14946478 14210365 15027297 15751754 16502012 15576774 13973871 14591539 15710599
13832 15710599 15441827 15388912 14387073 14786691 13829095 13347400 13905127 13381023 13648128
13823 13648128 14063699 13916849 14726876 14130455 14293822 14533215 15281067 14684441 14848564
13814 14848564 15616654 15173281 15916661 15237995 15064214 14355343 13900015 13610745 13739153
13805 13739153 14654224 14669629 14272517 13311316 14147917 15337310 16414933 16079015 15671616
13796 15671616 14463719 13355753 13986003 14367161 14516493 13121190 14169182 14857479 13550257
13787 13550257 12457398 12773744 13876580 13262905 13752269 15275903 14741009 14497593 13551871
13778 13551871 13594135 13091748 13168161 14342942 14461601 15424382 14051474 14169698 13815114
13769 13815114 13179507 13989322 15034294 14465030 15278356 15495465 16076080 15782630 14524433
13760 14524433 13784868 14635949 15580657 14814139 14785587 14424652 14271389 13541673 14239958
13751 14239958 13921139 14497300 15056038 14357453 14198343 13613353 15086340 15149895 13608320
13742 13608320 15431451 16130277 15617370 15649884 15455828 14099313 15157076 15869301 15441460
13733 15441460 15095133 15085747 15083468 15172705 14844109 14507088 14610548 15350267 15034257 14785987
13723 14785987 14443774 15731938 15336603 14930695 15304664 14135427 13713069 13845285 14492428
$$ [...]
##END NTUPLES=NMR SPECTRUM
##END=
