##TITLE=1H_CA-9076x
 CDCl3
 8 sc, 
 17.10.2022
##JCAMPDX= 6.0         $$ Bruker NMR JCAMP-DX V2.0
##DATA TYPE= NMR SPECTRUM
##DATA CLASS= NTUPLES
##ORIGIN= UXNMR, Bruker Analytische Messtechnik GmbH
##OWNER= root
$$ XWIN-NMR		Version 3.5
$$ Mon Oct 17 16:35:07 2022 Russian Standard Time (UT+4h)  she@DPX200
##.OBSERVE FREQUENCY= 200.1313499994
##.OBSERVE NUCLEUS= ^1H
##.ACQUISITION MODE= SIMULTANEOUS
##.ACQUISITION SCHEME= undefined
##.AVERAGES= 8
##.DIGITISER RES= 18
##SPECTROMETER/DATA SYSTEM= spect
##.PULSE SEQUENCE= zg30
##.SOLVENT NAME= CDCl3
##.SHIFT REFERENCE= (INTERNAL, CDCl3, 0, 15.7502)
##AUDIT TRAIL= $$ (NUMBER, WHEN, WHO, WHERE, WHAT)
$$ ##TITLE= Audit trail, XWIN-NMR		Version 3.5
$$ ##JCAMPDX= 5.01
$$ ##ORIGIN= Bruker BioSpin GmbH
$$ ##OWNER= she
$$ F:/spectra/data/she/nmr/H-F/1/pdata/1/auditp.txt
$$ ##AUDIT TRAIL=  $$ (NUMBER, WHEN, WHO, WHERE, WHAT)
(   1,<2022-10-17 16:34:00.39 +0400>,<she>,<DPX200>,
      <created by zg, POWCHK disabled, PULCHK disabled
       configuration hash MD5:
       00 E9 B6 7A A2 85 ED C7 34 08 36 98 17 FE 4E 26
       data hash MD5: 16K
       50 2C AE 05 76 7D CD 0A 1E 67 46 D3 97 C7 20 7C>)
(   2,<2022-10-17 16:34:02.71 +0400>,<she>,<DPX200>,
      <Start of raw data processing
       efp BC_mod = 2 LB = 0.24 FT_mod = 6 PKNL = 1 PHC0 = -18031.62 PHC1 = 8.80069 SI = 16K 
       data hash MD5: 16K
       0F EA 7B 13 AA 5F 39 BC 01 EE F0 6C 12 19 BD 55>)
(   3,<2022-10-17 16:34:18.20 +0400>,<she>,<DPX200>,
      <pk PHC0 = 5.929815 PHC1 = -7.200001 
       data hash MD5: 16K
       2B 8B E9 FE 7C 4C 4F D1 96 A6 FC 4E A9 97 82 2B>)
(   4,<2022-10-17 16:34:20.98 +0400>,<she>,<DPX200>,
      <abs ABSG = 5 
       data hash MD5: 16K
       C1 B4 1E 35 C3 46 5D EA DC 0C 65 69 2E FF 60 6D>)
$$ ##END=
$$ 
$$ hash MD5
$$ AF F9 AC 75 9D 68 42 C7 C6 6A 92 60 32 B9 C7 88
##$RELAX= 
##$RELAX= 
##$RELAX= 
##$RELAX= 
##$RELAX= 
##$RELAX= 
$$ Bruker specific parameters
$$ --------------------------
##$DU= <F:/spectra>
##$EXPNO= 1
##$NAME= <H-F>
##$PROCNO= 1
##$TYPE= <nmr>
##$USER= <she>
##$AMP= (0..31)
100 100 100 100 100 100 100 100 100 100 100 100 100 100 100 100 100 100 
100 100 100 100 100 100 100 100 100 100 100 100 100 100 
##$AQSEQ= 0
##$AQ_mod= 1
##$AUNM= <au_zg>
##$AUTOPOS= <>
##$BF1= 200.13
##$BF2= 200.13
##$BF3= 200.13
##$BF4= 200.13
##$BF5= 200.13
##$BF6= 200.13
##$BF7= 200.13
##$BF8= 200.13
##$BYTORDA= 1
##$CFDGTYP= 0
##$CFRGTYP= 5
##$CHEMSTR= <none>
##$CNST= (0..31)
1 1 145 1 1 1 1 1 1 1 1 1 1 1 1 1 1 1 1 1 1 1 1 1 1 1 1 1 1 1 1 1 
##$CPDPRG= <>
##$CPDPRG1= <>
##$CPDPRG2= <>
##$CPDPRG3= <>
##$CPDPRG4= <mlev>
##$CPDPRG5= <mlev>
##$CPDPRG6= <mlev>
##$CPDPRG7= <mlev>
##$CPDPRG8= <mlev>
##$CPDPRGB= <>
##$CPDPRGT= <>
##$D= (0..31)
0 1.2 0 0 0 0 0 0 0 0.06 0 0.03 0 0 0 0 0.0002 0 0 0 0 0 0 0 0 0 0 0 0 
0 0 0 
##$DATE= 1666010039
##$DBL= (0..7)
120 120 120 120 120 120 120 120 
##$DBP= (0..7)
150 150 150 150 150 150 150 150 
##$DBP07= 0
##$DBPNAM0= <>
##$DBPNAM1= <>
##$DBPNAM2= <>
##$DBPNAM3= <>
##$DBPNAM4= <>
$$ [...]
##$SUBNAM3= <"">
##$SUBNAM4= <"">
##$SUBNAM5= <"">
##$SUBNAM6= <"">
##$SUBNAM7= <"">
##$SUBNAM8= <"">
##$SUBNAM9= <"">
##$SW= 18.0517283424941
##$SWIBOX= (0..15)
0 0 2 0 0 0 0 0 0 0 0 0 0 0 0 0 
##$SW_h= 3612.71676300578
##$TD= 16384
##$TD0= 1
##$TE= 0
##$TE2= 300
##$TE3= 300
##$TEG= 300
##$TL= (0..7)
0 120 120 120 120 120 120 120 
##$TP= (0..7)
150 150 150 150 150 150 150 150 
##$TP07= 0
##$TPNAME0= <>
##$TPNAME1= <>
##$TPNAME2= <>
##$TPNAME3= <>
##$TPNAME4= <>
##$TPNAME5= <>
##$TPNAME6= <>
##$TPNAME7= <>
##$TPOAL= (0..7)
0.5 0.5 0.5 0.5 0.5 0.5 0.5 0.5 
##$TPOFFS= (0..7)
0 0 0 0 0 0 0 0 
##$TUNHIN= 0
##$TUNHOUT= 0
##$TUNXOUT= 0
##$USERA1= <user>
##$USERA2= <user>
##$USERA3= <user>
##$USERA4= <user>
##$USERA5= <user>
##$V9= 5
##$VALIST= <valist>
##$VCLIST= <CCCCCCCCCCCCCCC>
##$VD= 0
##$VDLIST= <DDDDDDDDDDDDDDD>
##$VPLIST= <PPPPPPPPPPPPPPP>
##$VTLIST= <TTTTTTTTTTTTTTT>
##$WBST= 1024
##$WBSW= 4
##$XGAIN= (0..3)
0 0 0 0 
##$XL= 0
##$YL= 0
##$YMAX_a= 99694
##$YMIN_a= -132322
##$ZGOPTNS= <>
##$ZL1= 120
##$ZL2= 120
##$ZL3= 120
##$ZL4= 120
##$ABSF1= 15.76452
##$ABSF2= -2.28733
##$ABSG= 5
##$ABSL= 3
##$ALPHA= 0
##$AQORDER= 0
##$ASSFAC= 0
##$ASSFACI= 0
##$ASSFACX= 0
##$ASSWID= 0
##$AUNMP= <proc_1d>
##$AZFE= 0.1
##$AZFW= 0.1
##$BCFW= 0
##$BC_mod= 2
##$BYTORDP= 0
##$COROFFS= 0
##$CY= -3
##$DATMOD= 1
##$DC= 0
##$DFILT= <>
##$DTYPP= 0
##$F1P= 0
##$F2P= 0
##$FCOR= 1
##$FTSIZE= 16384
##$FT_mod= 6
##$GAMMA= 0
##$GB= 0
##$INTBC= 1
##$INTSCL= 3.70164e-10
##$ISEN= 128
##$LB= 0.24
##$LEV0= 0
##$LPBIN= 0
##$MAXI= 10000
##$MC2= 0
##$MEAN= 0
##$ME_mod= 0
##$MI= 1.114404
##$NCOEF= 0
##$NC_proc= -9
##$NLEV= 6
##$NOISF1= 3.799351
##$NOISF2= 2.8
##$NSP= 0
##$NTH_PI= 0
##$NZP= 0
##$OFFSET= 15.75019
##$PC= 1
##$PHC0= -18025.69
##$PHC1= 1.600689
##$PH_mod= 1
##$PKNL= yes
##$PPARMOD= 0
##$PSCAL= 0
##$PSIGN= 0
##$REVERSE= no
##$SF= 200.130004271255
##$SI= 16384
##$SIGF1= 3
##$SIGF2= 2
##$SINO= 5.538805
##$SIOLD= 16384
##$SREGLST= <1H.CDCl3>
##$SSB= 0
##$STSI= 16384
##$STSR= 0
##$SW_p= 3612.71676300578
##$SYMM= 0
##$S_DEV= 0
##$TDeff= 16384
##$TDoff= 0
##$TI= <>
##$TILT= no
##$TM1= 0
##$TM2= 0
##$TOPLEV= 0
##$USERP1= <user>
##$USERP2= <user>
##$USERP3= <user>
##$USERP4= <user>
##$USERP5= <user>
##$WDW= 1
##$XDIM= 16384
##$YMAX_p= 307108063
##$YMIN_p= -4377239
$$ End of Bruker specific parameters
$$ ---------------------------------
##NTUPLES= NMR SPECTRUM
##VAR_NAME=  FREQUENCY,     SPECTRUM/REAL,   SPECTRUM/IMAG
##SYMBOL=    X,             R,               I
##VAR_TYPE=  INDEPENDENT,   DEPENDENT,       DEPENDENT
##VAR_FORM=  AFFN,          ASDF,            ASDF
##VAR_DIM=   16384,         16384,           16384
##UNITS=     HZ,            ARBITRARY UNITS, ARBITRARY UNITS
##FACTOR=    0.220516191357247, 1,           1
##FIRST=     3152.08554818242, 0,            0
##LAST=      -460.631214823356, 0,           0
##MIN=       -460.631214823356, -4377239,    0
##MAX=       3152.08554818242, 307108063,    0
$$ Real data points
##PAGE= N=1
##DATA TABLE= (X++(R..R)), XYDATA
$$ [...]
8546 8797257 8690040 8403504 8652976 7749174 8066918 8326486 8213756 7664328 7985354 7563413
8536 7563413 6875714 7030464 7201992 6556364 7002783 7291332 7682923 6987235 7909943 7683575
8526 7683575 7330059 7222340 7666648 8064637 6570219 6675236 7035937 6696464 6934024
8517 6934024 7232052 6727432 6149640 6203563 6653937 5676103 5734889 5655799 5204246 5901083
8507 5901083 6275796 5716847 6329857 5540518 5216012 5129449 5683317 5721397 5753774 5633634
8497 5633634 5424559 5091368 4889751 4166890 3718697 4546808 4849491 4646234 4528656 3568711
8487 3568711 3895839 5379006 5370465 5120870 4856082 4055133 3767082 4508019 4360645 4728402
8477 4728402 4271427 3320826 3604427 3614271 4018032 3306762 2823153 3682957 4223593 3534703
8467 3534703 4039620 4673011 4358077 3678663 2991257 3777533 4268263 3495294 2882898 3096192
8457 3096192 2956933 3415652 3342296 3934651 3383408 2761723 2896066 2428147 1872437 1861840
8447 1861840 2687208 2891760 2628426 2207224 2335380 1709136 1056105 1772752 1125783 1161060
8437 1161060 1899605 1723028 2569136 2469523 1765451 1407293 951808 1675864 1506865 2547041
8427 2547041 2785793 2132564 2132779 2250998 2857739 1908191 1460791 611907 617419 1382343
8417 1382343 1516480 2032630 2151373 1875950 2516057 2069272 1775226 1836526 2728609 3351731
8407 3351731 3401862 2338603 1022229 1499365 2256500 2277645 1474464 682919 1127766 2155943
8397 2155943 2494849 2405925 1818602 2022442 1822263 1759631 1709700 799025 991287 1732100
8387 1732100 572476 673983 1545271 2194417 1940404 739232 1110048 1332248 1028907
8378 1028907 775309 491141 995528 787287 1413701 2416518 1572797 1751894 1900853
8369 1900853 1662161 756840 764366 743423 854360 422187 -184512 307027 1044764 1348277
8359 1348277 464299 649882 931232 1144634 931219 186021 232729 720615 733188 451772
8349 451772 30973 812984 1135147 210736 390972 382444 27013 12876 113960 -209878
8339 -209878 -591124 664717 312959 -268862 72009 70716 -48371 397701 473861 689250
8329 689250 -149680 438350 1377543 1055329 699022 424396 -519330 -164228 427759 255047
8319 255047 329662 -135749 -311778 -284417 278958 632074 698562 1198044 1088294 733560
8309 733560 387670 784154 850014 -235351 -442418 329596 13263 -101431 176457 573493
8299 573493 1083588 1239570 1480861 1155934 1169172 894623 390889 -643161 -162049 -517014
8289 -517014 -485305 -349577 51371 -541675 -218780 -166698 -636944 364059 991410 111240
8279 111240 -66108 -363399 -582912 -285608 23099 -529130 -610928 308101 935486 176742
8269 176742 -859287 -1769169 -530283 548605 119002 522853 -123576 -251018 490205
8260 490205 91896 9348 -254831 426680 1108535 -521700 -363863 -785665 -774675 -937591
8250 -937591 -765562 -994461 -398999 -673787 -951902 -1151470 -1285512 -61678 -606 85472
8240 85472 319720 309820 609963 -326948 -366444 -410045 -267305 484627 404982 -346119 187538
8229 187538 -584251 -525250 821254 831848 646701 852626 234951 85950 835004 759305
8219 759305 558981 422533 379348 -49072 209244 -547286 -62073 -76753 -50111 -841166
8209 -841166 -362515 -10773 -671762 -109245 203832 47578 -262519 -279125 221533 -5659
8199 -5659 656063 177158 -486615 352654 768671 119305 755987 -1425642 -2805554 -1643170
8189 -1643170 -1699556 -1677669 -1559205 -932227 -1235176 -848565 -231256 -535498 -1151281 -2117577
8179 -2117577 -2545702 -1402697 -798685 -390243 -91122 -125787 -578983 -374340 -44964 -1172422
8169 -1172422 -688090 5446 -814030 -927603 -1246169 -1704302 -1873412 -765966 -717271 -691582
8159 -691582 -1975050 -1791770 -813551 -1581001 -863849 -578005 -1480599 -1274187 -794696 -359697
8149 -359697 -555266 -410563 -833431 -536873 -168780 -121463 -156500 -865128 -1045582 -755324
8139 -755324 -276009 -696785 -884160 -1049964 -864612 -1308376 -1532855 -1442256 -1365301 -1169850
8129 -1169850 -816236 -1386238 -1542176 -748185 -930802 -988434 -900918 -354543 -1275680 -2111127
8119 -2111127 -1040110 -688249 -1613902 -1660026 -1766746 -1491312 -638533 -606074 -726576 -495872
8109 -495872 -777192 -1346884 -2268652 -1724821 -1366955 -1220739 -1360095 -1433874 -2095191 -1585182
8099 -1585182 -805777 -951228 -862145 -1250794 -1109461 -1283531 -1096949 -648134 539477 -460417
8089 -460417 -1471174 -1138262 -1309200 -2019517 -1543249 -805463 -594935 -1087067 -1293376 -1391870
8079 -1391870 -1704307 -1229692 -866529 -1769613 -1168610 -593451 -488508 -920362 -1929993
8070 -1929993 -1068421 -925313 -714626 -589222 -792687 -549507 -859039 -1922033 -1440879
8061 -1440879 -1183831 -1300270 -1034496 -300501 -463563 -1191318 -698730 -1028853 -424165 -1140732
8051 -1140732 -1639256 -1694969 -939019 -394651 -604603 -734004 -860805 -1046731 -1023632 -987138
8041 -987138 -1111350 -921781 -754208 -741932 -472537 -117825 -981711 -1112562 -1280527 -1091849
8031 -1091849 -985661 -1889264 -1001008 -715885 -487963 -1124979 -1339130 -660889 -859460 -554206
8021 -554206 -880874 -752259 -678703 -739643 -1394845 -1703136 -1188123 -1185857 -1305974 -1525912
8011 -1525912 -2087983 -1974623 -1269383 -1830071 -1651577 -1399190 -1651141 -936828 -801920 -1003333
8001 -1003333 -900470 -1111642 -1398426 -1266270 -977806 -1095795 -509029 -1409693 -1959171 -1880651
7991 -1880651 -665277 -757760 50339 -506925 -1289182 -331595 -792265 -846070 -1730712 -1309645
7981 -1309645 -510302 -775032 -1078440 -1287091 -1019423 -1100734 -1272055 -1010954 -1039826 -1084948
7971 -1084948 -1137291 -1453898 -1666516 -846834 -396771 -256677 -846686 -250194 -202789 -942780
7961 -942780 -1883794 -962967 -812040 -93174 -272326 -976798 -1235594 -1770657 -2050930 -1721330
7951 -1721330 -1507730 -1744073 -1958713 -1897281 -2078966 -1946518 -923931 -53162 -390685 -642916
7941 -642916 -383301 -457979 -1589882 -1819627 -1478803 -868492 -615901 -1181363 -1520256 -1317028
7931 -1317028 -1382939 -1167632 -702100 -1143021 -1291418 -903165 -793899 -1214447 -2206140 -1720003
7921 -1720003 -1285243 -769861 -469376 -127513 -872448 -877415 -360091 -168695 -1599863 -2634588
7911 -2634588 -1840124 -931927 -1489973 -1986144 -716504 -1256649 -887139 -1423993 -444934
7902 -444934 -751208 -682149 -1235547 -1321128 -503936 -1064208 -1336996 -1129885 -1086384 -1477390
7892 -1477390 -1759973 -1281890 -1079890 -1884590 -1202246 -389142 -1096361 -646002 -1208399 -1638852
7882 -1638852 -1483538 -1540652 -1302088 -1310249 -1857170 -2262302 -1899447 -1382426 -1508733 -474125
7872 -474125 -941672 -1196321 -749066 -623870 -889254 -2444709 -1680199 -2063088 -2442346 -1379098
7862 -1379098 -1517675 -1163711 -1448680 -1638189 -1586657 -1774577 -2310065 -2339825 -2123920 -1527116
7852 -1527116 -1787606 -1687867 -1727950 -1507532 -1682751 -1575905 -1294163 -877891 -798955 -946323
7842 -946323 -1260257 -1251706 -1298984 -653700 553709 45182 -948331 -1369067 -1919064 -1487654
7832 -1487654 -982624 -1674576 -1858303 -1984411 -1028339 -769839 -1535852 -1650383 -2255770 -1423762
7822 -1423762 -962712 -1853423 -1707190 -2009598 -1543669 -1104211 -1270730 -1968052 -1918795 -2200082
7812 -2200082 -2450670 -2495728 -2711422 -2447417 -1761856 -1382088 -1932484 -3433379 -1658064
7803 -1658064 -1659348 -2049838 -1423160 -1512015 -1845392 -1932783 -2573952 -2451841 -1941279 -1686552
7793 -1686552 -1737709 -1724506 -1436017 -1715851 -1927077 -1631772 -949000 -1176050 -1569812 -1815651
7783 -1815651 -2443548 -1871910 -2187243 -1735558 -1558372 -601794 -880948 -992167 -703942 -1359864
7773 -1359864 -1338577 -2240376 -1424529 -1002511 -449069 -508679 -1326214 -641482 -92332 -1014781
7763 -1014781 -1568986 -1761566 -2262087 -1549951 -1719576 -1786330 -1513721 -1337662 -1473481 -2379208
7753 -2379208 -1444845 -874139 -412795 -1028775 -1679639 -1393979 -1089444 -1373893 -1042945 -1150563
7743 -1150563 -1553730 -2092140 -2254266 -1805829 -1932813 -1280717 -863350 -1710249 -1201812 -1394299
7733 -1394299 -2267203 -2739943 -2245795 -1757096 -1322461 -986385 -1666075 -2118203 -1628766 -1617619
7723 -1617619 -1789297 -1353628 -1354345 -959554 -978636 -1277341 -2175083 -2455583 -2015650 -1979573
7713 -1979573 -1552306 -778428 -1180849 -1639323 -1586080 -1187654 -1093477 -1541234 -1782489 -2215538
7703 -2215538 -2385759 -1185292 -1669355 -1496022 -898725 -950815 -971973 -1166138 -713763 -1366211
7693 -1366211 -1127773 -765052 -1104563 -1422576 -1019294 -1120589 -1070729 -1114462 -412639 -464605
7683 -464605 -1140099 -844476 -1249851 -1311153 -1525181 -711769 -125323 -1285637 -1561071 -1449328
7673 -1449328 -1824959 -1628375 -1360691 -1673460 -1627260 -2079079 -1316926 -1392954 -885919 -1003295
7663 -1003295 -727111 -564518 -635478 -893319 -1273503 -1138234 -919186 -145268 -575745 -978330
7653 -978330 -1368697 -1492727 -1590326 -1161990 -660689 -419315 -874361 -899864 -1434170 -1308467
7643 -1308467 -1060075 -979000 -2287988 -2020933 -1503328 -1693117 -808367 -772321 -600541 -1893104
7633 -1893104 -1803114 -1310458 -1197172 -440630 -789038 -1457808 -15019 106653 -855626 -1386100
7623 -1386100 -1231367 -1253599 -955658 -725066 -819551 -959748 -1628292 -1634162 -1207184 -1342835
7613 -1342835 -1697237 -921168 -1526663 -966807 -260429 -408490 -732676 -1081402 -1275454 -1099714
7603 -1099714 -806397 -668115 -268016 -859718 -1618949 -1069291 -1227129 -1377698 -1122689 -1070732
7593 -1070732 -1238203 -1415323 -1255218 -1707070 -1313753 -1413263 -1142401 -415528 -881545 -355297
7583 -355297 -827008 -580980 -1383830 -1504349 -1438933 -1393807 -1491645 -1920339 -1725897 -1481394
7573 -1481394 -910781 -1255602 -1440687 -1657179 -2220109 -2156790 -2196540 -1913535 -1888955 -1838746
7563 -1838746 -1411836 -849648 -913186 -762792 -2085894 -2154710 -1645273 -1563873 -1025484 -1155435
7553 -1155435 -1100433 -815946 -1232340 -1384827 -1353886 -1061190 -778550 -1424321 -1976314 -2327081
7543 -2327081 -2005456 -1986402 -1927326 -1623990 -1176245 -1565615 -1686352 -2555535 -2234984 -2060258
7533 -2060258 -1919073 -2384972 -2398108 -2691593 -2604717 -1635363 -745940 -524675 -1521507 -1593512
7523 -1593512 -1722695 -2287225 -1110144 -1377519 -2184312 -1407870 -958679 -858019 -1251991
7514 -1251991 -1450767 -1215904 -1282572 -1710146 -2248450 -1233321 -1505683 -2324978 -2437724 -2173149
7504 -2173149 -2084257 -2214553 -2320646 -1727334 -949777 -1732100 -2040458 -1691305 -2219434 -1646324
7494 -1646324 -1513378 -1252608 -1367965 -1399025 -1090476 -2147952 -2183870 -1343371 -2070464 -2600664
7484 -2600664 -2647875 -2167468 -2484883 -2180338 -1594564 -626939 -1593886 -1825078 -1980054 -2063891
7474 -2063891 -2154489 -2684579 -3046024 -2723092 -2096770 -2515166 -2133057 -3346884 -2955351 -2384583
7464 -2384583 -945820 -1402486 -1989737 -918284 -680631 -1691331 -2005103 -2592515 -2942108
7455 -2942108 -3013683 -2386131 -1447740 -1285374 -1272024 -1651242 -2338597 -3025592 -3154463 -2477113
7445 -2477113 -2301078 -2031218 -2582147 -2099169 -2256356 -2064975 -2791264 -2778209 -2292958 -1966295
7435 -1966295 -1677937 -1542963 -1977185 -1930270 -1903944 -2519990 -2728039 -2486025 -2659444 -2410211
7425 -2410211 -2424649 -3001688 -3475029 -2563265 -1672506 -2520978 -3118035 -2486538 -3054778 -2766882
7415 -2766882 -3349175 -3789803 -2916069 -3153102 -3206714 -3056786 -2436427 -2628282 -2365465 -2291285
7405 -2291285 -2952126 -2908120 -2338715 -2119174 -2338756 -2701173 -2090586 -1631235 -2140536 -3108850
7395 -3108850 -2166031 -2139522 -1719833 -1947031 -2790023 -3140199 -3162032 -2905312 -2278320 -2349481
7385 -2349481 -2826186 -3592163 -3524773 -2439772 -1943112 -2664023 -2463694 -2815973 -3592462 -2640337
7375 -2640337 -2472766 -2611346 -2696540 -2929554 -2316018 -2363520 -2321582 -2786685 -3729070 -3262152
7365 -3262152 -2458934 -3089687 -2808628 -3411477 -3480043 -3441370 -2873251 -2370319 -2782576 -3224369
7355 -3224369 -2745756 -3141382 -2872880 -3141398 -3651601 -3849847 -3654129 -3385942 -3041160 -2021043
7345 -2021043 -2152768 -2410503 -2998650 -2496081 -2518714 -2704766 -2540525 -2433137 -2334523 -2303517
7335 -2303517 -2367947 -2788401 -3251739 -2733332 -2877645 -2503966 -2594437 -2091059 -1616098 -2190378
7325 -2190378 -2348240 -2947800 -3603702 -3091400 -3456466 -2938528 -3622051 -3996838 -3498887 -4034114
7315 -4034114 -4028946 -3209464 -3397331 -3055784 -3601028 -2632693 -3343947 -3489524 -3728423 -4092148
7305 -4092148 -3113003 -2423384 -2351299 -3047567 -2503128 -2659022 -2692276 -3137287 -2494360 -2792996
7295 -2792996 -2954021 -3348092 -3451910 -3512018 -3211864 -3538830 -3827557 -3088339 -3465767 -4377239
7285 -4377239 -3663163 -3999683 -4319417 -4257293 -3364437 -2984515 -3534223 -3216903 -3261278 -3242770
7275 -3242770 -2765402 -2621789 -3039470 -3331827 -3295555 -2976168 -2582812 -3661161 -3427037 -3335713
7265 -3335713 -2958717 -3135041 -2628532 -2176691 -2473288 -2441612 -2688211 -2845541 -3148766 -3141382
7255 -3141382 -2839495 -3018568 -3630917 -3789715 -3900586 -3622457 -3728038 -3201374 -2973350 -3021175
7245 -3021175 -3033357 -3276918 -3859314 -3516091 -3004358 -3383149 -3468889 -2213595 -2428411 -2105287
7235 -2105287 -2208188 -2819545 -2598668 -2331758 -2494189 -2570338 -2930936 -2829204 -2666324 -2667342
7225 -2667342 -2862232 -3171625 -3272108 -2340469 -2237788 -2509996 -2399035 -2488645 -3150741 -3127940
7215 -3127940 -3449477 -3839050 -3667560 -2946821 -3179107 -3061433 -2477367 -2278139 -3166495 -4027342
7205 -4027342 -4285738 -3516375 -2994670 -2538606 -2758882 -2754196 -2901497 -2714739 -1995198 -3454091
7195 -3454091 -3810308 -3677370 -3659374 -3779909 -3198984 -3206532 -3153419 -3145850 -3363704 -3927818 -2928054
7184 -2928054 -2550705 -2581799 -2820451 -3051682 -2585440 -1310844 -1774418 -2587813 -2970743 -2393957
7174 -2393957 -2071418 -3069915 -3544047 -2998189 -2526555 -2578971 -2185006 -2262498 -2431430 -2991933
7164 -2991933 -3388499 -3650419 -3222114 -2827697 -2554663 -3455468 -3216123 -2589162 -2517996 -2326093
7154 -2326093 -2515814 -2549417 -3399116 -2771860 -2870673 -3191972 -2849726 -2970964 -3029530 -2147664
7144 -2147664 -2194570 -2708334 -3170945 -3952125 -3925655 -3710298 -2767750 -2124344 -2921375 -2945274
7134 -2945274 -2929688 -3193550 -2638976 -1863501 -2052749 -2245920 -2672837 -2379416 -2876562 -2099249
7124 -2099249 -1498614 -1815208 -2641012 -2875945 -2433885 -2598426 -2017698 -2250795 -2714955 -2717075
7114 -2717075 -2315712 -2377855 -1933263 -1946978 -2056961 -2049184 -2184011 -2210026 -2451792 -2461633 -2814112
7103 -2814112 -3132904 -3265955 -1912556 -1436673 -1603812 -2707157 -2521552 -2220203 -3135104
7094 -3135104 -2954089 -2850894 -2765585 -2610464 -2221406 -2251837 -2561979 -2465628 -2226277 -2491405
7084 -2491405 -1974054 -2287798 -1838654 -2204431 -2266212 -3470431 -3447966 -3257223 -3499065 -2876744
7074 -2876744 -2605482 -2602153 -1799771 -1411781 -2813248 -3316997 -3345010 -2730362 -2540440 -2223197
7064 -2223197 -2343662 -1837126 -2077378 -3106258 -3256399 -4210905 -3467971 -2620869 -2439353
7055 -2439353 -1747149 -1868773 -2504893 -2082491 -2308220 -2548479 -2590653 -2512738 -3089378 -3372595
7045 -3372595 -2516131 -1844902 -2149488 -2854281 -2544839 -2492134 -2396112 -2456367 -2369561 -2791943
7035 -2791943 -1853452 -1767223 -1815180 -2392524 -2682539 -2155570 -2438212 -2430029 -2766939 -1635287
7025 -1635287 -1707096 -1323342 -1849440 -1706494 -2042111 -2316830 -1958371 -2164865 -2891730 -2575039
7015 -2575039 -1170531 -1150455 -1775518 -1405608 -779212 -1105387 -1857653 -1342474 -1248528 -1353610
7005 -1353610 -1109036 -1730728 -1948955 -1941346 -2406162 -2215015 -2074815 -1863823 -1689421 -1668060
6995 -1668060 -1990378 -1624938 -1961292 -2587166 -2069204 -2341759 -3046758 -2380140 -1313585
6986 -1313585 -808825 -1226789 -1706350 -1432427 -2317657 -2408166 -2482879 -2444963 -1426246 -1910073
6976 -1910073 -2784811 -1818467 -1505551 -1213807 -2140333 -2136164 -2665132 -2566414 -1333068 -1175376
6966 -1175376 -2050587 -1788819 -2351127 -2261617 -1470908 -1410785 -1958619 -2201824 -2415988 -1745940
6956 -1745940 -930146 -1909527 -2740296 -1442885 -1541545 -1736442 -2239502 -1956805 -1641991 -1500647
6946 -1500647 -1452480 -1852208 -1493254 -1892261 -2524512 -2236184 -1238598 -1078175 -1086149 -934327
6936 -934327 -742850 -1021788 -2123267 -1705578 -1063911 -1034741 -769586 -1909451 -1516597 -1591711
6926 -1591711 -2024159 -1345342 -2310885 -1811577 -1188154 -925269 -1203094 -918664 -782287 -751358
6916 -751358 -1073114 -876726 -640151 -1334902 -917533 -642555 -732263 -1144008 -865710 -964418
6906 -964418 -593482 -85231 -36351 -366941 -756538 -1808719 -1551916 -894038 -1044175 -925543
6896 -925543 -941198 -922015 -116897 -992884 -786065 -561339 -853091 -885282 -222872 -222502 -615354
6885 -615354 -1031557 -1507187 -1203332 -761100 -1110072 -776658 -1043524 -490499 -636864 -686243
6875 -686243 -657090 -1017001 -1198070 -815727 -362979 197664 163912 -404066 126215 62180
6865 62180 -666046 -1062183 -484644 -84754 -833107 -1266954 -739764 269359 -112624 -241447
6855 -241447 -248823 -151875 -768462 -885052 -432699 -1018002 29604 -176282 -796210 -1021292
6845 -1021292 -1331147 -1125338 -609661 -154688 -444792 237524 475559 9517 101674 -836240
6835 -836240 -426206 -963386 -770696 168618 152214 -131803 505474 550916 -525761 -825700
6825 -825700 -729281 -292452 284648 943090 801350 1047923 479682 -680115 -6044 481416
6815 481416 106716 -156370 862112 75989 -323764 242188 -304280 -3762 -138842 -710951
6805 -710951 181361 668181 683736 685966 57636 -727005 -352188 -502603 -513632 -460271 116631
6794 116631 590428 121477 -427727 57073 403382 270965 -102140 138798 348931 217051
6784 217051 453021 -551510 513978 501133 514992 375675 -273807 377971 410148 838131
6774 838131 964685 569018 694209 777299 416992 537037 880129 1208539 258212 -49563
6764 -49563 244207 244707 553953 1003876 958867 1129977 1883417 1634152 1290891 841035 614123
6753 614123 1270384 534424 899388 1237793 754560 363733 1499784 2570060 1450915
6744 1450915 1200142 358114 787520 1049767 748223 1339365 2000483 1482129 892112 1111456
6734 1111456 1706177 1998367 1996716 893851 892360 1492555 2279041 1988143 2027253 2425545
6724 2425545 2017852 1682224 827395 810655 1012363 1513345 1459308 667548 1178022 1341066
6714 1341066 1545999 1543708 1862173 1899768 1476260 1650055 963606 522900 1554572 1599440
6704 1599440 607329 928612 1294294 1400149 936583 1639315 2206724 1809755 789943
6695 789943 727246 986662 1908420 1725842 1362169 1139815 412027 1697955 1957017 1475304
6685 1475304 1920691 2117783 1421295 537937 1014615 1310353 1701480 2020358 2179147 2154622
6675 2154622 2086876 2036087 1959889 1599275 1329848 1549301 1281601 1217007 900801 1156173
6665 1156173 1978246 2379346 1801507 1911065 2184497 2777413 2930813 2730349 2192417 1987948
6655 1987948 2316965 2214786 1891042 1542133 1729640 1612508 2227844 2783593 2485789 2183382
6645 2183382 1370950 1633722 1116312 1161569 1773194 2481190 2702649 1951806 1419430 1492658
6635 1492658 1703542 2110579 1942084 774255 2122740 2184785 1723220 2077994 2328355
6626 2328355 2241416 2024187 2100498 2125088 2218630 2158842 1122833 1146765 1741010 2084909
6616 2084909 1138590 1096276 1701325 1726519 1887224 1951382 2112178 1835109 1429267 1919972
6606 1919972 3027561 2841780 1725681 2134054 2583935 2400525 2392845 3043780 2365973 1454914
6596 1454914 1783947 2087699 2940134 2648051 2735972 2372903 1715269 1838501 1723336 1417593
6586 1417593 2248097 2653628 3166073 3064341 2608522 2426562 2653231 2421094 1936962 1869569
6576 1869569 2451704 2259562 2071372 2739505 3211305 2510209 1952372 996673 1381641 1486718
6566 1486718 1774983 1101589 1332249 1508650 1424725 1785541 2087245 1825238 2084679 2714600
6556 2714600 2063678 2097433 2327279 2337848 1839102 1907557 2124333 3090796 2126644 2395659
6546 2395659 2438992 2780386 2709969 2210192 1580872 2234872 2007751 2664061 2294030 2397441
6536 2397441 2915064 2858832 2730102 2627337 2458113 3080259 3360932 2301636 2093130 2019570
6526 2019570 1768823 1666173 2959221 2205132 1484804 2498968 2097324 1676255 2091145
6517 2091145 2413564 2592336 2498751 2154306 1919903 2600430 2645738 2802127 2612622 2165875
6507 2165875 2579884 3300644 3454941 2796649 1567575 2329046 2502595 2075692 2568725
6498 2568725 2289876 2194018 1645118 798199 1193546 1788723 2852016 2415549 2511612 2629377
6488 2629377 2388864 1865478 2142391 2530875 1950623 1862833 1653524 1793605 1333799 1325970
6478 1325970 1274306 1584242 1316957 1619725 2244697 2145007 1581281 1297639 1440754 1812756
6468 1812756 2607833 2556118 2562634 2326934 2547304 2382707 2222079 2064580 2204497 2015153
6458 2015153 2017369 1714754 1408714 1870925 2139619 1754273 1992620 1998959 2233293 3234010
6448 3234010 2594448 1635357 1259967 1244585 1509164 2151196 1868774 1900602 1356741 1842615
6438 1842615 2047638 1101834 951400 976476 1133352 1448316 1823664 1451871 1055591 882079
6428 882079 1213034 859356 1837655 1925390 1051308 1434969 1630769 1520742 960211 719502
6418 719502 1277144 1313206 1073374 770598 1273808 1053845 552750 1316262 1000480 2145693
6408 2145693 1743313 1738349 1859427 1610771 1483255 1448436 640516 288930 60861 814074
6398 814074 1041152 1006620 1202111 1824799 2304070 2303608 2413289 2106076 1809016 1425428
6388 1425428 1304147 695852 450254 1344893 2007749 1705570 1657673 1320079 1404014 1338368
6378 1338368 1413058 1289842 1532251 942273 611697 1322051 1356871 1532743 1518235 2180771
6368 2180771 2009958 1409439 1490671 1493239 1951373 1446151 1753243 1660157 1473934 1812587
6358 1812587 2100383 1511323 1678581 1519496 1192151 1147544 1930262 2159200 2296729 2651930
6348 2651930 1479090 1580292 1938690 1741952 1368725 998381 1953060 2299003 1543192
6339 1543192 1093428 1366628 1949902 2595806 2626232 1706613 1577918 1718872 1864536 1877851
6329 1877851 1282584 1956922 1300695 1404378 535333 597521 1810773 723424 350073
6320 350073 1431796 1564208 1240366 835550 1211734 1598945 1334419 2402513 1898998
6311 1898998 1876863 2035428 1623466 625780 1334981 1421586 900202 857756 1211024 1900456
6301 1900456 1429621 1975226 1393920 949628 858813 1296579 2342287 1666676 1579208 1980247
6291 1980247 1065825 1422178 2282731 1411534 1024174 947971 1818339 1628027 1791498 2515461
6281 2515461 2508703 2113730 2133480 1818436 1743951 1399149 1316601 1610147 907061 1677462
6271 1677462 1925908 1431750 895512 1159856 1213382 1328940 1546113 990800 1396942 1391349
6261 1391349 1565746 1847036 2087393 1607908 1589748 1983321 1117264 573974 773949 793456
6251 793456 1183056 1323854 1118721 1713328 1830105 1402575 1506896 1473297 1444434 1599148
6241 1599148 699324 986241 1721679 1699183 1569840 786421 684626 966358 1646155 1106695
6231 1106695 777441 1064529 1619808 972499 1721045 1746395 972407 1377287 1259948 1322574
6221 1322574 1575850 1934577 2069623 2142952 1822349 1168871 856839 1737278 1531398 379125
6211 379125 381178 760991 762969 1324466 1290907 1768894 1194360 1443357 1680792 1562684 1786660
6200 1786660 1020455 1429367 1168835 1072313 1109291 1358063 1851870 1292334 945389 1037474
6190 1037474 1278842 1256348 800552 1131835 764147 72729 847862 1716794 1634129 1306039
6180 1306039 835724 434111 934107 453039 952720 833649 772297 874811 925782 997956
6170 997956 1197255 1339743 1096906 660768 502129 832628 1182946 1263787 1328161 886822
6160 886822 255594 44357 123661 1164465 1395995 983430 679256 1804526 2150115 1371949
6150 1371949 1430301 866478 587729 541470 1058896 1026671 567341 5525 -207705 -353061
6140 -353061 -366385 511544 1130323 1515105 546274 -245950 47101 345221 702602 939901
6130 939901 1091343 864318 734812 287507 850032 910556 307372 134696 -123680 358217
6120 358217 672402 375849 1297372 933829 738029 748183 331971 379408 731631 757292
6110 757292 1105027 965840 1122943 764115 626423 669677 594841 1147554 634819 -81263
6100 -81263 -228932 335940 142135 -213096 -212545 486041 37311 396057 33974 478999
6090 478999 114025 25597 58862 234140 362434 963000 561502 612344 977341 932798
6080 932798 542428 244644 677098 -426441 -420576 291773 74832 -615085 -120398 439387
6070 439387 746286 432082 -45455 577031 -309158 -478548 -837597 -548265 -1144906 -1403276
6060 -1403276 -1547729 -837019 247154 -269236 -713327 -769720 -93086 -514230 -1538810
6051 -1538810 -1595931 -940470 -86238 -405688 -999379 281914 89309 -69884 226293 397652
6041 397652 284311 -367876 -739003 -1315900 -1696435 -527256 -506314 -650912 136475 -91607
6031 -91607 -333108 -37972 -246426 -330391 -27822 301538 -242665 -1240601 -1308966 -1510045
6021 -1510045 -587897 -391641 343535 251357 -737850 -257882 -532380 -1122038 -1112369 -588276
6011 -588276 -561660 -656995 -770709 -758863 -194265 -307016 -949155 -325883 48432 129917
6001 129917 -352356 155328 -813340 -846396 -72875 -681666 -897878 -476862 -498093 -966478
5991 -966478 316656 693309 558144 890433 141815 -510210 -796268 -895313 -1099155 -550376
5981 -550376 -1100163 -693481 -297367 -78950 -534413 -727461 -380845 -312001 -210757 -43050
5971 -43050 621826 357787 -470362 264986 222296 -342421 -116433 -71619 -227710 -230409 -1333204
5960 -1333204 -1392704 -269943 -628951 -846046 -830214 -920350 -851021 -573770 -570881 -1237086
5950 -1237086 -1018314 84514 122251 -5782 -99029 -418461 -484923 -627744 -415392 27738
5940 27738 48322 571250 104314 -101250 -76753 94533 -326601 -500185 -803332 -898896
5930 -898896 -662602 -163463 199265 -658847 -1703138 -1265058 71463 328437 -814182
5921 -814182 -789659 -482412 -548677 -359661 -90425 -620894 -1164014 -773858 -625734 -926396
5911 -926396 -753418 -155253 -214573 117701 897580 -412987 -260241 -56446 -835513 -976216
5901 -976216 -705101 -117126 -57888 -218261 -70306 313915 -1063829 -1055787 -1397396 -1828654
5891 -1828654 -1247455 -1008400 -927533 -465058 -260994 -802860 -1115667 -495311 -898009 -1373424
5881 -1373424 -899071 -27752 -559803 -837009 410577 -483865 -389258 -1113442 -1092401 -733890
5871 -733890 -368709 -81405 -344183 -417659 -753535 -609206 -254337 -793420 -627985 -632098
5861 -632098 -803798 -1258576 -782836 45676 -544501 -171129 388013 84091 -309007 -685572
5851 -685572 -458085 -1043372 -536034 -76417 -820620 -834040 -787035 -274556 -942507 -666403
5841 -666403 79848 -186153 277880 532968 47064 -35259 -15057 122516 5572 -927
5831 -927 -647489 -1157338 -1311391 -650076 -811687 -657501 -1016459 -1557545 -744601 -376831
5821 -376831 -959295 -1093787 -320479 -182500 327912 150106 -68479 553894 342029 -93308
5811 -93308 -466279 22 770802 765785 715132 441935 -149181 256102 -159890 -558458
5801 -558458 -272374 385240 -97244 -880106 -475397 -343834 537606 31999 -706945 -509214
5791 -509214 -16247 -927130 -978407 -325378 -474429 11931 -77990 -263503 -34569 -298661
5781 -298661 -412357 194170 -65632 -734658 -263436 -49733 -936100 -179546 266922 94751
5771 94751 248203 105542 716984 853464 -159792 442395 568270 -43935 -232163 -352330
5761 -352330 -109465 -257667 -606929 -248883 -60221 -198862 -199244 -451729 -559293 541914
5751 541914 809962 1197447 554316 619097 517745 1197908 663594 -992447 -844772 823181
5741 823181 1049930 150862 -59327 -110116 538950 -217692 -497849 359400 271505 192333
5731 192333 442880 -44198 -300862 66315 -238045 -353136 -314154 -87850 -110328 100008
5721 100008 1135355 340530 130263 409908 614066 493149 1322192 1132901 510992 424242
5711 424242 211083 49026 19644 768694 951628 985794 1135745 699710 577697 817373
5701 817373 572011 47107 236610 961561 1139128 459090 304295 666064 952359 636447
5691 636447 1149320 845392 1153416 1174271 904382 1043624 880215 945239 967351 869396
5681 869396 1114337 222502 818743 511588 243496 396914 904605 749215 574049 960097
5671 960097 1828332 1727917 1197344 1092193 1536095 1721525 1540471 799400 1075353 310934
5661 310934 24830 1331471 1215520 1758415 2078689 1590514 1113234 743452 724062 637233
5651 637233 989147 124237 234122 1155948 1468213 1059788 1074043 365819 28902 808699
5641 808699 1247165 896784 -190335 647475 646457 1046937 597161 -59634 539414 585969
5631 585969 185532 831412 715358 1712276 1622957 1799638 1133190 1560936 1318311 1469770
5621 1469770 981909 1762907 1824909 2064764 1965336 1426951 1593650 1050670 836812 928636
5611 928636 1351065 1801548 1771479 2782692 2976565 1558174 1336418 1375090 1683340 1534805
5601 1534805 1440004 2272445 1734674 1091976 1533165 1413772 1283726 1744315 1842553 1508068
5591 1508068 563948 514244 739577 1036413 832316 1440959 2023868 2052878 2212080 2264818
5581 2264818 2318674 2702030 2903471 2782620 2406616 1975187 1571821 1993486 2852576 2205160
5571 2205160 1978749 1855358 1853671 866878 679439 466344 890946 1780479 2635831 2701881
5561 2701881 2143103 1922361 1330426 1291621 2059358 1531936 857301 1273685 1534703 1176469
5551 1176469 926264 1434964 806661 631960 1241479 1751627 2023820 2101698 2148873 2188183
5541 2188183 2260860 2091596 1566035 1147024 1930582 2026832 2398950 1931753 1741986 2032535
5531 2032535 2460107 2740269 2933910 1969773 770125 1258302 1833010 1653871 1857864
5522 1857864 1833271 1911764 1905857 2351673 2954567 2938032 2011938 2270390 2239487 3093405 1970790
5511 1970790 2138267 2919875 2194589 2031037 2339115 1889457 2169508 2417029 1894200 1656694
5501 1656694 2066085 1593986 1751380 2579598 1608976 2071450 2315446 2305117 2564440 3115866
5491 3115866 2455208 2657341 3280994 2874530 3412596 3510707 3054825 4387858 4707415 4160072
5481 4160072 2874483 3265755 3235946 2772800 2891842 3128844 2400762 2263101 2751731 3835056
5471 3835056 4279979 3691390 3123465 3182371 3115880 4207136 4142828 3243094 3189020 3320901
5461 3320901 3088109 2752299 3311587 3857340 4054613 3987175 4002170 3100630 3111955 3422324
5451 3422324 3314821 3510922 3432248 2798717 3151432 3336857 3095021 3412056 3963241 3478183
5441 3478183 4249627 4423972 4448842 3577049 3411193 4013293 3457130 3338330 3497579 4062499
5431 4062499 4007487 4310908 4303549 4096942 4071314 4194097 4509101 4531714 5262645 5069750
5421 5069750 4884616 4731578 4222920 3540484 4000466 3975543 4079750 4744887 4867372 4831901
5411 4831901 4109841 3334628 3937001 4236375 4570023 5084561 4262984 4546525 4619551 4455763
5401 4455763 5074642 5287629 4996327 5016148 5273038 5298477 5309928 5278235 4578507 4018797
5391 4018797 4361114 5151867 5574143 5781939 4369709 4222401 5075861 4799608 4930686
5382 4930686 5045383 4592044 4620605 4552290 4618995 5575111 6705442 6034196 5706847 4973668
5372 4973668 5384704 5288427 5475477 5469115 5499719 4884210 5386838 5918793 5173830 4888605
5362 4888605 4855128 5588895 5748589 5517430 6305181 6417974 6119165 5467525 5624502 5570258
5352 5570258 5870794 5814667 5366443 5716404 5894345 5856489 5300643 5776471 5885964 5856742
5342 5856742 6227453 6146858 6036717 6497195 6554630 6647003 6040776 6791644 6255944 6165322
5332 6165322 6479489 6981049 8060334 7364454 7260136 7652265 6149299 6012011 6246580
5323 6246580 6291077 5966725 7002924 6699680 6094365 6378708 6631995 6042006 6053058 6203869
5313 6203869 6969329 7280676 6984060 7293039 6532805 6746168 6741484 6620805 7795344 7933787
5303 7933787 7833903 7214608 6898088 7269866 7299625 7761051 7215146 7543228 6851978 6396005
5293 6396005 6992119 6966427 6743492 7287177 7543853 7399349 6788567 7296919 7166431 7584686
5283 7584686 7794840 8054582 8003155 7511157 7560417 7545741 6909157 7281486 7974311 8417274
5273 8417274 7740362 7931459 8652063 7938773 7828116 8132625 7861592 7083339 7559371 8243924
5263 8243924 8620123 7931758 7836546 7533817 7700714 7937623 7732799 8396636 8778545 7989983
5253 7989983 7832104 8783090 9190295 8068283 7492750 7625214 8358311 8544915 8524881 8267388
5243 8267388 8945695 9190499 9524655 9405817 8892933 8723099 8005400 8198145 8500367 8125576
5233 8125576 9878585 9604414 9297978 9599304 9155515 9450966 10398329 10086980 9868261
5224 9868261 10067834 10286808 10649909 11491551 10963838 9935566 10413246 10431709 10278238 10174859
5214 10174859 10198265 10035638 10097809 9144825 9169827 9445849 9379127 9545825 10377156 10532087
5204 10532087 9724919 9419930 9557260 9675558 10135810 9294010 8957960 8993371 8570267 8269250
5194 8269250 8447477 9252018 9331378 9645400 9336579 9160318 8640101 8311086 8920100 9226307
5184 9226307 9643645 9683947 9184596 8832886 9580968 9825365 9527226 9503792 9744745 9233640
5174 9233640 9188673 9330572 9082632 8095694 8662062 8579648 8933122 8747745 9559732 8908726
5164 8908726 8654328 8867943 7887782 8342535 8896269 9106492 9300877 9041543 9708635 10038048
5154 10038048 9724202 9020240 9352975 9626618 9621361 9565063 9196246 8798865 9157944 9314634
5144 9314634 8900874 8895838 8890300 8919456 8459882 8049968 7757409 8547806 9029820 8871327
5134 8871327 8345532 8439636 8592847 8691950 8649907 8761230 9684908 9750435 8557406 8324142
5124 8324142 9039598 9031058 9096810 9206750 9733019 9647181 8947577 8982975 9509919 9064753
5114 9064753 8843290 9208216 8822382 8869569 8806230 8649284 9421004 9307053 9705501 9254294
5104 9254294 8448733 8543208 8850011 9254739 8879589 9031965 8818630 9062798 8205975 9034551
5094 9034551 9298512 9543500 9623944 9181019 8546658 8720945 9170904 9022176 8200167 8716399
5084 8716399 9735259 9819707 9028731 8987954 8580255 8320125 8562710 9529758 9377877 9076922
5074 9076922 8945562 9401919 9828713 10000289 8790691 8714609 9666831 9701914 9381966 9424124
5064 9424124 9654583 9552956 9857006 8994817 9155725 9041637 8617537 8924560 8735397 8423870
5054 8423870 8383123 9336108 9671409 8942464 8099342 8763756 9188726 9180576 8154658 8879590
5044 8879590 10155210 10101589 10078083 9751407 9980335 10539801 9964155 9907008 9877346 9536388
5034 9536388 9442950 9264402 9796046 9830681 10741432 9536451 9767749 10162171 10267473 9948354
5024 9948354 9500536 9325147 9816037 10170755 10400332 10214107 10623242 10566896 10875249 10880943
5014 10880943 11290540 11440164 11164716 11129977 10303993 10266242 10976045 10948552 10801844 10621694
5004 10621694 10710024 11257406 11855853 11731915 10761835 11986932 12203663 11933324 11994822 11601943
4994 11601943 11457742 11254536 11931589 12254608 12268356 12324700 13002352 13076591 13559026 12828081
4984 12828081 12958094 13384440 13090091 13468779 13526569 14736986 15028607 15012685 14584421 14489727
4974 14489727 15390192 15602776 14672829 15407564 16036193 15194244 15307961 16040279 16179756
4965 16179756 15490779 15923444 15759662 15898213 16049971 16563469 16128370 15247484 15070124
4956 15070124 15367942 14996719 14561662 13363918 13491388 14009420 13792496 14183545 14522322
4947 14522322 15294030 15141706 14220795 13634844 13685676 13684602 14232316 13472452 13427472 14220564
4937 14220564 14356467 13298860 13084488 12715336 12430103 12096210 12306768 12236140 12442414
4928 12442414 12740558 12461875 12640990 12246588 11557345 11817933 11998094 12448499 12151325
4919 12151325 12447839 12169500 11755340 12026622 12300780 11883508 11221880 10920361 11278549
4910 11278549 12483767 12830297 12667104 12375229 11874009 11448685 11231658 11650540 12462520
4901 12462520 11773802 12112413 12006379 11995044 11915293 12931088 12395238 12478448 12752077 12352864
4891 12352864 12284086 12034354 12067210 11568197 10886062 10692426 11927732 11405902 11026529 11018883
4881 11018883 11485943 11859887 11588730 11820528 12059025 11847896 11576679 11278767 11147674
4872 11147674 11720024 10716295 10766515 11235745 11874049 12738182 12714841 13463314 13270644 13004499
4862 13004499 13110707 12654556 12721943 12846380 13081124 13296905 13380624 13679914 13187849 13591129
4852 13591129 13471289 13257160 13200096 13339310 13536055 13646463 14278012 13847338 13725900 14195916
4842 14195916 14754265 15387589 14777862 14982695 15335831 15074075 14552502 14685404 14859874
4833 14859874 14621114 14503369 14411419 14608255 15015606 15266447 15796468 15784695 15306465 15997449
4823 15997449 16464038 15544052 15106361 15650745 16670101 17361585 16962556 17038382 17558117
4814 17558117 17608134 17531599 17168946 17337110 16991477 16429825 17311076 17814362 17849541 17363321
4804 17363321 17316608 17785793 17500197 17291834 17971043 18616360 19289475 19354862 18826287 19165162
4794 19165162 18802365 18043094 17806799 17548631 18065809 18312161 18348376 18307647 17974979 18516985
4784 18516985 18574478 18103354 17896412 18600333 19069400 19415286 19310597 19186899 19575662 18863742
4774 18863742 18718794 18624472 19460760 20349166 19160704 19005273 19160640 19912016 20442970
4765 20442970 19012755 17873188 18130880 17312150 17605903 17903210 17526203 17518865 18070526
4756 18070526 17689052 17356489 17200423 17504627 17852865 17476228 17238896 16434113 16569569
4747 16569569 16319676 17194167 17386982 17657247 17367056 16829939 16823664 16051493 16296244 16539303
4737 16539303 15554747 15767133 16123578 16467277 16029860 15547923 14960296 15769974 15695592 15704850
4727 15704850 15457217 15057846 15127069 14853558 15041276 15578166 15552225 15256646 14823546 14408332
4717 14408332 14047026 14566727 15144684 15570200 15291241 14992744 15052464 15060683 14243174 13556140
4707 13556140 15174877 14926461 14539447 14998407 14938525 14481820 14593658 14636853 14432152 14127684
4697 14127684 14471773 14542170 14232552 14799542 14750169 14938565 14153588 14204238 14085626 13605250
4687 13605250 14655888 14799473 15039834 14384002 13945839 13504525 14211493 14523345 13580984
4678 13580984 13791308 12704647 12485028 12895315 13970569 14822270 14340107 13817937 13412530
4669 13412530 14179232 14049940 13763433 13975918 14423666 13815601 13334237 13716012 14269926
4660 14269926 14652702 13874939 13646202 14970551 14828498 13819820 14659869 14691524 14567408
4651 14567408 14707651 14269722 14941630 14229991 14119420 14554560 14090115 14430753 14948680
4642 14948680 14620277 14963848 15380440 15322734 15458275 15279859 15096369 15147582 15413586 15413993
4632 15413993 15354748 15470263 15459404 15276363 15583442 15452138 15115188 14989472 14013873 15107677
4622 15107677 15793992 15396485 15416156 15770019 15982647 15095783 14481118 15178496 15528850 15697818
4612 15697818 16425404 16247550 16051399 16965855 17197924 16160159 15993871 16455814 15831069
4603 15831069 15282282 15480439 16019723 16093423 16165700 16922083 16876354 17286047 16775542 16215090
4593 16215090 16641838 16143740 16369968 16685276 16919288 16971223 17527721 17406354 16999302 18004937
4583 18004937 17920222 17523348 17621612 17870317 17926962 18393181 17987203 17997716 18225250 18088071
4573 18088071 18321375 19153110 18759399 18316663 18227711 18735588 19264488 19137783 19173541 19514121
4563 19514121 20175080 19845114 19793067 20015803 19780766 19907978 20431165 19924549 20047875 19844806
4553 19844806 19681374 20878671 20819835 20368193 19782003 19641255 20914950 20594523 20559463
4544 20559463 20504554 21100884 21412631 21334479 21864884 22409242 22972720 22281509 21996293 21996985
4534 21996985 21866449 21592843 21315161 22839911 22796391 22565929 22438845 22822943 23249436
4525 23249436 23509770 23419319 23641130 23485916 24293589 25017056 24714939 24362592 23579162 23740132
4515 23740132 24081416 24547845 24857556 24787631 24851531 25752964 26143863 26777654 26358927 26215343
4505 26215343 25623279 26702848 26851856 26449380 26980566 26860876 26365070 26695178 26108681
4496 26108681 26768972 27633834 27765699 28813327 29202767 28315133 27628432 28326392 28809173
4487 28809173 28004306 29268064 30022019 29869534 30245968 30627756 31709811 32385267 32521350
4478 32521350 32858316 33406261 34276972 35271643 35219047 35726745 35798061 35747145 35055920 34093492
4468 34093492 33799702 33774681 33744928 33812646 33586324 33710235 33494064 33599587 32985266 32543257
4458 32543257 33926472 33933382 34194417 34682335 34770032 34932507 35098303 35033720 35605887 35183834
4448 35183834 34833651 35360352 36115557 36242530 36147358 35022204 36025562 36220129 36735243
4439 36735243 36915393 36667753 36527070 36911576 36945449 37055397 37661892 39045772 40037941
4430 40037941 38814571 38715216 39234855 39030542 39364517 40251857 39778515 40161628 40131508 41208758
4420 41208758 41722381 41115265 40556918 41112338 41654596 42076325 41515636 42257260 42373627
4411 42373627 42674072 42559851 43659903 44358490 44236952 43852227 43506717 43787285 43645496
4402 43645496 44389262 44766063 44448402 44192925 44607129 45785500 45850882 45378703 45427626 45455133
4392 45455133 45713951 46498930 46837014 46559857 45913004 47018563 47966143 48750252 49635093
4383 49635093 50288256 49875979 49754802 49615336 49148492 49408283 49518809 49596180 50195129 50431087
4373 50431087 50597914 51145018 52026896 51679178 52133590 51945870 52854514 53559695 53383151
4364 53383151 54151984 53774034 53817190 54096938 54218970 55087911 55367679 55662940 56183730 55471387
4354 55471387 56190785 55768139 55830556 56787493 57321899 57801886 58424757 58436389 59042043 58954003
4344 58954003 59084174 59046387 59668629 60522547 60583587 60804291 60842083 60940517 61560380 62056183
4334 62056183 62429303 62563655 62912614 64274967 64546397 64319955 64810211 65067621 65438592
4325 65438592 65857606 66413316 66663416 67213248 68186080 67570303 68744069 68276535 67315211
4316 67315211 67918382 68259918 67923938 67267622 66843945 66776808 67317886 67910818 68327058 67587862
4306 67587862 67009710 66966406 66500443 65518972 66048329 66166948 66653747 67222897 66437301 67107476
4296 67107476 67573010 67481772 67429273 65629021 66264955 66037318 64573007 64032953 63463521
4287 63463521 63182720 63140814 63481824 64126938 63459236 62726234 62213224 61932591 61399988 61675581
4277 61675581 61100897 61089483 61440683 60910223 60359232 61250410 60289725 60742448 61651047 61197628
4267 61197628 61317381 61359026 61745336 62118208 61921897 61865827 62913729 63074325 62484937 62303763
4257 62303763 62286657 62886218 63181948 62646632 62983615 63196647 63907881 63939168 63846823 63364418
4247 63364418 62494265 62142000 61406692 61150045 61169827 60856782 60692848 60800127 60880608 60566971
4237 60566971 60245388 60736084 61011828 59476274 59563457 60402063 60792197 60012059 59675797
4228 59675797 60341539 60748770 61800127 60828742 60943941 60571233 60230009 60915246 61277019
4219 61277019 60836788 60596040 61407731 61422202 61681751 61535084 61493257 61128245 61192584 62149823
4209 62149823 62019812 62194103 62160304 61615286 62465282 62503638 63106830 62397924 62865331 63595780
4199 63595780 63487973 62972000 63285819 64092303 64789574 65034416 65406463 64981770 65087477
4190 65087477 65765960 66273762 66043026 65399684 65583439 66278158 66857327 67448591 67026833
4181 67026833 67461910 67734076 68005070 68913426 69232744 69128807 69391068 70156889 70797753
4172 70797753 71124282 71569628 71391699 72509814 72978655 72529989 73105615 73730297 74139264
4163 74139264 74364135 74519983 74699997 75354394 76288326 76354751 76426197 78030257 78747858 78484306
4153 78484306 79051017 80342788 80522423 80609100 81051723 81647041 82692676 82942234 83289008
4144 83289008 83914230 83861846 84230973 84891871 85933082 86730838 87371424 87787220 88138511
4135 88138511 88689503 89119266 89902727 91463553 91535814 91886650 92721829 95080025 96356185
4126 96356185 96914711 98204478 98677831 98879098 99770153 100940128 101599260 102292373 102726746
4117 102726746 103686719 105512926 107355874 108384639 109383785 110517866 111220695 112010442 112985203
4108 112985203 114798350 115805306 116446622 116824580 118884795 121315945 122653107 124228310
4100 124228310 125730126 126690485 128369633 129777880 130853284 132223010 133524831 134715660
4092 134715660 135430808 136055843 136332612 137241726 138483164 139807779 140636771 141343886 142428122
4083 142428122 143252988 143906001 144812389 146989246 147892911 148845793 149376400 150458920 152002408
4074 152002408 152900272 154316867 156108707 157947555 158488688 158576922 159887157 161451600 162396596
4065 162396596 163311617 164546796 165132860 165513179 166712376 166867990 167847248 168917259 169528905
4056 169528905 168675473 168831555 169569233 170497598 170854794 170494642 171077914 170899878 171258070
4047 171258070 171286004 170908882 170518266 171448477 171964163 171500995 170981436 170820025 170460893
4038 170460893 169951660 169782519 169923957 168980513 168900342 168014997 167431627 167609760 165997074
4029 165997074 165063109 164508680 164184301 163489936 162930161 161979067 161400158 160299425 159209449
4020 159209449 158833896 157460686 155832265 155725157 154758463 153811933 152957067 151293048 150352680
4011 150352680 149490821 148557924 148530366 148304501 146996061 145768073 145286020 144459271 143423449
4002 143423449 143138110 142707173 142507633 142565227 141036221 139670670 138937765 138520459 138170307
3993 138170307 137137306 136497797 135990251 136150644 135841266 134688865 134581254 134462626 133393663
3984 133393663 132766922 133429657 133609988 132017635 132253382 132385591 131931631 132317742 131100120
3975 131100120 131237426 131562351 130376904 129502372 129735940 129337951 128782998 127551257 127607126
3966 127607126 128170391 127323379 127444034 126600869 126024671 126726361 127207459 127091802 126987644
3957 126987644 126389383 125573731 125635987 126285776 126494350 125194363 124664431 125490922 126395088
3948 126395088 125747445 126256142 125745766 124778564 124480808 123602735 124233406 124014367 123468572
3939 123468572 123114518 121905556 120835694 121538289 121554310 120852829 119653725 118990814 118287061
3930 118287061 117663712 117165245 116320842 115606424 115243067 114323152 113433729 112358977 111628911
3921 111628911 111413310 110813667 109913543 108227446 107190029 106643722 105809551 104455731 104273180
3912 104273180 102166250 101455911 101015770 99907634 98869864 98281552 97016410 96773994 96388267
3903 96388267 94858080 92548325 92171930 91695080 90217436 89623241 89135919 89291438 88695165
3894 88695165 87680666 86280131 85036643 84484603 84127395 82817665 82056160 80894814 80607308
3885 80607308 80252031 79024476 78634640 78489513 77726705 77546931 76786932 76505010 75683629
3876 75683629 74855684 74418276 73144625 71711473 71119858 70479731 69870439 69192416 69150938
3867 69150938 68891491 69278297 68337918 67545482 66660365 66539307 65867634 64713685 65283476
3858 65283476 65841573 65302573 64206439 64157308 64077398 63216560 63390614 63305354 62518536 62322777
3848 62322777 61231046 61027375 60744982 59718514 59436938 59667023 59955302 60484665 59715942
3839 59715942 58450436 58072806 57879098 57478713 56537034 55834532 56566711 56925990 56610546
3830 56610546 56797242 55693348 54395289 54567722 54356461 54732053 55360912 54931621 54300000
3821 54300000 53310063 53469060 53642291 53481768 53301977 53934717 53681890 53118923 53967905
3812 53967905 53949266 53192130 53072134 53083334 52618254 53115101 53422263 53053277 52710588 51777669
3802 51777669 51429592 52555773 52125559 51788563 52060429 51862294 51587915 51668025 51496294
3793 51496294 51362317 52496972 52363277 52011675 51838694 51460559 52106064 52077320 52236958
3784 52236958 52286841 52429999 51974611 52351490 52478773 52429726 53325183 53506051 53559934 53970442
3774 53970442 53576335 53597103 53643414 54243563 53633021 53356445 54088618 54279563 55289652 55115517
3764 55115517 55803095 55294087 54937772 55329564 55569382 56614857 56266958 55947725 55897382
3755 55897382 56383504 56760069 57492432 57246425 57373423 57669850 57216003 57492231 58715924
3746 58715924 59384226 59774966 60499036 60739853 61175050 60924256 60980094 62183535 62114177 61797639
3736 61797639 63683011 64148653 64368869 65125325 64532516 64268679 65871220 66807449 67481443
3727 67481443 67483331 67908278 67450361 68568329 69616875 70432431 71850277 72539756 72558760
3718 72558760 72672326 73504475 74563295 74767466 75681899 76436299 77484431 78800178 79182208
3709 79182208 80077143 81422610 82831656 83740980 85482335 87530855 88045118 88101791 88616792
3700 88616792 89873070 91226241 92520634 93975825 94581851 95456380 97221362 99041330
3692 99041330 99925948 101224000 103520985 104676063 105166975 107203827 108367159 110111956
3684 110111956 111950701 113721986 114818157 116446582 117365853 119251586 120435163 122183644
3676 122183644 124512008 126484381 128446219 130130873 131699981 133701807 135086932 136589184
3668 136589184 138849288 140408031 143031310 144853434 147473700 149876316 152267135 154299250
3660 154299250 156107459 157731779 159550701 162142049 163833392 166423846 168608918 170025373
3652 170025373 171803545 174235468 176438761 178874339 180317025 182548568 184659900 187054855
3644 187054855 189338843 191976405 193806167 195266210 196535987 198317743 199407720 201218155
3636 201218155 203125458 204499767 205730847 207418467 209158492 209127560 210085038 211378031
3628 211378031 212113040 211699206 212210132 213270375 213715687 214342001 214613571 214512708 213834876
3619 213834876 212634447 211516023 210863706 209859646 208710377 207327897 205141043 203829165
3611 203829165 201172927 198787231 197305348 195340732 191569225 188088274 186212795 184626481
3603 184626481 181696808 178592570 175941128 174040794 170841010 167554870 164705014 161143358
3595 161143358 157283396 155620774 153241462 150030698 147069387 144863066 141935380 139853247
3587 139853247 137143708 134930593 132036141 129060925 126265195 124196923 122527653 120592339
3579 120592339 118038158 116013281 113908634 111578268 109545270 108438717 106597717 104276799
3571 104276799 102941057 101745443 99665195 97834899 96316137 94697044 93108491 91786464
3563 91786464 91056975 89122856 87878659 86803059 85401881 83853538 82885013 81787953
3555 81787953 80586171 79515006 78827180 77386215 75868888 75126601 73476285 72619492 71804419
3546 71804419 71252377 70522676 69759828 68104813 67061015 67597815 66647375 65506689 63799696
3537 63799696 63470574 62912125 62190566 61665214 61414362 61338147 59672395 58336042 57721065
3528 57721065 58095084 57298432 55671639 55244002 54644982 54679219 53611781 53671460 53095678
3519 53095678 52509361 51974732 51070829 51260300 51338862 49768737 48957733 48173843 47986707
3510 47986707 47303866 47408196 47253973 47407550 46403698 46048638 45331270 45650046 45085340
3501 45085340 44451435 44348482 44830585 44739808 43788747 43820014 43874022 44217174 44275857 43199288
3491 43199288 42802606 42718971 42419241 42895971 43435031 42675254 42208051 41641382 41328412 41090494
3481 41090494 40987361 40546583 40416996 41106153 40980586 40520991 40101675 40807618 39934585
3472 39934585 40124051 39962470 40233837 40720413 40506117 40104990 40524583 39476522 39070794
3463 39070794 38967209 38915056 38512756 38341968 38759586 39128738 38141723 38183360 39190029 38287583
3453 38287583 37740805 36882301 37433037 38212514 37467869 37285562 36812640 36629905 36513589
3444 36513589 36039134 36141868 36944452 36986385 36125787 36790070 36658978 36218284 36361419 36097019
3434 36097019 36049839 35784290 35873906 35859459 35446071 35384617 34960709 35194310 34544400 34485940
3424 34485940 34204403 33535590 33552835 33139450 32985605 32331743 32924631 33280342 33528426 32654083
3414 32654083 32934140 32651343 32935323 32279395 32315001 31892017 31381256 31251175 31612834 31346384
3404 31346384 31223272 30999461 30887664 30971102 31079022 30801507 29862178 29638245 29454305 29597711
3394 29597711 28966956 28382272 28861327 29162569 28853427 28354076 28169359 27940330 27777062
3385 27777062 27255165 27568699 28465528 28040422 27612957 26642427 26816401 25630016 25553179
3376 25553179 25122048 25137749 25871282 24757795 24384044 24604955 23618545 24587398 24948932
3367 24948932 24482691 25033923 24257664 23091754 23486460 23432111 23596731 23524291 22613985 22399523
3357 22399523 21737562 20490344 20370952 21259765 21848194 21610588 21305351 21222728 21353368
3348 21353368 21676130 21019790 21229619 21131202 20675364 20870576 21040023 21030004 20863479 21553319
3338 21553319 20228184 20013079 19587363 19095443 18935651 17898019 18147485 18515490 18112368
3329 18112368 18616777 18676394 18688987 18600322 17854007 17139547 16999992 16902613 17052870 17892204
3319 17892204 17818204 17456852 16771051 16849856 16064140 15767129 16161648 15545110 15255493 15181034
3309 15181034 15665930 15961984 16498008 16529785 15299183 15207423 15182743 15463430 14834747 14422989
3299 14422989 14940868 15327802 14359849 14147992 14323379 14250834 13877155 14591573 15310048 14683468
3289 14683468 14394423 14754791 15150282 14436448 13916509 14163608 14727945 14367464 14913723
3280 14913723 15903772 15193832 14381189 14686614 13688448 13252288 13927287 13831358 13803522 13895727
3270 13895727 14168187 14414932 14493569 14057916 14842193 14828032 14580308 14639545 13784739 14146580
3260 14146580 14465726 14120107 13271892 13068951 13670596 12994544 13578431 13498910 14143854 13839378
3250 13839378 13956090 14146174 14403107 14169629 14305960 14407651 14575155 16019167 15586521
3241 15586521 15354112 15045286 14892904 15086374 16106018 15739748 15401043 15916087 15906165 16068441
3231 16068441 16547935 16602864 16800145 16487842 17180432 17502988 16465051 16283826 15549736
3222 15549736 14671741 14656660 13450033 13604771 13282381 13926369 13619326 13390683 12703267
3213 12703267 12422473 12323786 11829325 11792807 12363365 12360526 11725095 10932560 10981793 11196207
3203 11196207 10886388 10756528 10900027 11395670 11309165 11386001 11397152 11249534 11246711 11093271
3193 11093271 10795646 10691533 10797807 10632455 9975291 9946388 9742821 11003261 11084414 10325946
3183 10325946 11113189 11307189 10508715 10228956 10061927 9166753 9476425 9682948 9465703
3174 9465703 9602118 9929909 9713345 9162341 8893131 8720121 8404909 9006284 9762394 9708387
3164 9708387 9354014 8277569 8359632 8864045 8146716 8738971 9177810 8834453 9659219 8976094
3154 8976094 9182070 9050372 8597932 8254885 8192036 8429120 8613934 8459682 8414209 7851529
3144 7851529 7623334 8230143 7951761 7796213 8871841 8707432 8042085 7648833 8147087
3135 8147087 7817982 7598586 6725952 6809147 7456532 7700875 8082809 8246785 8086823 7562987
3125 7562987 7553396 7403432 7660712 7214297 7618569 8108642 8114809 8340317 8148502 8144161 7245548
3114 7245548 7364026 6955350 7353756 7410069 6661814 6088946 6091775 6130629 6143640 6233352 6479014
3103 6479014 5892693 5643302 5727859 5430620 5500913 5659492 5364235 6467065 6587377 6896956
3093 6896956 7175975 6603597 6520910 6003661 6500152 6238517 6534366 5701474 6019591 5403883
3083 5403883 5804920 6287592 6215906 6492984 6419998 5943671 6312767 6459796 5530617 4918795
3073 4918795 5495059 5863419 5407508 5411863 5069341 5485397 6125989 5606061 4809696 5671570
3063 5671570 5973605 6410605 6600132 5755321 5448305 5059285 5207597 5005541 5278503 4996843
3053 4996843 5128087 4870755 5360932 5307266 5640723 5381802 5267058 4800607 5319087 4972727
3043 4972727 5075952 5778541 5721642 6325341 5494082 5640858 5821537 5616900 4859012 5126427
3033 5126427 5084494 4960142 5649882 5859424 5752356 6046374 5332382 5419447 5550597 5663589
3023 5663589 6579809 6280004 6325271 5050252 4801536 5104381 4369155 3735362 4565001 4624673
3013 4624673 4111375 4438425 4236334 3786827 4189185 5137233 4618855 4043222 3709155 4050785
3003 4050785 4110733 4001857 3400771 3288600 3825693 3357553 2873378 3681344 3293347 2294229
2993 2294229 3254048 3950385 4605728 4193585 3683109 2960340 3070225 3401573 3264628 2935640
2983 2935640 3435779 3574477 2889033 4014567 3738274 4009954 3628385 3622611 4422620 3424115
2973 3424115 3064972 3897755 3812418 3426042 2778812 2143429 2710308 2732997 2842703 2971244
2963 2971244 2607959 2395770 2864509 3200517 3439852 3702946 3162741 3268304 2999463 3306645
2953 3306645 2896268 2728808 3055346 2829432 2614627 2483396 2799704 3157964 3114823 2787377
2943 2787377 2950401 3262674 3630800 2873436 1982629 2080100 2743119 2912946 2535941 2908092
2933 2908092 3251185 3396802 3083557 2194021 2018457 2743681 3011931 3338944 2908681 3210906
2923 3210906 3234644 3153970 2795306 2410324 2562155 2736796 2474457 2674672 2097175 1985937
2913 1985937 2359423 2562505 2655791 2960404 3400537 2822164 2038262 1740127 1868836 2160932
2903 2160932 2384415 2017370 2332464 2354548 3133907 2551816 2391934 2162579 1324736 1367953
2893 1367953 1662276 2231022 2423847 2483168 2819368 2966830 2054181 1534404 1705880 1430648
2883 1430648 2154882 2258469 2070070 2317802 2447323 2224238 2004456 2635278 2376306 2280905
2873 2280905 1238023 1499505 1777771 2153831 2815699 2327932 1916519 1954566 1886530 2566500
2863 2566500 1670953 1545237 1953135 1687371 1493604 1601556 2109002 1584242 2630058
2854 2630058 3313567 1865745 1277050 1289044 1795781 1797453 1208821 1558044 1184567 1665211
2844 1665211 1611894 2419817 1551001 730547 1126975 2220383 2958277 2335360 1635747 1445875
2834 1445875 1868826 1342535 1544501 1520753 1026993 1403224 934374 1184824 1640104 1596132
2824 1596132 958161 538139 487371 583564 656826 985339 1382683 1034148 1559217 1343831
2814 1343831 1574288 1823423 1462433 1068126 723073 702582 976271 301420 -178462 -217948
2804 -217948 824439 1760992 940206 891522 1167764 1352518 885624 779955 -145162 -50282
2794 -50282 -227411 -235844 -468170 -259631 419093 302241 -121511 -494007 378787 467707
2784 467707 184404 487074 839060 964322 -39433 -259600 -68543 -432795 -726015 -766184
2774 -766184 -966082 -266090 29304 -64937 -408534 -436249 -166567 -453234 -519253 139823
2764 139823 185778 170733 -322964 183652 178039 1061385 854066 198681 385678 -74518
2754 -74518 159089 -435290 -308707 -571833 -179211 718937 726114 98614 -1214200 -1341922
2744 -1341922 -1123717 14903 142898 77569 84568 -162613 322823 376865 1768436 881629
2734 881629 294859 -19059 -67099 -517823 348158 454113 103930 -54456 425799 304414
2724 304414 682600 955991 924475 290738 -446805 314850 720849 4202 170056 692359
2714 692359 621326 24407 -68002 387996 202461 -545862 -908380 -1181014 -1166363 -1011862
2704 -1011862 -877271 -897681 -1163066 -909512 -583988 -804517 -320752 125826 -84195 -829591
2694 -829591 -836278 -243517 315452 108638 -366929 -846386 -1014265 -614481 -65716 -212272
2684 -212272 -877416 -485072 -516700 -1095834 -751298 -292635 349676 245533 -180811 382870
2674 382870 -59870 242148 -263334 -323421 -490570 -516564 -449696 -138328 25629 -562682
2664 -562682 -580364 -799193 -924825 -1283463 -1256127 -1199749 -877638 -1089156 -1368522 -1059489
2654 -1059489 -1573987 -1740689 -869243 291905 271703 109675 262258 354714 -308186 -13505
2644 -13505 -811856 -636500 405374 230516 -532533 -760685 -1151642 -658777 -640238 -1311652
2634 -1311652 -903471 -563257 30311 330405 88021 -839764 -945407 -98528 -192580 -382981
2624 -382981 440948 -123276 280889 -14558 -503540 -770397 -589328 -576489 -626346 -1083859
2614 -1083859 -851934 -655144 -1249437 -1414677 -829750 -96863 -153267 -998810 -935952 30627
2604 30627 293966 -404314 -671058 -14489 -474734 -626239 -532835 -612719 -689210 -107958
2594 -107958 -186353 -315530 -395340 -721580 -1565412 -515184 -162886 -930457 -1715745 -1726063
2584 -1726063 -1796145 -1612157 -915913 -522292 -382825 -708505 -135804 1005537 -219833
2575 -219833 -1173773 -1117478 -963653 -899998 -654901 -413541 -181584 -38361 153494 -332119
2565 -332119 -147950 -395211 -176764 -185813 -694869 324127 -542356 -716617 -596773 -92209
2555 -92209 127317 315026 595140 408585 311642 89838 37640 -577055 -839958 -1082015
2545 -1082015 -1281510 -1246429 -43434 -397249 -766433 -1167016 -632279 -34835 -394066 96545
2535 96545 168084 293171 190540 217930 -698966 -946197 -867539 -651750 -1795975 -1335081
2525 -1335081 -703225 -871937 -105043 -212840 -784855 -437241 -834834 -790223 -304795 27705
2515 27705 -369735 -896681 -1373782 -682722 541138 415141 75474 -383168 -1150560 -498108
2505 -498108 -287920 -1543610 -1418223 -1164029 -666888 -352092 81809 -460183 -1176843 -1382420
2495 -1382420 -995547 -68248 -201662 -860039 -1341337 -1256299 -1418098 -376073 -252833 -1197718
2485 -1197718 -1097574 -486954 278152 -36765 -301319 -323943 -221988 -235765 -204511 166792
2475 166792 496355 230185 -632580 -313518 -339360 -672947 -454691 -1234676 -848930 -621427
2465 -621427 -995661 -830217 162128 228096 -998205 -510652 -251868 -580116 -247180 -496752
2455 -496752 -1590443 -865602 -259235 -534123 -517984 -1073275 -1437720 -1478363 -1829283 -1337062
2445 -1337062 -1332272 -422606 127997 75074 -361047 -1121415 -880715 -49984 190812 351941
2435 351941 -623614 -480937 -468521 337379 500149 -103804 -45044 -518153 -401320 507027
2425 507027 -20966 -466180 -212961 -828292 -360083 -704045 -795417 -564385 -410879 -1096307
2415 -1096307 -880446 -875427 -1217575 -355546 -984044 -638970 -277026 -554056 -429159 -1024003
2405 -1024003 -535726 -42715 343955 228704 -441154 -763025 -1196922 -844718 -119458 -451202
2395 -451202 -603460 -477571 -591822 -13360 -196297 -1536317 -1344903 -1509107 -1031003 -84317
2385 -84317 39061 -153368 -31183 2931 195114 -362992 -214041 -797096 -1106044 -804497
2375 -804497 -538486 -158819 -517233 -491519 73685 959722 201614 -200166 -95008 83491
2365 83491 757536 220035 295375 609108 1041752 936280 329440 1064201 1420169 788586
2355 788586 1109119 158859 439424 153732 -139125 228318 746823 556948 467737 -159313
2345 -159313 -746691 -956050 -833548 -226559 -895312 -818966 -968879 -970465 -836164 -462530
2335 -462530 930356 1105672 402663 -512387 -514547 -458649 -82820 -213536 43070 222802
2325 222802 -157911 -535220 -635969 -511690 197569 233710 255386 -110495 -48467 -146803
2315 -146803 -149719 -78848 -733637 -1147321 -1001135 -334511 -677859 92690 112743 1189714
2305 1189714 553725 -385995 -1330086 -1150520 -654340 -570826 -732566 -568416 -329573 158516
2295 158516 -441736 -32038 -83068 -19708 442422 303868 -263469 -128405 358131 -44834
2285 -44834 -231175 -439269 -287177 -30228 379668 1030128 879677 504089 917187 1891059
2275 1891059 913368 -138843 -129545 145268 185547 -230383 -647604 -678045 248375 662085
2265 662085 408415 297576 139715 771940 -195993 -258561 -633 -614307 220214 1491517
2255 1491517 839258 970557 786830 561382 589608 424174 774261 561643 233339 608848
2245 608848 1689500 1617970 2120030 2030182 976186 1018486 849773 983898 1526083 757655
2235 757655 238965 808143 626632 119833 888041 742566 530383 732805 1097931 1726942
2225 1726942 2255203 1206970 1901431 2303695 1593412 1466192 1515470 1661483 1743051 1932302
2215 1932302 1677562 1588531 1231823 858687 1181902 1482387 2508421 2243880 1761333 1940064
2205 1940064 1695462 1921356 1605419 1534271 1884195 1966938 2217429 2265695 2267923 1955537
2195 1955537 1416847 1858649 1934156 1750070 2165815 3191431 3177474 2626883 3094698 2947908
2185 2947908 2856704 2355040 3004929 3426960 3966209 4067511 4914088 4739351 5166359 4757825
2175 4757825 4861054 4381381 4866683 4717654 5313913 4983509 5172509 6048282 5896989 5780198
2165 5780198 5284401 5902968 6157926 5931068 5753066 6217166 6849459 7260445 6516862 7552960
2155 7552960 7780916 7866211 8201826 8985562 8510034 7847358 7997633 9359868 9530056 9386406
2145 9386406 9712501 10151674 9846234 9547313 9789098 10172361 9903760 10530371 11080182 11842463
2135 11842463 11540946 12491416 13221315 13294051 13497305 14016575 14830789 15556508 16003357 16281549
2125 16281549 16724574 17621932 18432622 20156915 21359675 21937398 23260876 24037407 25491683
2116 25491683 25949678 27419670 28700143 30401615 31918551 33741727 35775708 37225989
2108 37225989 40252459 43660588 48138802 51707996 54869299 58676588 62320072 67022349
2100 67022349 72787460 79302569 88252688 100447521 116550876 136944536 163738293 199239862
2092 199239862 240942291 280579773 305079733 307108063 270623931 218051642 173864662
2085 173864662 141518764 117915948 99207337 85687002 73841666 64952191 57880497
2078 57880497 53341145 49300158 46672934 43163294 41602351 39039292 36306783 32718541
2070 32718541 29161529 27255345 26151265 24606795 22809796 22019560 20460525 18887715
2062 18887715 18447798 17248771 15545917 15354957 14499726 14172464 13644078 11858616 11969662
2053 11969662 11031900 9714066 9999652 9534500 9547526 9091020 8501127 8278997 8280359 8783291
2043 8783291 8618265 7689241 6951840 6327402 7235626 6987425 6652605 6267401 6702022 6186967
2033 6186967 5602185 5390062 5123634 5074150 5078480 4618916 4097941 3445082 4090135 3970074
2023 3970074 4126195 4090685 2661046 3360242 3773430 3942444 3745144 3078616 2341331 1670153
2013 1670153 1810547 2868670 2911815 2501108 1757986 1325738 1481923 1480711 1938786 1941490
2003 1941490 1577516 1834037 1528800 2469688 1908825 1734851 1408314 968944 1156257 1150005
1993 1150005 1426953 1613779 1713653 1120287 895435 804417 811798 567834 743151 743838 816982
1982 816982 1086015 1004061 1131556 798686 487621 144693 569004 797158 98105 271397
1972 271397 -100801 -469740 831493 910831 1460885 951861 -456126 -103500 -291254 517609
1962 517609 787859 908386 1389339 835979 319535 863651 719015 452459 275800 827671
1952 827671 -73589 -747485 -307862 -7198 -1076333 -1265208 -548563 -394585 189289 -202159
1942 -202159 -458210 335159 967351 -6668 1231754 367191 428419 -71507 -693282 -841980
1932 -841980 64068 328962 408846 131248 120663 76372 -558990 -252501 -181679 -531163
1922 -531163 -557527 -351669 -145948 108551 -331854 -220853 -680185 -171833 -317908 -339065
1912 -339065 -796593 -752468 -262994 -770468 -827746 -1138163 -275939 436361 -464722 -907194
1902 -907194 -511198 -881691 -1022150 -482206 -195213 -470589 -728709 -289144 -603818 -617550
1892 -617550 -729236 -1065350 -915637 -194386 -375688 -475883 -501212 -2851 -380227 -567315
1882 -567315 -722850 -48057 -262633 -296661 -671928 27409 -118612 -355044 -82742 -147563
1872 -147563 424770 587945 30541 -152428 299171 195912 -419273 -364030 -512389 -891816
1862 -891816 -1357538 -384980 -267956 -575386 -452983 -265797 572446 641950 242329 346404
1852 346404 573787 437106 458478 -864593 -1236389 -1181130 -1571424 -177926 -25720 -629919
1842 -629919 1242633 566353 1247086 752284 294483 -35741 -897019 -782288 -569703 147172
1832 147172 401624 -283985 -710391 -662999 -278354 18829 -444118 319293 -229737 -394620
1822 -394620 -524107 304646 392170 -287823 591448 396896 11935 -142165 -361374 -273519
1812 -273519 -79612 -904761 -633272 -748517 -1303281 -1083310 -1173238 -1074025 -804722 -1307390
1802 -1307390 -1986010 -1576068 -1175734 -1366957 -109789 369228 -1471993 -1647861 -1023396
1793 -1023396 -1073966 -1204986 -158402 136017 -647678 -587142 -1412023 -818789 -563968 -763339
1783 -763339 -1081525 -739379 -515378 -482454 -401601 -628901 -330935 413934 55666 215339
1773 215339 500147 299021 -57720 -503010 -1102824 -151655 -33024 -240341 -201175 -317101
1763 -317101 -629604 -426404 -100689 452068 -97753 -766556 -244944 -882993 -539328 -879346
1753 -879346 -1159519 -1567701 -826734 -486432 -457064 -421496 -592351 -623420 -708595 -193567
1743 -193567 -794077 -1235964 -1160810 -1599810 -1671882 -916080 -729747 -585122 -527041 66744
1733 66744 48871 -766949 -884687 -320521 -262257 -1113058 180255 -3013 -175635 -799869
1723 -799869 -585353 -791683 -928642 -576400 -625622 -1331550 -1166691 -114510 -607701 -1129571
1713 -1129571 -1437321 -692204 -346320 -758614 -1057912 -1291085 -259860 -311987 -705494 -439732
1703 -439732 -967961 -589191 -607880 -955309 -443191 -3201 -351870 -632550 -147833 183693
1693 183693 -757405 -197444 33253 -89781 -822847 -1272034 -466141 -290085 -112255 -175249
1683 -175249 -568743 -841700 -265058 475168 335533 -554229 -969809 -500796 -407987 -818820
1673 -818820 -187822 -86563 -267953 -164319 410794 372163 585973 98069 -445467 -433483
1663 -433483 -240717 -370090 -171531 -375290 -442355 -582092 -551018 -774332 -529525 -783828
1653 -783828 -1063120 -976278 -502126 -1013051 -956203 -113863 -161913 -65826 -752478 -592399
1643 -592399 -586613 -726190 -1037443 -1171004 -1309019 -869470 -791623 -953589 -1023371 -139947
1633 -139947 286604 -120954 -463991 -442317 -1477244 -1314179 -1035034 -1327775 -1821174 -2024643
1623 -2024643 -1543260 -1523022 -1462929 -1724656 -1385492 118185 -386772 -1276415 -1082816 -897646
1613 -897646 -940181 -1236339 -1422101 -1365697 -847336 -377657 -422689 -615288 -826684 -69760
1603 -69760 538480 235818 -432090 -96682 -735373 -838914 -881105 -976802 -670350 -883274
1593 -883274 -231627 -212190 -535477 -234769 -70328 -989339 -869270 -1068311 -398250 -399040
1583 -399040 -477689 -546049 -1295942 -708141 -203972 -158445 -72178 -191046 -164307 -308264 -584157
1572 -584157 -786040 25510 133979 -279859 -1148336 -1524413 -1569671 -1465539 -1778348 -1456047
1562 -1456047 -464951 -656746 -1027280 -305769 179437 430198 391810 -723267 -713576 -577631
1552 -577631 -978716 -954101 163218 -56417 -458093 -985858 -739373 -609307 -471012 -63895
1542 -63895 -230613 85097 265843 88678 -338012 -193220 -90710 59994 130030 -321129
1532 -321129 -302063 227710 77165 191394 195822 -357038 -658757 -420768 -86756 269818
1522 269818 167008 362020 408561 -1061026 -1639959 -1490110 -936646 -700820 -13257 126597
1512 126597 -437003 -380428 -264359 -162120 -440707 -887691 -629500 -295687 -256287 -284753
1502 -284753 -221638 -278228 -349806 -574023 -249070 -655118 -915346 -1535653 -1373616 -702803
1492 -702803 -1068688 -746446 -674588 -1004801 -365952 200777 -327644 -785192 53365 376929
1482 376929 -492263 -1092425 -1729319 -1292595 -582341 -430330 -538361 -768639 -1111113 -696065
1472 -696065 -307798 -208050 -823247 -567698 -1081615 -1021293 -853933 -952653 -432110 -481024
1462 -481024 -1012842 -1097592 -1023189 -935475 -449612 -372356 -892899 -1464813 -268519 -52319
1452 -52319 -685372 -631640 -1261409 -1122990 -229563 -313465 -67204 -878 -117702 125852
1442 125852 735453 341195 -457395 -1031899 -927209 -387776 447815 239849 285378 -88737
1432 -88737 -463366 141929 -259238 -363345 -690218 -808506 -675200 -93014 -379565 -386778
1422 -386778 -732147 40273 -131377 -65740 177204 -938370 -1055506 -854722 -407157 -471783
1412 -471783 829653 318094 217591 356730 -227731 -25931 28735 725557 771103 91773
1402 91773 87557 -317104 -499299 -248774 147305 30051 -207474 -103745 -922750 -773918
1392 -773918 -560174 -599976 -207134 -239411 -172392 -275170 -861045 -111563 -652882 -670642
1382 -670642 -542879 -705585 -932831 -837361 -1251876 -974763 -535655 88948 -183311 -245916
1372 -245916 202426 -138609 95473 185310 -116651 -259952 -133286 13962 -604351 -284383
1362 -284383 126274 106152 -33297 -411940 44950 485891 73210 1068250 565267 -231408
1352 -231408 -274814 -166303 46243 270176 430202 875718 335616 -594713 -587110 -817047
1342 -817047 -78586 -637944 -502142 -603911 -738647 -1225344 -277435 -584771 -130978 -407050
1332 -407050 -96060 55156 -261279 -91153 257087 63054 -151700 -576729 -396342 240424
1322 240424 292925 1270231 1033390 -319182 -567855 -574460 -380076 -242078 -837131 -308173
1312 -308173 587244 106345 -677181 -122534 58882 -129188 -1259 -556837 -6991 93747
1302 93747 -483886 -351043 180661 286058 87691 -104225 -940350 -1240558 -898103 -711760
1292 -711760 -28084 -25065 -406109 -487290 -361782 -147372 -153653 55957 -237846 -510085 -662594
1281 -662594 -750724 58992 277058 513485 336182 -465445 -384822 564166 403063 391168
1271 391168 383022 -177697 -1291284 -872405 -331239 90063 433782 -166295 395469 646954
1261 646954 540315 7902 -936430 -685120 -676091 -681456 -40932 -340412 -66225 173973
1251 173973 284578 393668 -163669 -1265130 -1017688 -665553 277700 211884 -483482 -883425
1241 -883425 -86035 -469534 -197401 -665351 -1317055 -1427701 -857264 -1419909 -511760 -141877
1231 -141877 -1243572 -509735 -536480 -608653 -585436 -862614 -775457 -750721 -882900 -782640
1221 -782640 -1142747 -744662 -275115 -685805 -621331 -384577 3848 88233 15048 19321 132181
1210 132181 489514 275830 -162942 -528638 -509411 -1075173 -504353 -439924 -951319 -591150
1200 -591150 -220610 -275226 -402082 -747180 -219685 -429890 -259932 -334948 149681 1128547
1190 1128547 544791 351426 328649 -61629 -441458 -243714 -599858 156608 193735 375855
1180 375855 19166 -118287 -399131 -398256 435617 807579 184557 592868 643798 663162 628515
1169 628515 -330736 -454761 -195408 -769857 -706661 -242424 162897 -88223 -626405 -10631
1159 -10631 -41466 178470 -395416 122639 -42638 -199137 188447 530339 67519 -792272
1149 -792272 -29590 333871 -184748 -618073 359563 322613 122175 97782 -139154 -333788
1139 -333788 -881659 -165262 178018 129918 -394960 426724 74290 16460 -203741 -742756
1129 -742756 -735489 433584 49426 -43598 -173983 -841436 -600566 -305953 172819 407565
1119 407565 699136 1023382 1777867 1249472 229214 -142743 -180508 3586 14251 -618841
1109 -618841 -830151 -680927 -619409 -250165 -350469 433 174126 575123 52279 372310
1099 372310 -449021 -1266817 -193562 -604068 -794672 -306551 121107 555515 19883 -158608
1089 -158608 -180621 -934534 -295594 -528015 -1488499 -1180357 -665065 -1045187 -486539 -312516
1079 -312516 535276 826770 510449 1075514 615745 -122805 916695 897138 541053 -16861
1069 -16861 -393164 -361154 19333 668465 -106564 94430 643171 387846 634691 -735154
1059 -735154 -362313 414484 120536 -39480 313875 179966 440553 265891 -146698 -157162
1049 -157162 -680039 -406169 -777760 716517 491741 19616 140629 -175862 -73871 390170
1039 390170 93813 -866575 -791417 -192177 -125680 -198764 -467580 -539194 54775 -56641
1029 -56641 -194395 -7539 -80975 78838 -384054 -575641 -213613 542207 921830 403101
1019 403101 144460 -374996 167191 -28649 -57840 416350 160901 -352789 -741147 -1125789
1009 -1125789 -1768120 -1678700 -834995 -181015 -636112 -131911 -294555 -630599 -605245 244261
999 244261 -457024 -194110 19785 -416529 834 11348 -278142 -471197 -515773 -713094
989 -713094 -1098417 -519267 -441007 -710132 802970 -259145 -378077 77926 206627 62193
979 62193 447542 204943 185199 151008 -141157 -847349 -1309771 -784553 -159270 54571
969 54571 365016 559779 508865 298034 -784017 -1252835 -195752 -330708 -282949 -839487
959 -839487 -1459270 -715417 -433579 197716 477526 379563 -22866 130421 -611695 -758805
949 -758805 -643741 -477303 -598459 -1061542 -165044 1004514 454581 -287571 -153035 -822460
939 -822460 -613111 -545406 -548083 -382987 -443089 -397806 413910 376066 -381442 -110072 -102485
928 -102485 -149654 71711 360676 1178271 591364 -559729 275863 884685 1289637 1216335
918 1216335 -106397 -456059 -162364 183133 617158 849784 893208 971594 479420 133656
908 133656 -350468 -393700 -112719 3249 -177512 -396005 -348962 -1024400 -1848597 -1328771
898 -1328771 -813693 -837524 -529496 -797 -449707 -252905 36802 -412048 -318659 -582887
888 -582887 -1038148 -1726633 -1109847 -312026 199193 -73369 -745839 -1002282 -1261467 -69411
878 -69411 -195874 -807190 -593218 -611289 -285634 -223966 -61725 113908 -58241 330789
868 330789 195582 -99486 312883 89263 246342 656576 734833 244319 -535279 -311177
858 -311177 885673 917702 542367 408462 589044 -197025 -105646 480246 269755 -205258
848 -205258 248071 -131553 167185 -51529 -634686 -965770 -292514 -557348 -212176 304412
838 304412 576297 -242279 349055 237914 244403 101599 205147 723110 448945 584379
828 584379 602239 874998 204125 61362 32473 -1408487 -542086 446612 180428 -301745
818 -301745 -407321 158776 34568 -347302 -525044 65477 -23920 -236953 143912 618870
808 618870 819583 108110 -447364 352833 -13330 851791 1515475 667612 740812 -77104
798 -77104 -343852 808876 372836 773841 678133 402398 443370 546026 -363225 96036
788 96036 337696 1080765 302107 -138470 -404355 -472409 -537403 -514967 -102145 364101 163092
777 163092 -3996 -474571 333611 106632 235417 -273305 -545123 -63875 323227 478182
767 478182 -45173 -139087 -631717 468351 174671 -350798 -702632 -779405 385249 444579
757 444579 314809 714453 366816 171194 151570 262996 249455 281395 815518 432735
747 432735 -256774 511907 1249028 460095 204540 462251 1333303 1026631 937953 323518
737 323518 189176 965399 416081 -136837 -16249 297885 357982 386254 249055 -489378
727 -489378 -547661 -57606 -50336 -234937 -615813 -467005 -346832 -429971 280620 568713 957624
716 957624 481094 59959 -237923 -851694 -585457 75767 395497 235938 -112483 -539449
706 -539449 21443 557644 538815 165712 258679 190585 1047126 67083 -503595 -453474 976598
695 976598 211761 -20437 -207852 430706 609913 539932 -559257 -1048447 -1252675 161873
685 161873 334806 178736 542859 122495 45123 211532 517334 368465 16693 411272
675 411272 825566 750480 180915 -521428 -102652 204677 280799 331523 548059 1021600
665 1021600 661575 480946 552216 622791 784197 41862 383710 165284 835360 659585
655 659585 157203 376391 1133196 1287682 930547 -137613 -428059 -255249 155880 -68150
645 -68150 -418189 -200371 99089 106018 192466 -497850 -617065 -35153 -247526 -397910 -174896
634 -174896 -108924 281032 70144 -78543 127145 310145 692033 1225326 240595 503765
624 503765 674155 412615 828674 -21104 7156 556440 580255 137000 -299495 -377613
614 -377613 -838618 -467364 -158342 413023 310542 -215100 583609 1016102 933553 522922
604 522922 205469 599457 758815 473878 325388 114747 -209671 107990 337419 58483
594 58483 183821 654403 944211 1122572 595099 397075 920343 465449 358842 177301
584 177301 163712 311164 937198 1291818 1318268 987151 475326 -643062 -166461 -649150
574 -649150 -418648 -49925 785786 453575 118264 308724 203396 96262 -193805 310260
564 310260 909895 160159 -5762 443437 -88778 199393 305270 1004039 368317 41047
554 41047 283486 575538 162999 276815 67240 89180 -357837 -94954 465431 593350
544 593350 502487 428140 31844 410827 43266 -245558 -949298 16165 458197 356654
534 356654 1254552 738985 118732 -448563 -154454 263588 313411 341446 291684 863823
524 863823 286052 -401180 123348 45929 580849 1690210 622096 337821 60158 -430940
514 -430940 59704 951565 1333850 1057584 899813 1351004 999917 222916 640248 -8472
504 -8472 554747 594691 831533 947109 710989 -25848 -216450 9645 280717 -330363
494 -330363 104187 142040 101111 148486 7322 122833 260150 1068070 1262371 434235
484 434235 2863 461138 567026 464272 915734 721164 749232 865354 784280 -287719
474 -287719 569217 614461 -428631 447856 417690 163522 1021139 1010707 979180 763969
464 763969 263146 420060 819457 205268 22009 401316 -332252 -356221 -338129 -278225
454 -278225 233448 451131 392779 -360937 -245120 271365 145105 1418081 408006 -193413
444 -193413 133637 -103997 135308 68974 -321898 -221554 509965 959219 557249 -463596
434 -463596 286495 316775 462389 503812 450539 649372 384763 794912 -104368 -101643 412242
423 412242 522094 219466 631698 793724 775268 795108 313622 78567 934804 1293692
413 1293692 974554 841323 846669 766615 846159 99876 1480208 365081 -378281 -171170
403 -171170 233390 675017 82983 -207668 -841120 -483978 -374365 93402 20957 -478199
393 -478199 -56596 -26355 -114643 329829 292131 1099045 1098561 632000 526504 715215 703852
382 703852 1391136 929903 1095122 1011868 87017 452116 447756 -583517 -234307 352027
372 352027 695566 708745 357352 650647 459024 638263 367408 105354 160730 388429
362 388429 230810 87285 620872 913294 455652 327909 492713 -282908 -67722 569071
352 569071 1174624 545817 -231515 -311500 -204840 -600417 -683310 374076 41463 -462587
342 -462587 246932 292458 525293 592842 176245 319687 340744 -386550 121690 172872 725306
331 725306 464189 291581 890123 789243 481888 412741 260988 105224 337311 425952
321 425952 689346 -87989 21859 -545768 41486 142093 -237969 224225 463120 92137
311 92137 208842 212424 751724 835695 12609 270633 1093714 589249 -292748 -83815 227633
300 227633 327628 976144 1322249 533511 515519 340443 411923 158744 70699 -375602 285806
289 285806 250350 -334133 806628 1036230 335707 824664 618219 34657 466282 728763
279 728763 1036822 1077005 1044516 212317 326625 13178 -274154 -128692 204882 663354
269 663354 623547 1032992 300606 -605537 -196167 -274645 -536047 -93138 -47927 -82677 363844
258 363844 192915 247303 795770 1373371 857712 1039708 730188 597194 547839 342648
248 342648 206711 -109219 444645 718095 633872 1137162 1035642 636806 71176 454006
238 454006 210128 -283420 -392097 -612818 196494 452477 415665 805977 690038 368814
228 368814 1250563 161595 742263 1056433 139982 -31407 -19738 139950 184779 407807
218 407807 467850 -174122 -113648 155419 688566 310807 1011263 1602296 1007937 549781
208 549781 977313 257008 329167 445505 327250 485591 455274 835637 155855 786702
198 786702 719029 506890 797923 961284 580506 696034 200344 389636 197185 51185
188 51185 717392 323630 584176 367792 12701 210893 166024 248507 566435 742642
178 742642 629783 813352 1357541 1333821 599597 406331 870641 1235736 52382 -146786
168 -146786 -208138 529568 439025 587562 319945 366022 -267164 -491094 194871 81265
158 81265 -65953 -223385 -233875 161029 250785 379753 58136 189542 1537553 660878
148 660878 1005045 955794 802246 246164 118542 534895 135226 418547 385794 190734
138 190734 -315462 -516482 255583 189774 658075 397139 415379 285271 586304 1278793
128 1278793 593901 -391673 -334363 189118 386314 158719 335928 82183 518883 485436
118 485436 211952 705609 983144 801526 973843 1090208 335647 260902 578262 605226
108 605226 131951 -153593 738072 553055 -1013 190310 562792 1430912 1515107 1451445
98 1451445 992380 1068080 534753 480349 547662 379556 688844 14703 491614 576495 1023712
87 1023712 1523047 1217346 970258 495803 68888 -212866 123007 -155230 171851 849501
77 849501 894777 1194790 1301210 1126175 1106641 -95459 -8374 452242 280278 1008012
67 1008012 1339526 1362269 943058 795405 1168090 598816 18405 160323 183462 315765
57 315765 582471 -66096 -164605 594295 613806 799745 497334 416602 757872 837737 660682
46 660682 481682 1004322 633340 200659 781454 1035580 870423 568074 -241756 -298009
36 -298009 -721853 -330204 127493 135800 324163 246818 700124 817248 726009 535877 232949
25 232949 145366 359712 358565 -3283 466634 656493 247180 304671 243199 600210 894116
14 894116 520374 963923 984061 1033795 927928 614028 618507 594740 798420 794199 935043
3 935043 679313 469900 658319
0 658319
$$ Imaginary data points
##PAGE= N=2
##DATA TABLE= (X++(I..I)), XYDATA
16383 -3918078 -4199780 -4274467 -4229643 -3653532 -3591127 -3106543 -2143831 -2514945 -3276852 -2882230
16373 -2882230 -3202422 -2893829 -2359909 -2299109 -1758371 -2149201 -1989249 -1914162 -1590000 -1711086
16363 -1711086 -2233887 -2060165 -1682877 -1373010 -2000840 -2381786 -1710393 -1616106 -1799562 -1847264
16353 -1847264 -1638164 -1793229 -748555 -793494 -396708 -277870 -322356 -759728 -457330 -281073
16343 -281073 -545733 -880381 -864268 -1163108 -1040703 -490168 -264205 -181654 -513918 -277216
16333 -277216 -37881 -180452 -535820 -489402 -134326 -190458 125504 674896 648816 370457
16323 370457 735924 881214 716289 1253576 1276264 935051 831502 1304682 1338456 1550201
16313 1550201 1295293 912852 1363871 1748235 2233280 2292299 1708866 1652171 1386726 1349317
16303 1349317 1896356 1888003 2344158 2197236 1468350 1723842 2118321 2949241 3097289 3171696
16293 3171696 3124582 2874315 2258961 2014504 2570662 3054379 3304782 3536525 3051116 3440313
16283 3440313 3586937 3556394 3421641 3201313 3824245 3568831 3243184 3615042 4128603 3846566
16273 3846566 3443378 3321204 3575819 3611482 3801260 4031416 3410678 3678957 3629974 4179872
16263 4179872 4042555 3595499 3147117 4088612 4147508 4090689 4016207 3995014 3929504 3865260
16253 3865260 3556652 4008949 4109039 3859220 3601268 3432289 3618820 4501859 4455434 4663848
16243 4663848 5263457 4553922 4926659 5265094 6280278 5961415 5197981 5662659 5621341
16234 5621341 4912321 5139581 5140609 5668599 5271623 5268042 5820694 5809376 6357052 6743878
16224 6743878 6784524 5911643 5650478 5942597 5168784 5996655 5908295 5700808 6041382 5941005
16214 5941005 5605223 5649927 5784020 6493084 6450104 6534011 6421847 7076395 6905671 6103830
16204 6103830 6344046 5944353 5698834 5481198 5951747 5897352 6171104 7342744 7845200
16195 7845200 7647159 6777535 6327176 6514112 6216485 6270669 6524880 6522022 5982222 6600973
16185 6600973 6519217 7219554 7061618 6901981 6268523 6372543 7788651 7458504 7389019 7319747
16175 7319747 6999458 7521998 8068881 7152730 6776538 7244728 6932249 7565570 7862127
16166 7862127 7839976 7686870 7030838 7493253 6800813 6357861 6750455 7352167 6837933 6573091
16156 6573091 6818165 6481241 6774018 6688039 6385694 7223151 7578262 7060752 7480249 7297054
16146 7297054 6900204 7041377 7510866 7328946 7771223 7962675 7615697 7942176 7581631
16137 7581631 7937427 7744091 7821156 7915835 8148807 7486858 7512574 7853471 7714419 7337402
16127 7337402 8299811 8006665 7681147 7920501 6738896 7085825 7901594 7630106 7339186
16118 7339186 7432218 8003533 7456555 8052740 8694543 8569037 8446678 9345424 9319358 8313624
16108 8313624 7867927 8066458 8454164 7401281 7675317 8250539 8001474 7922144 7485755
16099 7485755 8220636 9223231 8766979 8594605 7912448 7506494 8063995 8061961 7777937 8081874
16089 8081874 7772620 7926713 7150514 7929464 8169966 8448027 7787594 7657406 8799609
16080 8799609 7868033 7289744 8156942 8753612 7917829 8441189 8470463 7809940 7673062 7726693
16070 7726693 7834457 8327296 7985168 7403747 7689093 8094887 8385969 7581784 7674139 8998962
16060 8998962 8941333 8552457 8205241 8027953 7804171 8195370 8807081 8647748 7944440 7835258
16050 7835258 8411377 7929100 8355962 8842094 7838104 7648701 7809387 8013853 8484960
16041 8484960 8116861 8431015 7936534 7770771 7934559 8347180 7651398 7307326 7160103
16032 7160103 8017747 8385170 7507037 7296659 7382383 7131938 7688438 8523837 8595869 8899780
16022 8899780 9619132 8355982 7713904 7379939 8028121 8004699 7789105 8586143 8385575
16013 8385575 8715374 8529129 8229810 7935856 8283138 7776561 7345237 8152611 7632899
16004 7632899 7581643 7755699 8426778 8964524 8641832 8528677 8849652 8721112 8060571 8119174
15994 8119174 8588747 8666102 9305161 9360945 8290739 8161696 8931887 8267806 7258217
15985 7258217 7059987 7317953 7709552 7904664 8449279 8727997 8225191 7744410 7916689
15976 7916689 7648958 8538172 9084721 9279834 8394751 8009685 7748802 7903057 8442971
15967 8442971 8185760 7963222 8766730 8403444 8324235 8005421 8535494 8426906 8505670 8247148
15957 8247148 9122574 9269718 9571783 8990526 8596136 8326440 8129884 8200170 8049886 7829576
15947 7829576 8173617 8958802 8580541 7847365 7795963 8020207 8380726 7952023 7927928 8219209
15937 8219209 8122175 8933367 8913801 9408362 8272098 8363040 7795606 8025705 8651089 9091891
15927 9091891 8480398 8454203 8541326 7839461 8073082 8716616 8057234 7439104 8471302 8635189
15917 8635189 8326973 7626203 8287188 8090110 8692386 9180794 8914011 8438209 8090808
15908 8090808 8035389 7739375 8115596 8386878 8285805 8493961 7967743 8512330 8580616 8368119
15898 8368119 8247475 8446415 9074494 8298469 8107886 7995217 8018291 8616484 9273748 9878513
15888 9878513 9788828 8262407 8248022 7623856 8238219 8358993 8336664 8172105 8286068 7984186
15878 7984186 7961941 7933244 8238834 8801981 7599106 8067811 8001006 7776676 8070466 8054989
15868 8054989 8732312 9415076 9066000 7744866 7682583 8317475 8275587 8989738 8319187 7826550
15858 7826550 7333113 7488721 8339763 7809104 7679285 7652086 7586275 7884230 8214140 7647074
15848 7647074 7866944 8028593 8496500 8079524 8070143 7798450 8556586 9132522 8709921 9065548
15838 9065548 8668376 7714069 8188950 8841076 8773665 8954654 8385257 7566188 8153872 7931886
15828 7931886 7979000 8712769 8586759 8245017 8651281 7903739 8467525 8998305 8732738 8406670
15818 8406670 7945288 7796727 7491619 7685252 7532428 8485865 8556764 8416775 8186375 8452050
15808 8452050 8694899 8529297 9346760 9069791 8031135 8175793 8478756 8573612 8482348 8460738
15798 8460738 8239153 8751337 8534871 8268793 8272569 8873984 9194473 8640430 8363876 8742404
15788 8742404 8541566 8447983 8383864 8206781 8606449 9154939 8807029 9226396 8460086 8411169
15778 8411169 7853159 8010674 9122473 7977147 7900060 8330346 8352610 8494391 8446486 7764667
15768 7764667 8539101 8400956 7944473 8175789 8141967 8454199 8647635 8783389 8773695 8895891
15758 8895891 8350960 8557725 9304683 9170618 8655287 9605475 9113317 8969067 8418138
15749 8418138 8765719 8225051 8261243 8684824 9457153 9342706 8638067 8829592 7878669 7482296
15739 7482296 8500167 8744350 8204126 8166124 8291977 8438067 7320308 8308522 8316737 9032971
15729 9032971 8519113 7941302 8091225 7744005 8173350 8744958 8768862 8976193 9016326 8305712
15719 8305712 7782176 7793227 8122650 8166926 8088510 7885854 8086704 8556156 8442685 8568491
15709 8568491 8377213 9251808 9550943 8612465 7868860 8150658 8498820 8040141 7608976
15700 7608976 7789455 7622581 8290782 8901561 8925264 9204711 8263920 8672195 8411846 8873506
15690 8873506 8633958 8597397 9225048 8877425 8258690 8009858 8430795 8147180 8469798 7844685
15680 7844685 8306510 8061584 8541513 8650170 9376946 9150761 8145541 8471797 8584396
15671 8584396 8410801 7891228 7946096 8378533 8386203 8656637 8567608 8641202 9097000 9133145
15661 9133145 8811229 9114228 9303873 9042489 8759155 8749954 8695976 8358177 8877475 9160601
15651 9160601 8820286 8960978 9424558 9712875 9109856 9007786 8634305 9075854 9268109
15642 9268109 8776986 9453252 9665289 9236029 8922360 9351634 8957030 9466046 9137122
15633 9137122 9053650 8818078 8743848 7901201 7585312 9010709 9194445 8978000 8830899 8852092
15623 8852092 9147710 8373527 8678680 8551588 8788036 8207970 8791798 9334567 8807010
15614 8807010 8395955 8491639 8060081 7833114 7813071 8070443 8908860 8846799 8635228 7544634
15604 7544634 8206907 9358842 8617836 8114373 8216195 9246888 8601505 7512313 7781817
15595 7781817 8233934 8508500 8137237 9075104 9273955 8997755 8582095 9315536 8625843
15586 8625843 8159007 8810854 9711472 9446453 8489307 8910810 8911604 9598224 9652210 8478234
15576 8478234 8428284 8827456 8600680 9036449 9202394 9314777 8988387 9126987 8711712 8646105
15566 8646105 8207352 8234211 8426876 8459232 8859297 8545869 9443654 9688763 9501756 9076694
15556 9076694 9021984 9015874 8564774 8526080 8101904 9453023 8655110 8232502 9124430 8179622
15546 8179622 8153822 8422676 8904865 8688479 8721973 8955571 9698526 9274268 8658060 8866975
15536 8866975 9582594 10056552 9827465 9174896 8686493 9113492 9379143 9093329 9227024
15527 9227024 9460776 8746422 8330633 9062050 8674395 8775198 9393933 8588347 8374047
15518 8374047 8370267 8984731 8616543 8729003 8848742 8878726 9332939 8598502 8948921 9240874
15508 9240874 9758127 9282628 9094782 9143068 8974829 8589886 9432232 9688516 8386300
15499 8386300 8574812 8559423 8504922 8055583 8060602 8628566 8674956 9035157 8699701 8860660
15489 8860660 8641218 9178233 8774259 7868690 8715883 9020842 8540303 8647099 8660716 8885653
15479 8885653 8111760 8157610 8893887 8555434 8160484 8562096 9512148 9566862 8736979 9124313
15469 9124313 8909943 8394768 8571831 8679902 8904045 9220149 9495655 9496130 9361827 9575298
15459 9575298 8924887 8165045 8219358 8734493 9683129 8965121 9115355 9187401 8805669 8479855
15449 8479855 8817511 8329336 8712857 8609931 8698079 8721773 8370589 8121315 7990919 8990589
15439 8990589 9103969 8934417 9211057 8656318 9250548 10519728 9387720 8971649 10201825
15430 10201825 10024068 10094869 9680654 8688288 9797271 10263870 10095377 9410240 9411567 8893809
15420 8893809 8785424 8603102 9532850 9851711 8505936 9336253 8571524 8575761 9783960
15411 9783960 9135126 8738588 9235121 8470536 8394625 8657167 8960185 8886105 9096934 10074620
15401 10074620 9363044 8760045 9024239 8812658 9597555 8874881 10188545 10342407 9186504
15392 9186504 8866500 9113449 8482260 7954006 7599345 8667478 9162069 8611833 9286170
15383 9286170 9353589 8920056 9352946 9234774 8785497 9176282 8966766 8903099 8688921 8730217
15373 8730217 8599352 9000735 8732599 9101481 8494944 9052673 10071631 9939631 10122765
15364 10122765 9561714 8993175 8718730 8728379 9448373 9318115 8924409 9337746 9591545 9795688
15354 9795688 8816448 8263512 8650100 8709132 8932915 9376687 8725542 8247152 8365119 8403122
15344 8403122 8717874 8279583 8381928 9538381 9680769 9474170 8842757 9046299 9471327
15335 9471327 9496344 8747886 8717936 9037612 8462284 9019060 8668966 9017571 9004411 9299870
15325 9299870 9069605 8987814 7939992 8025398 8538649 8545481 8313728 9025397 9483080 9295812
15315 9295812 8788067 9193170 9832303 9486564 9837095 9593793 8792189 8533029 8707489
15306 8707489 8799123 9522710 9356948 9323328 9822327 9438868 9838703 9669199 9331007 9175477
15296 9175477 9796081 9492146 8972504 9155786 8436673 9050650 8973781 9607953 10051847 9802069
15286 9802069 10101548 9655081 9582058 8716657 8464389 8022652 8511428 9303450 9447405 8957231
15276 8957231 9265141 8998717 8555977 8540173 8513199 8155558 7806429 7790703 7870649 8887316
15266 8887316 9134558 9104955 9582469 8733587 8900464 9060909 9214784 8752013 8157449 8452602
15256 8452602 8771274 8429087 7922666 9135931 9395075 9182373 9605329 9922683 9240862
15247 9240862 9156056 9270550 9126106 8073640 7596504 8006888 8504205 8512476 9092124 9067837
15237 9067837 9233387 9370871 9434962 9035325 9245885 9609120 9393514 8726796 9173533 9003279
15227 9003279 9006973 8985561 8927015 9397665 9804267 8839962 7757413 8536638 9543654 9225280
15217 9225280 8903456 8715596 8697292 8459994 8887735 8037920 8258556 9460414 9681227
15208 9681227 9018412 8961577 9424706 10044090 9466303 9387356 9086451 8552031 8719399 8719947
15198 8719947 8556608 8673840 8463347 7583396 8551835 8583720 8193212 8980731 9957585 9856911
15188 9856911 9099762 9575813 9604917 9981931 9738101 9426531 9379829 8745702 8589417 8818223
15178 8818223 9434133 9742795 9635237 9091660 8262397 8505265 9216515 9217268 9642283 9257091
15168 9257091 9243781 9508653 9889178 9107961 8733066 8484749 9665618 9268441 8677754
15159 8677754 8720704 9315076 8463356 8566278 8695278 8347434 8666731 9122571 9951048 9105064
15149 9105064 9772036 8818878 8157291 9782462 10462425 9979084 9696686 10091994 10464508
15140 10464508 10299137 9734733 9478826 9519126 9969127 9448921 8653440 8396323 8653444
15131 8653444 9113109 9279286 8845510 8724022 9117339 9684938 9479827 9696766 10012581
15122 10012581 9437629 9244901 9021708 8959667 8598257 8449528 8902611 9482553 9086590
15113 9086590 8624097 9362076 9842685 9791324 9868360 10172977 10799556 9925472 8435343 8727872
15103 8727872 8788407 9223212 10151642 10327175 9586422 9737921 9758061 9603116 8999905 9486871
15093 9486871 10013444 9687156 9302662 9182730 9223254 9381673 9248178 9233763 9338519 10046636
15083 10046636 9831538 9829977 9832212 9438850 8964476 9358231 9990087 9486512 9690046 9612294
15073 9612294 9714741 9786202 10455697 9772545 9381184 9323962 9223556 9439163 9104418 9169438
15063 9169438 8877503 8836600 8797651 8584026 9102189 8459768 8438937 8622306 8580287 8671684
$$ [...]
##END NTUPLES=NMR SPECTRUM
##END=
