##TITLE=1H_CA-9074-2-1
 CDCl3
 8 sc, 
 26.10.2022
##JCAMPDX= 6.0         $$ Bruker NMR JCAMP-DX V2.0
##DATA TYPE= NMR SPECTRUM
##DATA CLASS= NTUPLES
##ORIGIN= UXNMR, Bruker Analytische Messtechnik GmbH
##OWNER= root
$$ XWIN-NMR		Version 3.5
$$ Wed Oct 26 14:52:13 2022 Russian Standard Time (UT+4h)  she@DPX200
##.OBSERVE FREQUENCY= 200.1313499994
##.OBSERVE NUCLEUS= ^1H
##.ACQUISITION MODE= SIMULTANEOUS
##.ACQUISITION SCHEME= undefined
##.AVERAGES= 8
##.DIGITISER RES= 18
##SPECTROMETER/DATA SYSTEM= spect
##.PULSE SEQUENCE= zg30
##.SOLVENT NAME= CDCl3
##.SHIFT REFERENCE= (INTERNAL, CDCl3, 0, 15.7513)
##AUDIT TRAIL= $$ (NUMBER, WHEN, WHO, WHERE, WHAT)
$$ ##TITLE= Audit trail, XWIN-NMR		Version 3.5
$$ ##JCAMPDX= 5.01
$$ ##ORIGIN= Bruker BioSpin GmbH
$$ ##OWNER= she
$$ F:/spectra/data/she/nmr/H-F/1/pdata/1/auditp.txt
$$ ##AUDIT TRAIL=  $$ (NUMBER, WHEN, WHO, WHERE, WHAT)
(   1,<2022-10-26 14:51:05.51 +0400>,<she>,<DPX200>,
      <created by zg, POWCHK disabled, PULCHK disabled
       configuration hash MD5:
       00 E9 B6 7A A2 85 ED C7 34 08 36 98 17 FE 4E 26
       data hash MD5: 16K
       7B 6D 20 EF 44 05 81 AF 48 7D 48 E3 1B D9 0D 0D>)
(   2,<2022-10-26 14:51:08.93 +0400>,<she>,<DPX200>,
      <Start of raw data processing
       efp BC_mod = 2 LB = 0.24 FT_mod = 6 PKNL = 1 PHC0 = -18400.29 PHC1 = 19.4007 SI = 16K 
       data hash MD5: 16K
       ED C9 17 67 44 EE 97 4D EF 7E 7F 10 07 15 43 85>)
(   3,<2022-10-26 14:51:25.76 +0400>,<she>,<DPX200>,
      <pk PHC0 = 1.973365 PHC1 = -2.235174e-07 
       data hash MD5: 16K
       1A 78 C1 E9 8A 23 B5 61 B4 44 FF F1 38 08 26 AC>)
(   4,<2022-10-26 14:51:28.84 +0400>,<she>,<DPX200>,
      <abs ABSG = 5 
       data hash MD5: 16K
       99 10 4E 17 8C 5E 1B F1 05 34 D8 38 ED F3 A8 4E>)
$$ ##END=
$$ 
$$ hash MD5
$$ 51 52 EB 90 51 B6 A3 62 17 20 C8 A3 74 FD 22 E0
##$RELAX= 
##$RELAX= 
##$RELAX= 
##$RELAX= 
##$RELAX= 
##$RELAX= 
$$ Bruker specific parameters
$$ --------------------------
##$DU= <F:/spectra>
##$EXPNO= 1
##$NAME= <H-F>
##$PROCNO= 1
##$TYPE= <nmr>
##$USER= <she>
##$AMP= (0..31)
100 100 100 100 100 100 100 100 100 100 100 100 100 100 100 100 100 100 
100 100 100 100 100 100 100 100 100 100 100 100 100 100 
##$AQSEQ= 0
##$AQ_mod= 1
##$AUNM= <au_zg>
##$AUTOPOS= <>
##$BF1= 200.13
##$BF2= 200.13
##$BF3= 200.13
##$BF4= 200.13
##$BF5= 200.13
##$BF6= 200.13
##$BF7= 200.13
##$BF8= 200.13
##$BYTORDA= 1
##$CFDGTYP= 0
##$CFRGTYP= 5
##$CHEMSTR= <none>
##$CNST= (0..31)
1 1 145 1 1 1 1 1 1 1 1 1 1 1 1 1 1 1 1 1 1 1 1 1 1 1 1 1 1 1 1 1 
##$CPDPRG= <>
##$CPDPRG1= <>
##$CPDPRG2= <>
##$CPDPRG3= <>
##$CPDPRG4= <mlev>
##$CPDPRG5= <mlev>
##$CPDPRG6= <mlev>
##$CPDPRG7= <mlev>
##$CPDPRG8= <mlev>
##$CPDPRGB= <>
##$CPDPRGT= <>
##$D= (0..31)
0 1.2 0 0 0 0 0 0 0 0.06 0 0.03 0 0 0 0 0.0002 0 0 0 0 0 0 0 0 0 0 0 0 
0 0 0 
##$DATE= 1666781465
##$DBL= (0..7)
120 120 120 120 120 120 120 120 
##$DBP= (0..7)
150 150 150 150 150 150 150 150 
##$DBP07= 0
##$DBPNAM0= <>
##$DBPNAM1= <>
##$DBPNAM2= <>
##$DBPNAM3= <>
$$ [...]
##$SUBNAM3= <"">
##$SUBNAM4= <"">
##$SUBNAM5= <"">
##$SUBNAM6= <"">
##$SUBNAM7= <"">
##$SUBNAM8= <"">
##$SUBNAM9= <"">
##$SW= 18.0517283424941
##$SWIBOX= (0..15)
0 0 2 0 0 0 0 0 0 0 0 0 0 0 0 0 
##$SW_h= 3612.71676300578
##$TD= 16384
##$TD0= 1
##$TE= 0
##$TE2= 300
##$TE3= 300
##$TEG= 300
##$TL= (0..7)
0 120 120 120 120 120 120 120 
##$TP= (0..7)
150 150 150 150 150 150 150 150 
##$TP07= 0
##$TPNAME0= <>
##$TPNAME1= <>
##$TPNAME2= <>
##$TPNAME3= <>
##$TPNAME4= <>
##$TPNAME5= <>
##$TPNAME6= <>
##$TPNAME7= <>
##$TPOAL= (0..7)
0.5 0.5 0.5 0.5 0.5 0.5 0.5 0.5 
##$TPOFFS= (0..7)
0 0 0 0 0 0 0 0 
##$TUNHIN= 0
##$TUNHOUT= 0
##$TUNXOUT= 0
##$USERA1= <user>
##$USERA2= <user>
##$USERA3= <user>
##$USERA4= <user>
##$USERA5= <user>
##$V9= 5
##$VALIST= <valist>
##$VCLIST= <CCCCCCCCCCCCCCC>
##$VD= 0
##$VDLIST= <DDDDDDDDDDDDDDD>
##$VPLIST= <PPPPPPPPPPPPPPP>
##$VTLIST= <TTTTTTTTTTTTTTT>
##$WBST= 1024
##$WBSW= 4
##$XGAIN= (0..3)
0 0 0 0 
##$XL= 0
##$YL= 0
##$YMAX_a= 313515
##$YMIN_a= -619798
##$ZGOPTNS= <>
##$ZL1= 120
##$ZL2= 120
##$ZL3= 120
##$ZL4= 120
##$ABSF1= 15.66646
##$ABSF2= -2.385387
##$ABSG= 5
##$ABSL= 3
##$ALPHA= 0
##$AQORDER= 0
##$ASSFAC= 0
##$ASSFACI= 0
##$ASSFACX= 0
##$ASSWID= 0
##$AUNMP= <proc_1d>
##$AZFE= 0.1
##$AZFW= 0.1
##$BCFW= 0
##$BC_mod= 2
##$BYTORDP= 0
##$COROFFS= 0
##$CY= -3
##$DATMOD= 1
##$DC= 0
##$DFILT= <>
##$DTYPP= 0
##$F1P= 0
##$F2P= 0
##$FCOR= 1
##$FTSIZE= 16384
##$FT_mod= 6
##$GAMMA= 0
##$GB= 0
##$INTBC= 1
##$INTSCL= 3.70164e-10
##$ISEN= 128
##$LB= 0.24
##$LEV0= 0
##$LPBIN= 0
##$MAXI= 10000
##$MC2= 0
##$MEAN= 0
##$ME_mod= 0
##$MI= 1.114404
##$NCOEF= 0
##$NC_proc= -5
##$NLEV= 6
##$NOISF1= 3.799351
##$NOISF2= 2.8
##$NSP= 0
##$NTH_PI= 0
##$NZP= 0
##$OFFSET= 15.7513
##$PC= 1
##$PHC0= -18398.32
##$PHC1= 19.4007
##$PH_mod= 1
##$PKNL= yes
##$PPARMOD= 0
##$PSCAL= 0
##$PSIGN= 0
##$REVERSE= no
##$SF= 200.13000405155
##$SI= 16384
##$SIGF1= 3
##$SIGF2= 2
##$SINO= 5.538805
##$SIOLD= 16384
##$SREGLST= <1H.CDCl3>
##$SSB= 0
##$STSI= 16384
##$STSR= 0
##$SW_p= 3612.71676300578
##$SYMM= 0
##$S_DEV= 0
##$TDeff= 16384
##$TDoff= 0
##$TI= <>
##$TILT= no
##$TM1= 0
##$TM2= 0
##$TOPLEV= 0
##$USERP1= <user>
##$USERP2= <user>
##$USERP3= <user>
##$USERP4= <user>
##$USERP5= <user>
##$WDW= 1
##$XDIM= 16384
##$YMAX_p= 312649826
##$YMIN_p= -693989
$$ End of Bruker specific parameters
$$ ---------------------------------
##NTUPLES= NMR SPECTRUM
##VAR_NAME=  FREQUENCY,     SPECTRUM/REAL,   SPECTRUM/IMAG
##SYMBOL=    X,             R,               I
##VAR_TYPE=  INDEPENDENT,   DEPENDENT,       DEPENDENT
##VAR_FORM=  AFFN,          ASDF,            ASDF
##VAR_DIM=   16384,         16384,           16384
##UNITS=     HZ,            ARBITRARY UNITS, ARBITRARY UNITS
##FACTOR=    0.220516191357247, 1,           1
##FIRST=     3152.30770441738, 0,            0
##LAST=      -460.409058588397, 0,           0
##MIN=       -460.409058588397, -693989,     0
##MAX=       3152.30770441738, 312649826,    0
$$ Real data points
##PAGE= N=1
##DATA TABLE= (X++(R..R)), XYDATA
$$ [...]
7816e5607J377M5315l4917r640p648O0190l9359R6479R7127j75136M3693M7057
7804F8931n8042j5699l9718k3689P434m4984O0645j6258j0971l4849L2793k7111
7792a01518J154m986O5955K6521k4279m3427L892p392J8454L2414K7270j6787
7780b2729p847j7192J0248j0419m2161k005J4419r521p643j7954j6947J09750
7768b0001l5324k4641k9956M4001L7396k4675k943q159J0297j5498m0189l1041
7756a40733K9276N9096p323L553J3865j6152N2476m1099l3506o36Q3919k6609
7744b3873p9749P2280j01179k2379M6553M481K9791n0445j8292L9940k0024N436
7732a17460k299L8811M1679m3526k0847j8552K909L8434M3930K6190l3752Q334
$$ y = [-55607, -54230, -8915, -43832, -53472, -61120, -930, -40289, 56190, 153317, -21819, 21874, 68931, 10889, -4810, -44528, -68217, -60783, -105767, -45122, -61380, -72351, -107200, -74407, -101518, -100364, -105350, -39395, -12874, -37153, -80580, -76688, -84080, -65626, -33212, -5942, -22729, -30576, -47768, -37520, -47939, -90100, -92105, -77686, -87207, -94850, -112804, -129751, -20001, -55325, -79966, -109922, -65921, -28525, -53200, -56143, -64302, -54005, -69503, -109692, -140733, -111457, -52361, -59684, -56131, -42266, -58418, -5942, -47041, -80547, -81183, 2736, -23873, -103622, -31342, -132521, -154900, -108347, -103866, -74075, -124520, -142812, -102872, -122896, -117460, -119759, -80948, -39269, -82795, -103642, -122194, -119285, -80851, -36921, -10731, -44483, -36149]
7720c6149k5352K3378O7034m9532k0863J5347K9402L0802r6570M299n7478l6525
7708a52207L8856J4378M6674Q117j3838K853L3802J092n9623k028N3374r6656
7696a25206r753Q8268L1354J9358l046m6236k6394K7127m2616R230N711K4169
7684d8034J2994l4678n726K9091k9884J5002k9902j8325J920o890J735m165N1331
7671f5531j9802Q199K4316K4587K7327n8682O6598R516m0120J1303k4162K4448
7659a2003N036j0237M0915J5460l4221K9180l7253m5879p9207k8740j3112j4815
7647a84876R6107K1872L527l8357M7638O9696q5542m7059M2705j7871l064J8002
7635g7222Q5606l0401l9952k477n513j3315J1687R1975k7779m5508K6263L9603
$$ y = [-36149, -61501, -38123, 28911, -20621, -41484, -26137, 3265, 34067, -62503, -58204, -115682, -152207, -113351, -98973, -52299, -44182, -58020, -55167, -21365, -20273, -79896, -81924, -28550, -125206, -134959, -46691, -15337, 4021, 975, -45261, -71655, -44528, -87144, -77914, -72203, -48034, -35040, -69718, -75444, -46353, -76237, -61235, -91137, -109462, -107542, -114432, -112697, -116862, -65531, -85333, -77134, -52818, -28231, -904, -59586, 7012, 16528, -23592, -12289, -36451, -12003, -6967, -17204, 23711, 39171, 4950, 34130, -3123, -49002, -128209, -156949, -170061, -184876, -88769, -66897, -63370, -101727, -54089, 15607, -69935, -116994, -74289, -92160, -95224, -77222, 8384, -22017, -61969, -64446, -69959, -83274, -71587, 20388, -7391, -52899, -26636, 12967]
7623A2967m9283l7358j3820L703k1033L1826Q3726M405M76o5543m7547J13091
7611A5610L682p968q0851j6L4054m8325K7407J0920o3697O2516l9137n3593P6271
7598f3127L2082K0039k4765L4250N5252l3678L977o6547l0360J2270m5J5806J9069
7585b5777l4950l1430K0783L0368J3277k2330l0384j7363K1968O906L0669o5272
7573a03535N1479K5533J705O0402n651o475L0076j6764j4425K0087K2533k487
7561F2478J9354l671n0590M7495J6407m7137j7377j9760o4126L1170J1991M9560
7549C5794K7757L9070k2591j2821j0285k3837K9071R279L3372n4885O297n2032
7537D189M4390L8844R157O4753r9978j1142L0498j4709J1073K3284P0519j5460
$$ y = [12967, -36316, -73674, -87494, -83791, -104824, -72998, 10728, 15133, 15609, -49934, -97481, 15610, 19292, 11324, -69527, -69543, -35489, -83814, -56407, -45487, -109184, -46668, -85805, -139398, -63127, -31045, -11006, -35771, -1521, 53731, 20053, 24030, -42517, -72877, -60607, -60652, -44846, -25777, -60727, -92157, -71374, -41006, -27729, -50059, -80443, -97806, -75838, -68932, -38263, -103535, -52056, -26523, -24818, 35584, 29933, 23458, 53534, 36770, 22345, 42432, 64965, 62478, 81832, 78161, 27571, 75066, 91473, 44336, 26959, 7199, -56927, -25757, -13766, 35794, 63551, 102621, 80030, 67209, 56924, 33087, 62158, 71437, 104809, 49924, 56221, 4189, 48579, 87423, 96580, 161333, 61355, 50213, 80711, 66002, 77075, 100359, 170878, 155418]
7525A55418J4726p316N0566j8495R286K9079p65N3270n484O1962O928L8345M8418
7512D35938J2639N8892Q1770J11949N6568M0484L1091R8322J52592N6068N4313
7501A190626n05K8583J8577K9425J5747k3142j56923j82106j56877p4310l6668
7490F52427j16784l9580m5257l7432r2565p7181J1188K2805m4266p2968r636N5201
7478B05952o743o6317j1210k7120k7937k2498m560L6616j097Q475k3373l8682
7466B1506N6149J9803L0639L5416m047P97j9781k070m8407m2856r765K3615Q1492
7453A42491o5422k8204l7941K3820q081J6859N8217j438k0857p3249M1753P9577
7441A27525J659m5311L748l4989J05905m1342p5674L8578P1436j6795j872k5687
$$ y = [155418, 170144, 162828, 213394, 194899, 204185, 233264, 232499, 285769, 280285, 342247, 349175, 387520, 435938, 448577, 507469, 589239, 701188, 757756, 798240, 829331, 927653, 1080245, 1136313, 1190626, 1190121, 1218704, 1237281, 1266706, 1282453, 1259311, 1102388, 920282, 763405, 689095, 652427, 535643, 496063, 450806, 413374, 320809, 243628, 254816, 277621, 233355, 160387, 150751, 205952, 199209, 132892, 121682, 94562, 66625, 44127, 39567, 76183, 75086, 83561, 60188, 21506, 77655, 97458, 128097, 163513, 159466, 160263, 140482, 138412, 90005, 47149, 37384, 60999, 142491, 77069, 48865, 10924, 34744, 26663, 43522, 101739, 100301, 79444, 6195, 47948, 127525, 129184, 83873, 87621, 52632, 158537, 117195, 41521, 80099, 151535, 134740, 132868, 107181]
7429A07181L4475K9845j9206p7246m8363N0922K9160n3316k6404M1534J0837l4820
7417D4599m1099M1443k6500n6065k1308m920P6107l4351r473M8605k4934K6962
7405A9066o813o4359L6348J5440o3901M1782p08k3307K4039k8963j7018L3260
7393c5134J5634O7116o2952J1731j1338j8542J7112j01j6873j3197M6181Q00o2970
7380f2533L4173J2238K1642m9210m2367K1635q258L1279j3000O15O5198J3220
7368B4632O836l6951O346l4167J7587J6759L7111J8214r3040K4338J1519L554
7356B738M188l179K1038l3690N6326K6459l9098K9492r5707N032J9368J6676j3709
7343d066P946J8510m7082O448R0625n5172n2420K5048P9319k2664p1014o987O938
$$ y = [107181, 141656, 171501, 152295, 75049, 26686, 77608, 106768, 53452, 27048, 68582, 79419, 44599, 3500, 44943, 18443, -37622, -58930, -63850, 12257, -22094, -31567, 17038, -7896, 19066, 12253, -52106, -15758, -318, -64219, -22437, -23145, -46452, -22413, -51376, -68394, -35134, -19500, 47616, -15336, -3605, -14943, -33485, -16373, -16474, -33347, -46544, -363, 437, -62533, -28360, -16122, 5520, -43690, -86057, -64422, -72680, -41401, -54401, -53786, 11412, 24632, 31468, -5483, 863, -33304, -15717, 1042, 38153, 56367, -36673, -12335, -816, 2738, 6926, 3747, 24785, -8905, 47421, 73880, 34782, 64274, -31433, -26401, -7033, 9643, -4066, 3880, 22390, -24692, -18244, 72381, 17209, -35211, -10163, 69156, 46492, -24522, -31509, -24571]
7330b4571l935l742l5008P0259j264k2101J4882J379m915K6531R3726p9607o3729
7317c2095r902Q0849J9653L5452K5028j2648j2197K5540N2267n6908k9187l6146
7305D9706m900J9609J3282R7351m6844o030R296l1945J8414j598j5102q446m0158
7292E2635N0635R944K0569J4965k5256M9227o4520o885L1349O547J281j8369k3877
7279I8245j066K6189l6277r564K9879N3661m0462M9442P4307j8677n518K1580
7267B41739L8555m3231m844O248m4088l9841K3032K424M7269J8037o5836j8494
7255A60970j2701J4212L0756K4326L2564k23J1083o4201k5568j896k4759M7886
7243A92449N415l602O8094m439P4931R078m8888J505N0732M2726k8739m6575l8066
$$ y = [-24571, -28506, -32248, -67256, 3003, 1739, -20362, -5480, -4101, -9016, 17515, 111241, 31634, -32095, -41997, 38852, 58505, 93957, 118985, 106337, 94140, 119680, 171947, 115039, 85852, 49706, 44806, 64415, 77697, 175048, 128204, 122174, 131470, 99525, 117939, 116341, 101239, 92793, 52635, 103270, 113214, 133783, 148748, 123492, 172719, 108199, 101314, 132663, 139210, 140491, 122122, 98245, 97179, 123368, 87091, 77527, 107406, 161067, 120605, 170047, 244354, 225677, 220159, 241739, 280294, 237063, 232219, 238467, 194379, 154538, 177570, 179994, 227263, 245300, 179464, 160970, 148269, 162481, 193237, 217563, 250127, 249904, 260987, 196786, 171218, 169322, 144563, 192449, 197864, 194262, 262356, 257917, 332848, 341926, 293038, 294543, 345275, 388001, 359262, 312687, 274621]
7230B74621M4772Q9204m452j5597K8566J2804k1403Q664J4190l4855K5588L6813
7218D58915o1604j5553L2911j4513L7663k678K8898j8564L7306N3189K127L1885
7206E69982J7664Q53M362J0294K9681J5036m1158j2943P0488J9283j1159M5477
7194G17860O825M4277J4363m929R6002j5640j2392J02156L6651j0669J8703L5369
7182A028576M4662K3279M4815J8184N0023P6441N7469N1962J8693J5081J7644
7171A446829J7982K1146J27980J02859K0254P8802L7577k783J07773P8925N1433
7160B088777J19533P7209L6930R3878O6608R0209J4293M2125J66980N6546J29379
7149B982467O9542J0964J22741J54718J01584J32255J62669J52633J03173J29667
$$ y = [274621, 319393, 408597, 404145, 388548, 417114, 429918, 408515, 417179, 431369, 396514, 422102, 458915, 397311, 381758, 414669, 400156, 437819, 435141, 464039, 445475, 482781, 535970, 538097, 569982, 587646, 588499, 592861, 603155, 632836, 647872, 606714, 593771, 664259, 683542, 672383, 717860, 724685, 768962, 783325, 778396, 874398, 858758, 846366, 948522, 985173, 974504, 993207, 1028576, 1073238, 1096517, 1141332, 1159516, 1209539, 1285980, 1343449, 1395411, 1414104, 1429185, 1446829, 1464811, 1485957, 1613937, 1716796, 1737050, 1815852, 1853429, 1850646, 1958419, 2037344, 2088777, 2208310, 2285519, 2322449, 2416327, 2482935, 2573144, 2587437, 2629562, 2796542, 2853088, 2982467, 3052009, 3062973, 3185714, 3340432, 3442016, 3574271, 3736940, 3889573, 3992746, 4122413]
7139D122413J83232J84198K04824J92043K49003K71226K94214K68635L02730L14179
7129F586697L68121M39859L90559L94235M59733M27343N03057N05315N25998N95613
7119A1196530O43016P78728Q76183J035382J191252J390616J605710J821408K139680
7110B2678505K447509K900689L676966M572585N817422P391734R229765J0521949
7102F9237124J0360244P973139K705817l356638q600644j1547980j1508415r770689
7094D5491958p659762n861979m444097l489859k774516k183909j818010j569990
7086A5689836j324808j102416r85806p99599p91180p86202o06815n80729n27476
7077H184805m21320l91476k99978k46072l43587k81618k57998j99978k34178k09560
$$ y = [4122413, 4305645, 4489843, 4694667, 4886710, 5135713, 5406939, 5701153, 5969788, 6272518, 6586697, 6954818, 7394677, 7785236, 8179471, 8639204, 9066547, 9569604, 10074919, 10600917, 11196530, 11839546, 12618274, 13494457, 14529839, 15721091, 17111707, 18717417, 20538825, 22678505, 25126014, 28026703, 31703669, 36276254, 42093676, 49485410, 58715175, 69237124, 79597368, 87570507, 90276324, 86919686, 78319042, 66771062, 55262647, 45491958, 37832196, 31970217, 27526120, 24036261, 21261745, 19077836, 17259826, 15689836, 14365028, 13262612, 12276806, 11477207, 10686027, 9899825, 9293010, 8712281, 8184805, 7763485, 7372009, 7072031, 6825959, 6482372, 6200754, 5942756, 5742778, 5508600, 5299040]
7067E299040j77270j93205j79300j07325j77696j86951j84080k37015j48484j13176
7057C594538m8760r7492o2876k10308j77365p0708p1741m5445r3898j48862l2361
7046B534722r8435j17506l0155l2547q834j22843l0443m8059l9404L204k0584
7035A989116q0265j0604p617m8953j15242l7784p9482o3145k6899p4572k9892
7024A414661K4863k3588k4313p0005j19628N0115q8210q2804K0016l1835m4347
7013A024925k9479m131o580l3308k1480o5392l8342N728k6639R0127k1627l7099
7001H36703l8552q3608j1265j8207l0971n5113K2663n1279o1856P9616m3290K9613
6989E74454M6096J0006l7559j8536m544k4778K929k8625q145L5698r853q8246
$$ y = [5299040, 5121770, 4928565, 4749265, 4641940, 4464244, 4277293, 4093213, 3856198, 3707714, 3594538, 3545778, 3448286, 3385410, 3175102, 2997737, 2927029, 2855288, 2809843, 2715945, 2567083, 2534722, 2436287, 2318781, 2288626, 2256079, 2247245, 2124402, 2093959, 2045900, 2006496, 2009700, 1989116, 1908851, 1898247, 1890630, 1841677, 1726435, 1688651, 1609169, 1546024, 1519125, 1444553, 1414661, 1439524, 1415936, 1391623, 1321618, 1201990, 1252105, 1163895, 1081091, 1101107, 1069272, 1024925, 995446, 991315, 984735, 951427, 929947, 864555, 826213, 831941, 805302, 895429, 873802, 836703, 798151, 714543, 703278, 685071, 654100, 598987, 621650, 570371, 508515, 588131, 544841, 574454, 620550, 630556, 592997, 574461, 569917, 545139, 548068, 519443, 511298, 546996, 537143, 448897]
6977D48897L6011O0367J9048J6665l0834N323M6369j5649l2912k1391L8853J9868
6965E90615N855l9098j2625k8118P2820N8411l4008l6442O6836k4173m9933R807
6953E79947M0871J0865l5417j9218M3525L2131K2727l3814J3858k7874J2339K4462
6941F64402L129r596j6288N6170j5616R29l2121L4841L3376J6675q296m8136J9898
6928F99367N2189J8789J2757Q9460O9835J9714N9036k2222Q2767J09900N8465
6917A250057K7963N156N0137Q2505R0666N2668K8623r714P4372J49095J15279
6906A916807J22866J28435Q4123J43214K62061K57464K07528L55178L44725M54015
6896D276416N52038P49256J049364J369145J685697K196410K196864J659737k83569
$$ y = [448897, 484908, 545275, 564323, 580988, 550154, 555477, 601846, 586197, 553285, 531894, 570747, 590615, 596470, 557372, 544747, 516629, 589449, 647860, 613852, 577410, 644246, 620073, 570140, 579947, 620818, 631683, 596266, 577048, 620573, 652704, 675431, 641617, 655475, 627601, 639940, 664402, 667531, 657935, 641647, 697817, 682201, 683130, 651009, 685850, 719226, 735901, 727605, 679469, 699367, 751556, 770345, 783102, 872562, 942397, 962111, 1021147, 998925, 1081692, 1191592, 1250057, 1278020, 1283176, 1333313, 1415818, 1506484, 1559152, 1587775, 1578061, 1652433, 1801528, 1916807, 2039673, 2168108, 2252231, 2395445, 2657506, 2914970, 3122498, 3477676, 3822401, 4276416, 4828454, 5577710, 6627074, 7996219, 9681916, 11878326, 14075190, 15734927, 15451358]
6887A5451358k433598k660369k181476j567666j147174r05383o98164m48496l96003
6878C013029l10477k73282k38388j53999n3516j90645j38041j15074m6333l9541
6868A453733j00702p2906l4460m5063n1505m4671r0303o9558j4489l7428m6658
6857H45990k5023J5213n2876p1835l3382O12R714j7932n1600M5389Q558r5595
6845E77233o9511K6373l6747m5498n58L1163j0434k9669k6241L9652O805n4654
6833D07914N6562m9287M2423L793m2877M259l7791K438m3805l1844K071M2040
6821C55896m0418M5159q9367m9797K2163l3463L5758J536o604N8988q167l6740
6809B54944j4184k5874m2958m4218n180q066R9521k0004n389J9377k4241n9735
$$ y = [15451358, 13017760, 10357391, 8175915, 6608249, 5461075, 4555692, 3857528, 3409032, 3013029, 2702552, 2429270, 2190882, 2036883, 1983367, 1792722, 1654681, 1539607, 1493274, 1453733, 1353031, 1280125, 1245665, 1200602, 1149097, 1104426, 1014123, 944565, 930076, 892648, 845990, 820967, 836180, 783304, 711469, 678087, 678699, 688413, 670481, 618881, 664270, 672828, 577233, 507722, 534095, 497348, 451850, 451292, 482455, 472021, 442352, 416111, 455763, 462568, 407914, 464476, 415189, 457612, 461405, 418528, 422787, 384996, 387434, 343629, 311785, 313856, 355896, 315478, 360637, 271270, 221473, 243636, 210173, 245931, 247467, 240863, 299851, 291684, 254944, 240760, 214886, 171928, 127710, 122530, 114464, 213985, 193981, 188592, 207969, 183728, 123993]
6797A23993K6258j0800k6818k5064O5962R536l8573J5181k67l5355J1040r179
6785A05914J3400K3671q216o485q805M8112o943o4578M4623J4410k6288l549l4743
6772I0523P3773k8820p252j1279l7372K59k1203K8541J5379J5232r259j8675o4003
6759B5844j9696n2276O3539L4949K3856K8599O2162o6222j7561K0079m8918k5670
6747B8685K0694L9052J6283r637j413l2860j2127K3469j8310n4792J5049L7222
6735E1315J16571m4897J6164m3879n448L3914k8558L1405P283l226K3730K9508
6723A83882j0577k3719l5302J0656j1443K0640m3715M7495K6321N4961M8899J6619
6711B84717r4509N5141L5612L6416J9958j3175O277M628J8287J09301Q867P1700
$$ y = [123993, 150251, 139451, 112633, 87569, 153531, 163067, 124494, 139675, 139408, 104053, 115093, 105914, 119314, 142985, 134769, 128284, 119479, 167591, 160648, 96070, 140693, 155103, 128815, 125266, 90523, 164296, 135476, 128224, 116945, 79573, 79832, 58629, 87170, 102549, 117781, 108522, 89847, 25844, 6148, -46128, 17411, 52360, 76216, 104815, 166977, 100755, 83194, 103273, 54355, 28685, 49379, 88431, 104714, 95077, 93664, 60804, 48677, 72146, 53836, -956, 14093, 51315, 167886, 122989, 139153, 95274, 89826, 123740, 95182, 126587, 133870, 130644, 154374, 183882, 173305, 149586, 114284, 124940, 113497, 134137, 90422, 137917, 164238, 219199, 268098, 284717, 190208, 245349, 280961, 317377, 337335, 324160, 330437, 335065, 353352, 462653, 471520, 543220]
6699E43220m596k1588l4427n9974J3720n2113p1919p3673p8748K8343J6082j3837
6687A90490J855l1484L0722K8138N342j8240J389k7829l9215N1908m054m2794
6675A46228J996J8414J5168n2209J5487L113N08Q30j3569M3879j5621M7k7144
6662A37127O6781M2662k3137P151L3781n6823M2462K1816m9285J6223J5820k1828
6650B32750O9878j2843n3397J1550N1368P735p3869m461K2378J3948l2093K1675
6638B54619j600N4594N7443m7649M9219N9676M961m7442n6901K5518M0340M0137
6626D32915j1317M0609j4004j4425L3190K6987n003P4055L5404N5061l4218J1210
6614F30464Q0079J49453J6920j1938O0505L3888p125m5454J7464j8867n9332J1175
$$ y = [543220, 538624, 517036, 482609, 422635, 436355, 384242, 312323, 238650, 159902, 188245, 204327, 190490, 192345, 160861, 191583, 219721, 225063, 206823, 208212, 180383, 141168, 193076, 189022, 146228, 148224, 166638, 181806, 129597, 145084, 148197, 148705, 149535, 135966, 179845, 164224, 164271, 137127, 203908, 246570, 223433, 230584, 264365, 207542, 250004, 271820, 222535, 238758, 254578, 232750, 302628, 289785, 236388, 247938, 299306, 307041, 233172, 228711, 251089, 265037, 232944, 254619, 253019, 307613, 365056, 317407, 366626, 426302, 431263, 383821, 326920, 352438, 392778, 432915, 421598, 462207, 448203, 433778, 466968, 493955, 488952, 563007, 598411, 653472, 619254, 630464, 710543, 859996, 876916, 864978, 925483, 959371, 952246, 906792, 924256, 905389, 846057, 857232]
6602H57232M7904O1443k8822M864M0690J00331Q1520J8204J01199O8838J51635
6591A505038J50805J61797J12385K13510K79264L01504M18039L25795K52585N5778
6581C776500k49619l51134k55327k54459j61688n5401q4818K079m954j3124l7543
6570B310512n7463Q9586O8270J37246K14492R1075J42375K36422K61423M02139
6560C896077N29621N66766P29587Q98044Q40164O58654L17324l84364q37488p97365
6550F417020p77060n33301l86590l53502k00165j42495p8673l7702m0266n6521
6540C810745j564M4049Q6903J59543K08774K58999K93108L88033N59660P29228
6530F537478Q41316J007450J175249J069568O07651k44271j016457j336269j133022
$$ y = [857232, 905136, 966579, 937757, 942621, 983311, 1083642, 1165162, 1183366, 1284565, 1353403, 1505038, 1655843, 1817640, 1930025, 2143535, 2422799, 2724303, 3142342, 3468137, 3720722, 3776500, 3526881, 3175747, 2920420, 2665961, 2504273, 2448872, 2364054, 2366133, 2361179, 2348055, 2310512, 2253049, 2342635, 2410905, 2548151, 2762643, 2853718, 2996093, 3232515, 3493938, 3896077, 4425698, 4992464, 5722051, 6620095, 7460259, 8118913, 8436237, 8051873, 7214385, 6417020, 5639960, 5106659, 4720069, 4366567, 4166402, 4023907, 3945234, 3907532, 3867266, 3810745, 3809181, 3853230, 3940133, 4099676, 4308450, 4567449, 4860557, 5248590, 5808250, 6537478, 7378794, 8386244, 9561493, 10631061, 11238712, 10994441, 9977984, 8641715, 7508693]
6521G508693r50161p33638m84727l93286l49321k01316j94782j96214j47924r8480
6511C758844L0404j5737P9865M1998J94009K42427J94184K59894M46415N10505
6501E742808O18259P81996P77712N71137J03705o67473r67751r37130q21689o69527
6491D532047m54721l84190l09996j76308k07074j95441p0011m6499j83761m5954
6481B458092r0940j8003o381O99O8919J14841Q2240J95294J82226L16654K86501
6470C590142K26479Q1734j39717l46803l93684l47906l26424j75802j43492j62751
6460A861776j17395j52620j12316o7098j4742p0365l3374m7917l7723m4286m5367
6449A118573j6971J8971k597j4771N6809P4115N1412r909K8758n0526j13467j34821
$$ y = [7508693, 6558532, 5824894, 5340167, 4946881, 4597560, 4396244, 4201462, 4005248, 3857324, 3758844, 3789248, 3773511, 3853376, 3895374, 4089383, 4331810, 4525994, 4785888, 5232303, 5742808, 6361067, 7143063, 7920775, 8491912, 8595617, 7928144, 6960393, 6023263, 5201574, 4532047, 4077326, 3693136, 3383140, 3206832, 2999758, 2804317, 2734306, 2687807, 2504046, 2458092, 2367152, 2349149, 2342768, 2343467, 2412386, 2527227, 2609467, 2804761, 2986987, 3303641, 3590142, 3816621, 3898355, 3758638, 3411835, 3018151, 2670245, 2343821, 2168019, 2024527, 1861776, 1744381, 1591761, 1479445, 1412347, 1397605, 1327240, 1293866, 1245949, 1208226, 1163940, 1118573, 1101602, 1120573, 1117976, 1103205, 1160014, 1234129, 1285541, 1275632, 1304390, 1253864, 1140397, 1005576]
6437A005576p1468j3365k5103n8458l5165n1204l435l9111n4979J3826P252m5609
6425F28757l8357m211j4453l4325L9291J9518m938l9892n0727J9509j2713j858
6413E05601k1398J1553L3125m9018M806K1422m696M3769l5032m6394k89J7735
6401D81184m484R599n7380J1982K5795k646O016L8897K141n6031Q071j0155N147
6388D58136J3530q164o8500M4809L4478M6222J3900M1368M0256l2723k7074j3158
6376E43080L545n5220n8040Q3228P0108k8093m347L287m768J13632L9053k8708
6364F76757l9487L6270m3161k3627M3113R9513K624j1218k7215K2867P109K2133
6352G65678L3549K9701O7666q043j5418J5518j8613m7195O8768M8185N3705l521
$$ y = [1005576, 934108, 920743, 895640, 837182, 802017, 750813, 747378, 708267, 653288, 667114, 674366, 628757, 590400, 586189, 571736, 537411, 576702, 596220, 591282, 551390, 500663, 520172, 507459, 505601, 484203, 495756, 528881, 479863, 484669, 506091, 501395, 545164, 510132, 463738, 463449, 481184, 476700, 486299, 428919, 440901, 466696, 464050, 470066, 508963, 511104, 455073, 463144, 452989, 458136, 471666, 463502, 395002, 439811, 474289, 520511, 534411, 575779, 616035, 583312, 556238, 543080, 546625, 491405, 433365, 516593, 586701, 558608, 554261, 557548, 552780, 666412, 705465, 676757, 637270, 673540, 630379, 606752, 649865, 749378, 752002, 740784, 713569, 736436, 743545, 765678, 799227, 828928, 896594, 888551, 873133, 888651, 870038, 822843, 891611, 939796, 993501, 989980]
6340I89980J7689M7344j9777M9775K313K2693r946J9257K9386k5556O808k1492
6328A108474k0351K1167R8261L8154k4175K026L5019J3609J6039P902j752L5066
6316A329439R9632O3109J4312j9380j0735o775J5350k4224n4343l3996N9658K4174
6304A456221J4154J0317L2321k3093M1013P8992J9978O398k7061J6764j3229L9601
6292A652376P8516l2977M0471L3871K1821o627L4367R458K1380Q0339O2578L0010
6280B025583L0451N4232M6663N8222O6010L2796J05949N5965L4703J04393J15193
6269B730160O5289M0659J20762O0866M7127Q2916O9062M4547J70364J51306P2832
6258C655890J12853O6763P0715J25502Q1518J51214J73607J93066J24125R5339
$$ y = [989980, 1007669, 1055013, 1035236, 1085011, 1087324, 1110017, 1100071, 1119328, 1148714, 1123158, 1129966, 1108474, 1088123, 1109290, 1207551, 1245705, 1221530, 1223556, 1258575, 1272184, 1288223, 1296125, 1294373, 1329439, 1429071, 1492180, 1506492, 1487112, 1476377, 1469602, 1484952, 1460728, 1406385, 1372389, 1432047, 1456221, 1470375, 1480692, 1513013, 1489920, 1530933, 1609925, 1629903, 1636301, 1609240, 1626004, 1612775, 1652376, 1730892, 1697915, 1738386, 1772257, 1794078, 1787451, 1821818, 1831276, 1852656, 1932995, 1995573, 2025583, 2056034, 2110266, 2156929, 2215151, 2281161, 2313957, 2419906, 2475871, 2510574, 2614967, 2730160, 2795449, 2836108, 2956870, 3017736, 3064863, 3147779, 3216841, 3261388, 3431752, 3583058, 3655890, 3768743, 3835506, 3906221, 4031723, 4113241, 4264455, 4438062, 4631128, 4755253, 4850592]
6248D850592J97801J01954J69008K07924K21820J67974J92263K43684K48007K86134
6238F887161K44770K51949L09638L27827K55090K75541M40905L62376L76533M38150
6228A0169940M17919N10255N17488N42003O25614O95534P91702Q81241R67927
6219A6119623J119570J294773J415603J534532J864182K261494K837857L408039
6211C1855673L887494M509832M637930L813555K172030Q9551j608660k431551
6203D6925854k327946j574511n25682M82534J491969K457234L187715L622539
6195E3739706L461651K451533J638931J327364J744914K293316J856221M69184
6187F8982820j378999l002062l741021l358649k179541p61578O78734J568085
$$ y = [4850592, 5048393, 5150347, 5319355, 5527279, 5749099, 5917073, 6109336, 6353020, 6601027, 6887161, 7131931, 7383880, 7693518, 8021345, 8276435, 8551976, 8992881, 9355257, 9731790, 10169940, 10587859, 11098114, 11615602, 12157605, 12783219, 13478753, 14270455, 15151696, 16119623, 17239193, 18533966, 19949569, 21484101, 23348283, 25609777, 28447634, 31855673, 35743167, 40252999, 44890929, 48704484, 50876514, 50966065, 49357405, 46925854, 44597908, 43023397, 42497715, 42980249, 44472218, 46929452, 50117167, 53739706, 57201357, 59652890, 61291821, 62619185, 64364099, 66657415, 68513636, 68982820, 67603821, 64601759, 60860738, 57502089, 55322548, 54560970, 55239704, 56807789]
6179E6807789J798819R05756n38817j716401k056900j153489K66973J826716L180197
6170E9320643M310621M272973K557101r08000m907005p197977p400765o510105
6162D3537486n302333m249268l360760k746563k158740j816014j492750j257899
6154B1153159j109469r12852p35156o46580o17266n13750m70269l03025k61705
6145A5583087j67210q6123j29498m9395J23912l4107j18669j19293m3433L3060
6135A4992331J81450K87873M75481N29927N43487N06309L26055J63145N1988J84422
6125A8242468L95571O36811O60012N53340K64964J20183J11042M25287P49535
6116B2159213R81146J056260P32695L78111M3894K5677o2803j713J54302N35255
$$ y = [56807789, 58606608, 59512364, 58973547, 57257146, 55200246, 54046757, 54313730, 56140446, 59320643, 63631264, 67904237, 70461338, 69553338, 64646333, 57448356, 50047591, 43537486, 38235153, 33985885, 30625125, 27878562, 25719822, 23903808, 22411058, 21153159, 20043690, 19130838, 18395682, 17749102, 17131836, 16618086, 16147817, 15844792, 15583087, 15415877, 15329754, 15200256, 15150861, 15274773, 15240666, 15121997, 15002704, 14959271, 14992331, 15173781, 15461654, 15937135, 16467062, 17010549, 17516858, 17842913, 18006058, 18058046, 18242468, 18638039, 19274850, 19934862, 20488202, 20753166, 20873349, 20984391, 21409678, 22159213, 23140359, 24196619, 24929314, 25307425, 25351319, 25376996, 25314193, 25312480, 25466782, 26002037]
6106B6002037R15913J217483J143174P31192K19556k2318K92275P22233J197742
6097C2419287J469729J361204Q90857P62455R24226R40759J310821J796467J810577
6088D3686382J315358L45600l81599j210496k215658l126158l030887k583766
6080C2798776k025375j567297j046813o15744l00639M0462L24674P58065J040869
6071B9406978J567838K059875K563161L058405L057305K339982J135664J6670
6063D5205878n20380j176378j880521j847896j394925q45509n75404o89787p54809
6054C5520269j022660j155207q97292n14011K0866K75650K65774o9128n87774
6045C1836487n70937k97291K11410N88878P00139P89446N52483M54273L21615
$$ y = [26002037, 26917950, 28135433, 29278607, 30009799, 30229355, 30207037, 30499312, 31221545, 32419287, 33889016, 35250220, 36141077, 36903532, 37827758, 38768517, 40079338, 41875805, 43686382, 45001740, 45347340, 44965741, 43755245, 41539587, 38413429, 35382542, 32798776, 30773401, 29206104, 28159291, 27543547, 27242908, 27283370, 27608044, 28366109, 29406978, 30974816, 33034691, 35597852, 38656257, 41713562, 44053544, 45189208, 45205878, 44685498, 43509120, 41628599, 39780703, 38385778, 37540269, 36964865, 36275078, 35520269, 34497609, 33342402, 32445110, 31931099, 31951965, 32227615, 32493389, 32424261, 31836487, 31265550, 30968259, 31179669, 31768547, 32468686, 33258132, 33810615, 34264888, 34586503]
6036C4586503J47760j45495j82990K66751Q39160J237800J478761J653438J739506
6027D1621194J747732J844185J815429K035619K843517L779369M702256N532786
6019F5922087O083869N571150L457367k41619l857923n314721m755577l149634
6011F3714999j624479o5158J195883J947542J765385O64941n75750j440164j033101
6002F4550098J76786J645818L159085M319535M690081M313655K970464J090667
5994H6916189q78078k943528m165109m053162l840176m149669m563158m534795
5986E7788514l794679k652128j534364m64271N02647J424034J928746J980862
5978E5179361J127598m92360k466072l934184m565725m288544l589458k848432
$$ y = [34586503, 34734263, 34588768, 34405778, 34672529, 35511689, 36749489, 38228250, 39881688, 41621194, 43368926, 45213111, 47028540, 49064159, 51907676, 55687045, 60389301, 65922087, 72005956, 77577106, 81034473, 80792854, 76934931, 71620210, 66864633, 63714999, 62090520, 62025362, 63221245, 65168787, 66934172, 67599113, 67023363, 65583199, 64550098, 64726884, 66372702, 69531787, 73851322, 78541403, 82855058, 85825522, 86916189, 86038111, 83094583, 78929474, 74876312, 71036136, 66886467, 62323309, 57788514, 53993835, 51341707, 49807343, 49343072, 49845719, 51269753, 53198499, 55179361, 56306959, 55814599, 53348527, 49414343, 44848618, 40560074, 36970616, 34122184]
5970C4122184k158371j690844j086539m61561J71183O86137J280296J476428R13015
5961C3251928o15718k626889l270261k944459k317787j737303j453692j158073
5953A7127746j010537q41368o67583o79966n93259n08782l87463l00132l31451
5944A1807205l48916k15780j80977k40658j56477r1340o1133J7248K6141J48533
5934A0703846K80906L84480N95215N76210N34549K5967o29913r07548r13517p32744
5924I917451m44936l97647m33109m26081m03609l02190k85639l05394l39210j98229
5914F381407k10566j22373j72221j79580p2150q7677j06974j35518n8957j10787
5904E124604l8042j27495o7865r9438j9647N0188k622p9386M210j0221l7540Q0125
$$ y = [34122184, 31963813, 30272969, 29186430, 28724869, 28896052, 29582189, 30862485, 32338913, 33251928, 32636210, 30009321, 26739060, 23794601, 21476814, 19739511, 18285819, 17127746, 16117209, 15275841, 14608258, 13928292, 13335033, 12826251, 12438788, 12138656, 11807205, 11458289, 11242509, 11061532, 10820874, 10664397, 10573057, 10511924, 10529172, 10555313, 10703846, 10984752, 11369232, 11964447, 12540657, 13075206, 13101173, 12471260, 11563712, 10650195, 9917451, 9472515, 9074868, 8641759, 8215678, 7812069, 7509879, 7224240, 6918846, 6579636, 6381407, 6170841, 6048468, 5876247, 5696667, 5624517, 5536840, 5429866, 5294348, 5235391, 5124604, 5086562, 4959067, 4891202, 4791764, 4772117, 4822305, 4819683, 4740297, 4744507, 4734286, 4696746, 4776871]
5892D776871J17033N0910q9917j30901j78233j32671j39172j79040j08443j46081
5882C840356j14266r6548l7916r9014r0476l6601O281K9599k9470m7121o1024
5871C263800J5180L3659m910q0247N397l9419L6439N021n1686K4721R1218L8504
5859C337677n4004k5060K0828l1949j05877q6547p6372k1681j1724k4934J8744
5848B939101p821j2876K1446m2315k0764L0192Q2016J0977K1739j3301R7396J11112
5836C216902P6969M9819j5529n3737k7878n5277j14420J8573j3379l8621j1259
5825C032163m17K8308p1711p6050j3300j5625M0635l0611m7071j1442m072J5265
5813B846072J0482m9660j20283r6250k9272k9057m4711p7598n0301l7763p7575
$$ y = [4776871, 4893904, 4944814, 4854897, 4723996, 4545763, 4413092, 4273920, 4094880, 3986437, 3840356, 3726090, 3629542, 3591626, 3492612, 3402136, 3365535, 3371816, 3401415, 3371945, 3324824, 3263800, 3278980, 3312639, 3307729, 3227482, 3232879, 3193460, 3229899, 3234920, 3183234, 3207955, 3299173, 3337677, 3283673, 3258613, 3279441, 3247492, 3141615, 3055068, 2978696, 2957015, 2945291, 2920357, 2939101, 2931280, 2918404, 2939850, 2897535, 2876771, 2906963, 2988979, 2999956, 3021695, 3008394, 3105790, 3216902, 3293871, 3343690, 3328161, 3274424, 3246546, 3191269, 3076849, 3095422, 3082043, 3043422, 3032163, 3031746, 3060054, 2988343, 2912293, 2898993, 2883368, 2924003, 2893392, 2846321, 2834879, 2830807, 2846072, 2856554, 2806894, 2686611, 2590361, 2561089, 2532032, 2487321, 2409723, 2359422, 2321659, 2244084]
5802B244084Q55J5922o3151R21M8082J14744j9565n7561j52277j68876j432J4735
5790A976481r5686p5689p8851m5815n5604j4666K0464M0861n903o0342J7289n5411
5778A567128K6025L0230m1327n5125j04242q871n6645M736l9084M5914L4611n7899
5766A345451j6359K3454J5264l6953l4900K6924j2981n2887l0974r1392k7352
5755A107295J6524J09903k4625n1284j7436J2890l584J7924p2137l4417j6131
5744A044922k4711L9387P071l1181R315K4429k9779N6381R437l6313j2488m9707
5732A006763J2471J2313j3872r162k8087N574J4830j5693j8051k4972o172j906
5720I34036j519l024R100L8822m6337j6253k1160J3560P5384p4985J3999M8721
$$ y = [2244084, 2244939, 2260861, 2197710, 2198631, 2246713, 2361457, 2341892, 2284331, 2132054, 1963178, 1961746, 1976481, 1880795, 1805106, 1726255, 1680440, 1624836, 1610170, 1630634, 1671495, 1665592, 1605250, 1622539, 1567128, 1593153, 1623383, 1582056, 1526931, 1422689, 1413818, 1357173, 1361909, 1322825, 1368739, 1403350, 1345451, 1329092, 1352546, 1367810, 1330857, 1295957, 1322881, 1309900, 1257013, 1226039, 1134647, 1107295, 1123819, 1233722, 1209097, 1157813, 1140377, 1153267, 1149683, 1167607, 1095470, 1061053, 1044922, 1020211, 1059598, 1066669, 1035488, 1044803, 1069232, 1039453, 1095834, 1105271, 1068958, 1056470, 1006763, 1019234, 1031547, 1017675, 1008513, 980426, 986000, 1000830, 985137, 967086, 942114, 935942, 934036, 932517, 929493, 938593, 977415, 931078, 914825, 893665, 907225, 982609, 907624, 921623, 970344]
5708I70344R910q681o3022o2828L0895L4933k607N494K9167l9448m883k1749k410
5695H75115N2724l3782J171l1882N6074O8870J3267k4639m3486J4618K8166J10105
5683A086321J9671j3358K0274m2223o9442j3672m0209m1774J0263M825K9150M7078
5671I96904k8254m1183R5481j4863o1529P162J7863K2108K0186L1327L6508k9681
5659A052029k0109J3350o5165J9863L8370J4320j3929l5412n3075k1582m5457
5648H83203k1722K5957p851M692m381K5583Q4033J6037o5012m1201o449J3363
5636I06252m3369o0360n6831J800L376j4441k3442N1218p4021j3759P905J1691
5624F96019L4681K7885m5282K56N9655Q3930J5090r1584k4517q8884p9372J7047
$$ y = [970344, 980254, 971573, 908551, 845723, 876618, 911551, 908944, 914438, 943605, 904157, 899274, 877525, 875115, 927839, 894057, 895228, 863346, 919420, 988290, 1001557, 976918, 933432, 948050, 976216, 1086321, 1105992, 1092634, 1112908, 1070685, 1001243, 987571, 947362, 905588, 915851, 920676, 949826, 996904, 968650, 927467, 1022948, 1008085, 946556, 953718, 971581, 993689, 1013875, 1045202, 1081710, 1052029, 1031920, 1045270, 980105, 999968, 1038338, 1052658, 1038729, 1003317, 950242, 928660, 883203, 861481, 887438, 879587, 884279, 879898, 905481, 989514, 1005551, 940539, 899338, 892889, 906252, 862883, 802523, 745692, 747492, 750868, 736427, 712985, 764203, 690182, 676423, 684328, 696019, 730700, 758585, 713303, 713559, 773214, 857144, 872234, 780650, 756133, 667249, 587877, 604924]
5612F04924M4839J8259K0680m5335l2067P462j7150L8632J133k7099J9794j3036
5600F21036j8638L0608j4442j0219K3585N791J4320q5209o9371O8533J9882o655
5588E79221N1043m7500n4772K7385l37J774L4639M8161k9984m2547M1124j543
5576F06664n8297J3479R5619m2058K6357K8719j6096k9626J809J173j5268P1777
5564F84252k6782o8441l4605M7318k1073n782N7755K5040K8629j0281L8491J654
5552G16175J7615m4158N839O02K0099L0334K6121J1611K4071J2065m8611K1193
5540G92956K1011K5397m7460j7990O3K8455n400p005k6212P27n752J4844M0424
5527H14058n3965Q562J8342J3931O2260L8833l0526k7779J4342K9717J9792M2283
$$ y = [604924, 649763, 668022, 688702, 643367, 611300, 618762, 601612, 640244, 641377, 614278, 634072, 621036, 602398, 633006, 618564, 608345, 631930, 637721, 652041, 566832, 497461, 565994, 585876, 579221, 630264, 582764, 527992, 555377, 555040, 556814, 591453, 639614, 609630, 567083, 608207, 606664, 548367, 561846, 657465, 615407, 641764, 670483, 654387, 624761, 626570, 627743, 612475, 684252, 657470, 589029, 554424, 601742, 580669, 574887, 632642, 657682, 686311, 676030, 714521, 716175, 733790, 689632, 695471, 696073, 716172, 746506, 772627, 784238, 808309, 820374, 771763, 792956, 813967, 839364, 791904, 773914, 773977, 802432, 797032, 790027, 763815, 764542, 758790, 773634, 814058, 760093, 768655, 786997, 800928, 863188, 902021, 871495, 843716, 858058, 887775, 907567, 949850]
5515I49850p0389J9659j7139p7482R0161P0932k7020o6725j4986R5257O2781l2596
5503I82303l8682m3110J4426J9837K4308o9715o0791O0551l6129k305j572J7566
5491H66687m8146J3954R3896m2081M7088o905J21278N9423K1943K0176j1876O6294
5479A201731J9159J4719K0343n2315r8361p6573o0237k9831p8144o2246K4095
5468H22340P572K8812r7944K593R2368J8041j6493O0595J7916J1428N5978N125
5456A008331M8521P2464k9555N5160k0770j7759P7802j02172j3292o0816j47383
5445H70531q6243n2456m6473K6986k0518l201O729Q271j5977N505k562R5101M0691
5432H26384N6068K3729O0394O3513M8965l2288K2358K2475j56024O339k0041k9309
$$ y = [949850, 879461, 899120, 881981, 804499, 894660, 965592, 938572, 871847, 856861, 952118, 1014899, 982303, 943621, 900511, 914937, 934774, 959082, 889367, 828576, 889127, 852998, 850693, 849121, 866687, 818541, 832495, 926391, 884310, 931398, 924493, 1045771, 1105194, 1127137, 1147313, 1135437, 1201731, 1220890, 1235609, 1255952, 1203637, 1105276, 1028703, 968466, 938635, 860491, 798245, 822340, 829912, 858724, 760780, 763373, 855741, 873782, 857289, 917884, 935800, 947228, 1003206, 1008331, 1056852, 1129316, 1099761, 1154921, 1134151, 1116392, 1194194, 1092022, 1078730, 1017914, 870531, 784288, 731832, 685359, 712345, 691827, 688626, 695355, 703626, 687649, 693154, 690592, 785693, 826384, 882452, 906181, 966575, 1030088, 1079053, 1046765, 1069123, 1091598, 935574, 941913, 921872, 892563]
5420H92563r222j6560j4743l3350P6266j0930k1654L4423k9606Q315J29105N8857
5408A063464Q6188J44326K3679J54747J81970J70512Q2931o3279k02601k25083
5398A416854j54996j15484q9036n9722p2407r2202p0640k7197j5197j6821L6981
5387G40133k9292l5941K235J9113P9680O9149m0406q78m292k4693l0156j7595
5375G27057k3987L245k6140l0239k5463n1161k0862m0338L9139p8859Q669j6748
5363D64313j4007j016k909J9831p0199J2015O930j642O217j6108r799k0208j8306
5350C55112J8125K6814o8147M9234K8975P740r812l2295J7483J2856p7043p930
5338C21112l4134n950K4084k2821M313L4303l499K7665o1225l230N3695K5902
$$ y = [892563, 883341, 866781, 852038, 818688, 894954, 884024, 862370, 896793, 867187, 875502, 1004607, 1063464, 1149652, 1293978, 1317657, 1472404, 1654374, 1824886, 1907817, 1844538, 1641937, 1416854, 1261858, 1146374, 1057338, 997616, 925209, 833007, 762367, 735170, 719973, 703152, 740133, 710841, 674900, 677135, 696248, 775928, 845077, 804671, 803793, 799501, 774808, 744652, 727057, 703070, 706315, 680175, 649936, 624473, 573312, 552450, 512112, 551251, 472392, 481061, 464313, 450306, 449290, 446381, 466212, 396013, 408028, 414958, 413316, 419533, 403425, 393626, 373418, 355112, 373237, 400051, 331904, 381138, 410113, 417853, 408041, 375746, 393229, 406085, 329042, 321112, 286978, 281028, 305112, 282291, 286604, 320907, 317408, 345073, 283848, 280618, 334313, 360215]
5326C60215j5790q00j6118j2608J1717N8980j1818o6779L3742o3309J061o3444
5314B15049P4746j9727O831M5375l1649M6855P289m4186Q450k3900J4721n094
5302B94760J12L3575L3124l8598j4083p171k1102p389J9558r809J2681K4991L7615
5289C58264l6958m7483p547k6560j7170R207Q1583m2327r084J4205K6358P3965
5277C76453q9604n3723j9192k3740K609m077L5498N2042m8730l3620k7530Q354
5265A74740N8297Q115j618k7686l028K7665m9562l6466L1376O7238j9346n5726
5253A73999j6761J7582L1993j9983K0320k6866O950m439J2651J5505K530m2129
5241A71352n9605n6910K4867J05055p25P50K2955n124j7309j5192K1082m1330
$$ y = [360215, 344425, 343625, 327507, 314899, 326616, 385596, 373778, 306999, 340741, 277432, 278493, 215049, 289795, 270068, 276899, 322274, 290625, 337480, 344769, 300583, 309033, 285133, 299854, 294760, 294872, 328447, 361571, 322973, 308890, 301719, 280617, 273228, 292786, 282977, 295658, 320649, 358264, 321306, 273823, 266276, 239716, 222546, 231753, 313336, 271009, 261925, 276130, 302488, 376453, 286849, 233126, 213934, 190194, 192803, 188726, 224224, 276266, 227536, 193916, 166386, 174740, 233037, 241152, 239534, 211848, 208820, 236485, 186923, 150457, 181833, 249071, 229725, 173999, 157238, 174820, 206813, 186830, 207150, 180284, 187234, 182795, 195446, 210951, 213481, 171352, 111747, 54837, 79704, 184759, 184034, 184784, 207739, 202615, 185306, 170114, 191196, 149866]
5229A49866K9010J0898J182m6498k5818M5970M719L077J1182o4783m0095K962
5217H1672j9033M1893K2418m9353L1228j1848M1630K5115l0541l985L9348l5886
5205A32658j3844P6166p848j9876p2505N9556J4550n0798m501k416j1210J4134
5193A14066o991M1546L3954L4958m921L0759q5045m4157O4172Q3786q879m5975
5181B07273j5422J537j3034J3388L2759N206M6402o612K7226K6967J37249Q3440
5169E46379J06095O7740M0698N7705l444n5649p9914j00192p6737l8414l4945
5158D29322j4758j6218l5268J792k7853r289o1502o2728L9879O5064k5827k4633
5146B57981j3494l4858O1615J4518l4008N8802O9782q309N1188O5289k352K5906
$$ y = [149866, 178876, 189774, 190956, 144458, 118640, 164610, 169329, 172406, 183588, 118805, 78710, 81672, 62639, 104532, 126950, 77597, 108825, 96977, 138607, 163722, 133181, 129196, 168544, 132658, 118814, 194980, 187132, 167256, 94751, 154307, 168857, 118059, 113558, 111142, 99932, 114066, 107075, 148621, 182575, 217533, 212612, 243371, 158326, 114169, 178341, 262127, 253248, 207273, 191851, 193388, 180354, 193742, 226501, 231707, 278109, 271497, 298723, 325690, 462939, 546379, 652474, 720214, 760912, 818617, 815173, 759524, 679610, 579418, 502681, 464267, 429322, 414564, 398346, 363078, 364870, 337017, 327728, 266226, 203498, 243377, 308441, 282614, 257981, 244487, 209629, 271244, 285762, 251754, 310556, 380338, 372029, 423217, 488506, 486154, 512060]
5134E12060J9464N5539N4222r958j10066J403M2566n6242m3420L876j556N395
5122D73283J4823o5247l270K793n091M1231L1500K0304L6082Q3699L9662K6483
5110F96252P0373j1473K1705q2968j1713M1331K9098Q0297O1820P8821J05227
5099A078770k9287L8655R4509J5711p1953r3129p8146j04284p4556l6148m9162
5088F90980p1974N7449l6196k7213P775N9740j5909l8521j8935k7029K5443n9882
5076E45728L0794N5997P1858N1437P7932J4632M4326J81633J46598J69897J48158
5065A538990K13828J81503M9426k6002j00514j82400k57371q4192j19593m5085
5055A168590J1710r2364k0555o4566j1386r2159l342J915l4361J6390R2553N6804
$$ y = [512060, 531524, 587063, 641285, 631327, 521261, 522664, 565230, 508988, 465568, 469444, 467888, 473283, 488106, 422859, 419589, 422382, 417291, 458522, 490022, 510326, 546408, 630107, 669769, 696252, 766625, 755152, 776857, 693889, 682176, 723507, 752605, 832902, 894722, 973543, 1078770, 1049483, 1088138, 1182647, 1198358, 1126405, 1033276, 955130, 850846, 776290, 740142, 690980, 619006, 676455, 640259, 613046, 620821, 680561, 664652, 626131, 607196, 580167, 605610, 545728, 576522, 632519, 704377, 755814, 833746, 848378, 892704, 1074337, 1220935, 1390832, 1538990, 1752818, 1934321, 1983747, 1957745, 1857231, 1674831, 1417460, 1333268, 1213675, 1168590, 1180300, 1087936, 1067381, 1002815, 991429, 899270, 895928, 897843, 863482, 879872, 972425, 1029229]
5043A029229k1606K8463Q4265J08381J79873J21201Q2866J89192J80816J93559
5033B176239L33686K97581K50788K51986L5495k10302l30188l81622l25067k11511
5023A887085k25425j83301j35748j51656j26820N469j08217l0318J4048l0868
5013I14249p2662l6788J65R8085l1501R260k0928j1281O7593L1864L9694J3992
5001A001742K7727N4842N6718O2986m162o8941M319n8608k6991j8763J6012N699
4989A052580p533k7991K2645K4633l4734n954k3917K7959O6719K7172L8321o5259
4977A094641j2781j8510l6930l8301L9740J03107M0232l2561o0753J1915L1121
4966A120920J4130J0359P5349m1205l8631K0966R3558Q1730j49k5503M0714L4046
$$ y = [1029229, 1007623, 1036086, 1120351, 1228732, 1408605, 1529806, 1612672, 1801864, 1982680, 2176239, 2509925, 2807506, 3058294, 3310280, 3345775, 3135473, 2805285, 2423663, 2098596, 1887085, 1661660, 1478359, 1342611, 1190955, 1064135, 1069604, 961387, 931069, 945117, 914249, 841587, 804799, 804964, 903049, 871548, 880808, 859880, 848599, 916192, 948056, 987750, 1001742, 1029469, 1084311, 1141029, 1204015, 1199853, 1130912, 1135231, 1076623, 1049632, 1030869, 1046881, 1052580, 1045047, 1017056, 1039701, 1064334, 1029600, 1023646, 999729, 1027688, 1094407, 1121579, 1159900, 1094641, 1081860, 1063350, 1026420, 988119, 1027859, 1130966, 1171198, 1138637, 1077884, 1089799, 1120920, 1135050, 1145409, 1220758, 1179553, 1140922, 1161888, 1255446, 1337176, 1337027, 1311524, 1352238, 1386284]
4954A386284o8425L1661l19n709J01012p951p4435k6033K8887J2915m1220J0160
4942A346827K0275L3365K129k4976N7010N4281r577j0093M5161N5996J3777J10119
4930A694294J35462R4052J01149J00582O9863J16937Q3727L2826M5038J15874
4920B589804L7586J02451J7263J3290K5575J03642J07740N4517P5649Q8179M1486
4909C257182J07790J10455P7236L0899R4314J57743J11119P0699J16890J12136
4899D246463N8651K2649K12919J94065J25320J88627K50987K62536L33969K70919
4889F167105K93078M12924K90286L51286L09897L00997L00821L92070L45168L68867
4879I532499M34117M86152N72287O60892O40253P01120P31382Q23007Q32394Q80289
$$ y = [1386284, 1317859, 1349520, 1349201, 1343492, 1444504, 1436553, 1362118, 1336085, 1364972, 1377887, 1336667, 1346827, 1367102, 1400467, 1402596, 1377620, 1434630, 1488911, 1479334, 1469241, 1514402, 1570398, 1584175, 1694294, 1829756, 1923808, 2024957, 2125539, 2195402, 2312339, 2396066, 2428892, 2473930, 2589804, 2627390, 2729841, 2747104, 2760394, 2785969, 2889611, 2997351, 3051868, 3127517, 3215696, 3257182, 3364972, 3475427, 3552663, 3583562, 3677876, 3835619, 3946738, 4017437, 4134327, 4246463, 4305114, 4327763, 4540682, 4734747, 4860067, 5048694, 5299681, 5562217, 5896186, 6167105, 6460183, 6873107, 7163393, 7514679, 7824576, 8125573, 8426394, 8818464, 9163632, 9532499, 9966616, 10452768, 11025055, 11685947, 12326200, 13027320, 13758702, 14581709, 15414103, 16294392]
4869A6294392R94149J127260J303879J452133J532033J772526K285773K784372
4861B9546517L230202L797693M752742O330381Q316327J0163314J2286809J4707048
4853I3131033J3578774Q606297l982069j5733624j7619124j4833419j0821642
4846E2326226q055025o129904m819711l780551k996737k277714j832987j507755
4838B0925842j224345j000435q32421o34816p00473n14802m46233m43845l40938
4829A4787534k67331j72323j69203o4572j8013k288Q6541J65314R1207O0379P4304
4818A4571549P8905J84208K54232L08807M27393M43856O29078Q09912J001449
4809A8709389J163484J507589J605926J921549K296445L101732M213681N619124
$$ y = [16294392, 17288541, 18415801, 19719680, 21171813, 22703846, 24476372, 26762145, 29546517, 32776719, 36574412, 41327154, 47657535, 55973862, 66137176, 78423985, 93131033, 106709807, 115316104, 111334035, 95600411, 77981287, 63147868, 52326226, 44271201, 38141297, 33321586, 29541035, 26544298, 24266584, 22433597, 20925842, 19701497, 18701062, 17868641, 17233825, 16533352, 16018550, 15572317, 15128472, 14787534, 14520203, 14347880, 14178677, 14114105, 14096092, 14093804, 14180345, 14345659, 14436866, 14497245, 14571549, 14650454, 14834662, 15088894, 15397701, 15825094, 16268950, 16898028, 17707940, 18709389, 19872873, 21380462, 22986388, 24907937, 27204382, 30306114, 34519795, 40138919]
4801D0138919O864404R287177J0260315Q487820K768746p094379j1474023j0525386
4793D8713593p940432n627116m170385l247349k616757k034094j666891j373051
4785B0037518j117023r33195p52539n90732n59003m69177k76327k26355j99864
4776A4913303j50133r8821r8612j17544N767j22296r1408K7011L1751J6431L538
4765A4318987j2239K1913R768m3833J44593K13711J94234L29807L18809L61626
4755A5857376L62943M17320L46424M33501N33486N72819O24408P41726P41672
4746B0631675Q21385Q44947R38213J103997J085866J133675J178918J150836J301100
4737C0190612J340207J413462J542273J733994J978916K366294K716408L111260
$$ y = [40138919, 47003323, 56290500, 66550815, 75038635, 77807381, 70713002, 59238979, 48713593, 40773161, 35146045, 30975660, 27728311, 25111554, 23077460, 21410569, 20037518, 18920495, 17987300, 17234761, 16644029, 16085026, 15615849, 15339522, 15113167, 14913303, 14763170, 14664349, 14565737, 14448193, 14453960, 14331664, 14240256, 14267267, 14299018, 14315449, 14318987, 14306748, 14328661, 14338429, 14294596, 14439189, 14652900, 14847134, 15176941, 15495750, 15857376, 16220319, 16637639, 16984063, 17417564, 17951050, 18523869, 19148277, 19890003, 20631675, 21453060, 22298007, 23236220, 24340217, 25426083, 26559758, 27738676, 28889512, 30190612, 31530819, 32944281, 34486554, 36220548, 38199464, 40565758, 43282166, 46393426]
4729D6393426L673730M264848N138936O201503P219089Q255501R697359J2157089
4721A03001481J6576214K2232858K7614649L5240796M3137376M0092550K4753902
4714C12649826j1781427m3494267m8364162m0700943k9991209k2477208j7308984
4707I8531626j3719069j0621504q404603o593156n407089m409704l720974l181412
4699D2474115k717209k309020k204413j857962j736293j583037j517215j268193
4691B7280773j146976j006243q49042p41942p67533o83537o28820n65370n02835
4682B0388475l16877j54770n9716j08694Q1474R5318n8198m85688r81744j155539
4672A7244041j031886q65864o76290n91255n67319m68906m58853l85943m09983
$$ y = [46393426, 50067156, 54332004, 59470940, 65672443, 72891532, 81147033, 90844392, 103001481, 119577695, 141810553, 169425202, 204665998, 247803374, 287895924, 312649826, 300868399, 257374132, 209009970, 168309027, 138317818, 115840610, 98531626, 84812557, 74191053, 65786450, 59193294, 53786205, 49376501, 45655527, 42474115, 39756906, 37447886, 35243473, 33385511, 31649218, 30066181, 28548966, 27280773, 26133797, 25127554, 24278512, 23536570, 22769037, 22085500, 21456680, 20891310, 20388475, 20071598, 19916828, 19857112, 19748418, 19829892, 19925210, 19867012, 19381324, 18399580, 17244041, 16212155, 15346291, 14670001, 14078746, 13511427, 13042521, 12583668, 12197725, 11787742]
4663A1787742l07129k43755j79013k60804k93227j89182j93841j94693j30504
4654I795594m174M0725o678j0126o5506r7889j7709k686j10246j59397j45056
4643I216852m3315M1434J92292L12100L64094L16667m8612m33176n75416o57731
4633H685189o45216n61380m75208l42996l41620l17736k80272k51048j41831j94995
4623E132887r1474q5508o0440j33152j24552r2222o0150p977n0243n6414q0336
4612D290419n1918n9673j55829r1079q0069p9903o9170j07608n1255p6675j11684
4601C355556j05225M142n9134r0471n4063p1915o6771m6334l3113l6875n1075
4590B744722n2881J7055k3652n8244Q908p1960k8347k185M2866n7587j9810j4361
$$ y = [11787742, 11480613, 11236858, 11057845, 10797041, 10503814, 10314632, 10120791, 9926098, 9795594, 9791420, 9832145, 9825467, 9815341, 9749835, 9651946, 9634237, 9631551, 9521305, 9361908, 9216852, 9173537, 9214971, 9407263, 9719363, 10083457, 10400124, 10351512, 9918336, 9342920, 8685189, 8039973, 7478593, 7003385, 6660389, 6318769, 6001033, 5720761, 5469713, 5327882, 5132887, 5041413, 4955905, 4895465, 4762313, 4637761, 4545539, 4485389, 4477412, 4427169, 4370755, 4290419, 4238501, 4178828, 4022999, 3931920, 3851851, 3771948, 3702778, 3595170, 3543915, 3467240, 3355556, 3250331, 3254473, 3195339, 3104868, 3050805, 2978890, 2912119, 2865785, 2832672, 2795797, 2744722, 2691841, 2708896, 2685244, 2627000, 2635908, 2563948, 2535601, 2533416, 2576282, 2518695, 2498885, 2484524]
4578B484524p2097k7976p327n6198m5693M7324l8360m1846k1420J4497j9251r931
4566B206246l9282p2803p3424K3808j8658p236O3116k7379o8779m9610k3802l1628
4554A880569q421K7039j4560o8961q1166m6563l8013l0519k9928k8762k1013o5876
4542A473826J5479L5975J43519J42535J57027J76974L4958M1268N8356K2965j69600
4531B133282j39534o1356n8795q9090q4647k9348l363q0661p4684k5274k9414
4520A457116m2908l485L2849Q0587o6855k3636r18l0851k9741N8008K1720n1156
4508A400730m6530q3843M2124M1455l7502j2988L7672M4064J015O9411J0650M3916
4496A510174m42r0838r600O2047K517n9599k4317K4893O9820K0489M7857o5846
$$ y = [2484524, 2412427, 2384451, 2377124, 2320926, 2275233, 2322557, 2284197, 2242351, 2220931, 2235428, 2216177, 2206246, 2166964, 2094161, 2020737, 2044545, 2025887, 2018651, 2081767, 2054388, 1985609, 1935999, 1912197, 1880569, 1872148, 1899187, 1884627, 1815666, 1734500, 1687937, 1649924, 1619405, 1589477, 1560715, 1539702, 1473826, 1489305, 1525280, 1668799, 1811334, 1968361, 2145335, 2180293, 2221561, 2279917, 2302882, 2133282, 1993748, 1932392, 1873597, 1784507, 1699860, 1670512, 1667149, 1586488, 1511804, 1486530, 1457116, 1414208, 1410723, 1443572, 1524159, 1457304, 1433668, 1432750, 1401899, 1372158, 1430166, 1451886, 1400730, 1354200, 1270357, 1312481, 1353936, 1316434, 1303446, 1341118, 1385182, 1386197, 1455608, 1466258, 1510174, 1509732, 1418894, 1409294, 1471341, 1473858, 1414259, 1389942, 1414835, 1484655, 1505144, 1553001, 1487155]
4484A487155k2441N5759L9115J7937k0237q2198J6591l9711q2718m8796M3369
4473A363825K882l5256R1375j9796l9769o2884O081Q808q7532J9181P590k8675
4461A225830j5541M8830M5037M924J6903k4374L6405R6656p0587P344J5173L5983
4449A422583J8566N1131k0939N9655Q1950Q7491M3232L7560J90258Q7469P7336
4438B136292K22681K81985J87347O8136n9905o0973k39811j75675j41716j29693
4428B088668j32509j00624O187q581n4425q913J6014q898L965k423J7932o9294
4416A747099K2560q626M3934L3036O5266O3559l3599K2741J20557J35458P6889
4405B288874O0551J19812J28972J62132K24943K97177L17424K52083J02085j13730
$$ y = [1487155, 1464714, 1520473, 1559588, 1577525, 1557288, 1475090, 1491681, 1451970, 1369252, 1320456, 1363825, 1366707, 1331451, 1422826, 1403030, 1363261, 1300377, 1306458, 1315266, 1227734, 1246915, 1254505, 1225830, 1210289, 1259119, 1304156, 1309080, 1325983, 1301609, 1338014, 1434670, 1364083, 1371427, 1386600, 1422583, 1441149, 1492280, 1471341, 1530996, 1612946, 1700437, 1743669, 1781229, 1971487, 2058956, 2136292, 2358973, 2640958, 2828305, 2896441, 2836536, 2775563, 2535752, 2360077, 2218361, 2088668, 1956159, 1855535, 1861722, 1853141, 1798716, 1789803, 1805817, 1796919, 1800884, 1798461, 1816393, 1747099, 1769659, 1761033, 1804967, 1838003, 1903269, 1966828, 1933229, 1955970, 2076527, 2211985, 2288874, 2349425, 2469237, 2598209, 2760341, 2985284, 3282461, 3599885, 3851968, 3954053, 3840323]
4395C840323j29322r0642M1360J00009J18544K25792L19036L19879J39078j9191
4385D864866j0234J78j3215N906q9477l16169l92456l70287l56639k90016k15869
4374B816588j83456j41841j85578p1937q8551k5676r3676j09832n4808n6149j3890
4363A791194j7573p2884o3924J4360N794j1390P856l7443o5591K2724L5345n9396
4351A549072j64559L22J9145J1762p842J0770j5243m4930k7041J6377n2877n1547
4339A243409J6370L0861q228q8548k8005j6993l1999N3042K9936m7811j1592K150
4327A142592j8331j1985K3556O8011O7715Q9435J07868O130j4633L3849j8866
4316A475341l910n2013k1767p507r1404l372l1925K652l1687L8868o822K593M8010
$$ y = [3840323, 3711001, 3620359, 3661719, 3761728, 3880272, 4106064, 4425100, 4744979, 4884057, 4864866, 4854632, 4854810, 4841595, 4847501, 4758024, 4441855, 4049399, 3679112, 3322473, 3032457, 2816588, 2633132, 2491291, 2305713, 2233776, 2145225, 2119549, 2025873, 1916041, 1861233, 1805084, 1791194, 1773621, 1700737, 1636813, 1651173, 1656967, 1645577, 1653433, 1615990, 1550399, 1573123, 1608468, 1549072, 1384513, 1384835, 1403980, 1415742, 1407900, 1418670, 1403427, 1358497, 1331456, 1347833, 1294956, 1243409, 1259779, 1290640, 1282412, 1193864, 1165859, 1148866, 1116867, 1169909, 1199845, 1152034, 1140442, 1142592, 1124261, 1112276, 1135832, 1203843, 1271558, 1360993, 1468861, 1474991, 1460358, 1494207, 1475341, 1471431, 1419418, 1397651, 1390144, 1298740, 1295368, 1263443, 1266095, 1234408, 1273276, 1266454, 1269047, 1317057]
4303A317057M112P171M5500K4737o329J4931J3569J9412m6940M3M2488N835L4135
4290A475721l0597R8139J22506M7388J780m800M5456l693n456k5801L9293J1534
4278A771470M035O1309j372N9415L8618Q2477m663J7551K1088J0891O855J4447
4266B082121L6453M6594K1906o2K8567L6351P9619K67K4254Q0669Q4165P7328
4254B598232K2962P0379J10186J8421N1458L7975R0897Q0598J11651R8672J15673
4243C407104N8142O3245L4811k523N9387J4408P4115M4942Q6426J34959j2427
4232C962589J05631J513J09244J08074J33380J31751P4767J44354K64181K96887
4222E332371K69333K71078K71627K47158K35600L48406L72906M63712N34412N25062
$$ y = [1317057, 1321169, 1328340, 1373840, 1398577, 1392248, 1407179, 1420748, 1440160, 1393220, 1393263, 1435751, 1441586, 1475721, 1445124, 1543263, 1665769, 1713157, 1714937, 1710137, 1755593, 1751900, 1746444, 1720643, 1759936, 1771470, 1775505, 1836814, 1835442, 1894857, 1933475, 2015952, 2011289, 2028840, 2049928, 2060819, 2067674, 2082121, 2118574, 2165168, 2187074, 2187012, 2215579, 2251930, 2331549, 2331816, 2356070, 2436739, 2520904, 2598232, 2621194, 2691573, 2801759, 2820180, 2871638, 2909613, 3000510, 3081108, 3192759, 3291431, 3407104, 3465246, 3528491, 3563302, 3560779, 3620166, 3634574, 3708689, 3753631, 3840057, 3975016, 3962589, 4068220, 4069733, 4178977, 4287051, 4420431, 4552182, 4626949, 4771303, 5035484, 5332371, 5601704, 5872782, 6144409, 6391567, 6627167, 6975573, 7348479, 7812191, 8346603, 8871665]
4212H871665O84296O89420L62581J8079k11735l03125k53132j32175j16162m8158
4202I561554n2977R9986J24999J13242J67112J72766J44945K34785K29190J94771
4192A0990373L96551L87952L06502M32799M26628M54377N65295N15541N18285
4183A4994303N73072O30863P75835Q37422R22555R65524J091032J056188J167082
4174B3013876J327251J286676J267752J327582J421438J565136J678914J895182
4166C4783807K097938K470966K775760L158242L506718M047982M569237N431926
4158F2842576O429607P580375Q942920J0785077J3679011J7692914K2589951K8631953
4150A79174384L3920069L5253513K7839160Q206577j4807791l2905019l8545561
$$ y = [8871665, 9555961, 10245381, 10607962, 10626041, 10414306, 10111181, 9858049, 9725874, 9609712, 9561554, 9508577, 9608563, 9733562, 9846804, 10013916, 10186682, 10331627, 10566412, 10795602, 10990373, 11386924, 11774876, 12081378, 12514177, 12940805, 13395182, 13960477, 14476018, 14994303, 15567375, 16198238, 16974073, 17811495, 18734050, 19699574, 20790606, 21846794, 23013876, 24341127, 25627803, 26895555, 28223137, 29644575, 31209711, 32888625, 34783807, 36881745, 39352711, 42128471, 45286713, 48793431, 52841413, 57410650, 62842576, 69272183, 76852558, 85795478, 96580555, 110259566, 127952480, 150542431, 179174384, 213094453, 248347966, 276187126, 284393703, 269585912, 236680893, 198135332]
4143A98135332l4122757k6952087k0601305j5948611j2551919r922691p817260
4136G0218702o376753n387525m680989m075571l595822l212606k904710k578510
4128C7406216k335867k101419j912791j658377j469613j261210j079954j092567
4120B4494418r94294q76445q07287p70598p01902o36954o54403n86690p20747
4111A7745098o33417o84287o38060o07539m93185m87335m16213l42742l82835
4102A3059485l41736l40370l28139k72385k63165j85755k38234j76762j84232
4093A0728707k11148j95724k30030l73660k95970k37136k40932j16104j20464
4084H707539q4743j70495j44284j79231k34031j78409k28297k14165k38505j79606
$$ y = [198135332, 164012575, 137060488, 116459183, 100510572, 87958653, 78035962, 70218702, 63841949, 58454424, 53773435, 49697864, 46102042, 42889436, 39984726, 37406216, 35070349, 32968930, 31056139, 29397762, 27928149, 26666939, 25586985, 24494418, 23500124, 22623679, 21816392, 21045794, 20343892, 19706938, 19052535, 18465845, 17745098, 17111681, 16427394, 15789334, 15181795, 14688610, 14201275, 13785062, 13442320, 13059485, 12717749, 12377379, 12049240, 11776855, 11513690, 11327935, 11089701, 10912939, 10728707, 10517559, 10321835, 10091805, 9718145, 9422175, 9185039, 8944107, 8828003, 8707539, 8622796, 8452301, 8308017, 8128786, 7894755, 7716346, 7488049, 7273884, 7035379, 6855773]
4074F855773k49947j28116j83576j69839n9479m1819j36062k11759j53202r9082
4064E422892j48460j51488j05857n0862o5824R64r5545j36906k2709n723r7897
4053D542585q2001r2589q5735m5238l7137L2642q2467o3398p3320j04943j02413
4042C805986j15639p877n2587j18846k4902m0054j7370m0583k9659m917k6383
4031C327169o0358p4896p6014k0445l8991o124o7074j6627j07674r531k8683o5886
4019B754866m1677K8034l8348M0638J5480k1860n5806J4701K6945j25485k8944
4008B568544j4255P3211j2149j4464K0400m7626j2639o2656J3187L7269j5556
3997B533266j9372L5266Q360j1856O0698J6400P9750O6263l0326l7354o9760p2507
$$ y = [6855773, 6605826, 6477710, 6294134, 6124295, 6064816, 6022997, 5886935, 5675176, 5521974, 5422892, 5274432, 5122944, 5017087, 4966225, 4900401, 4901365, 4805820, 4668914, 4646205, 4640482, 4542585, 4460584, 4367995, 4282260, 4237022, 4199885, 4232527, 4150060, 4086662, 4013342, 3908399, 3805986, 3690347, 3682470, 3629883, 3511037, 3486135, 3446081, 3428711, 3388128, 3358469, 3353552, 3327169, 3266811, 3191915, 3115901, 3095456, 3056465, 3050341, 2983267, 2966640, 2858966, 2849435, 2820752, 2754866, 2713189, 2741223, 2702875, 2743513, 2758993, 2737133, 2681327, 2696028, 2722973, 2597488, 2568544, 2554289, 2627500, 2615351, 2600887, 2621287, 2573661, 2561022, 2498366, 2511553, 2548822, 2533266, 2513894, 2549160, 2557520, 2545664, 2606362, 2622762, 2702512, 2768775, 2738449, 2701095, 2631335, 2558828]
3985B558828j29858r4728p4957q6901k0970q5973n5080k0008j7837p5952k2801
3974A873763P0861Q8200J00462J1511L7383K5692J7616J4606P689j1625M920M9393
3962B290471N3590K3207L1747J0765J2496Q7606k2602L6628n9446l6933l4366
3951B393163k6854k5319j1134Q6727o2890q1288n6538k3454J4844j0349j7979
3940B178929L5074O3435j527J6568M3723L0381O0366L4382q351k1472J6835P1876
3928B520219O2921M9615k1464l1178N335N7054N4551K3519K2470N3442J0687l8227
3916B768944M5237J03137J1952O3553J16813L2773J05294J17602J01463O2444
3906C529212K30732J40408J40259J67431K66642J86055Q1210K44946K93394K86170
$$ y = [2558828, 2428970, 2334242, 2259285, 2172384, 2151414, 2065441, 2010361, 1990353, 1972516, 1896564, 1873763, 1944624, 2032824, 2133286, 2144797, 2182180, 2207872, 2225488, 2240094, 2247783, 2236158, 2241078, 2290471, 2344061, 2367268, 2399015, 2409780, 2422276, 2509882, 2487280, 2523908, 2464462, 2427529, 2393163, 2366309, 2340990, 2329856, 2416583, 2353693, 2272405, 2215867, 2192413, 2207257, 2196908, 2178929, 2214003, 2277438, 2275911, 2292479, 2336202, 2366583, 2426949, 2461331, 2452980, 2431508, 2448343, 2520219, 2583140, 2632755, 2611291, 2580113, 2585448, 2642502, 2697053, 2720572, 2743042, 2796484, 2807171, 2768944, 2814181, 2917318, 2929270, 2992823, 3109636, 3142409, 3247703, 3365305, 3466768, 3529212, 3759944, 3900352, 4040611, 4208042, 4474684, 4660739, 4741949, 4986895, 5280289, 5566459]
3896E566459L33135L34781L93278M08929M07594N06526M46918M28531L58515L59091
3886I543757K88414J57480l4701j32342l64279l94253m33140m47236m96041m32200
3876G255459m72298m68128l08760l16363k83025k42070k67610k14571j97512j03905
3866D381217j53609j60489o4508o6446j8080K3912L0183J46717P7599j4791p9516
3855D102189j35969k26265k78464k25618k30550j75980j35819r4487j36198q6369
3845B376470j02723j03079o9842o3298j0688R025m3666n0583j13214j802m5243
3834A781357k3057m1437n3479k5079L255n5384o0404O161k4200r1222m6876J0051
3822A379686L5635o2680L7526l0879l4335K0020n1216j2401k7387p489l5843l8540
$$ y = [5566459, 5899594, 6234375, 6627653, 7036582, 7444176, 7950702, 8397620, 8826151, 9184666, 9543757, 9832171, 9989651, 9954950, 9822608, 9458329, 9064076, 8630936, 8183700, 7687659, 7255459, 6783161, 6315033, 6006273, 5689910, 5406885, 5164815, 4897205, 4682634, 4485122, 4381217, 4227608, 4067119, 4002611, 3936165, 3918085, 3941997, 3972180, 4118897, 4196496, 4181705, 4102189, 3966220, 3739955, 3461491, 3235873, 3005323, 2829343, 2693524, 2599037, 2462839, 2376470, 2273747, 2170668, 2100826, 2037528, 2026840, 2035865, 1992199, 1941616, 1828402, 1826600, 1781357, 1758300, 1716863, 1663384, 1638305, 1641560, 1586176, 1525772, 1531933, 1507733, 1416511, 1369635, 1379686, 1415321, 1352641, 1390167, 1359288, 1324953, 1344973, 1293757, 1281356, 1253969, 1246480, 1210637, 1172097]
3810A172097k0038J7410o191K111l5457o5892k6858k0159l7260L8484o761P6708
3798A088194l9832j3942l8588k165R91k6765r557J8687M1753m4062p1298j2604
3786H90812j5900K5353j8937K2799L2685k1108p926m9516o901n149j6634k7666
3774H01912P817o6938M2491N4284L7788l9716L1957m2362o8601K168k0528J9691
3762G59963N3290Q809p2239l3633M544N8015m0151k2667K9107K4684J5092k7708
3750G57106P131O4041M212j5792n6466L5841L48n221J5617k1222k965q2435P697
3737G07892q531J09694l5306m6947m672R228J3957L4861q4178l4818M3576j11501
3725E93255j9987O0450K3411l9781O412L2826K0221l806l435k6633R578K3803
$$ y = [1172097, 1152059, 1169469, 1163278, 1165389, 1129932, 1064040, 1037182, 1017023, 979763, 1018247, 1011486, 1088194, 1048362, 1034420, 995832, 993667, 994658, 967893, 958336, 977023, 1018776, 974714, 903416, 890812, 874912, 900265, 881328, 904127, 936812, 915704, 907778, 858262, 851361, 846212, 829578, 801912, 809729, 742791, 785282, 839566, 877354, 837638, 869595, 827233, 758632, 760800, 740272, 759963, 813253, 822062, 749823, 716190, 720734, 778749, 738598, 715931, 745038, 769722, 784814, 757106, 764237, 828278, 832490, 816698, 760232, 796073, 796421, 791200, 806817, 785595, 782630, 700195, 707892, 699361, 809055, 773749, 726802, 722130, 731358, 745315, 780176, 695998, 661180, 704756, 593255, 573268, 633718, 657129, 617348, 623760, 656586, 676807, 673001, 669566, 642933, 652511, 676314]
3713F76314m5717j8433J1414n873L1826O2586k6162J9007K2658o7912j658J6258
3701F74308k1826J9084J8124L052j4297m1396K4609O178K529K1015L9118J8406
3689G48904k0580l549k8494J0608M02J3796P0646K3013P124O485l0387J0040k1858
3676G86150k6699p073k0172L680n155L5891J4858k3906j8371J2920l7080L9566
3664G54609j209N0455K1614o216q942l7359m2672m456K2596M6985N63j20O0970
3651H56818Q5897K122k9283K368n3229o3816O240J3086j5926K0885n6780J9898
3639G88280k7782j6822L6111m2595K9031m4123J3273o061m6449N4592R85j7326
3627G21114K8813L4692K8317n2819N6754M5246k0395K716L6713O3046p7702l0977
$$ y = [676314, 630597, 612164, 623578, 617705, 649531, 712117, 685955, 704962, 727620, 659708, 658050, 674308, 652482, 671566, 689690, 692742, 678445, 637049, 661658, 667836, 670365, 691380, 730498, 748904, 728324, 724775, 696281, 706889, 707291, 721087, 791733, 814746, 821870, 828355, 797968, 808008, 786150, 759451, 752378, 732206, 735886, 730731, 766622, 781480, 757574, 739203, 752123, 715043, 754609, 753400, 803855, 825469, 819253, 810311, 772952, 730280, 725824, 748420, 795405, 795968, 795848, 856818, 942715, 944837, 915554, 917922, 864693, 800877, 807117, 820203, 804277, 825162, 768382, 788280, 760498, 743676, 779787, 737192, 766223, 722100, 735373, 729312, 682863, 737455, 738440, 721114, 749927, 784619, 812936, 760117, 816871, 862117, 841722, 844438, 881151, 944197, 866495, 835518]
3615H35518k0244N2830M6225M9681J2251R818k8102n9760j4939J6257j190L0634
3603I28979O0065m2233l0681M3363K7312r4047j6560J0029R361r292J6654L2060
3591I35010J4808k8529m6144L1489M3556J2856N6974N50n0393K6768K2730K72
3579A019947j4505P0328N0782O5427P5107N1267J0179P5270l6438p8039n2540
3568A236785n3277q115l3525k8358l8621J7272l5007j8317m285n2405P3237Q2080
3556A137464N0908J172J2997p5261p37O3891K2557N2121N1231O5161K1997Q4877
3544A488378P7912m5349p7194l0436k7487j33834j1942j4729J9256O479m7628
3533A203426J1755k320l5672o0798j9474M5527P4290J2376j953k6517L7257n1962
$$ y = [835518, 815274, 868104, 914329, 964010, 976261, 986079, 957977, 898217, 883278, 899535, 898345, 928979, 989044, 946811, 916130, 959493, 986805, 892758, 876198, 886227, 895588, 886296, 902950, 935010, 949818, 921289, 875145, 906634, 950190, 963046, 1020020, 1020570, 970177, 996945, 1019675, 1019947, 1005442, 1075770, 1126552, 1191979, 1267086, 1318353, 1328532, 1403802, 1367364, 1289325, 1236785, 1183508, 1175393, 1141868, 1113510, 1074889, 1092161, 1057154, 1038837, 1034552, 982147, 1055384, 1137464, 1188372, 1189544, 1202541, 1127280, 1126543, 1190434, 1212991, 1265112, 1316343, 1381504, 1403501, 1488378, 1566290, 1520941, 1443747, 1413311, 1385824, 1251990, 1240048, 1225319, 1244575, 1251054, 1203426, 1215181, 1212861, 1177189, 1116391, 1096917, 1142444, 1216734, 1229110, 1227157, 1200640, 1237897, 1185935]
3521A185935j4296M8180O061l8165k1537p018K8316o9004q252K0960L3942r418
3509A155704n4675j7982j0893J0948L1206m5197l974O031J2584j3409K4540M7635
3497A142518J1069J9501J970k4274k9536q50L5032r261l0422J6891K6494r334
3485A149798o0497K9135J4105M46R216L6041L9421M9680J3127O0528k0524m1906
3473A278570N5123r340K7564m1545r978Q1028M1916k3462l2696k7208J9273O0411
3461A419656N7255R6425L8100J0397m9360O683K875j6165L7541K175K0652O0359
3449A686593o2480M2040M6061J9280J0891J2270j8298M9837l2758O5928Q5253
3438A904617J3836N6708Q3348L4816M7719J14943Q4291J999r895Q4739J48162
$$ y = [1185935, 1171639, 1219819, 1225880, 1187715, 1166178, 1159160, 1187476, 1118472, 1110220, 1131180, 1165122, 1155704, 1101029, 1083047, 1072154, 1083102, 1114308, 1069111, 1065137, 1071168, 1083752, 1070343, 1094883, 1142518, 1153587, 1173088, 1175058, 1150784, 1121248, 1120398, 1155430, 1146169, 1115747, 1132638, 1159132, 1149798, 1089301, 1118436, 1132541, 1132987, 1142203, 1178244, 1217665, 1267345, 1280472, 1341000, 1320476, 1278570, 1333693, 1324353, 1351917, 1310372, 1300394, 1381422, 1423338, 1399876, 1367180, 1339972, 1359245, 1419656, 1476911, 1573336, 1611436, 1621833, 1572473, 1579156, 1582031, 1565866, 1603407, 1605582, 1626234, 1686593, 1624113, 1666153, 1712214, 1731494, 1742385, 1754655, 1736357, 1786194, 1753436, 1819364, 1904617, 1918453, 1975161, 2058509, 2093325, 2141044, 2255987, 2340278, 2342277, 2332382, 2417121, 2565283]
3427B565283J01100O8477L1609L7460P3338M8995J39995J64359J16358q312O5470
3416C404132J62747J36119J29661J57717J47081J17996K29662K27870K22070K80428
3406E215483L34249L18805L45921M69697N44876N80772P08157R60846J270094
3397A0748900J610775K116506K584101K431449J585860n02207k279539k558631
3389A5737214k004098j426944r43145o96575n30822k69719j53875j03245q003
3380I600788o1670O9642N0970N1964J75495K18360L69271M46045N41445O87428
3370A2149738P83594R35825J210414J608172K214416K889395L696163M788321
3362C0276038M814865L522528k29526m335549n337776m522560l377059k473440
$$ y = [2565283, 2666383, 2734860, 2766469, 2803929, 2877267, 2926262, 3066257, 3230616, 3346974, 3338662, 3404132, 3566879, 3702998, 3832659, 3990376, 4137457, 4255453, 4485115, 4712985, 4935055, 5215483, 5549732, 5868537, 6214458, 6684155, 7229031, 7809803, 8517960, 9478806, 10748900, 12359675, 14476181, 17060282, 19491731, 21077591, 20575384, 18295845, 15737214, 13733116, 12306172, 11363027, 10666452, 10135630, 9865911, 9712036, 9608791, 9600788, 9539118, 9608760, 9659730, 9711694, 9887189, 10105549, 10474820, 10920865, 11462310, 12149738, 12933332, 13869157, 15079571, 16687743, 18902159, 21791554, 25487717, 30276038, 35090903, 38613431, 38383905, 34048356, 28710580, 24188020, 20810961, 18337521]
3354A8337521j791845j352139j036244q14156o50860m10662k76820j50164j33499
3345A1721132m7494K1476R7196J68555K38920L85695M09366L99140M27392N35410
3335A4356788P27965R67575J304468J617762K210835K401400J940594M92936j693018
3326B4327305k483877k179522j608217j063995p10554m10989j84726O862J07492
3317A5799779J86183J44632J13391J54868J22716L02433K89884N01005M59781
3308A8074672M44930N90026P03531P12874Q38960J067832J098131J290750J470706
3299B6292412J778911K158916K540246K709568L197611L718755M729036O319541
3291E3444996Q311992J0287063J3180150J4852814J2943953O208009n980362j3684207
$$ y = [18337521, 16545676, 15193537, 14157293, 13343137, 12692277, 12281615, 12004795, 11854631, 11721132, 11673638, 11695114, 11792310, 11960865, 12199785, 12585480, 12994846, 13393986, 13821378, 14356788, 15084753, 16052328, 17356796, 18974558, 21185393, 23586793, 25527387, 26020323, 24327305, 21843428, 19663906, 18055689, 16991694, 16281140, 15870151, 15685425, 15692287, 15799779, 15985962, 16130594, 16243985, 16398853, 16521569, 16824002, 17113886, 17614891, 18074672, 18519602, 19109628, 19813159, 20526033, 21364993, 22432825, 23530956, 24821706, 26292412, 28071323, 30230239, 32770485, 35480053, 38677664, 42396419, 47125455, 53444996, 61756988, 72044051, 85224201, 100077015, 113020968, 119228977, 113248615, 99564408]
3283I9564408j4361662j1928910r055389p050124n372887m116085l065592k314171
3275D2299588j733992j138456o18146j99476L24549Q22920J257427J743103K142565
3266D4900082K659923L445476M817749O674107Q631288J0992347J3561498J3146802
3258A08829272Q845689j506785j1790986j4731034j3185314j0319717q112678
3251E8028447o527566n281957m161665l326312k599144k229741j901489j567867
3243C0432706j258593j032070p30461n03354m32783k49355j73768o3654J05207
3234B6093875K39248K49554L81014L27087J03532j07123n24564r00037j226530
3225B4636056j347985j327233j226929j130704r59488q93806p92170o97390n90417
$$ y = [99564408, 85202746, 73273836, 64218447, 57168323, 51795436, 47679351, 44613759, 42299588, 40565596, 39427140, 38808994, 38609518, 38934067, 39756987, 41014414, 42757517, 44900082, 47560005, 51005481, 55823230, 62497337, 71128625, 82120972, 95682470, 108829272, 117674961, 116168176, 104377190, 89646156, 76460842, 66141125, 58028447, 51500881, 46218924, 42057259, 38730947, 36131803, 33902062, 32000573, 30432706, 29174113, 28142043, 27411582, 26908228, 26475445, 26226090, 26052322, 25988668, 26093875, 26333123, 26582677, 26963691, 27290778, 27394310, 27287187, 26762623, 25862586, 24636056, 23288071, 21960838, 20733909, 19603205, 18643717, 17749911, 16957741, 16260351, 15669934]
3216A5669934n85121m85252m76610l81561k76778k83769k09519q7402j83411k21991
3206A2478520k98515l01577m20908m23810l50530l77493l70598j77956k51664
3197I505469j37899j15163j82808j81230j08718j05526j14813r3165q5573q8510
3187H292064p0866j08704j06249l3017j08486l9559j4085P3506R7620J97148L03977
3176H483349K23417M0458j14601k86404l71181m54081m63877l69539k77991k56273
3166F153277k56461j93974j32679j56160j46639j29354p7989o3390p7762q5769
3156D833100l9997m9626j1015j3966m1998l1648n588j5639L3844J20161J17524
3145D895152J45043P6921J2197M8624j02068j95442k13746j89682j91080j28652
$$ y = [15669934, 15084813, 14599561, 14122951, 13741390, 13464612, 13180843, 12971324, 12883922, 12700511, 12478520, 12180005, 11878428, 11457520, 11033710, 10683180, 10305687, 9935089, 9757133, 9505469, 9367570, 9252407, 9069599, 8888369, 8779651, 8674125, 8559312, 8466147, 8380574, 8292064, 8221198, 8112494, 8006245, 7973228, 7864742, 7825183, 7811098, 7884604, 7982224, 8179372, 8483349, 8706766, 8747224, 8632623, 8346219, 7975038, 7520957, 7057080, 6687541, 6409550, 6153277, 5896816, 5702842, 5570163, 5414003, 5267364, 5138010, 5060021, 4996631, 4918869, 4833100, 4793103, 4743477, 4732462, 4718496, 4676498, 4644850, 4639262, 4623623, 4657467, 4777628, 4895152, 5040195, 5117116, 5129313, 5177937, 5075869, 4880427, 4666681, 4476999, 4285919, 4157267]
3135D157267j70671q5237j60095j63339m5330m046l7638q9201k6234o5173m9218
3124C261085r7816m2558k708r3307n2134n2272l5906q202r4173k7605K6296J5858
3112B796558m1861k1360J23024k980o9581K9716j3129j168l7570k7651j4470N583
3100B725111q795o8007k2337m6310j08269n1882k9225k1055m7687J3294l7273
3089B297565o0850j8125j181l8818l7728K6005K0602N0010l7361q336j319J9924
3077B210388M9999l6289k09K2016J3905j3844k070L0063J3812K0200n1427n3577
3065B202967r9875J5472p7335m4095j4436N4978m0740j35691L8859o1170Q526
3054A847460j7425l4153K3310k5918l3944k2077M1043M6168L7700m4110k7947
$$ y = [4157267, 3986596, 3901359, 3741264, 3577925, 3532595, 3528549, 3490911, 3401710, 3375476, 3310303, 3261085, 3163269, 3120711, 3118003, 3024696, 2972562, 2920290, 2884384, 2876182, 2782009, 2754404, 2780700, 2796558, 2754697, 2733337, 2856361, 2853381, 2783800, 2813516, 2800387, 2799219, 2761649, 2733998, 2719528, 2725111, 2716316, 2648309, 2625972, 2579662, 2471393, 2419511, 2390286, 2369231, 2321544, 2334838, 2297565, 2236715, 2218590, 2217409, 2178591, 2140863, 2166868, 2187470, 2237480, 2200119, 2191783, 2190464, 2210388, 2260387, 2224098, 2223889, 2245905, 2259810, 2245966, 2243896, 2273959, 2287771, 2307971, 2256544, 2202967, 2103092, 2118564, 2041229, 1997134, 1982698, 2037676, 1996936, 1861245, 1900104, 1838934, 1847460, 1830035, 1795882, 1819192, 1793274, 1759330, 1737253, 1778296, 1824464, 1862164, 1818054, 1790107]
3043A790107J676j5519q916K1020K3977r799r443J9234n010k0677k1956k0164
3031A744530l0969n5403j1341P535k2797k0603J315l2082m1979K5865J6714N1291
3019A632076j102Q099j1463l6805O496K5408P5069r7417o653J0364m4625M5415
3007A604862L7843J4540J4291O9047M0397l433J8788R6751J11550O9168M6799
2996B120603J4145J8106p4090j6615k3834k0297j6154m9161k1392l4351n1619
2985A845341K5225l8318M7424m0515j5035M6215M5600N4236l0728J6041P5606
2974B031092P1065P5890N2421J11007J32941P5716N1054j00718k6409m5983p2006
2963B356070p7227k4421L1908m8895P3098R0999O1357N55k3445p0228l732p5316
$$ y = [1790107, 1791783, 1776264, 1767348, 1788368, 1812345, 1802546, 1793103, 1812337, 1807327, 1786650, 1764694, 1744530, 1713561, 1658158, 1646817, 1654352, 1631555, 1610952, 1612267, 1580185, 1538206, 1564071, 1580785, 1632076, 1630974, 1639073, 1627610, 1590805, 1597301, 1622709, 1697778, 1600361, 1593708, 1604072, 1559447, 1604862, 1642705, 1657245, 1671536, 1740583, 1780980, 1777547, 1796335, 1893086, 2004636, 2073804, 2120603, 2134748, 2152854, 2078764, 2062149, 2038315, 2018018, 2001864, 1952703, 1931311, 1896960, 1845341, 1870566, 1832248, 1879672, 1839157, 1824122, 1870337, 1915937, 1970173, 1939445, 1955486, 2031092, 2102157, 2178047, 2230468, 2341475, 2474416, 2550132, 2601186, 2500468, 2474059, 2428076, 2356070, 2278843, 2254422, 2286330, 2237435, 2310533, 2401532, 2462889, 2463444, 2439999, 2369771, 2366039, 2290723]
2951B290723l0018K8309o8246l3603K0142L5072m9114l608k3112N4535N8261J1988
2939B291329L9102K6829R3437k7895O1165k5952q6606J8809j0139l1575p664L6264
2927B377104J9254P6668P2942M0873J6922J5185J3025j394K350P5152N635j8542
2915B695174J0491K318m2638N3801p1588j0489R2467n5574l2894J1034L841N3555
2903B709498L8365l7295q1113K4938M8443L6671j5029J5940R1396M3272N6291
2892B931377P2172R2579L5772P0416J30038P2357P9666m3982n2029j29072j69443
2881C089851j38608j04573l5358p1853m1902M8134j8542n4088m6162O9963M6681
2870B743543n6066K3012k403M8917N4945m2493N3428R2646J9881n1789J0660J7942
$$ y = [2290723, 2260705, 2289014, 2220768, 2187165, 2207307, 2242379, 2193265, 2189657, 2166545, 2221080, 2279341, 2291329, 2330431, 2357260, 2450697, 2422802, 2483967, 2458015, 2371409, 2390218, 2380079, 2348504, 2340840, 2377104, 2396358, 2473026, 2545968, 2586841, 2603763, 2618948, 2631973, 2630579, 2632929, 2708081, 2713716, 2695174, 2705665, 2707983, 2665345, 2719146, 2647558, 2637069, 2729536, 2673962, 2641068, 2652102, 2655943, 2709498, 2747863, 2710568, 2629455, 2654393, 2702836, 2739507, 2724478, 2740418, 2831814, 2875086, 2931377, 3003549, 3096128, 3131900, 3202316, 3332354, 3404711, 3484377, 3440395, 3388366, 3259294, 3089851, 2951243, 2846670, 2811312, 2739459, 2697557, 2745691, 2727149, 2673061, 2626899, 2696862, 2743543, 2687477, 2710489, 2708086, 2757003, 2811948, 2769455, 2822883, 2915529, 2935410, 2883621, 2894281, 2912223]
2858B912223p7482l9p1670p5106r096q3855r4843l9807q1601l8175p0762p5799
2846B193988K0411N4180p242k9939j6453L377m9121r7358K4689n7134k2213P865
2834B025050k3756r4203n8799p8423o6609k0421q2064K6170q242Q977q7917j4874
2822A524889k6514l5614l8937p534J1520l7974m6783k0696j0351j5537L274M3808
2810A343551l0768p1672J8587k8305o8451j1926K1172N2972k9671j12624k0681
2799A062184j0117k1512L685J4121j4484l5885K012m1221K7007K7250q6282n2146
2787H74612l6484Q0762J7090k2361J9640j6930k3712j3800k458J0755n3730n9240
2775G74144J3365L7706Q197K9437J5078p1001k2878K7824o3774N4262M5209k8969
$$ y = [2912223, 2834741, 2834702, 2763032, 2687926, 2678830, 2594975, 2500132, 2460325, 2378724, 2340549, 2269787, 2193988, 2214399, 2268579, 2261337, 2231398, 2214945, 2218322, 2169201, 2071843, 2096532, 2039398, 2017185, 2025050, 2001294, 1907091, 1848292, 1769869, 1703260, 1682839, 1600775, 1626945, 1618703, 1627680, 1539763, 1524889, 1498375, 1462761, 1423824, 1416290, 1427810, 1389836, 1343053, 1322357, 1312006, 1296469, 1299743, 1343551, 1312783, 1241111, 1259698, 1231393, 1162942, 1151016, 1172188, 1225160, 1195489, 1082865, 1062184, 1052067, 1030555, 1034240, 1048361, 1033877, 997992, 1000004, 958783, 985790, 1013040, 926758, 874612, 838128, 918890, 935980, 913619, 933259, 916329, 892617, 878817, 876359, 887114, 833384, 774144, 787509, 825215, 833412, 862849, 877927, 806926, 784048, 811872, 748098, 802360, 847569, 818600]
2763H18600p618m7927j1908j5213m1558Q981N8438J1888k5712p3832J66K2940
2751F97245K7270j682n6161j2513J4155L6558O8881o3816l8987j0408j2059n869
2739F42614n5507N6504K496N799m2539k275K0791k5460J9770k7583N6753k2753
2727F28610j4587J9767J257J9576o8829K972M8091k2318j8014l4913O8353J2680
2715F42645q3364l199k6016j0173Q9464K4919k6570p273J9610M0312m0707l2533
2703E87115J4661J072m3709L730K9350l3611m227q420k5433Q6k914M3030m996
2690E55734l9179O3699K6623o8239q999J0363l5148k4707K2367M604N850J3389
2678E26357L6052n4603J585l2536l5423R593K2893K1866K8627j536k9184j4321
$$ y = [818600, 810982, 763055, 751147, 735934, 694376, 703357, 761795, 773683, 747971, 674139, 674305, 697245, 724515, 722833, 666672, 654159, 668314, 704872, 773753, 709937, 670950, 660542, 648483, 642614, 587107, 643611, 646107, 651906, 609367, 607092, 627883, 602423, 622193, 594610, 651363, 628610, 614023, 633790, 635047, 654623, 585794, 588766, 636857, 614539, 596525, 561612, 629965, 642645, 559281, 556082, 530066, 519893, 609357, 634276, 607706, 600433, 620043, 660355, 619648, 587115, 601776, 602848, 559139, 562869, 592219, 558608, 554381, 545961, 520528, 520614, 517700, 560730, 555734, 516555, 580254, 606877, 538638, 529639, 540002, 504854, 480147, 502514, 507118, 512968, 526357, 562409, 507806, 509391, 476855, 441432, 451025, 473918, 495784, 524411, 522875, 493691, 479370]
2666D79370l3616L0770m6507O589J3905P851N9900l532q1384l1907O4675Q1041
2654E47155K3115j6902o4721l663K0253L4923J3022K211o6090m7877L4880Q536
2642D84842l726O976M1014j6948l5034k5424L2640j644j3294O2150M26o2540K7213
2629D96651o157L4983J0399o0561q07K2175n2964R975N2247j7092J7905k8377
2617D78377L6131j192P355j5145k8052l821K0364p536J4773M8679j2872J7163
2605E54224m0684N2924J4574l8300k8239J0442K8467o516m3016K1110J2575l4185
2593E03376Q8949J953m2904j3826N214l2438l2845J329J1352L8872l7761M095
2581D95366M8498l6384R516R360j3624L6198m3108l0400l936k0284M0573k7766
$$ y = [479370, 445754, 476524, 430017, 436606, 450511, 458362, 518262, 514730, 433346, 401439, 466114, 547155, 570270, 553368, 488647, 484984, 505237, 540160, 553182, 555393, 489303, 441426, 476306, 484842, 481116, 488092, 529106, 512158, 477124, 451700, 484340, 482696, 469402, 531552, 531978, 469438, 496651, 490494, 525477, 535876, 475315, 474508, 496683, 443719, 453694, 505941, 488849, 506754, 478377, 514508, 513316, 520671, 505526, 477474, 473653, 494017, 486481, 501254, 549933, 537061, 554224, 513540, 566464, 581038, 542738, 514499, 524941, 553408, 546892, 503876, 524986, 537561, 503376, 592325, 594278, 551374, 537548, 542762, 510324, 477479, 478808, 490160, 529032, 491271, 495366, 543864, 507480, 516996, 526356, 512732, 548930, 505822, 475422, 471486, 451202, 491775, 464009]
2569D64009k0857L8050J6005K3122l021J5918n5770r587L0133L882j8206n5681
2557D27997P5289m815j6650j4259k0030R1174l6196l2193Q024l2052Q2614k9909
2545D98994J82L4614j2166k7178n7633P0427L5535m9172k5413K8121J9724n1849
2533D64186r1820N9564q644r653J7748m9016J2891m5044j6393M7539k8108R826
2521C63076O6164J0356m5110J2058k1964L7944k7365J7332K622j07383R6862j3748
2509C90844r865j648J1061L6252n5068q714L3271J1119m6900j88N483J1761J5106
2496C92514j4017j937j1860n6842l6079Q2843m014J4387j1271j6216k3030L0564
2484C45042k6172L2246k4586l0431L9582l698J6883k0341K6324j9773o7772K2132
$$ y = [464009, 443152, 481202, 497207, 520329, 517308, 533226, 477456, 467869, 498002, 501884, 483678, 427997, 503286, 498471, 481821, 467562, 447532, 538706, 502510, 470317, 478341, 446289, 528903, 498994, 499176, 533790, 521624, 494446, 436813, 507240, 542775, 493603, 468190, 496311, 516035, 464186, 372366, 431930, 423286, 413633, 431381, 382365, 395256, 350212, 333819, 381358, 353250, 363076, 429240, 439596, 394486, 406544, 384580, 422524, 395159, 412491, 415113, 307730, 404592, 390844, 380979, 379331, 390392, 426644, 371576, 362862, 396133, 407252, 360352, 360164, 365647, 377408, 392514, 378497, 376560, 364700, 307858, 271779, 354622, 350608, 364995, 353724, 337508, 314478, 345042, 318870, 351116, 326530, 296099, 335681, 331983, 348866, 328525, 354849, 335076, 267304, 289436]
2472B89436N9045m3568m2031L1965L7679l9549M1207m7213R2004j2433n5564K3409
2460C34387j9858j8057J9516L6282Q568r115n5199L0044p4615K9098L5567p8986
2448B37632l5116K3560N3000r495J6089L9150n0765J4399N2726j2600J4126l7979
2436C04727m9924L3147K7513n4097J0411N0736m2317J4923n6402M9367K6769l7398
2424B77455M0523k125J2027j1116k9612O3752j0191j00697j6594M3289L2043J3777
2412C12531j223k3441J3186k5517k4213M5629p272r961l7765P614M9995N2028
2400C51591O5730l1743J5714q922j26178k414P9348J7791m7523l716k0362j9718
2388B69598M2893L6465K0631O3195j05341q2449L7620L2960J0174j8989N7487
$$ y = [289436, 348481, 304913, 262882, 294847, 332526, 292977, 334184, 286971, 378975, 366542, 310978, 334387, 314529, 296472, 315988, 352270, 360838, 351723, 296524, 326568, 251953, 281051, 316618, 237632, 202516, 226076, 279076, 269581, 285670, 324820, 274055, 288454, 341180, 328580, 342706, 304727, 254803, 287950, 315463, 261366, 271777, 322513, 280196, 295119, 238717, 288084, 314853, 277455, 317978, 315853, 327880, 316764, 287152, 350904, 340713, 240016, 223422, 266711, 298754, 312531, 311308, 287867, 301053, 275536, 251323, 296952, 289680, 279719, 241954, 249568, 299563, 351591, 417321, 385578, 401292, 392370, 266192, 263778, 343126, 360917, 313394, 309678, 289316, 269598, 312491, 348956, 369587, 432782, 327441, 244992, 282612, 315572, 325746, 306757, 364244]
2377C64244o3190l1016k3232O80j7007R319P690K5639l4478N9291L2579J3968
2365C44487j0138m5495m3860j2659K9126M9641K7107K2994n510m6091o111N3945
2353C57436K1984n238l2943j656m5831p7969k5279J4924L1891L811k6347M1295
2341B56078L5122j0302N4506K0050L7505j20572k9248O2432m3578m4267K7944
2330B45670j9532J757j3497K1231K3095j0182K1516j7931L9764l1133j7768p825
2318B35165r731N6177J7425K2148l6814p5258K8585L6715m6452j4401p1798J9880
2306A61641K8395N5491q305O07K7921L6531m6712l5126K3482l6678O003j0852
2294B02398j9167J0955M5524L5170K4584q2256l6188L4137J129k0019J5541L5828
$$ y = [364244, 301054, 270038, 246806, 247486, 230479, 239798, 247488, 273127, 238649, 297940, 330519, 344487, 334349, 288854, 244994, 232335, 261461, 311102, 338209, 361203, 355693, 309602, 303491, 357436, 379420, 374182, 341239, 339583, 293752, 215783, 190504, 205428, 237319, 241130, 214783, 256078, 291200, 280898, 335404, 355454, 392959, 272387, 243139, 305571, 261993, 217726, 245670, 226138, 227895, 214398, 235629, 258724, 248542, 270058, 252127, 291891, 260758, 242990, 235165, 225434, 281611, 299036, 321184, 284370, 209112, 237697, 274412, 227960, 213559, 141761, 161641, 190036, 245527, 237222, 237829, 265750, 302281, 255569, 220443, 243925, 207247, 213250, 202398, 183231, 194186, 239710, 274880, 299464, 217208, 181020, 215157, 216286, 196267, 211808, 247636]
2282B47636J4308l9770m9006N4854N6040k2441n5764k498M5379K3766L7385o1598
2270B48291J1402M0937P1350p8472o1896L7424Q029m9512o096N5239l5186j7952
2258B23558j846K4984M3926j1252j6243k4275K0939M0568Q18l8411k1149M5989
2246B87606k2543n453j8953J2320M96L666J3060K9369m997m2362j3800J7294j6555
2233B39148K573j8516K4419p786J5771l3165k402L994L7180K1148K4320m2993
2221B63691l0359j9908J0156K3745L3143K3852p739j7404l405J3652j2942k9868
2209B46614J2444l4530j7370O3680J88o4956L9401J05784r6554n2117N6512Q4333
2197C43429l5532P17m2664Q052M1392m5184j2210M1115l2420L0060R155R843K2491
$$ y = [247636, 261944, 222174, 173168, 228022, 284062, 261621, 205857, 203359, 248738, 272504, 309889, 248291, 259693, 300630, 371980, 293508, 231612, 269036, 277065, 227553, 221457, 276696, 241510, 223558, 221712, 246696, 290622, 279370, 263127, 238852, 259791, 300359, 301177, 262766, 241617, 287606, 265063, 259610, 240657, 252977, 253473, 257139, 270199, 299568, 294571, 252209, 238409, 255703, 239148, 241721, 223205, 247624, 239838, 255609, 222444, 220042, 224036, 261216, 282364, 306684, 263691, 233332, 213424, 223580, 247325, 280468, 304320, 296581, 279177, 275772, 289424, 276482, 246614, 259058, 224528, 207158, 270838, 271026, 206070, 245471, 351255, 254701, 202584, 259096, 343429, 307897, 308614, 265950, 274002, 315394, 270210, 258000, 299115, 266695, 296755, 305910, 315753, 338244]
2184C38244k3976j7069Q2948o5748k8277K0694K1645j3391l2773N0454K7473m6253
2172C13971J6830O9753l1312l2242j5272L5134R911K58L8524k221l8043J0124
2160C75415R763M3219N380j6911K8516k5073k8017k996P2764j7513J3961O9012
2148E27520J3127O6619j1963l9670K3187J8418J6318K491N2639o932p2166N8083
2136F47671k3324N5916J5984k1596Q8802J3052l196J5500L5999O8022J5972o0808
2124H47994O6310J6587L3216K7253R1867J03168O4546M7766J2638Q6997K7739
2113A426081J31796P3157N5395R6162J01145J44825R6739R9829K17957K03563
2103B646649K31398J98895J84150J95857K21071L97596M51227M45764P25360R96468
$$ y = [338244, 314268, 297199, 380147, 314399, 286122, 306816, 328461, 315070, 282297, 332751, 360224, 313971, 330801, 400554, 369242, 337000, 321728, 356862, 366773, 367031, 405555, 403334, 365291, 375415, 385178, 428397, 433777, 416866, 445382, 420309, 392292, 389296, 462060, 444547, 458508, 527520, 540647, 607266, 595303, 555633, 578820, 597238, 613556, 616047, 668686, 661754, 589588, 647671, 624347, 680263, 696247, 674651, 763453, 776505, 773309, 788809, 824808, 892830, 908802, 847994, 914304, 930891, 964107, 991360, 1083227, 1186395, 1250941, 1298707, 1311345, 1398342, 1426081, 1557877, 1631034, 1686429, 1782591, 1883736, 2028561, 2125300, 2225129, 2443086, 2646649, 2878047, 3076942, 3261092, 3456949, 3678020, 4075616, 4526843, 4972607, 5697967, 6694435]
2093F694435J274627J573282K169436K535436K210675J153637j343644k793498
2085A3474386k634424k012259j446388j070118q65767p08433n57109l85424k96556
2076C497908k54150j80887j23909j12705j77443j24411k00969k09445j04396q6180
2066A923413j38210o0985o6980r1817j00783j3791l1297l1288j11889j7460L0112
2055A289025l0701n1235p8500k7657K1985l7945n7513N673l1288k6074m8922q8486
2043H38362P7031n9836L4111l5357l3649k9601m9863k0223M4845j9055l2600L1096
2031G45261n4018l3531n7552P8235L5984j0628m8613o2180J5686j6591K3499K4582
2019F40134l3460K0661p7199L9068n1217p3059L2042j0901L0667o0331k0059P2743
$$ y = [6694435, 7969062, 9542344, 11711780, 14247216, 16457891, 17611528, 16267884, 13474386, 10839962, 8827703, 7381315, 6311197, 5445430, 4736997, 4179888, 3794464, 3497908, 3243758, 3062871, 2938962, 2826257, 2648814, 2524403, 2323434, 2113989, 2009593, 1923413, 1785203, 1724218, 1657238, 1565421, 1464638, 1450847, 1419550, 1388262, 1276373, 1258913, 1289025, 1258324, 1207089, 1128589, 1100932, 1122917, 1084972, 1027459, 1033132, 1001844, 975770, 926848, 838362, 915393, 855557, 889668, 854311, 820662, 791061, 741198, 720975, 765820, 746765, 714165, 745261, 691243, 657712, 600160, 678395, 714379, 703751, 655138, 592958, 608644, 592053, 615552, 640134, 606674, 627335, 550136, 589204, 537987, 464928, 496970, 486069, 516736, 456405, 436346, 509089]
2007E09089n9229l236k1436J6757O699j9013k131m4745K0880O5592p5371j03342
1995B90514L5093M1838J2469O157J0460n050Q762j7838o4521J1360n7940K3757
1983B95061K5859M444K5755M112p1537K0381M0227K9086r358q096k3272m3298
1971B89364K2252j2488K2028K9016J9805n4778k2289P881k0686K2375l6890Q38
1959B66428N947J7957M7915R264n3457L1393N5999p3538k9134L31M9058o1496
1947B66667o8511L8948J2688J7286N0422m5671l010K4616K307K8286l1206n4611
1935B38211K5806n6278L1680M8208k6318l1205J995j3852K7855L9923m3018J2119
1923B55126K9192l016m0083J306j5884J6858Q2791m7485n6477Q194m809r039J2244
$$ y = [509089, 449860, 446624, 425188, 441945, 448644, 429631, 427500, 382755, 403635, 469227, 393856, 290514, 325607, 367445, 379914, 386071, 396531, 391481, 400243, 382405, 317884, 329244, 271304, 295061, 320920, 325364, 351119, 355231, 283694, 304075, 344302, 373388, 364030, 355934, 332662, 289364, 311616, 299128, 321156, 350172, 369977, 315199, 292910, 300791, 280105, 302480, 265590, 266428, 272375, 290332, 338247, 347511, 294054, 325447, 381446, 307908, 278774, 279105, 328163, 266667, 198156, 237104, 249792, 267078, 317500, 271829, 268819, 293435, 295742, 324028, 292822, 238211, 264017, 207739, 239419, 287627, 261309, 230104, 232099, 218247, 246102, 286025, 243007, 255126, 284318, 281302, 241219, 242525, 226641, 243499, 326290, 278805, 222328, 230522, 225713, 216674, 228918]
1910B28918K6096N2483K0045p080k0208j8139l4918K971L5463p58p871j7051J4256
1897B74207M9461p8870l7360M6329m2808l9599j9302P5440P1080N5752n0502o9242
1885B34586j4500R308J4144o81l8105k3886m6049P863K5935L192O554L7767L4079
1872B50207j0984n9436L8353K4067m1834J8230m9274l1958O6571M1522L4619K09
1860B80292m4628K7563l1259j03007J31O6657J4918J0542j5247l3869j9201l0652
1848A22240L0408K7379R181J3718l925L817K4397k3724l5835L2265m6495J4257
1836A67683l4246J3861k3014L6009j902M5279L9920k0826K3281m5710k14j2410
1824A87711M9280L0455J2922q402L0556M8322l2237J4841L677m5331M2426l4139
$$ y = [228918, 255014, 307497, 327542, 320462, 300254, 282115, 247197, 250168, 285631, 284873, 277002, 259951, 274207, 323668, 244798, 207438, 253767, 210959, 171360, 152058, 227498, 298578, 354330, 303828, 234586, 220086, 229394, 243538, 242857, 204752, 180866, 134817, 142680, 168615, 171807, 178361, 216128, 250207, 239223, 179787, 218140, 242207, 200373, 218603, 169329, 137371, 203942, 245464, 280083, 280292, 235664, 263227, 231968, 128961, 129092, 195749, 210667, 221209, 205962, 172093, 152892, 122240, 152648, 180027, 189208, 202926, 199001, 202818, 227215, 203491, 167656, 199921, 153426, 167683, 133437, 147298, 124284, 160293, 158391, 203670, 243590, 222764, 246045, 200335, 200121, 187711, 236991, 267446, 280368, 271966, 302522, 350844, 318607, 333448, 337125, 291794, 334220, 300081]
1812C00081k9483o4571m8456O3450k1287m684R228j8700J3178K3130l1164L4448
1800B25170K148J4871o9815l9665J4230N1652o272p67K8162o9399R886J987R98
1787A63186J2464j9650J0099J1334J6311m068L267J9035p4247M011K9309N0440
1775B21491m4518M1887k0689o755K534k2351j4649J4345j0058K104m7596l0295
1763H5450O2364L2109j0116j7619K771q825L2898m8427l1926J4731N1547k3855
1751A41102j5146K0163L4203p955L4653K644j7754m3954k224l8593K3076K006
1739A32221l9840j0624L7723K5613n0840L9993J9598m2132J268N1423j8432j2768
1727A33203N9113J1214r260M1699l2273l4485j9625m1091j8127P9095l5479K1281
$$ y = [300081, 270598, 206027, 157571, 221021, 199734, 195050, 204278, 185578, 198756, 221886, 190722, 225170, 227318, 242189, 172374, 132709, 146939, 198591, 192319, 191552, 219714, 150315, 160201, 162188, 163186, 175650, 156000, 166099, 177433, 193744, 189676, 192943, 211978, 137731, 141742, 171051, 221491, 176973, 218860, 198171, 191416, 193950, 171599, 156950, 171295, 161237, 163341, 115745, 85450, 147814, 179923, 169807, 152188, 154959, 146134, 179032, 130605, 98679, 113410, 164957, 141102, 125956, 146119, 180322, 172367, 207020, 209664, 191910, 147956, 145732, 107139, 130215, 132221, 92381, 81757, 119480, 145093, 94253, 134246, 153844, 111712, 112980, 164403, 145971, 133203, 192316, 203530, 194270, 235969, 203696, 169211, 149586, 108495, 90368, 169463, 133984, 155265]
1715A55265M136j9731P170J702p2299k9351p224M7856N8303m12l2168j9982K1232
1702A14497k0143J7364K1440M9333k5061n2526M1412J9343p3196K3661N043n1462
1690F9705L9915k12K3703M2918k9298k9636k7879L5905J5095L3396L4885o657
1678B01840L466o30l3924j6546J6846m9007m34J3244N299p061j4932J1118j3498
1665A15781R327J5714K1689P409J5803o1263o4208J9727J9641K3164M0399n655
1653A57528L3681k3215p5201k1922L4018J6868k4646J7535l7170J5973L7979k6294
1641A05134o254k6886k3005m277M2988k5300l079K6842p858L3703J5020l2994
1629I4034j3374M1550k6359O7744J5738j198L9144o8429R020j5781l6652k2780
$$ y = [155265, 159401, 139670, 146840, 148542, 76243, 46892, 39668, 87524, 145827, 145415, 113247, 93265, 114497, 94354, 111718, 133158, 182491, 157430, 104904, 146316, 165659, 92463, 116124, 121167, 69705, 109620, 109408, 133111, 176029, 146731, 117095, 89216, 125121, 140216, 173612, 208497, 201840, 205306, 204676, 170752, 154206, 171052, 122045, 121611, 134855, 140154, 133093, 118161, 129279, 115781, 125108, 140822, 162511, 169920, 185723, 124460, 60252, 79979, 99620, 122784, 163183, 157528, 191209, 167994, 92793, 70871, 104889, 121757, 97111, 114646, 77476, 93449, 131428, 105134, 98880, 71994, 48989, 44712, 87700, 62400, 59321, 86163, 78305, 112008, 127028, 94034, 80660, 122210, 95851, 163595, 179333, 178135, 217279, 148850, 157870, 142089, 105437, 82657]
1617H2657M0506K0346j539J6322j2784j3530j0621P246p721n1547L8550L2742
1605A40627K659L0442N632l4071P45M4961p6094k2842j2622j0572K2980N4970
1593A46815m0068p835j4601j9826L2992k1487J5484p658K3324J7639J4465M625
1581A43869j0206p0098L1409l201m7223K8707Q6905n0965n6387M9933o5233N6605
1569I4115L1654K6440r136J7330k4025q1084K7509l422L5494L9468J7932Q848
1557A81123q8179k1841K7761r204K1497L517K5417L1491r359J8458K0553k6782
$$ y = [82657, 123163, 143509, 141970, 158292, 145508, 131978, 121357, 128603, 120882, 69335, 107885, 140627, 143286, 173728, 179360, 145289, 146034, 190995, 114901, 92059, 79437, 68865, 91845, 146815, 106747, 98912, 84311, 64485, 97477, 75990, 91474, 83816, 107140, 124779, 139244, 143869, 133663, 63565, 94974, 91773, 44550, 73257, 160162, 109197, 52810, 102743, 37510, 94115, 125769, 152209, 143073, 160403, 136378, 55294, 82803, 79381, 114875, 154343, 172275, 181123, 92944, 71103, 98864, 89660, 111157, 114674, 140091, 171582, 162223, 180681, 201234, 174452]
$$ [...]
##END NTUPLES=NMR SPECTRUM
##END=
