##TITLE=1H_CA-9071-2
 CDCl3
 8 sc, 
 19.10.2022
##JCAMPDX= 6.0         $$ Bruker NMR JCAMP-DX V2.0
##DATA TYPE= NMR SPECTRUM
##DATA CLASS= NTUPLES
##ORIGIN= UXNMR, Bruker Analytische Messtechnik GmbH
##OWNER= root
$$ XWIN-NMR		Version 3.5
$$ Wed Oct 19 16:28:47 2022 Russian Standard Time (UT+4h)  she@DPX200
##.OBSERVE FREQUENCY= 200.1313499994
##.OBSERVE NUCLEUS= ^1H
##.ACQUISITION MODE= SIMULTANEOUS
##.ACQUISITION SCHEME= undefined
##.AVERAGES= 8
##.DIGITISER RES= 18
##SPECTROMETER/DATA SYSTEM= spect
##.PULSE SEQUENCE= zg30
##.SOLVENT NAME= CD2Cl2
##.SHIFT REFERENCE= (INTERNAL, CD2Cl2, 0, 15.7282)
##AUDIT TRAIL= $$ (NUMBER, WHEN, WHO, WHERE, WHAT)
$$ ##TITLE= Audit trail, XWIN-NMR		Version 3.5
$$ ##JCAMPDX= 5.01
$$ ##ORIGIN= Bruker BioSpin GmbH
$$ ##OWNER= she
$$ F:/spectra/data/she/nmr/H-F/1/pdata/1/auditp.txt
$$ ##AUDIT TRAIL=  $$ (NUMBER, WHEN, WHO, WHERE, WHAT)
(   1,<2022-10-19 16:27:38.21 +0400>,<she>,<DPX200>,
      <created by zg, POWCHK disabled, PULCHK disabled
       configuration hash MD5:
       00 E9 B6 7A A2 85 ED C7 34 08 36 98 17 FE 4E 26
       data hash MD5: 16K
       F2 75 E1 57 05 70 48 92 8F 18 75 33 10 36 EF 1D>)
(   2,<2022-10-19 16:27:41.54 +0400>,<she>,<DPX200>,
      <Start of raw data processing
       efp BC_mod = 2 LB = 0.24 FT_mod = 6 PKNL = 1 PHC0 = -18040.38 PHC1 = 23.2007 SI = 16K 
       data hash MD5: 16K
       8B C8 3A EF 26 13 C7 5E 46 8C 1B 52 69 0F D7 72>)
(   3,<2022-10-19 16:28:03.51 +0400>,<she>,<DPX200>,
      <pk PHC0 = 6.829479 PHC1 = -12.2 
       data hash MD5: 16K
       FE 17 2F 11 89 78 BD 25 D3 9A B1 46 66 4A 7B 96>)
(   4,<2022-10-19 16:28:06.85 +0400>,<she>,<DPX200>,
      <abs ABSG = 5 
       data hash MD5: 16K
       27 3B 86 ED 7D 20 9F DE 3E 31 48 B8 F7 6F AB CC>)
$$ ##END=
$$ 
$$ hash MD5
$$ 8C 8B 4C DC E1 98 77 1F 34 18 03 46 87 AC CE 45
##$RELAX= 
##$RELAX= 
##$RELAX= 
##$RELAX= 
##$RELAX= 
##$RELAX= 
$$ Bruker specific parameters
$$ --------------------------
##$DU= <F:/spectra>
##$EXPNO= 1
##$NAME= <H-F>
##$PROCNO= 1
##$TYPE= <nmr>
##$USER= <she>
##$AMP= (0..31)
100 100 100 100 100 100 100 100 100 100 100 100 100 100 100 100 100 100 
100 100 100 100 100 100 100 100 100 100 100 100 100 100 
##$AQSEQ= 0
##$AQ_mod= 1
##$AUNM= <au_zg>
##$AUTOPOS= <>
##$BF1= 200.13
##$BF2= 200.13
##$BF3= 200.13
##$BF4= 200.13
##$BF5= 200.13
##$BF6= 200.13
##$BF7= 200.13
##$BF8= 200.13
##$BYTORDA= 1
##$CFDGTYP= 0
##$CFRGTYP= 5
##$CHEMSTR= <none>
##$CNST= (0..31)
1 1 145 1 1 1 1 1 1 1 1 1 1 1 1 1 1 1 1 1 1 1 1 1 1 1 1 1 1 1 1 1 
##$CPDPRG= <>
##$CPDPRG1= <>
##$CPDPRG2= <>
##$CPDPRG3= <>
##$CPDPRG4= <mlev>
##$CPDPRG5= <mlev>
##$CPDPRG6= <mlev>
##$CPDPRG7= <mlev>
##$CPDPRG8= <mlev>
##$CPDPRGB= <>
##$CPDPRGT= <>
##$D= (0..31)
0 1.2 0 0 0 0 0 0 0 0.06 0 0.03 0 0 0 0 0.0002 0 0 0 0 0 0 0 0 0 0 0 0 
0 0 0 
##$DATE= 1666182457
##$DBL= (0..7)
120 120 120 120 120 120 120 120 
##$DBP= (0..7)
150 150 150 150 150 150 150 150 
##$DBP07= 0
##$DBPNAM0= <>
##$DBPNAM1= <>
##$DBPNAM2= <>
##$DBPNAM3= <>
##$DBPNAM4= <>
$$ [...]
##$SUBNAM3= <"">
##$SUBNAM4= <"">
##$SUBNAM5= <"">
##$SUBNAM6= <"">
##$SUBNAM7= <"">
##$SUBNAM8= <"">
##$SUBNAM9= <"">
##$SW= 18.0517283424941
##$SWIBOX= (0..15)
0 0 2 0 0 0 0 0 0 0 0 0 0 0 0 0 
##$SW_h= 3612.71676300578
##$TD= 16384
##$TD0= 1
##$TE= 0
##$TE2= 300
##$TE3= 300
##$TEG= 300
##$TL= (0..7)
0 120 120 120 120 120 120 120 
##$TP= (0..7)
150 150 150 150 150 150 150 150 
##$TP07= 0
##$TPNAME0= <>
##$TPNAME1= <>
##$TPNAME2= <>
##$TPNAME3= <>
##$TPNAME4= <>
##$TPNAME5= <>
##$TPNAME6= <>
##$TPNAME7= <>
##$TPOAL= (0..7)
0.5 0.5 0.5 0.5 0.5 0.5 0.5 0.5 
##$TPOFFS= (0..7)
0 0 0 0 0 0 0 0 
##$TUNHIN= 0
##$TUNHOUT= 0
##$TUNXOUT= 0
##$USERA1= <user>
##$USERA2= <user>
##$USERA3= <user>
##$USERA4= <user>
##$USERA5= <user>
##$V9= 5
##$VALIST= <valist>
##$VCLIST= <CCCCCCCCCCCCCCC>
##$VD= 0
##$VDLIST= <DDDDDDDDDDDDDDD>
##$VPLIST= <PPPPPPPPPPPPPPP>
##$VTLIST= <TTTTTTTTTTTTTTT>
##$WBST= 1024
##$WBSW= 4
##$XGAIN= (0..3)
0 0 0 0 
##$XL= 0
##$YL= 0
##$YMAX_a= 165120
##$YMIN_a= -283978
##$ZGOPTNS= <>
##$ZL1= 120
##$ZL2= 120
##$ZL3= 120
##$ZL4= 120
##$ABSF1= 15.68519
##$ABSF2= -2.366659
##$ABSG= 5
##$ABSL= 3
##$ALPHA= 0
##$AQORDER= 0
##$ASSFAC= 0
##$ASSFACI= 0
##$ASSFACX= 0
##$ASSWID= 0
##$AUNMP= <proc_1d>
##$AZFE= 0.1
##$AZFW= 0.1
##$BCFW= 0
##$BC_mod= 2
##$BYTORDP= 0
##$COROFFS= 0
##$CY= -3
##$DATMOD= 1
##$DC= 0
##$DFILT= <>
##$DTYPP= 0
##$F1P= 0
##$F2P= 0
##$FCOR= 1
##$FTSIZE= 16384
##$FT_mod= 6
##$GAMMA= 0
##$GB= 0
##$INTBC= 1
##$INTSCL= 3.70164e-10
##$ISEN= 128
##$LB= 0.24
##$LEV0= 0
##$LPBIN= 0
##$MAXI= 10000
##$MC2= 0
##$MEAN= 0
##$ME_mod= 0
##$MI= 1.114404
##$NCOEF= 0
##$NC_proc= -7
##$NLEV= 6
##$NOISF1= 3.799351
##$NOISF2= 2.8
##$NSP= 0
##$NTH_PI= 0
##$NZP= 0
##$OFFSET= 15.72816
##$PC= 1
##$PHC0= -18033.55
##$PHC1= 11.0007
##$PH_mod= 1
##$PKNL= yes
##$PPARMOD= 0
##$PSCAL= 0
##$PSIGN= 0
##$REVERSE= no
##$SF= 200.130008680837
##$SI= 16384
##$SIGF1= 3
##$SIGF2= 2
##$SINO= 5.538805
##$SIOLD= 16384
##$SREGLST= <1H.CDCl3>
##$SSB= 0
##$STSI= 16384
##$STSR= 0
##$SW_p= 3612.71676300578
##$SYMM= 0
##$S_DEV= 0
##$TDeff= 16384
##$TDoff= 0
##$TI= <>
##$TILT= no
##$TM1= 0
##$TM2= 0
##$TOPLEV= 0
##$USERP1= <user>
##$USERP2= <user>
##$USERP3= <user>
##$USERP4= <user>
##$USERP5= <user>
##$WDW= 1
##$XDIM= 16384
##$YMAX_p= 356059588
##$YMIN_p= -763873
$$ End of Bruker specific parameters
$$ ---------------------------------
##NTUPLES= NMR SPECTRUM
##VAR_NAME=  FREQUENCY,     SPECTRUM/REAL,   SPECTRUM/IMAG
##SYMBOL=    X,             R,               I
##VAR_TYPE=  INDEPENDENT,   DEPENDENT,       DEPENDENT
##VAR_FORM=  AFFN,          ASDF,            ASDF
##VAR_DIM=   16384,         16384,           16384
##UNITS=     HZ,            ARBITRARY UNITS, ARBITRARY UNITS
##FACTOR=    0.220516191357247, 1,           1
##FIRST=     3147.67677821717, 0,            0
##LAST=      -465.039984788609, 0,           0
##MIN=       -465.039984788609, -763873,     0
##MAX=       3147.67677821717, 356059588,    0
$$ Real data points
##PAGE= N=1
##DATA TABLE= (X++(R..R)), XYDATA
$$ [...]
5663B2409078N93108Q67878J046775J147263J610623J398871J334531J342653
5655C1750780P08262j90871n22220j139911j578221k099834k032967j647005j334003
5646B1914010j410197j244056j232337j124553r02227j093554m50809p04858o03929
5637A3147490j50976m40929k11701n75084l49701Q4307l99181m50880k51028R7993
5627A0500310j17127n7717p6884o9097q9231k81179r9658j7709j88065j67117
5617I336526J33109K12776l8034M8241J10325q2927P8249n8412K61844K41021
5607A0242718J92236n4235K87420N71292N02504L98372L23095O18205N79957Q06895
5597A4468459R67213R26823J150924Q63445J076865J099140N04654N77212J12622
$$ y = [22409078, 23002186, 23870064, 24916839, 26064102, 27674725, 29073596, 30408127, 31750780, 32459042, 32268171, 31745951, 30606040, 29027819, 26927985, 24895018, 23248013, 21914010, 20503813, 19259757, 18027420, 16902867, 16000640, 14907086, 14456277, 13751419, 13147490, 12996514, 12555585, 12343884, 11768800, 11419099, 11503406, 11104225, 10653345, 10402317, 10500310, 10383183, 10325466, 10248582, 10179485, 10090254, 9809075, 9709417, 9691708, 9503643, 9336526, 9469635, 9682411, 9644377, 9692618, 9802943, 9720016, 9798265, 9739853, 10001697, 10242718, 10434954, 10380719, 10668139, 11239431, 11741935, 12140307, 12463402, 13081607, 13661564, 14468459, 15435672, 16362495, 17513419, 18376864, 19453729, 20552869, 21057523, 21634735, 21747357]
5588B1747357j99188r05087q37407l05051n71996m50612j26689k84350k92889
5579A7774088k07661J7964M9900j3507K95918J26095m64002j12014q1663j54237
5569A7230881r1311j60100l50504k88757l8919L09853L05962L43244K55036J67274
5559A7682659M11335K55920M37890J81126m3601n023k83830j20745k01972l34910
5549A7978849O4140n1882R7960r4755K6386J45748K45789N07950P2183k2470j46176
5538A8823722k00734M796r6598k11056l03427m28750l92340m76936k57944j53378
5528A6307355L680L9362J46062m8339k27341n1003j0395l02147k55307l56397
5518A5245530m71886l70967n11800k2086l67316n44021l15239k83767J7115j2944
$$ y = [21747357, 21548169, 20643082, 19805675, 19500624, 18928628, 18478016, 18351327, 18066977, 17774088, 17566427, 17584391, 17634291, 17620784, 17916702, 18042797, 17578795, 17466781, 17385118, 17230881, 17139570, 16979470, 16628966, 16340209, 16301290, 16611143, 16917105, 17260349, 17515385, 17682659, 18093994, 18349914, 18787804, 18968930, 18925329, 18920306, 18636476, 18515731, 18313759, 17978849, 18042989, 17991107, 18089067, 17994312, 18020698, 18166446, 18412235, 18920185, 18992368, 18969898, 18823722, 18622988, 18627784, 18531186, 18320130, 18016703, 17587953, 17195613, 16718677, 16460733, 16307355, 16311035, 16350397, 16496459, 16448120, 16220779, 16169776, 16159381, 15857234, 15601927, 15245530, 14773644, 14402677, 13890877, 13868791, 13501475, 12957454, 12642215, 12358448, 12375563, 12362619]
5508A2362619k4499J65651j5966j64691l64352n34837l07336J30500n23646k24031
5498A0499412k01458k23680j02348k16589n09388j05397j06548k81422l6819l90878
5488H324885Q661O8157J4925o2243r1624j74658l06538j61406k22242j34317j0829
5477G252771K3253J98974l61346j84229j2244k62746J37293J39316J3443j55941
5467F788544J82430J00248p0700J4986k21608r9075l18902P7117M8783j5603j38219
5456F348001k4321J76721J87952j39089J75114J27168K29316l40133k0815L62881
5446G082795R1967J0477n9131J37091R5499Q2564o0713J68513K15300K61746O8100
5435H094208J32355k06813K40677J70490J1743n9271R1837K23791M15822R3891
$$ y = [12362619, 12338120, 12503771, 12487805, 12323114, 11958762, 11423925, 11116589, 11247089, 10723443, 10499412, 10297954, 10074274, 9971926, 9755337, 9245949, 9140552, 9034004, 8752582, 8715763, 8324885, 8333546, 8401703, 8416628, 8354385, 8262761, 8088103, 7781565, 7620159, 7397917, 7263600, 7252771, 7276024, 7474998, 7113652, 6929423, 6917179, 6654433, 6791726, 6931042, 6944485, 6788544, 6970974, 7071222, 7000522, 7015508, 6793900, 6694825, 6375923, 6453040, 6501823, 6486220, 6348001, 6323680, 6500401, 6688353, 6549264, 6724378, 6851546, 7080862, 6740729, 6719914, 7082795, 7174762, 7185239, 7126108, 7263199, 7358698, 7441262, 7380549, 7549062, 7764362, 8026108, 8094208, 8226563, 8019750, 8260427, 8430917, 8442660, 8383389, 8475226, 8699017, 9114839, 9208730]
5425I208730K20012L37016k6299L64410J47232L93677K31139J01743M11948M01665
5415A1791273K88583N10718M95890M98153M71156L73496P28378O13065O54410
5406A6425122O05418M89033K15119M5682J59013j9144K64522M15544K1214o7172
5396A8554351J61704K96445M7378J92136N36274M64450M61300L37241N63953P60750
5386B2375982O20982Q67969J297448R54801J109467J465484J846993K211236K353295
5377C5103657K517976L057433L692461M034740L852011L948714L965122L650528
5369F3822642L435957L700391L566043K817385J847554M85178o97798j894777
5361G7082575k958952l295703k707990k759435k700432k403329j767434j346825
$$ y = [9208730, 9428742, 9765758, 9739459, 10103869, 10251101, 10644778, 10875917, 10977660, 11389608, 11791273, 12079856, 12590574, 13086464, 13584617, 14055773, 14429269, 15157647, 15770712, 16425122, 17030540, 17519573, 17734692, 17780374, 17939387, 17920243, 18184765, 18600309, 18621523, 18554351, 18716055, 19012500, 19059878, 19252014, 19788288, 20252738, 20714038, 21051279, 21615232, 22375982, 22996964, 23864933, 25162381, 26117182, 27226649, 28692133, 30539126, 32750362, 35103657, 37621633, 40679066, 44371527, 48406267, 52258278, 56206992, 60172114, 63822642, 67258599, 70958990, 74525033, 77342418, 79189972, 79675150, 78977352, 77082575, 74123623, 70827920, 68119930, 65360495, 62660063, 60256734, 58489300, 57142475]
5353E7142475p64213k98798K82976O85508J150052J380589J085227Q73612J191008
5344F2728436P60781J96023R1436m51512o77326p42355q56968r56179o22928n78294
5334E8891114m75682l80871Q3212j21994j16338k57771n90705n46512j497023
5325E4987430k052663j905900k408946k526456k380014k428553k373530k630528
5317C6280840k466507k452226k201736j837728j613178j646246j526990j365771
5309B1170458j112957j040606p78196r05733n89215n79645n15494o98184n36630
5300A4413798m86417m26903l20270n56490m94378k06494l64895l58617r2134k87130
5290A0820070r2328j96890L3129j80725l37963p3912l645j75907J48425J00272
$$ y = [57142475, 56378262, 56079464, 56362440, 57047948, 58198000, 59578589, 60663816, 61537428, 62728436, 63489217, 63685240, 63776676, 63325164, 62647838, 61905483, 61048515, 60092336, 59469408, 58891114, 58415432, 58034561, 58117773, 57995779, 57879441, 57621670, 57030965, 56484453, 54987430, 52934767, 51028867, 48619921, 46093465, 43713451, 41284898, 38911368, 36280840, 33814333, 31362107, 29160371, 27322643, 25709465, 24063219, 22536229, 21170458, 20057501, 19016895, 18238699, 17332966, 16743751, 16164106, 15648612, 14950428, 14413798, 13927381, 13500478, 13180208, 12623718, 12129340, 11922846, 11557951, 11199334, 11107200, 10820070, 10727742, 10530852, 10563981, 10383256, 10045293, 9971381, 9967736, 9791829, 9940254, 10040526]
5280A0040526l11575j18302J37652L08850M82364J56603M6261Q9911N0308J63191
5270A1045789M2974Q3775J78565l9471N8556l3904l52735m12823q0949m26902
5260A0062875n47242l22861k95621j55971l95710m41803k21108k90816l40308
5251G051435k20865k33636r1087j07908m3808j44277m67554p5958o8126j76800
5241E421416k88149R9059P1251q5366j44699M4372k21967j83276m0371l6887p1741
5230D563642J195J2825k53952j56220l2779j43552K23382L0267j40205m9549L7434
5219D092488l609j13682J76649M2127l05161m4656M737Q8401R2928k67117j18973
5208C644132J36064J37616k44977P8883J74128n4274k67155J68817J25415R2831
$$ y = [10040526, 9728951, 9610649, 9748301, 10057151, 10539515, 10696118, 10742379, 10832290, 10882598, 11045789, 11088763, 11172538, 11351103, 11311632, 11370188, 11336284, 10983549, 10570726, 10489777, 10062875, 9515633, 9192772, 8897151, 8741180, 8345470, 7903667, 7682559, 7391743, 7051435, 6830570, 6596934, 6505847, 6397939, 6354131, 6209854, 5742300, 5666342, 5598216, 5421416, 5133267, 5232326, 5303577, 5218211, 5073512, 5117884, 4895917, 4712641, 4672270, 4635383, 4563642, 4564837, 4577662, 4323710, 4167490, 4134711, 3991159, 4214541, 4244808, 4104603, 4055054, 4092488, 4088879, 3975197, 4151846, 4193973, 3888812, 3844156, 3848893, 3937294, 4030222, 3763105, 3644132, 3780196, 3917812, 3672835, 3751718, 3925846, 3871572, 3604417, 3773234, 3898649, 3991480]
5198C991480j99188r2533P618o2723Q3175K34145j18217j64761o3837l21769N180
5187C298570J83915J95501r154L416q4466O66J54289R0530j11351J85759J9469
5176C927144J6000M8730p7296k0754K23279K56312j8364J60239N7295m7043K82582
5165D808124P189j18021r686J13574Q2422k39029n3457m16321J25156R5364p194
5154D388121p3731O0709r0439k22857K7946M27007J50q1035K9239j92715K82704
5143D555099K05549j13619K21571L03441M00707M33503J09493J53409K5672P6751
5133F371576j55422J06093j2124j24747L04779J15496l10908j98316j39207n30597
5123E426623n1215j97828q0458j37756m40519j61519j63717j14950M7912K14459
$$ y = [3991480, 3792292, 3699759, 3707377, 3644654, 3727829, 3961974, 3843757, 3678996, 3615159, 3293390, 3298570, 3482485, 3677986, 3668832, 3672248, 3587782, 3588448, 3742737, 3833267, 3721916, 3907675, 3927144, 3943144, 3991874, 3914578, 3893824, 4117103, 4373415, 4355051, 4515290, 4572585, 4525542, 4808124, 4815313, 4697292, 4687606, 4801180, 4883602, 4644573, 4591116, 4174795, 4299951, 4395315, 4388121, 4314390, 4375099, 4284660, 4061803, 4089749, 4516756, 4516906, 4435871, 4465110, 4272395, 4555099, 4760648, 4647029, 4868600, 5172041, 5572748, 6006251, 6115744, 6269153, 6294825, 6371576, 6216154, 6322247, 6310123, 6185376, 6490155, 6605651, 6294743, 6096427, 5957220, 5426623, 5375408, 5177580, 5097122, 4959366, 4518847, 4357328, 4193611, 4078661, 4126573, 4341032]
5113D341032m7790k94018m428J48075P2802J97792M9292O5370P6888K50198k76090
5102D579123R5322K5733m7870L6585k03055J03649j85001l10275j64434o3589
5092C866188o1944j92576r5017n0541j15544j78505j66106J05682j15981o2564
5082B933092j76271P4892M975J35829l606k54151n8078M5550K01070j290j65192
5071B736820k09214j07483K7094J91293K27899l0090j92154J7968P1694o2535
5061B671292L4534j9432j98560o0508j2645M621P1726R1015M6879J286j10090
5050B520118Q1354J00946M350k08675L4327j17996p9300M17881K07547j56452
5040B804100k23831k12226P0722j5072J6154l3292j06794J84759J54760J73504
$$ y = [4341032, 4293242, 3999224, 3994796, 4142871, 4215673, 4413465, 4462757, 4528127, 4605015, 4855213, 4579123, 4674445, 4700178, 4652308, 4688893, 4485838, 4589487, 4404486, 4094211, 3929777, 3866188, 3804244, 3611668, 3516651, 3466110, 3350566, 3172061, 3005955, 3111637, 2995656, 2933092, 2756821, 2831713, 2836688, 2972517, 2968911, 2714760, 2656682, 2702232, 2903302, 2902012, 2736820, 2527606, 2420123, 2447217, 2638510, 2866409, 2836319, 2644165, 2662133, 2733827, 2671292, 2705826, 2686394, 2487834, 2427326, 2414681, 2419302, 2491028, 2582043, 2628922, 2630208, 2520118, 2601472, 2702418, 2706768, 2498093, 2532420, 2414424, 2335124, 2753005, 2960552, 2804100, 2580269, 2368043, 2438765, 2423693, 2439847, 2406555, 2299761, 2484520, 2639280, 2812784]
5030B812784j06207k54916j79084K39820M4313J50366J62352j72412j78163K06906
5020B725759L1410p952J94172k00433j35481j54993L608j44648J72818N719k36597
5009B253382j12853q074J56527J70675K37551p3956l79420O3194M5079J89543
4999B541648j65842j47037J9828Q6758l5297M603l262j47438J38922P3353j64449
4988B201787p513O0516j40292K20622j7539K5280k91425j61785L23438J89981
4978B403070k68239J25857K00312J11529L9315O4852K27094j00522j39221j25650
4968B538397j08241o2520J06332p8026r7146K2174K84832k5120K46241k1161J48929
4957B954691M5240l70752q3182J38182R3879k32109J2233K41829R5869k19307
$$ y = [2812784, 2706577, 2451661, 2272577, 2512397, 2556710, 2707076, 2869428, 2697016, 2518853, 2725759, 2757169, 2749217, 2943389, 2742956, 2607475, 2452482, 2456090, 2311442, 2484260, 2489979, 2253382, 2140529, 2132455, 2288982, 2459657, 2697208, 2623252, 2243832, 2307026, 2352105, 2541648, 2375806, 2228769, 2248597, 2335355, 2300058, 2304661, 2301399, 2153961, 2292883, 2366236, 2201787, 2194274, 2254790, 2114498, 2335120, 2317581, 2342861, 2051436, 1889651, 2213089, 2403070, 2134831, 2260688, 2461000, 2572529, 2611844, 2676696, 2903790, 2803268, 2664047, 2538397, 2430156, 2367636, 2473968, 2395942, 2298796, 2320970, 2605802, 2580682, 2826923, 2805762, 2954691, 2999931, 2629179, 2545997, 2684179, 2778058, 2545949, 2558182, 2800011, 2895880, 2676573]
4947B676573n680J40277Q4873p8156K37524p0151k70764J31797j66250j35753
4937B544290j64221j15302n3578K89458J03879J4875J98265Q6924k31208n4323
4927B619059N1948j04808p0398J34375L22319o581K32328n4486K02066N8280r6427
4916C287675K60195J52101L8813J02345j39720R0712n4091L2343O5142N06229
4906D341744L06507J46379J22617P6588o204p666L09899J60773n7298k5454K78957
4895E646842m3772k79442k2924j94687M2496L0296P228q6854j70768o3411J24577
4884D989581Q3377L1504K657L75410J52244q0250L43486m2477q2114K44931L02094
4873F320443p8802J65583L9040m9648J94885k54673J22054k9166k74816j86146
$$ y = [2676573, 2670893, 2811170, 2896043, 2817887, 3055411, 2985260, 2714496, 2846293, 2680043, 2544290, 2380069, 2264767, 2211189, 2500647, 2604526, 2619401, 2817666, 2904590, 2673382, 2619059, 2671007, 2566199, 2495801, 2630176, 2952495, 2945914, 3178242, 3123756, 3325822, 3384102, 3287675, 3547870, 3699971, 3738784, 3841129, 3701409, 3792121, 3738030, 3770373, 3835515, 4341744, 4648251, 4794630, 4917247, 4993835, 4987631, 4979965, 5289864, 5450637, 5393339, 5367885, 5646842, 5603070, 5323628, 5300704, 5106017, 5148513, 5178809, 5186037, 5099183, 4928415, 4865004, 4989581, 5072958, 5104462, 5107119, 5482529, 5634773, 5554523, 5898009, 5855532, 5773418, 6018349, 6320443, 6241641, 6407224, 6446264, 6396616, 6591501, 6336828, 6458882, 6429716, 6154900, 5968754]
4863E968754M22987l31070j82277j81446j52471K9155m12093j0352m7867k64314
4853D839006p5519K43800j30166K65714j90138k80650J51212J71688J46224J57811
4843E298982r7734j43839Q2112l1091J10962J35476R0853k14682j2852O1173k58757
4832E020603k32840k79588J24042k18854o7982j88642O6717l59387R5768J84445
4822D144282R0962j42172N2744Q94j97772J68113k63306j14414K00389k2947J13193
4811D029966m3358J83683m8816j11588L9056n6105K07657L2164n7064j7082N7807
4800D216320K8142K89070J98359k424J18996j82675J09840K17794K97463k59743
4790E031142J0342Q9188K36131K40742K43064N85343L03390n3485j30124p423
$$ y = [5968754, 6391741, 6060671, 5878394, 5696948, 5544477, 5573632, 5161539, 5151187, 5103320, 4839006, 4763487, 5007287, 4877121, 5142835, 4952697, 4672047, 4823259, 4994947, 5141171, 5298982, 5201248, 5057409, 5139521, 5108430, 5219392, 5354868, 5445721, 5231039, 5218187, 5279360, 5020603, 4787763, 4508175, 4632217, 4413363, 4345381, 4156739, 4223456, 3864069, 3959837, 4144282, 4235244, 4093072, 4145816, 4146710, 3948938, 4117051, 3853745, 3739331, 3939720, 3916773, 4029966, 3986608, 4170291, 4121475, 4009887, 4048943, 3992838, 4200495, 4232659, 4175595, 4158513, 4216320, 4244462, 4533532, 4731891, 4729467, 4848463, 4665788, 4775628, 4993422, 5290885, 5031142, 5041484, 5130672, 5366803, 5607545, 5850609, 6435952, 6739342, 6685857, 6555733, 6548310]
4780F548310J1211J0661l03984m53696j8648J80535j34180k7428n236K91357M94389
4769F593291o0100q2669J81082M071R8845J89775J1163q6341O12528J49681p5127
4758G536199J383J26119K72441R9667K2661J03072K31890q5569L9727N9401M0999
4747H447990K26768m8291m310L77559L10082M9665O7249L04003K75304K24906
4737A0230925M63667K50177K40413L50919K40565J44471L03706N4090N6694l18911
4727A2016716P692K09002q8334J26911K84404q0295K64494k5526K97019m19140
4717A2592943o394K59087j50013j00768j80724j19370J64782M60621M9177J47422
4707A3116763L63841L44098K09305L12064O41693J31933L03218K28673M3840m1872
$$ y = [6548310, 6559521, 6570182, 6266198, 5812502, 5793854, 5974389, 5840209, 5812781, 5807545, 6098902, 6593291, 6533191, 6450522, 6631604, 6635675, 6734520, 6924295, 6935458, 6849117, 7461645, 7611326, 7536199, 7537582, 7663701, 7936142, 8035809, 8058470, 8161542, 8393432, 8307863, 8347590, 8406991, 8447990, 8674758, 8626467, 8622157, 8999716, 9309798, 9359463, 9426712, 9730715, 10006019, 10230925, 10694592, 10944769, 11185182, 11536101, 11776666, 11921137, 12224843, 12278933, 12335627, 12016716, 12024408, 12233410, 12145076, 12271987, 12556391, 12476096, 12740590, 12715064, 13012083, 12592943, 12586549, 12845636, 12695623, 12594855, 12414131, 12294761, 12459543, 12920164, 12969341, 13116763, 13480604, 13824702, 14034007, 14346071, 14987764, 15119697, 15422915, 15651588, 15695428, 15653556]
4697A5653556K77865K92120J93435K43517L17224L10795j32286K38839J50183
4688A7545248M90384N2455J90745J35569q383K34757K66479J86833R7954l283
4678A9188758J96448J67160o8679M22192O44821k2157N20783P15005N47837O86142
4668B2998310M86358N83072O97579J108554O81568N15342N39924O38416M42212
4659B8691335L91180M95666j93345j98312k20371n4385k68781j46885m14711j28395
4649B7952996J0610j63718j44326q8522J55946J19350K80633K61264O60730N81041
4639B9626004O31731P32618R42109Q55439R27979J024897J131062Q35058N48092
4630C7254989M18778N88173N36974M43947K84963M51007O45842L31130Q00868
$$ y = [15653556, 15931421, 16223541, 16416976, 16660493, 16977717, 17288512, 17156226, 17395065, 17545248, 18035632, 18088087, 18278832, 18414401, 18406018, 18640775, 18907254, 19094087, 19192041, 19188758, 19385206, 19552366, 19483687, 19905879, 20550700, 20528543, 21049326, 21764331, 22312168, 22998310, 23484668, 24067740, 24765319, 25873873, 26555441, 27070783, 27610707, 28249123, 28691335, 29082515, 29578181, 29384836, 29186524, 28966153, 28911768, 28642987, 28496102, 28081391, 27952996, 27963606, 27799888, 27655562, 27567040, 27722986, 27842336, 28122969, 28384233, 29044963, 29626004, 30257735, 30990353, 31932462, 32787901, 33715880, 34740777, 35871839, 36706897, 37254989, 37673767, 38261940, 38798914, 39242861, 39527824, 39978831, 40624673, 40955803, 41756671]
4621D1756671P58944R72424J000193J349505J276839J655322K151137K393063
4613E3314098K626148L135006L579748M167023M083926L863791L145695K480588
4605H0396023K200905J926899K421756L449472M336776N245609N326025N744640
4597A11048105M851254L386118J964626J15485j057171k403947l689969m309751
4589A09904750m441230m765780m662803m482175m225813l472993l396641k910301
4581G7547014k617787k412337k205840k112790j885816j724280j620150j451476
4573F1516538j631074j543655j194328j607236j814436j790522j664310j694051
4565D8576926j622839j414801j072602j056663r49381o44893n58578o72964l79922
$$ y = [41756671, 42515615, 43488039, 44488232, 45837737, 47114576, 48769898, 50921035, 53314098, 55940246, 59075252, 62655000, 66822023, 70905949, 74769740, 77915435, 80396023, 82596928, 84523827, 86945583, 90395055, 94731831, 99977440, 105303465, 111048105, 115899359, 119285477, 121250103, 121365588, 120308417, 117904470, 114214501, 109904750, 105463520, 100697740, 96034937, 91552762, 87326949, 83853956, 80457315, 77547014, 74929227, 72516890, 70311050, 68198260, 66312444, 64588164, 62968014, 61516538, 59885464, 58341809, 57147481, 55540245, 53725809, 51935287, 50270977, 48576926, 46954087, 45539286, 44466684, 43410021, 42460640, 41815747, 41257169, 40584205, 40204283]
4556D0204283o13624o05277p09750p28969o23941k33822k92086m30339n28673
4547C5437802n0990K06629P0337j2042j20423j08112K12527M30758L00737M60605
4537C6827828M85983M31323Q86538P48842K65192M77529O22567J10259M75167
4528D1331228Q62656P27840J091212J052766P42479J046190R96147P76643K99462
4519D8926623J67353l90226m73225n27291j019818q48549j269100j096181p94439
4510D2675147m12831l97592q0365L61960k5245K30103P27821Q88677P45168R52175
4500D5665018J067458O11663Q28495J008152R63769R65962O21152Q84447N41125
4491E3157241M36547N60092O06590J007888P76231R68647O69374J38218j4714
$$ y = [40204283, 39590659, 38985382, 38275632, 37546663, 36922722, 36688900, 36396814, 35966475, 35437802, 35386812, 35593441, 35663778, 35651736, 35531313, 35423201, 35635728, 36066486, 36367223, 36827828, 37313811, 37745134, 38631672, 39380514, 39645706, 40123235, 40745802, 40856061, 41331228, 42193884, 42921724, 44012936, 45065702, 45808181, 46854371, 47850518, 48627161, 48926623, 49093976, 48703750, 48230525, 47703234, 46683416, 45834867, 44565767, 43469586, 42675147, 42262316, 41864724, 41784359, 42146319, 42121074, 42351177, 43078998, 43967675, 44712843, 45665018, 46732476, 47344139, 48172634, 49180786, 50144555, 51110517, 51731669, 52616116, 53157241, 53593788, 54153880, 54760470, 55768358, 56544589, 57513236, 58182610, 58320828, 58306114]
4482E8306114n6817k08526o78336p50958p75055r99168r19474m62253o17989k21247
4472E2616291l05669j35739j23382J350j36008j22250m87617n91547q57450n36679
4462D9321300p58702j032168n03244k65909m35978l92736m71830j024555q65328
4453D3570850j339496j247390j401162j073314r06732j069645j162987n98571
4445C4771553k38087k56779l35930R1904O8372J55805L19801N48926O91568P22722
4435C6539855M14356P87993P81443Q56001R13609L56505K43602M58346N6493K71852
4425D1680055O67396O59134M65087R30608J386625J276520J415278K010281J916778
4416E2407762K345939K555547K514280K856382L120895L025856L143769L021894
$$ y = [58306114, 58249297, 58040771, 57362435, 56611477, 55836422, 54837254, 53917780, 53455527, 52837538, 52616291, 52310622, 52174883, 52051501, 52052851, 51916843, 51794593, 51306976, 50715429, 49857979, 49321300, 48562598, 47530430, 47027186, 46761277, 46325299, 45932563, 45460733, 44436178, 43570850, 42231354, 40983964, 39582802, 38509488, 37602756, 36533111, 35370124, 34771553, 34533466, 34276687, 33940757, 34032661, 34101033, 34256838, 34576639, 35125565, 35817133, 36539855, 36954211, 37742204, 38523647, 39379648, 40293257, 40649762, 40893364, 41351710, 41408203, 41680055, 42347451, 43006585, 43471672, 44402280, 45788905, 47065425, 48480703, 50490984, 52407762, 54753701, 57309248, 59823528, 62679910, 65800805, 68826661, 71970430, 74992324]
4408G4992324L563705M308636N259213O509027Q395508J1373985J3903858J4697166
4400A43003422J1912636O249813k816008j2382080j7701341j6953270j4157760
4393I7155412j1318345q694856p146235n525830m187993l333016k473719j803709
4385E2671709j586231j225914r85084n80916l40531N8175L27739K35870L29937
4376D8904754L85447j07552o10512p65480j402942j615453j817034j752100j570054
4367C9649074j361065j136049m65718o33950m44772n63344k42726l8153l50587
4358C4412710p39853p48115o57455r31120p14610o82808o52434o52831o10221
4349B8023263n15993k67111j99271l9807n5046n60527l934K56455K54802K15042
$$ y = [74992324, 78556029, 82864665, 88123878, 94632905, 103028413, 114402398, 128306256, 143003422, 154916058, 161165871, 158349863, 145967783, 128266442, 111313172, 97155412, 85837067, 77142211, 69995976, 64470146, 60282153, 56949137, 54475418, 52671709, 51085478, 49859564, 48874480, 48293564, 47953033, 48011208, 48338947, 48574817, 48904754, 49290201, 49182649, 48572137, 47806657, 46403715, 44788262, 42971228, 41219128, 39649074, 38288009, 37151960, 36686242, 36052292, 35607520, 35044176, 34801450, 34763297, 34412710, 33672857, 32924742, 32267287, 31336167, 30621557, 29938749, 29286315, 28633484, 28023263, 27507270, 27240159, 27040888, 27001081, 26946035, 26385508, 26381574, 26638029, 26892831, 27107873]
4339B7107873L50139M03843K40688L71012P93510N07211O32434O36995J020482
4330C2064187Q04601J113872J028246R61601R43916J183829J226761Q04880O67539
4321D0799432Q61129Q56370Q42705J361151J218401J890933K247808K536270K703060
4312E5317259L610835M127516M725873N439867O504452P199173Q251282R959311
4304A05135568J1767212J3066011J3185661J2644839R417723L633448k512822
4297A66337640r192371j3445739j5011592j4219259j2517953j1157883r490344
4290H1302499p844593o736332n651893m713805m126228l755463l219676k593236
4282D2661273k469741k420976j911167j619641j643683j754071j394144r97612
$$ y = [27107873, 27458012, 27861855, 28102543, 28473555, 29267065, 29774276, 30406710, 31043705, 32064187, 32868788, 33982660, 35010906, 35972507, 36916423, 38100252, 39327013, 40131893, 40799432, 41660561, 42516931, 43359636, 44720787, 45939188, 47830121, 50077929, 52614199, 55317259, 58928094, 63055610, 67781483, 73221350, 79725802, 86924975, 95176257, 105135568, 116902780, 129968791, 143154452, 155799291, 165217014, 168850462, 166337640, 157145269, 143699530, 128687938, 114468679, 101950726, 90792843, 81302499, 73457906, 66721574, 61069681, 56355876, 52229648, 48474185, 45254509, 42661273, 40191532, 37770556, 35859389, 34239748, 32596065, 30841994, 29447850, 28450238]
4274B8450238j073312j011104j012128r80800n85441r39315q55668q78970p23851
4265B0389649m86916o09944n65396o62727n33790m66894n57481j72106l18619
4256A6015776n04341m85495r3089k17628n50449J82720k35450k69265j31326l09471
4246A3401982j83192m1359k85615p3454k01893l22932j32415k48316j5092j19157
4236A1778557j30158j1567j78083l9291j72122j28929L5949K26704j48734k21676
4226A1010650j40664N5378j25597n02084m74725l26880l21919M3772j91204k55544
4216H771183j40825j74510L09724j73383j45726o1772q1084l5948K92994k80964
4206H279689j76944j24028j34242K6213n7544r7509m5772J16138l2622o2143r3246
$$ y = [28450238, 27376926, 26365822, 25353694, 24372894, 23787453, 22848138, 21992470, 21113500, 20389649, 19902733, 19292789, 18727393, 18064666, 17530876, 17063982, 16506501, 16334395, 16015776, 15511435, 15025940, 14932851, 14715223, 14164774, 14347494, 14112044, 13842779, 13711453, 13401982, 13218790, 13177431, 12891816, 12818362, 12616469, 12293537, 12161122, 11912806, 11897714, 11778557, 11648399, 11636832, 11458749, 11419458, 11247336, 11118407, 11154356, 11381060, 11232326, 11010650, 10869986, 10925364, 10799767, 10297683, 9822958, 9496078, 9174159, 9217931, 9026727, 8771183, 8630358, 8455848, 8765572, 8592189, 8446463, 8384691, 8303607, 8267659, 8560653, 8279689, 8102745, 7978717, 7844475, 7870688, 7813144, 7715635, 7669863, 7786001, 7753379, 7691236, 7597990]
4195G597990j81749j650K21000k71634J6865k16168K91978K9501j84936j00128
4185G201069O9983K12093j2304l00984J86748o0608N0291o9089j5157J96030J41242
4174G599314j14021N2256J29258J85943L35195l9641J52751K31252J94390N1074
4164H777771N50217N46108n9103k64923j7137K3896l2695m12851q0884k37740
4154H792659N8637N33501J26045K33872K16599J84450L43889L38251O02266N39390
4144A1969559M61137j32966m51019o05578n01391o25823m89848k85425k22430
4135I116216k60342m24981k36535j55994k5937n7532m8589P3240n8913m6106m82339
4124G392188K69364k70386k74051j01408Q8951Q1110N0709j1553K03028K48487
$$ y = [7597990, 7416241, 7414591, 7635591, 7363957, 7380822, 7164654, 7456632, 7486133, 7301197, 7201069, 7271052, 7483145, 7470841, 7169857, 7356605, 7295997, 7346288, 7277199, 7262042, 7458072, 7599314, 7485293, 7537549, 7666807, 7852750, 8187945, 8148304, 8301055, 8532307, 8726697, 8777771, 9327988, 9874096, 9814993, 9550070, 9532933, 9556829, 9524134, 9111283, 9030399, 8792659, 8851296, 9384797, 9510842, 9744714, 9961313, 10145763, 10489652, 10827903, 11430169, 11969559, 12430696, 12297730, 11846711, 11241133, 10739742, 10113919, 9624071, 9338646, 9116216, 8855874, 8430893, 8194358, 8038364, 8012427, 7954895, 7906306, 7979546, 7920633, 7874527, 7392188, 7661552, 7391166, 7117115, 7015707, 7104658, 7185768, 7236477, 7224924, 7427952, 7676439]
4114G676439K7855J55813J20294L78647r8805J14056N898M1615K46734M6698K07313
4103H922557K12447K8134J95153K57076N16702M40336O5055k2378P28558P28089
4093A2071729K99144L73390M66990P03533N90862R96372J077641J264036J417983
4084A9261680J896070K793749L853920N819521O327716M141017K392606j221784
4076D5264495o875031p112548m944217l674822k515302k000899j512354j025524
4068A5603798j114054o74764o23267j30042k25132m91686k28113j88465j98217
4059A1730058K6237j23503K47429j380L150j71081Q2256m6395l6936K52081L0348
4048A1992264J65795R9999M2982M5804K70399K81360L27184K98682j829m5064
$$ y = [7676439, 7704294, 7860107, 7980401, 8359048, 8260243, 8374299, 8380197, 8421812, 8668546, 8715244, 8922557, 9135004, 9163138, 9358291, 9615367, 10132069, 10572405, 10637460, 10615082, 11343640, 12071729, 12370873, 12744263, 13211253, 13914786, 14505648, 15502020, 16579661, 17843697, 19261680, 21157750, 23951499, 27805419, 33624940, 39952656, 44093673, 46486279, 45264495, 38389464, 31276916, 26332699, 22657877, 20142575, 18141676, 16629322, 15603798, 14489744, 13814980, 13191713, 13061671, 12836539, 12344853, 12116740, 11928275, 11730058, 11756295, 11632792, 11880221, 11878841, 11881991, 11710910, 11793166, 11746771, 11709835, 11961916, 11992264, 12158059, 12258058, 12301040, 12346844, 12617243, 12898603, 13225787, 13524469, 13522640, 13477576]
4038A3477576N7142K85988K01658N4183K90276L46704M08038N36669M99185K55205
4028A6412624N33589O56291K29138M07114M69775L85811M19877Q7949N08749M51360
4018B0562277P45070K19860N29159R90861O97544P74217N61831N18332M73561
4009B6072712M47597N53209J67523P018K23016Q8690J60533J66184n0090N14967
3999B8351359O16118N52989O05505L19431n880l515k14097n18708n90621q69172
3989B8243409o89273m15488o23779l96415k24350k93700k24646j39287m49329
3980B4787142n73160l90204q08552r12722j065863r10310p57313p36305n21860
3971A8110853o10847o08253n07112o03844k94941m65575m91203n82195k82294
$$ y = [13477576, 13534718, 13820706, 14022364, 14076547, 14366823, 14713527, 15121565, 15658234, 16157419, 16412624, 16946213, 17602504, 17831642, 18238756, 18708531, 19094342, 19514219, 19602168, 20110917, 20562277, 21307347, 21527207, 22056366, 23047227, 23744771, 24518988, 25080819, 25599151, 26072712, 26520309, 27073518, 27241041, 27248059, 27471075, 27559765, 27720298, 27886482, 27836392, 28351359, 28967477, 29520466, 30125971, 30445402, 30439522, 30436007, 30221910, 29703202, 29112581, 28243409, 27554136, 27138648, 26514869, 26118454, 25894104, 25600404, 25375758, 25236471, 24787142, 24213982, 23823778, 23015226, 22102504, 21036641, 20126331, 19369018, 18632713, 18110853, 17500006, 16891753, 16384641, 15780797, 15485856, 15020281, 14529078, 13946883, 13664589]
3962A3664589o42878q81355m81728p99444m93814n04441j83342k10548l95617
3953I071422k21775l42317k64825k77444j24764l12934l46824j07232k33482J08137
3943F947962j45212j54210k99720j95174j18982j44808l08880n7676p9296j89352
3933E254652r9299k43543k7248j35298j15783N38R7293k42568N9862J40658j67395
3922D521869k46357j27706M3947K1892l394j75629k01942K40775L6649m8176r2572
3911C969356k50199j89662J54522m5311M0857k38517K37000K4484n5198k86889
3901C360443j81756J64945j7391J4298k90990M5476Q523K26056K16020j36248
3891C409376k38360j30173j74086l6037K8024J95880O1810j94484j83051L903
$$ y = [13664589, 13021711, 12140356, 11658628, 10859184, 10365370, 9860929, 9677587, 9467039, 9071422, 8849647, 8507330, 8242505, 7965061, 7840297, 7527363, 7180539, 7073307, 6839825, 6947962, 6802750, 6648540, 6348820, 6153646, 6034664, 5889856, 5580976, 5523300, 5444004, 5254652, 5155353, 4911810, 4884562, 4749264, 4633481, 4634019, 4731312, 4488744, 4548606, 4689264, 4521869, 4275512, 4147806, 4191753, 4213645, 4210251, 4034622, 3832680, 4073455, 4110104, 4061928, 3969356, 3719157, 3529495, 3684017, 3638706, 3679563, 3441046, 3678046, 3702530, 3647332, 3360443, 3178687, 3343632, 3326241, 3340539, 3049549, 3095025, 3103548, 3329604, 3545624, 3409376, 3171016, 3040843, 2866757, 2830720, 2858744, 3054624, 3116434, 2921950, 2738899, 2742802]
3881B742802q0367K38898J0811j78775j8232n9794j77549j4592J51491M4266L7360
3870B696319m5444j26991J81495j24385j13387K68806J6233n3375J3448j77138
3860B535581J75054r4171m6947r5851j00630k3993r1066J48389K7686M9212q6012
3849B397252j7690J73292j61256L5264J23004L939K1442j0098l23219m2144J84329
3838B384115k33819O1021P866j9392J21214K43881j02552O3810j21546k45462
3828B159136k15304L72349N8169J05742j50426k33072J43254j38738q7373L0769
3818B044506q7163J06532p097J9845K59799k3270R4089N2136J804l22037K06093
3807B345237m2840N5857L96580j26195k60197O6751l53409j36477K0585j07764
$$ y = [2742802, 2662435, 2901333, 2912144, 2733369, 2715137, 2655343, 2477794, 2463202, 2614693, 2658959, 2696319, 2650875, 2523884, 2705379, 2580994, 2467607, 2736413, 2752646, 2699271, 2712719, 2535581, 2710635, 2616464, 2569517, 2473666, 2373036, 2349043, 2257977, 2406366, 2434052, 2483264, 2397252, 2379562, 2552854, 2391598, 2426862, 2549866, 2553805, 2575247, 2565149, 2241930, 2199786, 2384115, 2150296, 2211317, 2219183, 2199791, 2321005, 2564886, 2462334, 2526144, 2404598, 2159136, 1943832, 2316181, 2374350, 2480092, 2329666, 2096594, 2239848, 2101110, 2013737, 2044506, 1957343, 2063875, 2056778, 2076623, 2336422, 2313152, 2407241, 2459377, 2461181, 2139144, 2345237, 2302397, 2358254, 2754834, 2628639, 2368442, 2435193, 2081784, 1945307, 1965892, 1858128]
3797A858128l6635K39386j11302q7786P2922N2151J43994q2909L9287K62505m5448
3786B304293p7327J75751j96773l25790j06300J81210j0698J53834R0691j21915
3776B066976m11464J09074J71481r0620J34721J25072j05613O7009O394k75170
3766A797860o6100J09314q1728K15204j65734p245J09164j12780p110J37206J198
3755A929249k21900K0541m7260L7010J10031J57617J44586K3484N5111m4365j71336
3744A992768J65873m6839o888N3120K0303r3513k07913k41585l1759K47120j14106
3733A736581R3560k7843J19572N1532Q3624K88921k39139k00389n3071J71643
3723B024991R6464k68270j19356J35774K94775j06619r5251J36953j18915Q6809
$$ y = [1858128, 1821493, 2060879, 1949577, 1861791, 1934713, 1986864, 2130858, 2047949, 2087236, 2349741, 2304293, 2226966, 2402717, 2205944, 1880154, 1773854, 1955064, 1944366, 2098200, 2188891, 2066976, 1655512, 1764586, 1936067, 1845447, 1980168, 2105240, 1999627, 2066636, 2073030, 1797860, 1731760, 1841074, 1759346, 1974550, 1808816, 1801571, 1910735, 1797955, 1790845, 1928051, 1929249, 1707349, 1727890, 1680630, 1717640, 1827671, 1985288, 2129874, 2153358, 2208469, 2164104, 1992768, 2158641, 2111802, 2104914, 2158034, 2178337, 2084824, 1876911, 1635326, 1603567, 1850687, 1736581, 1830141, 1802298, 1921870, 1973402, 2057026, 2345947, 2106808, 1906419, 1853348, 2024991, 2121455, 1853185, 1733829, 1869603, 2164378, 2057759, 1962508, 2099461, 1980546, 2067355]
3713B067355L3639J5401R5939m99081J4293J47925J98909Q4833j39593n4296p0812
3702A894512K20300J27841o9610l5289L9166p0061Q9865j32861K7338q7322j56968
3691A846911Q199j10637J33047P6497q1001P9169j47636J6966j05468J49282P3368
3680A938697j3404P0099J13501o7618k01242k28966K50616L04798J72k1528j12655
3669B032470j76176Q1223r1422j11708P4564P9194K14490p1516j01323j56051
3659A773745J39502P0653J23503R4558j05427J66673j56009R9111j28878j75811
3649A901620n915q7463P9120J94866O3315q413j11207l4802J24094j70184R0964
3638B035995J31149J45926m1240k166j13273p4704L1267k8154r5159J34419J97595
$$ y = [2067355, 2100994, 2116395, 2212334, 1713253, 1727546, 1875471, 2074380, 2159213, 2019620, 1965324, 1894512, 2114812, 2242653, 2173043, 2137754, 2176920, 2106859, 2196724, 2063863, 2091201, 2003879, 1846911, 1855110, 1744473, 1877520, 1954017, 1873016, 1952185, 1804549, 1821515, 1716047, 1865329, 1938697, 1925293, 1995392, 2108893, 2041275, 1840033, 1611067, 1861683, 2166481, 2166653, 2145125, 2032470, 1856294, 1937517, 1846095, 1734387, 1808951, 1888145, 2102635, 2031119, 1929796, 1773745, 1913247, 1983900, 2107403, 2201961, 2096534, 2263207, 2107198, 2206309, 2077431, 1901620, 1895705, 1808242, 1887362, 2082228, 2145543, 2137130, 2025923, 1991121, 2115215, 1945031, 2035995, 2167144, 2313070, 2271830, 2269664, 2156391, 2081687, 2112954, 2084800, 1989641, 2124060, 2321655]
3627B321655j18987j18932M5440L49510l0434j650Q8283k75136R945O0606J46451
3616B476751k22964Q2881K2188M7305L5728J24953k30870K37357K1115k55950
3606B338494K08245Q5922j9601o1519J27090k9973M8211k27795p637J52218J31282
3595B744937Q7606J30174m20715j1426K83064j7592O1964J90770o8660k23686
3585B756436K1209m8404j18535M002K2916M33494R4194k12196j23804J32430L12446
3574C274188J0636r9867J46092p95L5907m5537j93035m4173l04692n2509R1933
3563B818148J07524R6288j47113o6091L38107O4592N5452k61851l9970L4748q082
3552B991752K68843j36124k87385P7277K35994n6484j66442P8236o7911J05792
$$ y = [2321655, 2202668, 2083736, 2129176, 2478686, 2448252, 2446602, 2534885, 2259749, 2269694, 2330300, 2476751, 2253787, 2336668, 2358856, 2406161, 2441889, 2566842, 2335972, 2573329, 2594444, 2338494, 2546739, 2632661, 2613060, 2551541, 2678631, 2648658, 2696869, 2469074, 2461437, 2613655, 2744937, 2832543, 2962717, 2542002, 2530576, 2813640, 2796048, 2858012, 3048782, 2980122, 2756436, 2777645, 2729241, 2610706, 2614708, 2637624, 3071118, 3165312, 2953116, 2829312, 2961742, 3274188, 3284824, 3184957, 3331049, 3330254, 3366161, 3320624, 3127589, 3083416, 2778724, 2726215, 2818148, 2925672, 3021960, 2874847, 2808756, 3146863, 3211455, 3266907, 3005056, 2965086, 2999834, 2991752, 3260595, 3124471, 2837086, 2914363, 3150357, 3093873, 2927431, 3005667, 2937756, 3043548]
3542C043548J09408k57790J50777J599N8662J50894n2896k5221n2349M4535m9025
3531C122142O8967J33498q0587q4832K63087j64069K96368Q8467j89136L46703
3521C800608O5055p0705j74351k66684J6420L2740O5464L10068j26184l7163k38336
3510C376932O7412k1359j78151j64391j4639J92232j03449j46765l024r0522L3751
3499B948027K62072k8727k4898n6362K63014o2048L831Q7581j41836l9062j09742
3488C101850K0462l3347K598J13202R0759k6130J39799P7969J20262M3162j23978
3477C526608j16103P226L5589L9967j36586J20074L51962K56168k60359J07106
3467C931652k6247l5118p4029j61532K58686N8488J75487k30290M7663J03597
$$ y = [3043548, 3152956, 2895166, 3045943, 3047542, 3106204, 3257098, 3204202, 3178981, 3126632, 3171167, 3122142, 3191109, 3324607, 3244020, 3159188, 3422275, 3258206, 3554574, 3643041, 3453905, 3800608, 3865663, 3794958, 3620607, 3353923, 3370343, 3403083, 3468547, 3778615, 3652431, 3615268, 3376932, 3444344, 3422985, 3244834, 3080443, 3065804, 3258036, 3154587, 3007822, 3004798, 2914276, 2948027, 3210099, 3181372, 3156474, 3100112, 3363126, 3301078, 3304909, 3392490, 3250654, 3211592, 3101850, 3122312, 3088965, 3091563, 3204765, 3295524, 3269394, 3409193, 3487162, 3607424, 3650586, 3526608, 3410505, 3417731, 3453320, 3493287, 3356701, 3476775, 3828737, 4084905, 3824546, 3931652, 3905405, 3870287, 3796258, 3634726, 3893412, 3951900, 4127387, 3897097, 3944760, 4048357]
3457D048357l1762j19875J27399J24370J07475Q3015j37653L0379O1684k74073
3447D019316K41233K33147J03652R9156j30596O4009J47303K52291L75730p8943
3437E326298k58899L24170J86954j09133o1787j52321J68646R1478L65850K02632
3427F083888j62054J277O20375J29211k05072O9300k77684K79474K33856K58610
3417G031181j10997j01455N2958L8508M7745J30698M0159R1734J86590M6616L7835
3406G491572K51056J23995K04296P9756K6653j0520M2427K10888K2983K14991
3396H658097j40346j5983K11631m5747R7128k0393J00507q7553R7655J02410J47933
3385I105339J68335L4790k09038O0627J20058q342J41515K43396J91317O2114
$$ y = [4048357, 4016595, 3896720, 4024119, 4148489, 4255964, 4338979, 4201326, 4231705, 4293389, 4019316, 4260549, 4493696, 4597348, 4696504, 4565908, 4629917, 4777220, 5029511, 5405241, 5326298, 5067399, 5391569, 5578523, 5469390, 5407603, 5255282, 5423928, 5515406, 5881256, 6083888, 5921834, 5923111, 6543486, 6672697, 6467625, 6536925, 6259241, 6538715, 6772571, 7031181, 6920184, 6818729, 6871687, 6910195, 6957940, 7088638, 7128797, 7220531, 7407121, 7453737, 7491572, 7742628, 7866623, 8070919, 8150675, 8177328, 8166808, 8209235, 8420123, 8443106, 8658097, 8517751, 8501768, 8713399, 8667652, 8764780, 8744387, 8844894, 8757341, 8854996, 8957406, 9105339, 9273674, 9308464, 9099426, 9160053, 9280111, 9271769, 9413284, 9656680, 9847997, 9910111]
3375I910111K14392K04924J54841j17932R3243p9242n9155K08784J53029J49779
3365A0832774P3429R5669K59729L8652K40326N7432K98777L89927N9544M80487
3355A2826746J78497k34595K04694M03129R1583J57941K49170L15261J47067J43768
3345A4483261J48675o8073L61205M09453K5870N9988K49426O48434L26079J03790
3335A6748108K6884L58554L51673J00263L41442K78433N51543N11550M84991N21971
3325B0275412M28617L13134J95580L91741J101451Q05244N68903Q44777P51150
3316B5676009O50763J160937J183468J156395J281366J353778J618874J685745
3308C5767335J769231J672952K128776K258764K575008K664286K467403K688509
$$ y = [9910111, 10124503, 10329427, 10484268, 10366336, 10459579, 10380337, 10321182, 10529966, 10682995, 10832774, 10906203, 11001872, 11261601, 11300253, 11540579, 11598011, 11896788, 12286715, 12346259, 12826746, 13005243, 12770648, 12975342, 13378471, 13470054, 13627995, 13877165, 14192426, 14339493, 14483261, 14631936, 14563863, 14925068, 15334521, 15360391, 15420379, 15669805, 16318239, 16644318, 16748108, 16774992, 17133546, 17485219, 17585482, 17926924, 18205357, 18756900, 19268450, 19753441, 20275412, 20704029, 21017163, 21212743, 21604484, 22705935, 23511179, 24080082, 24924859, 25676009, 26326772, 27487709, 28671177, 29827572, 31108938, 32462716, 34081590, 35767335, 37536566, 39209518, 41338294, 43597058, 46172066, 48836352, 51303755, 53992264]
3300E3992264K691245K837353K707045K975097K643431K798113K480507K430001
3292G5555056K094344J784945J653387J436823J246025O01617O23832M38124M39989
3283H5874142J32768J81624J54756n6472K04197M9987l08358l23047o19427q09338
3273H4480832q39511r77172j095462j037833r02009o83445m66596K7504J14509
3264G8620817M01585Q76486J195018J667345K355755K773185L433376M194699
3256I5518266M495767N025249N490135O423549O843042P055109P036918O903674
3248A44791709O699660N362484M243188K946582J476797L04360j203198j143598
3240A63477984j472338j585635q95724q02038m93532l34277q74598j656428k429656
$$ y = [53992264, 56683509, 59520862, 62227907, 65203004, 67846435, 70644548, 73125055, 75555056, 77649400, 79434345, 81087732, 82524555, 83770580, 84372197, 84996029, 85434153, 85874142, 86006910, 86188534, 86343290, 86286818, 86491015, 86541002, 86232644, 85909597, 85290170, 84480832, 83641321, 82664149, 81568687, 80530854, 79628845, 78945400, 78478804, 78506308, 78620817, 79022402, 79898888, 81093906, 82761251, 85117006, 87890191, 91323567, 95518266, 100014033, 105039282, 110529417, 116952966, 123796008, 130851117, 137888035, 144791709, 151491369, 156853853, 161097041, 164043623, 165520420, 165824780, 164621582, 163477984, 162005646, 160420011, 159524287, 158722249, 158228717, 157894440, 157019842, 155363414, 152933758]
3231A52933758l679419m733679n913462o702516p062533p673290p398172p130053
3223A02640634p021496o266241n867553m940281m574312m190007l913575l122408
3215F2744761k861078k599294k217515k170491k276553k065880j888105j628092
3207D5037753j430934j648113q61772j173039j254680q93636o62141r74730p35218
3198C5403490q61582p19732l94727n68430l56783k20136k97722n78306J6289N2636
3188C1474997L4653j5879k85413j4301N60787K34238N0769J00334M05659M41249
3178C2987093J68220L99438L45823L79514J50395K56256k9442J43728K47946l37853
3168C4711118o86444k52489j61905j99213n72818m29614k02361n11465m22806
$$ y = [152933758, 149254339, 144520660, 138607198, 131904682, 124842149, 117168859, 109770687, 102640634, 95619138, 89352897, 83485344, 78545063, 73970751, 69780744, 65867169, 62744761, 59883683, 57284389, 55066874, 52896383, 50619830, 48553950, 46665845, 45037753, 43606819, 41958706, 41096934, 39923895, 38669215, 37775579, 37113438, 36138708, 35403490, 34541908, 33822176, 33427449, 32859019, 32502236, 32282100, 31984378, 31406072, 31422361, 31474997, 31509650, 31493771, 31208358, 31194057, 31754844, 31989082, 32039851, 32140185, 32545844, 32987093, 33155313, 33554751, 33900574, 34280088, 34430483, 34686739, 34657297, 34801025, 35048971, 34711118, 34024674, 33772185, 33610280, 33411067, 32838249, 32408635, 32206274, 31694809, 31272003]
3159C1272003l37571r150j52614J35702N9443N7686J78632L78906K81751O20173
3149C2484961L64263P09640P29342O13316R66830P36379M84423N44297O52539
3140C8285990N88286K90205K85983O42113L64219M66303P31976O59252O85846
3131D3000173J051322J232434J653487J611752J751115J804780J799228K170939
3123E6075230K030615J949517J801638K008299J974622J715930J340899J639447
3115G0536197J461940J163478J078648P39472M57881M92713N05451M87696P52904
3106G7676380P17941R95065J482113J686325K307608K503849K831096L211295
3098I3411672L930494M645251N285371N814378O199466O367860O418994O465387
$$ y = [31272003, 30934432, 30925282, 30772668, 30908370, 30967813, 31025499, 31204131, 31583037, 31864788, 32484961, 32849224, 33558864, 34288206, 34901522, 35868352, 36604731, 37089154, 37633451, 38285990, 38874276, 39164481, 39450464, 40092577, 40456796, 40923099, 41655075, 42314327, 43000173, 44051495, 45283929, 46937416, 48549168, 50300283, 52105063, 53904291, 56075230, 58105845, 60055362, 61857000, 63865299, 65839921, 67555851, 68896750, 70536197, 71998137, 73161615, 74240263, 74979735, 75437616, 75930329, 76435780, 76923476, 77676380, 78394321, 79389386, 80871499, 82557824, 84865432, 87369281, 90200377, 93411672, 97342166, 101987417, 107272788, 113087166, 119286632, 125654492, 132073486, 138538873]
3090A38538873N830718M622679L289168K606701J171273k19048j412210k210369
3082A52217785l235075m040150m762789m990871m776338m242869m015953l171803
3074A18981937k784926j678753j746607j293169j255129j112182j591107j554968
3066A05965096j873862k761055k887562l267377l904895l952396m253257m435633
3058G8629059m357971m435064m380314m157141l490423l026988l127258k606263
3050D9047637k418252k563183j996426j667188j562893j425793j185030j451005
3042C4777867j241753p10474o04359q05953r13114r81316n74630p01036k49876
3033B7995356l80758m76224o20015l16107j99583j22566j17503p127j08873m2919
$$ y = [138538873, 144369591, 148992270, 152281438, 154888139, 156059412, 155840364, 154428154, 152217785, 148982710, 144942560, 140179771, 135188900, 130412562, 126169693, 122153740, 118981937, 116197011, 114518258, 112771651, 111478482, 110223353, 109111171, 107520064, 105965096, 104091234, 101330179, 98442617, 95175240, 91270345, 87317949, 83064692, 78629059, 74271088, 69836024, 65455710, 61298569, 57808146, 54781158, 51653900, 49047637, 46629385, 44066202, 42069776, 40402588, 38839695, 37413902, 36228872, 34777867, 33536114, 32825640, 32221281, 31415328, 30502214, 29520898, 28946268, 28245232, 27995356, 27614598, 27138374, 26518359, 26202252, 26002669, 25880103, 25762600, 25755473, 25646600, 25603681]
3023B5603681L63182L0560K01161M13843M52052M03378K65157M57734K16084M80216
3013B8887048J89834M9935n1042k14503n40106k32070p07606j024230p43321r91469
3003B4622470j279865q80830j055836r20785r93787o07291q60692r28963q40227
2994A6254194n64134l15112l34064m97363n76594k35179m49389k64216k27046
2985A2791097n8202R71m42320k26767r323j27421k8230l39984j68882j80809j66683
2974A1043447M5760j33967l5910L30652k47674J40304k6570j51907k20711o9490
2964A0673934K11604j27088j54741J89955l0971j85201L62411m8010p7484j231
2954A0813178J36476J23592K1803j22764J01214K96078L7420M7152L3425J39647
$$ y = [25603681, 25966863, 25997423, 26198584, 26612427, 27064479, 27467857, 27733014, 28190748, 28406832, 28887048, 29076882, 29126817, 29075775, 28861272, 28321166, 28089096, 27381490, 26357260, 25613939, 24622470, 23342605, 22461775, 21405939, 20485154, 19491367, 18884076, 18023384, 17094421, 16254194, 15690060, 15374948, 15040884, 14543521, 13966927, 13731748, 13282359, 13018143, 12791097, 12732895, 12733866, 12291546, 12064779, 12055456, 11928035, 11899805, 11559821, 11390939, 11210130, 11043447, 11089207, 10955240, 10919330, 11249982, 11002308, 11142612, 11116042, 10964135, 10743424, 10673934, 10885538, 10758450, 10603709, 10793664, 10762693, 10577492, 10939903, 10891893, 10814409, 10813178, 10949654, 11073246, 11095049, 10972285, 11073499, 11369577, 11406997, 11454149, 11487574, 11627221]
2944A1627221m130K67859R5260J07312J40827N8511l3381K41102K57087N7938
2934A2815606q1436R6466M26788N1629R8573L21316J10050L90352J51242L11873
2924A4692459L09979J29947K80619K47519L56756L20889K10712K30699R9582K11234
2914A7090395L60665O35745M39944K7003M82891K64051N25934L14305K43028N37961
2904B0921922K38919L27893N96815N69175M07305O93996L68976N16546N37287
2895B5178834Q08042Q46048O49592Q69586J008537J053991R68168J362448J094363
2886C3839609J204516J162710J111035J447385J514533J731159J614430J891523
2878D5516900K048846K077748K387727K551811K780582L110978L664068L460535
$$ y = [11627221, 11623091, 11890950, 11986210, 12093522, 12234349, 12292860, 12259479, 12500581, 12757668, 12815606, 12734170, 12830636, 13257424, 13309053, 13407626, 13728942, 13838992, 14229344, 14380586, 14692459, 15002438, 15132385, 15413004, 15660523, 16017279, 16338168, 16548880, 16779579, 16879161, 17090395, 17451060, 18086805, 18526749, 18553752, 19036643, 19300694, 19826628, 20140933, 20383961, 20921922, 21160841, 21488734, 22085549, 22654724, 23062029, 23756025, 24125001, 24641547, 25178834, 25986876, 26832924, 27482516, 28352102, 29360639, 30414630, 31382798, 32745246, 33839609, 35044125, 36206835, 37317870, 38765255, 40279788, 42010947, 43625377, 45516900, 47565746, 49643494, 52031221, 54583032, 57363614, 60474592, 64138660, 67599195]
2870F7599195M020026M547024M694737N420462N996711O969308P833367Q651439
2862A15732269Q643022P941430P331298N976231M800867N190574O030682P386711
2854A69033084R883442J2573668J5747271J9116244K3104393K6238486K7702819
2847C03399407K6250619J9217080P192482p413874k1327103l0064990l2779137
2840B64474484l1232698k7597295k3358839j9437406j6489121j4007611j1391597
2833A20959917r738509r072146p881359o904829o124434n309548m760551m191356
2825F6977185l528159l273261k719870k595432k872027k324258j980879k060709
2817D5622590j899140k268184j954884j708247j307186j389038j666872j531294
$$ y = [67599195, 71619221, 76166245, 80860982, 86281444, 92278155, 99247463, 107080830, 115732269, 124375291, 132316721, 139648019, 145624250, 150425117, 155615691, 161646373, 169033084, 178916526, 191490194, 207237465, 226353709, 249458102, 275696588, 303399407, 329650026, 348867106, 356059588, 348645714, 327318611, 297253621, 264474484, 233241786, 205644491, 182285652, 162848246, 146359125, 132351514, 120959917, 111221408, 102149262, 94267903, 87363074, 81238640, 75929092, 71168541, 66977185, 63449026, 60175765, 57455895, 54860463, 51988436, 49664178, 47683299, 45622590, 43723450, 41455266, 39500382, 37792135, 36484949, 35095911, 33429039, 31897745]
2809C1897745j321223j285670q54694j076494j063346p78407q62300q79725n98935
2800B3176951p99732q06668l41791o97394n20379p25731o83337n17382l51299
2791A7733238l79395n50106l44620n39391l41944n59658m45622l19384m41946
2782A3811172j45900k27409j71749k56315o48597o72708r344O5609j29003m29915
2772A1185841k63057k94522l58779n36739p1466l64559J07183l28534l04501l1197
2762H739670l10087l1607n6678k22570l56982r4901j27388j2144l06166j35447
2752G085700j14678J12120j05958l70103j41875K6432l9431m41173j93k9970K5012
2741F005883j56569L4459q6280o2131J10145l68157j26596L1981q3065j95823
$$ y = [31897745, 30576522, 29290852, 28436158, 27359664, 26296318, 25517911, 24655611, 23775886, 23176951, 22377219, 21570551, 21228760, 20531366, 20010987, 19285256, 18601919, 18084537, 17733238, 17353843, 16803737, 16459117, 15919726, 15577782, 15018124, 14572502, 14253118, 13811172, 13665272, 13437863, 13266114, 13009799, 12361202, 11688494, 11679150, 11744759, 11615756, 11185841, 10922784, 10628262, 10269483, 9732744, 9661278, 9296719, 9403902, 9075368, 8770867, 8739670, 8429583, 8397976, 8341298, 8118728, 7761746, 7666845, 7539457, 7527313, 7221147, 7085700, 6971022, 7083142, 6977184, 6607081, 6465206, 6491638, 6452207, 6011034, 6010841, 5980871, 6005883, 5849314, 5883773, 5797493, 5735362, 5845507, 5477350, 5350754, 5382735, 5299670, 5103847]
2731E103847m6191J35049r2049k29608k6415J44747j40047l45699j56204m2410
2721D305020j20502k65872R7554J98200j74572j27754K34578j13043j27739j7926
2711C887944O951J7949j75335k54414K10209j3360j87813O4019j57885q5540K17276
2700C530001j67259j39609o5831j36225j23264Q9127J02513l8472k13941k09333
2690B627707R101J35093R8722l30900N621J07382j07117j23121j40481k04246
2680B077761k3103L35006N277n4703K7094j9596k74087o1450K23305l41650l17704
2669A576150j46174J11834R3763J5659l002K54681l083j10038M0988l0789K50781
2658B050770J20127o4093j05428O927j72367j04368L2638J33386J21025L5732
$$ y = [5103847, 5057656, 5192705, 5100656, 4871048, 4844633, 4989380, 4849333, 4503634, 4347430, 4305020, 4184518, 3918646, 4016200, 4214400, 4039828, 3912074, 4146652, 4033609, 3905870, 3887944, 3894895, 3912844, 3737509, 3483095, 3693304, 3679944, 3492131, 3556150, 3398265, 3312725, 3530001, 3362742, 3223133, 3157302, 3021077, 2897813, 2986940, 3089453, 3050981, 2837040, 2627707, 2636808, 2771901, 2870623, 2539723, 2545344, 2652726, 2545609, 2422488, 2282007, 2077761, 2054658, 2389664, 2394941, 2340238, 2367332, 2347736, 2073649, 2012199, 2235504, 1893854, 1576150, 1429976, 1541810, 1635573, 1651232, 1648230, 1902911, 1899828, 1789790, 1830778, 1799989, 2050770, 2170897, 2106804, 2001376, 2008303, 1835936, 1731568, 1764206, 1897592, 2018617, 2054349]
2648B054349k25461L2066j19600n3074L9650q8024j48700j40881q0796P2063K69456
2637A611048r0958J96602j41720j84053J77934K17344p6826L4635m8330o2331
2627A633345o767N5805N7009k08567N3438j67340K14496j54490k07036O4039J34591
2616A468523R2697j23113p3691R6408J04208P800r1308j57369J00200j04426J07146
2605A427075n6628p9582P5329K37349j52490j09510R7212j40636j7249K43026
2595A523896K91157l13958j60443J21547L18647j36596j31960n6040N5369j57548
2585A354071j2827q7644K2369L30045k2399o4184p4198L45016Q1218j54796M6226
2574A762897J36012k13903q7175j06679K30232L69743J54338Q2562l678n9314
$$ y = [2054349, 1828888, 1860954, 1741354, 1688280, 1727930, 1639906, 1491206, 1350325, 1269529, 1341592, 1611048, 1520090, 1716692, 1574972, 1390919, 1568853, 1786197, 1709371, 1744006, 1695676, 1633345, 1626578, 1682383, 1739392, 1530825, 1584263, 1416923, 1631419, 1476929, 1269893, 1333932, 1468523, 1561220, 1438107, 1364416, 1460824, 1565032, 1572832, 1481524, 1324155, 1424355, 1319929, 1427075, 1370447, 1290865, 1366194, 1603543, 1451053, 1341543, 1438755, 1298119, 1280870, 1523896, 1815053, 1501095, 1340652, 1462199, 1780846, 1644250, 1512290, 1456250, 1511619, 1354071, 1341244, 1253600, 1275969, 1606014, 1583615, 1519431, 1445233, 1790249, 1871467, 1716671, 1762897, 1898909, 1685006, 1597831, 1491152, 1721384, 2091127, 2245465, 2328027, 2324349, 2265035]
2564B265035K16209K88897j68153k25688L1476j23196r0358L4415k38744j56648
2554A833245J39091k27580o3005p3170r7217p2010R0772m9252j20771K41527k12121
2543A389509j40651o5728j20089Q8785K89516r9851m28936m24267J83579K28822
2533I00689K1964j5177m520J82301j69359k18134P289j67114J59802K09948k08285
2522F99404j69755K02398K15789Q0749k11771l23125m8690m4933R0488p6210J56655
2511E70999J19841J17696j04766k25044L9807J83563J07535n8699J01879L9707
2501H92518j22619k42483l9208j05011K11677J62932j00686r7939j67659K39615
2491F31137k21483k5734P3409O1476J01477Q7067k6879j04211P3610M2216L9623
$$ y = [2265035, 2481244, 2770141, 2601988, 2376300, 2407776, 2284580, 2194222, 2228637, 1989893, 1833245, 1972336, 1744756, 1681751, 1608581, 1511364, 1439354, 1530126, 1480874, 1360103, 1601630, 1389509, 1248858, 1183130, 1063041, 1151826, 1441342, 1341491, 912555, 488288, 671867, 900689, 922653, 907476, 902956, 1085257, 915898, 697764, 705053, 537939, 697741, 907689, 699404, 529649, 732047, 947836, 1028585, 816814, 493689, 444999, 400066, 490554, 414344, 570999, 690840, 808536, 703770, 478726, 518533, 702096, 809631, 750932, 852811, 892518, 769899, 527416, 488208, 383197, 594874, 757806, 657120, 559181, 391522, 631137, 409654, 383920, 457329, 518805, 620282, 707349, 680470, 576259, 649869, 692085, 731708]
2480G31708j12220j23204K9322N9709R8195k77519r2946J21624j40646J98517
2470D92540N3211J49846j54718j92244K08181J30408o9694M0804k547j84582N3086
2459E24291p487J6854k30670J50540N2624j84919K36610R7498p8190O99Q541r5934
2447D90457m6909q3572Q1314L07649j63866l39976K42636M7719p9584J53405M5303
2436F54576k57049j5825J20852K15510O0797j75219J5481r6761j22087l5828p0154
2425B94293K6532R6066J40031j40021o5116J68405j33406L8029J08621j23719
2415D09715J14226q1671K31405o1894j76549j72425O7457P0296l0317j21870R6015
2404C44388J14078j93692M9181O2257n9979O0409q53J61115L3695n9638k26927
$$ y = [731708, 619488, 496284, 525606, 585315, 683510, 405991, 313045, 434669, 294023, 492540, 545751, 695597, 540879, 348635, 556816, 687224, 617530, 658334, 655787, 471205, 524291, 516804, 533658, 302988, 453528, 506152, 321233, 557843, 655341, 577151, 577850, 586391, 490457, 443548, 359976, 441290, 748939, 585073, 245097, 487733, 535452, 455868, 609273, 654576, 397527, 381702, 502554, 718064, 778861, 603642, 619123, 522362, 400275, 364447, 294293, 320825, 416891, 556922, 416901, 351785, 520190, 386784, 424813, 533434, 409715, 523941, 442270, 673675, 611781, 435232, 262807, 330264, 400560, 370243, 248373, 344388, 458466, 264774, 313955, 376212, 316233, 376642, 375789, 536904, 570599, 510961, 284034]
2393B84034L2466L27502j00786m4024j71545M6803j73567Q2747n399n5215J47237
2382C70253m0130q9155K20804J41161j25897n1609o180J53374K43253J37697r3347
2371H60224K2498N8471j53650r9010k3034Q2085J78712j44549k74617J35356M0820
2360F83306k82611j48378k33134J39605J94873R0710K02507k65030j47654j77368
2350E6826O8302K85570o9278P068P8483M4180J4933j10758J81561q6344j40756
2339C29787J28910R5197k07438o0220l8212L13026k05514j77669m9348n5684j66362
2328i3527m0881K35269J40207L48685J05433k65739p1775Q9802k3435l351j19990
2317C00698K93751k83693j26856K33606k47671q1659p2540L22467K2538j42300
$$ y = [284034, 316500, 644002, 543216, 499192, 327647, 374450, 200883, 283630, 278231, 223016, 370253, 330123, 240968, 461772, 602933, 477036, 425427, 419247, 572621, 815874, 953571, 860224, 882722, 941193, 787543, 688533, 665499, 747584, 926296, 781747, 507130, 642486, 683306, 400695, 252317, 19183, 158788, 353661, 444371, 646878, 381848, 234194, 56826, 125128, 410698, 341420, 348488, 426971, 471151, 486084, 375326, 556887, 470543, 329787, 458697, 553894, 346456, 286236, 248024, 561050, 355536, 177867, 128519, 72835, -93527, -134408, 100861, 241068, 589753, 695186, 429447, 357672, 447474, 424039, 420688, 300698, 594449, 310756, 183900, 417506, 169835, 88176, 15636, 338103, 360641, 218341]
2307B18341j44840k9149K04157J12159j06985m5130L98191l05789J9228J08136
2297D28319J71484j28129O1009q8872J12638p318l44160R8806K4201M8177R0931
2286D67086k9810P1686j8704j3493k11217q8117L3624J57693K85744k15481j22290
2275C16721O2980k4919L2279K9555J08753k361j82134L27363k21613l67268J70336
2264B49692M37987L6558j26N844j63889j05375j73403P3377j6252J18816j24137
2253C39092l2513K29564j87910J21144M7672j984o8677K5283k1488Q1840j90050
2242C41973K0639J28535M8J15349j17466l55507l5210L39598J50924K13457k14875
2231E87465r9632j28099J14148o1603J3625J02408J7904R0193K60386p8106p3246
$$ y = [218341, 73501, 44352, 248509, 360668, 253683, 208553, 606744, 300955, 320183, 428319, 599803, 471674, 532683, 443811, 556449, 549131, 204971, 303777, 327978, 376155, 467086, 437276, 508962, 490258, 476765, 265548, 177431, 211055, 368748, 654492, 439011, 316721, 379701, 354782, 387061, 416616, 525369, 523008, 340874, 668237, 446624, 79356, 249692, 687679, 724237, 724111, 729955, 566066, 460691, 287288, 360665, 344413, 463229, 339092, 306579, 536143, 348233, 469377, 517049, 515065, 446388, 471671, 450183, 532023, 341973, 362612, 491147, 491195, 606544, 489078, 133571, 98361, 437959, 588883, 802340, 587465, 487833, 359734, 473882, 412279, 425904, 528312, 546216, 636409, 896795, 818689, 745443]
2220G45443p7070o2281P4269j91491K4465R2131K71768j20452m0373J54560l743
2209H67226L534l7588O8682K74797r7704l294O7299j54739p6975K02143p1656
2198A041725j34514K59870J96465r2360O5117j8083J53639p7044K25080p1727
2188A548168j73478N8399J6738J00554J11337K19030j57476n7818P7799K0803
2178A764056l7328J59247N362J04102K39952N1939j30743p0877j00671L43192
2168B328231q0152j10624O9716L8378J40048K62559J9896K6228P1497J25182j32393
2157B758566M8400K28445N8552K3586K5711K43798J63744q2070K65535K51784
2147C986051N6914M09623J43876j13550K39413R7249M00764J3990J11302M74423
$$ y = [745443, 668373, 606092, 680361, 488870, 513335, 605466, 877234, 756782, 716409, 870969, 867226, 870760, 833172, 901854, 1176651, 1078947, 1075653, 1142952, 988213, 911238, 1113381, 1041725, 907211, 1167081, 1363546, 1271186, 1336303, 1318220, 1471859, 1394815, 1619895, 1548168, 1374690, 1433089, 1449827, 1550381, 1661718, 1880748, 1723272, 1665454, 1743253, 1764056, 1726728, 1885975, 1891337, 1995439, 2235391, 2287330, 2156587, 2085710, 1985039, 2328231, 2248079, 2137455, 2207171, 2245549, 2385597, 2648156, 2668052, 2694280, 2765777, 2890959, 2758566, 2806966, 3035411, 3093963, 3117549, 3143260, 3387058, 3550802, 3468732, 3734267, 3986051, 4042965, 4452588, 4596464, 4482914, 4722327, 4819576, 5220340, 5234330, 5345632, 5820055]
2137E820055L43629K81790K54495K65717L50522N02342P52250L78470L58154J058077
2127A0365501N89773R85289R95106J019415Q28899R54012J093064J358971J895406
2118B0085436K172946K874793L174505L762787N597314P524022J1002039J3394064
2110F9587906J0792530O379071L97267j1370410j6552066j2368163q646421o283000
2102C1936714m789662m034566k999521j907371j667650j303517r42971p92776
2094A3498680n71521q25517q95761p60427q79292o06565o44279m32431l80223
2085G502664m26353m30028j17211l74881k47538k75413l61934m34804l05996j38187
2075D390319k56417j79760k79061m4209n3623p5243l45551l45085o9845O6986
$$ y = [5820055, 6163684, 6445474, 6699969, 6965686, 7316208, 7818550, 8570800, 8949270, 9307424, 10365501, 10955274, 11940563, 12935669, 13955084, 14783983, 15737995, 16831059, 18190030, 20085436, 22258382, 25133175, 28307680, 32070467, 37667781, 45191803, 56193842, 69587906, 80380436, 86759507, 87156774, 75786364, 59234298, 46866135, 38219714, 31936714, 27147052, 23112486, 20112965, 18205594, 16537944, 15234427, 14291456, 13498680, 12927159, 12101642, 11205881, 10445454, 9566162, 8959597, 8315318, 7882887, 7502664, 7076311, 6646283, 6529072, 6154191, 5906653, 5631240, 5269306, 4834502, 4528506, 4390319, 4133902, 3954142, 3675081, 3630872, 3577249, 3502006, 3156455, 2811370, 2741525, 2808511]
2065B808511j22944K99169k26900J9131J6573k29874q8465L5212r1906q2811l12407
2054B023289j22617J35967n2852q9728j18244j0031j62477J55914q8416k2576
2044A648229j72853K215J05074m0087q9435q3232j53683o3900K93577K5071k45281
2033A225695o6717r3792l5353j43614R8390P6348L8924r3747k7725j3198l7335
2022I27876j24042p5037K05194N6160k62341Q9825j09437k02559Q7932J93628
2012G87199o2854q0794k02968J62348k81415K47069J11465O6217P7457k21528
2002F02196N0956J40086o1186k28067L82864N752p24q5914q2057k26529L8278
1991E35655o0951K40606K8740j81830j37980J37605K7148j17862m09998K65899
$$ y = [2808511, 2685567, 2984736, 2757836, 2776967, 2793540, 2563666, 2475201, 2510413, 2418507, 2335696, 2023289, 1900672, 2036639, 1983787, 1894059, 1775815, 1765784, 1603307, 1759221, 1670805, 1648229, 1475376, 1477591, 1582665, 1542578, 1453143, 1369911, 1216228, 1152328, 1445905, 1470976, 1225695, 1158978, 1065186, 1029833, 886219, 984609, 1060957, 1099881, 1006134, 978409, 965211, 927876, 803834, 728797, 933991, 990151, 727810, 817635, 708198, 505639, 593571, 787199, 724345, 643551, 440583, 602931, 321516, 568585, 680050, 746267, 823724, 602196, 653152, 793238, 732052, 503985, 886849, 892601, 891877, 805963, 723906, 497377, 535655, 474704, 715310, 744050, 562220, 424240, 561845, 588993, 471131, 61133, 327032]
1981C27032j26714J11992J60863k55080J66202M5719j0085j17323M3664j60417
1971A85853J41223K25343N4677K4788L3776l1797k84245o765o8344q9808K25742
1960D10443K13914j9638l24304L10199J86857k45089j94555j91794O6464P2234
1950B84731J05552r3786O3217j82423J71542J98335j62010J40138J7356J20495
1940F63147j65238k61100J38567J1179O2592j09953j33487J29586k34196j95784
1930i4687L3774o2921j7360J80087k4182O3965J46028m607m1110j42496J1274
1919D7765j42748P4681L28252p7042K6300k1758j29575j17807J36181M777L13952
1908D42978J22271j52329j54773J32522k68624j13663J00105j58798p7655K9375
$$ y = [327032, 200318, 312310, 473173, 218093, 384295, 430014, 419929, 302606, 346270, 185853, 327076, 552419, 607096, 631884, 665660, 633863, 349618, 342853, 274509, 184701, 410443, 624357, 604719, 280415, 590614, 777471, 532382, 337827, 146033, 212497, 284731, 390283, 296497, 359714, 177291, 348833, 547168, 385158, 525296, 542652, 663147, 497909, 236809, 375376, 386555, 449147, 339194, 205707, 335293, 101097, -94687, -60913, -123834, -141194, 38893, 14711, 78676, 224704, 220097, 178987, 36491, 47765, -94983, -20302, 307950, 230908, 257208, 235450, 105875, -11932, 124249, 129026, 442978, 565249, 412920, 258147, 390669, 122045, 8382, 108487, -50311, -127966, -98591]
1898i8591K31969L488k2576J3482M5058k03577K06517j5005K6201L7966K227K05828
1886D32987j06171l84912J44344m6571r7440J65089M46328k0100l34883J39161
1876C37832j51490J40589j71959j04376j90689o5595J03308J78646j35888J45576
1866H5954j44213J30436p0119l3769j3973J57112Q0891O0095j97116j88912J89803
1855E6189O8488k39614K35405P9931K8093K01303p2409P5630M2499j31614j75737
1844A68164J65448k71212K46707J96479k2942j61127K49651k44832j0504L9942
1834C55774j69579j90395K10557l6763k39788K4245K16248J92854q7146p4570
1824B01437Q0198Q6337k0284j99590J19540J69448j58472k87473Q4393J50219
$$ y = [-98591, 133378, 136866, 114290, 127772, 172830, -30747, 175770, 160765, 186966, 224932, 227159, 432987, 326816, -58096, 86248, 39677, -57763, 107326, 553654, 533554, 198671, 337832, 186342, 326931, 154972, 50596, -140093, -205688, -102380, 76266, -59622, 85954, -58259, 72177, 2058, -31711, -45684, 111428, 192319, 252414, 55298, -133614, 56189, 124677, -114937, 120468, 200399, 228492, 429795, 357386, 433016, 475515, 343901, 168164, 333612, 62400, 309107, 505586, 482644, 321517, 571168, 326336, 315832, 355774, 186195, -4200, 206357, 169594, -70194, -45949, 170299, 363153, 276007, 201437, 281635, 367972, 347688, 148098, 267638, 437086, 278614, -8859, 75534, 225753]
1814B25753j05151m5640m2739k0129J40669j33242J06035j04087J80727Q1330
1804B83526Q0060j93382o9078n7277J71991J9633l52681J93588j45581j01809
1794a71010K68562j61808N9813L78413l2132q300k0760N9350o2069K4973k46246
1783H8786j02066N1871m2274M9137k3202Q0770J28710l10154J33391j14170k6387
1772h5588J4531j59337J97944M4042J22833m2008j75463O8397k8434o7049J68227
1761E8095P2482j01700j20783J66075J57424l08469j5915N9182J2714O7260P5851
1750A22216j99460L8401M4748r1566Q887J04063k22348K23428M8545k4979j49079
1739i7144K4956J66387R9781j47078J23369L3512k00942J36463J60032l5018l9462
$$ y = [225753, 120602, 74962, 32223, 12094, 152763, 19521, 125556, 21469, 202196, 283526, 363586, 170204, 101126, 43849, 215840, 235473, -117208, 76380, -69201, -171010, 97552, -64256, -4443, 373970, 341838, 333538, 312778, 372128, 310059, 335032, 88786, -13280, 38591, -3683, 45454, 22252, 103022, 231732, -78422, 54969, -59201, -85588, -71057, -230394, -32450, 11592, 134425, 92417, -83046, -14649, -43083, -110132, 58095, 130577, 28877, -91906, 74169, 231593, -76876, -92791, -33609, -20895, 46365, 122216, -77244, -38843, 5905, -85661, -76774, 27289, -195059, 28369, 76914, 51935, -97144, -72188, 94199, 193980, 46902, 170271, 203783, 2841, 139304, 299336, 264318, 224856]
1728B24856j27578m8043R0225j11249J76583n3201K8756K2724j62845l4786j40590
1717a35148j9680K22991J3080q2255J44335j45551K00042L5092j70074K496q2639
1706a7311K8325l17089J16357K97577l3487j43721R7005J28296j8578j16307r3981
1695g2914J1389R3134m3040O1353k4046M7645r6399j58020l5338R951j19132K70550
1683e4867J50687r6869j3546O8347k9763j49626p539J18672p8306J14791p8862
1672e6881m9345j02855J32670M4051r6100J440J20601P0820k4249j21199J8356
1661f2691P5807m6979L6195j86199L9758o506K37316J83548k02659j39800J25617
1650E3407j78036K32947J06732k48980j38250m4779L64344N3024j17476j76702
$$ y = [224856, 97278, 49235, 139460, 28211, 204794, 151593, 180349, 203073, 40228, 5442, -135148, -154828, 68163, 81243, -1012, 143323, -2228, 197814, 232906, 62832, 65328, -17311, 11014, -306075, -189718, 107859, 74372, -69349, 27656, 155952, 137374, 21067, -72914, -61525, 31609, -11431, 49922, 25876, 73521, -22878, -180898, -216236, -206285, -325417, -54867, 95820, -1049, -14595, 53752, 23989, -125637, -133176, -14504, -92810, 21981, -56881, -106226, -209081, -76411, -32360, -128460, -127020, -6419, 64401, 40152, -81047, -62691, 13116, -33863, 2332, -183867, -144109, -150615, 86701, 270249, 67590, -72210, 53407, -124629, 108318, 215050, -33930, -172180, -216959, 147385, 200409, 82933, -93769]
1640i3769k4317R6899J97094p5171j81785J83749o0907R9409k05374l0198K08190
1629A13820O6801O101j64048j04885j63107r373K90684N9827j2294p3408j57298
1618a47180k0322J4827O991o1076J264j5230M06117M9130o3153O5976j0254r4363
1606A32727p6215L6077Q5990j59656m4728J09812j82672k990N5778N3394o1938
1595e4421r8056j4760K39381r0719K51021q9931l9930o7120j61518K2933K44460
1584A41340n8806K406P2128K2952r4978k38582o4783Q1677N1023q1783N7930O434
1572a03042j57051P5847K24101j21710J28869m15579l0494K98702L0760J10057
1562D0460k35737k7117J02287K8676L12426j25224r3063L5284r7738m63K6232
$$ y = [-93769, -118086, -21187, 175907, 100736, -81049, 102700, 41793, 141202, -64172, -94370, 113820, 180621, 186722, 22674, -82211, -245318, -254691, 35993, 95820, 83526, 10118, -147180, -167502, -152675, -145684, -206760, -205496, -220726, 185391, 234521, 171368, 237344, 227090, 132727, 56512, 92589, 178579, 18923, -25805, 84007, -98665, -101655, -45877, 7517, -54421, -152477, -167237, 72144, -18575, 232446, 142515, 102585, 35465, -126053, -103120, 141340, 82534, 84940, 157068, 180020, 85042, -153540, -218323, -136646, -85623, -167406, -109476, -103042, -260093, -184246, 39855, -81855, 47014, -368565, -399059, -100357, -69597, 40460, -195277, -222394, -120107, -91431, 220995, 95771, 2708, 37992, -59746, -60209, -33977]
1551c3977j55266k06734j2462J62378J58860N2049L0574p8137q6462l8460Q7647
1540a19990k10730J58822M01950R8123k00243k00049J29270j17407j55492L05018
1530H9272k45203j36185J92816j38076O9799J25485j19414j98181J96845Q6762
1520g6080K0227M9806N8652j10208J17222k21853J18765K64744j0964m29909l8962
1509b58560J84756J59874k6174L6448K68052l33683j01592J46783j89277j57738
1499b71111k33925J67589J98319K5161M9399m291J1722M8596K09214p0044N7378
1488A88007p1303p1971j44701J74493R221k38917q1178r936J03480K68863p3495
1477E2563j01827J27697j96330l3134K77201n2577J2185L2768k21836k0277k4542
$$ y = [-33977, -189243, -395977, -408439, -246061, -87201, -35152, -4578, -82715, -169177, -207637, -119990, -330720, -171898, 230052, 328175, 127932, -72117, 57153, -60254, -215746, 89272, -155931, -292116, -99300, -237376, -167577, -42092, -161506, -359687, -162842, -76080, -55853, -6047, 52605, -57603, 59619, -162234, -43469, 221275, 210311, -219598, -258560, -73804, 86070, 59896, 96344, 364396, 30713, -70879, 75904, -113373, -271111, -505036, -337447, -139128, -113967, -64568, -68859, -57137, -8541, 200673, 130629, 188007, 116704, 44733, -99968, 74525, 83746, -155171, -236349, -246285, -142805, 126058, 52563, -49264, 78433, -117897, -151031, 126170, 73593, 85778, 118546, -103290, -123567, -148109]
1466a48109J31923k02327O0863J08203P5353l4173J9949J29143M19800j44368
1456D16257n90637o5001M01046j13490K2840K6623R7096R4041l49236Q1587j76366
1445a55240R5145j52264J06649p8698J55318K39910Q4588m33887J12578L8101
1435A2200r8565J81214J7346J0122J6459L0306j62388L37586P2302n00511r6774
1424a80703K22966J72052k30151n3783k3520K3948P0133K19866j16610k9985N9403
1413A33616J38623P3514j94949q1818k78413J18895J8954j11912J0756K35886
1403F3152p9269n0852J7300m1647K81840j02305k4743j2598Q4255J49722m6347
1392B38508q6884l21974R1903O7187m3767J79186k7605M4065j24951M4486J35467
$$ y = [-148109, -16186, -218513, -157650, -49447, 25906, -8267, 11682, 140825, 560625, 416257, -174380, -239381, 161665, 48175, 71015, 97638, 194734, 288775, -60461, 21126, -155240, -60095, -212359, -105710, -184408, -29090, 210820, 295408, -138479, -25901, 12200, -86365, 94849, 112195, 122317, 138776, 169082, 6694, 344280, 416582, -83929, -180703, 42263, 214315, -15836, -69619, -93139, -69191, 942, 220808, 104198, 74213, 133616, 272239, 345753, 150804, 68986, -209427, -90532, -71578, -183490, -172734, 63152, -16117, -66969, -49669, -91316, 190524, 88219, 63476, 50878, 135133, 284855, 238508, 151624, -170350, -78447, -11260, -55027, 124159, 96554, 140619, 15668, 60154, 195621]
1381A95621k35807n0087j0125K8733j91587j05808P5678J52751K51752n9056n2934
1370h69j58948N6814m532K04310m2173j68480k19581J98389J92186j7166O1312
1359A01262k91768j32444J94956L60871j1199j81744r4897j6853j2779j22832
1349b07427l44856K39629J11281M0616K14690L4715K796l5978p2035J26878M0168
1338A50477p9410j71195J64946L113j51992Q4907Q5569k06770R2114k3755N7944
1327E948m3214k3363j71092K29621j99078j1675M37138r668j27474k46477k50531
1316d09865L00243J69463P449q3053K6382J11722o7842j18470l1006N3224K6746
1305a5007l1123n946K29727m7022j68190J30063k23567N7503o5358R9738J98359
$$ y = [195621, -40186, -90273, -100398, -71665, -263252, -369060, -293382, -140631, 111121, 52065, -869, -159817, -103003, -107535, 96775, 54602, -113878, -333459, -135070, 57116, 39950, 101262, -190506, -322950, -127994, 232877, 221678, 39934, -54963, -71816, -84595, -207427, -552283, -312654, -201373, -160757, 53933, 88648, 91444, 55466, -16569, 110309, 150477, 71067, -100128, 64818, 67931, -84061, 846, 86415, -120355, -28241, -51996, 5948, -37266, -60629, -231721, -2100, -201178, -212853, 224285, 214617, 87143, -159334, -409865, -109622, 59841, 67290, -15763, 10619, 122341, 54499, -63971, -94977, -41753, -15007, -46130, -52076, 177651, 130629, -37561, 92502, -131065, -73562, -138920, -39182, 159177]
1294A59177j26000m6018j14152J72230J1937K0249j67040j60750J55411L12400
1284B17444P7521o3211k45816J72694m4869r3789q1429j85286K45180o2569q8442
1273a52572r4765N2853K05636n7809l8209K9793j21432k12001K71216k6818L3143
1262a10965J88266L26769k27390k96075O2842P4602j66852j8998R3943J98192
1252A24334O1174j06175j34696j06283l8556J12194j81363L5797J12807m4014
1242a64781J69726J68588n9099l26911J65588k99085J37838Q2540o3726J21296
1232f8026m00857J83975Q6626p3856O7143L67381k28489m4206r9205J74491J52724
1221A17701J1735N0803K05037j28825k09829R041k06904P761l188J63007Q4629
$$ y = [159177, 33177, -12841, -126993, 45237, 57174, 77423, -89617, -250367, -94956, 217444, 294965, 231754, -14062, 158632, 113763, 19974, -61455, -246741, -1561, -64130, -152572, -247337, -194484, 11152, -46657, -84866, -55073, -176505, -388506, -117290, -144108, -110965, 77301, 404070, 176680, -119395, -56553, 18049, -148803, -167801, -73858, 124334, 185508, 79333, -55363, -161646, -200202, -88008, -269371, -233574, -120767, -164781, 4945, 173533, 114434, -212477, -46889, -345974, -208136, -125596, -189322, -68026, -468883, -284908, -198282, -272138, -204995, 162386, -66103, -110309, -209514, -35023, 117701, 129436, 180239, 385276, 256451, 46622, 55663, -151241, -143480, -146668, 16339, 100968]
1210A00968n5619J68916J23673k81580m9512k85290q9793L62185K0429L7373j62870
1199a11120L0477J35541J02538O0085k62035j59800J36319M0199J42242r3623
1189B0823q234L4190l8487q1729O2682j93868J403K6383N7341l0298k88R1986
1177e8096Q4819k8709j05771K7839l6085L26681j29187q2724k51742n169J5485
1166b42659Q7528m4531l9187k4436J95613Q3676K42189j44817j42553M8860k13771
1155a94088j41085K30514M9799k51193k59609M07883L0449Q573n1101Q8036N0360
1144c1462J30755p3662P0099J00075j58551l25313J54199K04919k15307P1801
1134g2447k6537k08985o3615P7231L95939O3512k11412j5341Q4139K0089O324
$$ y = [100968, 45349, 214265, 337938, 56358, 6846, -278444, -368237, -6052, 14377, 51750, -111120, -80643, 54898, 157436, 217521, -44514, -204314, -67995, -27796, 114446, 20823, 12589, 46779, 8292, -73437, -10755, -204623, -203220, -176837, -119496, -149794, -150082, -58096, 26723, -1986, -107757, -79918, -116003, 210678, 81491, -1233, -252975, -258144, -242659, -155131, -199662, -238849, -263285, -67672, 16004, 258193, 113376, -29177, 19683, -194088, -335173, -104659, -54860, -306053, -565662, -157779, -127330, -118757, -169858, -81822, -31462, 99293, 25631, 95730, 195805, 37254, -288059, -133860, 71059, -144248, -72447, -98984, -307969, -371584, -294353, 101586, 165098, -46314, -61655, 22484, 42573, 48897]
1123D8897M6721j40405R9909p5317j64083L06816O2973j28718N6466j58309j69034
1112b14084J33684j8193J18352o8672J96883J79259j68630j88136m4129J12828
1102C9162r2786P2905P8390k21159M6273K36590j12125J99167M1368j10778k82541
1091a05534j62216J07577K26049k5083L4689j8500J83482O2978k7682l14670J4410
1080b4500l3109J06014r0846J20099l7973q2815k08433K42868L9941k11150r6568
1069b76472j5868K8061o9734K75143J76260j80280j78808J12699J27315O9060
1059F7376J96501o0768j94017q0158j45104P8013J71031j3883l3385K02453j50911
1048C7148k97408Q8403L20855p6017q261J11517j99877m7688J69940M0716j43481
$$ y = [48897, 95618, -44787, 55122, -20195, -184278, 122538, 185511, 56793, 113259, -45050, -214084, -80400, -98593, 19759, -48913, 147970, 327229, 158599, -29537, -73666, 39162, -53624, 19281, 97671, -123488, -77215, 159375, 47250, 246417, 287785, 177007, -105534, -267750, -160173, 65876, 40793, 75482, 56982, 240464, 303442, 275760, -38910, -24500, -57609, 48405, -42441, 77658, 39685, -43130, -251563, -8695, 31246, -179904, -276472, -292340, -264279, -334013, -58870, 117390, -62890, -241698, -128999, -1684, 67376, 263877, 203109, 9092, -71066, -216170, -138157, 32874, 18991, -14394, 188059, 37148, -260260, -171857, 148998, 72981, 64720, 176237, -23640, -71328, 98612, 139328, -4153]
1037d153k04260K9739J87215j07227N8643K10940l889L6126j83395j97255o4309
1026b41825K87962K49490m9275k17787o4877m0883n3834K21460K21054m019k98681
1015H785J5921l0576l9449J81258J78034j21250l14395K2524J3784J12860K1145
1004D8641m4222J34881k39358k77720K39673R3728J6949j16387k11756K10601
994a44970K80995j70488j78235O3634J97923j67160R7645K26826K0541j65355
984F1356K17801j68133k54629K5805O3195p0185j7990L92034J08448k6696j9077
973C11929m3254J92476m259m56727j27484j47713K59185J92758R1567n339k56158
962F981J10298Q1831n7642P1115L7102j39855l1861Q696j73249J28408Q8260m4028
$$ y = [-4153, -208413, -178674, 8541, -98686, -40043, 170897, 167008, 203134, 19739, -177516, -241825, 46137, 295627, 246352, 28565, -36312, -77195, -131029, 90431, 311485, 307466, 8785, 24706, -5870, -45319, 135939, 313973, 192723, -121672, -99148, -85364, 27496, 48641, 4419, 139300, -100058, -377778, -138105, -44377, -27428, -143815, -355571, -144970, 136025, -34463, -212698, -149064, 48859, -118301, -20656, 206170, 226711, 61356, 279157, 111024, -143605, -117800, -54605, -124790, -142780, 249254, 357702, 331006, 311929, 268675, 461151, 456892, 165, -127319, -275032, -15847, 176911, 268478, 263139, 6981, 117279, 199110, 141468, 212583, 249685, 109830, 77969, 86665, -86584, 41824, 130084, 86056]
950H6056j6352K53200k03476J03171k44481j42168p984J0333R4294j18272J65397
939b0282j9254j41674J73979J88008j63209o7735J14435J35279j01230J0080m6604
928F1793j56408m63R2276k3882R5551r6664p7311k00219k3905n6140m4592K87584
916a42380J09834k1710m5781p15r8010K05134J83514k49661K03005J03931j08734
905A38427j47202m1154j16534J8815J52928Q3824r2773k24722r4044L0112J59501
894a32822J72224P1695j20772k13054Q8349K76274l325n3871O716m2960M1632
883I0086j73822Q9406l2400l7840R8583p0259j33315J80634J20319J01809n9768
872A73433j47776O1034K4955p8663J09904R1576J1738K1536r5804J51689Q7359
$$ y = [86056, 69704, 322904, 119428, 222599, -21882, -164050, -172034, -161701, -67407, -185679, -20282, -39536, -181210, -7231, 180777, 17568, -50167, 64268, 199547, 98317, 108397, 61793, -94615, -95078, -2802, -26684, 68867, -27797, -105108, -305327, -329232, -385372, -429964, -142380, -32546, -54256, -100037, -100752, -198762, 6372, 189886, -59775, 143230, 247161, 138427, -8775, -49929, -166463, -147648, 5280, 89104, -3669, -228391, -322435, -292323, -132822, 39402, 111097, -9675, -222729, -134380, 141894, 138569, 84698, 91414, 48454, 90086, -83736, 5670, -26730, -64570, 34013, -36246, -169561, 11073, 131392, 233201, 173433, 25657, 86691, 111646, 32983, 142887, 234463, 246201, 267737, 171933, 323622, 410981]
861D10981k61387J01477k29699p1885L9990l0458J40676j50165m4715J52697R0942
850A48454j25798j4309J0925M6490L77717o6900k37551J45360k32622l54279K5748
839b76765K67830k3892J61113k24077Q7162N0767q4117L2394r5094J9183m5890
828a31386j4338K17241K40904j75441k44377j28437q0022J57638R8167q968R8077
817B9058M20574j97002k1195O8565k22467M293k76189j27997K45608l82j89122
806b66256J69467M0853k29652J65992j21896m2144J69416J72853j25644J0758
796e6253L03898k78714k16039J75256q2492P458Q3795J02413j74468j16917Q2970
785a69093J73158j00936K14226n9682Q5783J02395M7352j16031j7490j3973m43751
$$ y = [410981, 149594, 251071, 21372, -50513, -10523, -40981, 99695, -50470, -95185, 57512, 148454, 22656, 8347, 19272, 65762, 443479, 376579, 139028, 284388, 51766, -302513, -276765, -8935, -32827, 128286, -95791, -8629, 42138, -41979, -9585, -104679, -85496, -131386, -145724, 71517, 312421, 136980, -107397, -235834, -315856, -158218, -60051, -69019, 29058, 449632, 252630, 231435, 300000, 77533, 81826, -194363, -322360, -76752, -77134, -266256, -96789, -55936, -285588, -119596, -241492, -283636, -114220, 58633, -67011, -56253, 247645, -31069, -247108, -71852, -154344, -146886, -63091, 39322, -135146, -252063, -169093, 4065, -96871, 117355, 57673, 143456, 245851, 293203, 177172, 159682, 145709, -298042]
774b98042P2682J69242M3248K14003p6088n2003p8105J42919J12641l92321J46278
763D454p9187J99391j36968k77128L52672R2594k1891l0770k51507J27870J22371
752A01901o4975q5549O5139k07866m0439J47468q8516n6804J68386J41346j04971
741b4880L770q5082K3095L5042j82438J12104o0493Q5239j14446k20726J25475
730c03340J52134j69951J2471J10891K27899q278l22165J08997J27691r3327J52543
719d435Q5130j29979r7368M5412O8893K46817k30239j38528Q1489J07368J8250
708E2810r335P8828p6040q5685l0385j46671J0126J5996o3949N8769j37545K36763
696i6318J12756j9793P7499O9494k45164l18189L56993k41962J38449K42088k4489
$$ y = [-298042, -225360, -56118, -12870, 201133, 125045, 73042, -5063, 137856, 250497, -141824, 4454, -74733, 124658, -12310, -289438, 63234, 155828, 133937, 103167, -148340, -20470, 101901, 36926, -48623, 16516, -191350, -231789, -84321, -172837, -229641, -61255, 80091, -24880, -21110, -106192, -83097, -48055, -230493, -118389, -178882, -93643, -208089, -428815, -303340, -151206, -321157, -308686, -197795, 30104, 21826, -300339, -191342, -63651, -156978, -4435, 80695, -49284, -146652, -101240, -32347, 214470, -15769, -154297, -72808, 34560, 52810, 43475, 122303, 46263, -39422, -69807, -216478, -206352, -190356, -254305, -195536, -333081, -96318, 16438, -3355, 74144, 143638, -101526, -419715, -62722, -304684, -166235, 75853, 51364]
685E1364o1952J87440P85J38280k82808r6880N5498j07052J79533j26114k2973
674h4879J25964K05487l03674j82179L022R919Q2523M4174J18213J18475k40301
663a03256k2760j5445o5397K19694J38297J03014J49807l18877L3810k8320m1542
652D9025q3928J90291O742K1684l96159K58531J8334j59556k87621P7984L06405
641A732R7589J24001j38275J14860o1417Q1141q4051k88588j13159L46764l2822
630D7775j40646L66K57794r0746j67539J31438K08390j09122o9541O375n6823
619A7721J07779j91117J99939J5825j67316L0831m1892j27842J26196j80687N3500
608a57063O5418k07660Q5187r0821J28491n1727J34319J67207j33797L7907J8535
$$ y = [51364, -10588, 176852, 177637, 315917, 33109, -63771, -8273, -115325, 64208, -61906, -84879, 41085, 246572, -57102, -239281, -236259, -226340, -143817, -99643, 18570, 137045, -103256, -126016, -141461, -206858, 12836, 151133, 254147, 403954, 85077, 118887, 90567, 49025, -34903, 155388, 162130, 183814, -212345, 46186, 64520, -95036, -382657, -304673, 1732, 99321, 223322, 85047, 199907, 138490, 219631, 135580, -153008, -266167, 80597, 47775, -92871, -92505, 165289, 74543, -92996, 38442, 246832, 137710, 68169, 74544, 17721, 125500, -65617, 134322, 150147, -17169, 13662, -28230, -156072, -29876, -210563, -157063, -91645, -299305, -214118, -304939, -176448, -228175, -93856, 73351, -60446, -22539, -4004]
597d004r3631K26889j36416p0876O4869J03845o8648j66507K68554j65131o62
586d1718r1077P305J3481k79939L4137K79589M08088m44602L0289J61329l63476
575b86594K04754J03981J0645l32090J90620q0566P2092Q9375l6056Q8791l7843
564a2891O9812j33368J91448k9612m734j74096J56163P6413J09168R5063j28066
553B15300k20983J7582K11113L3599j41030J02265l9376j86203j05772J5959l2873
542a30419J73382K33002k20936k36814j81190m6344k133J64274J25374Q7392J49125
531A14713J57637M4648j08602p4171q6290l50531K95847K1391j40018J74884J23857
520A73365L9044k41235j29344J67080J00475k54570N7249J63218m4100l6929j2507
$$ y = [-4004, -97635, 129254, -7162, -78038, -13169, 90676, 22028, -144479, 124075, -41056, -41718, -132795, -125490, -112009, -391948, -357811, -78222, 329866, -114736, -84447, 76882, -286594, -81840, 22141, 32786, -299304, -108684, -189250, -117158, -27783, -63839, 24952, -12891, 56921, -76447, 115001, 85389, 80655, -93441, 62722, 139135, 248303, 343366, 215300, -5683, 11899, 223012, 256611, 115581, 217846, 178470, -7733, -113505, -97546, -130419, 42963, 275965, 55029, -181785, -362975, -409319, -411452, -247178, -121804, -34412, 114713, 272350, 316998, 208396, 134225, 47935, -302596, -6749, 14642, -125376, 49508, 173365, 212409, -28826, -158170, 8910, 109385, -145185, -87936, 75282, 31182, -5747, -18254]
509a8254r3396J00696j1087N5739j13868N2826L73902k3032l31121k31177J17835
498a20937J36813J66925j73596L4482N8455j67206l5499R5526k82309q0078K98762
487f8662K5312M2683J99602Q6220k08889j72370k6905J05208j48252K76303K12104
476C22354k71789o8601K24651K22859k85837M6461J3218r6984k1608L7386o7109
465E5001P3729m1529j63459J52383o9198K44999j11038j19686Q0898k478j38167
454c8545k43665o6985p1257Q9122K10027R4872r6384r0942J06472J70527k1678
443D1564j65271P3001J74481m3689k73882j35715K31911K93134L196o1642k79385
432a42297K34480J82122N8839j69309q2978J48934k10033J16187L680j15425k9994
$$ y = [-18254, -111650, -10954, -22041, 33698, -80170, -27344, 346558, 323526, -7595, -238772, -120937, 15876, 182801, 9205, 43687, 102142, -65064, -100563, -5037, -287346, -367424, -68662, -43350, -667, 198935, 285155, 76266, -96104, -123009, -17801, -166053, 110250, 322354, 50565, -18036, 206615, 429474, 143637, 190098, 203316, 106332, 84724, 122110, 55001, 128730, 87201, -76258, 76125, 6927, 251926, 140888, 21202, 102100, 99622, -38545, -282210, -349195, -420452, -331330, -121303, -26431, -122815, -213757, -107285, 63242, 41564, -123707, -50706, 123775, 80086, -193796, -329511, -97600, 195534, 198730, 137088, -142297, 92183, 274305, 333144, 163835, 80857, 229791, 19758, 135945, 139625, 24200, -5794]
421e794J61058J07391k9482k38965Q3541J24814k38799j15020j65103Q4467L25804
410I3912N7137k14082Q4176K0517m4191j16605L7503J16730j2831J12514k1531
399A13249k29537m2341L87022J66150k85055L3164Q7548l3844j97123q6087l3757
388a20611p3629L78604j75622J06858n9181j49520p2263J25989J2899k8699j0673
377f5848J57150K12302J176j66847j52889J05000L3558p0487J16868k33772L4228
366b9561O316J55130J9900m2518J9318j6478j16651k3454N1311j8053J24255k28494
354i8979J38355P9014R3162j31310p1311j66838L27949J92587m01773j29589P9710
343h9023j21608R3838M9113J13441K2301K76392m386r7325k1546k19178o034N4922
$$ y = [-5794, 155264, 262655, 233173, -5792, 77749, 202563, -36236, -151256, -316359, -231892, 93912, 151049, -63033, 21143, 41660, -2531, -119136, -81633, 35097, 22266, 134780, 113249, -116288, -158629, 228393, 394543, 109488, 142652, 230200, 196356, -767, -86854, -120611, -194240, 184364, 8742, 115600, 56419, -93101, -165364, -39375, -26476, -55175, -65848, 91302, 303604, 304780, 137933, -14956, 90044, 123602, 53115, 169983, -63789, -29561, -23245, 131885, 151785, 109267, 128585, 112107, -4544, -27998, 23313, 5260, 129515, -98979, 39376, 118390, 211552, 80242, 8931, -157907, 170042, 362629, -39144, -168733, -89023, -210631, -116793, -67680, 45761, 68062, 344454, 340068, 242743, 221197, 2019, -4015, 50907]
331E0907j26147J60838j659k62145K85559N9843q4911P0469l7709l7235j40610
320f2800R6676j81298j17494J78152J48341N5361k27733K9462M7929J07167m2911
309C0852j0658J66563j37838J20370j02516j05851L0344j0273J1663j04252j41484
298b53080m02K56125n0623R3292J21113J36025R0876j80435n1596J41403k46782
287E5916P1006q536j7321q0365J4952j35876%J69876M2649R1343r0832k96881
275a84069N1976j8808J042J09042P373M5349m5272R9190p9300J2498j35069J57920
263B1872K90228j09550K29001j1227k13677j38225j0821M2068r0861j24263L06113
252A90658M2880l44746k7039J12586O691j3189l4332K37127j00758k7713P2242
$$ y = [50907, -75240, 85598, 83939, -178206, 107353, 167196, 82285, 152754, 115045, 77810, -62800, 33876, -147422, -264916, -86764, 61577, 116938, -110795, -81333, -33404, 73763, 30852, 20194, 186757, 48919, 169289, 66773, -39078, -8734, -19007, -7344, -111596, -253080, -253482, 2643, -47980, 45312, 166425, 302450, 393326, 212891, 161295, 302698, 55916, 126922, 118386, 101065, 20700, 35652, -100224, -100224, 69652, 112301, 203644, 112812, -184069, -132093, -150901, -149859, -40817, -33444, 11905, -33367, 65823, -13477, -979, -136048, 21872, 312100, 202550, 431551, 420324, 206647, 68422, 57601, 99669, 8808, -115455, 190658, 233538, -111208, -138247, -25661, -18970, -32159, -66491, 170636, 69878, 42165, 114407]
241A14407p2159J94351j71802j58121L70644J98998k92292J6170l37149R9500
231c7453J67250K79136k60138j85647J5779J60223o4194r3796k20722K29156J15317
220A04911j50711j54174q6360J97306J32095M33967j88917p0884k82050J28405
210F3588K0374k36897K938K9537J67277K45498M2078o6903p4062j31779J58779
199B20428Q3009l33140R3045K74826n574l8129L208j80339j64540Q4441M7365
188H4600K5682O7089q7522k51506K21016J30197k5889k4691M239j6666r5288J53355
176A84616Q793J09242j511j36455J44802N1330j63119q869K1009j17863q0176
165A1799j90852j67792K02245J47021o9326L7218j43346K25100j5172J39921j6240
$$ y = [114407, 42248, 236599, 64797, -93324, 277320, 476318, 184026, 200196, -136953, -37453, 129797, 408933, 148795, -36852, -21073, 139150, 74956, -18840, -239562, -10406, 104911, -45800, -199974, -286334, -89028, 43067, 477034, 288117, 217233, -64817, 63588, 83962, -152935, -149997, -120460, 46817, 292315, 334393, 267490, 193428, 61649, 220428, 303437, -29703, 63342, 338168, 332594, 294465, 297673, 117334, -47206, 37235, 84600, 110282, 177371, 89849, -161657, 59359, 189556, 163667, 138976, 143215, 126549, 31261, 184616, 193409, 302651, 301140, 164685, 309487, 360817, 197698, 188829, 209838, 91975, 11799, -179053, -346845, -144600, 2421, -66905, -29687, -173033, 52067, 36895, 176816, 160576]
154A60576k13343J96077j06189j4474M7995r5133k2188j12289J26952m9330q2926
143a64272r4276p659K3800J9817K35714K61345R4553l65586j67960p905P3013
132i9416M7976J68364J7570K2086j0103P8762j7815o2149j0022j48544k5962K36170
120A96917j22752n5377O0025r7114J79072q4883k52296K96825J26912j19640j29684
109a995P5037L1164R145N2837j0094k8199K0205J27485j01146P8806q6875k20827
97e4457R0979J28541m0848j7060J27337L542q3671j35453j09835J57397M5251
86A11723L8002j32450k6601L3078r4849J0314P831L75470r2367j77908K2317N0569
74A25129j1753r7822j6226M140L4997k5811P2106j27212J7183J58122j6332m9677
$$ y = [160576, -52767, 143310, 37121, 22647, 70642, -24491, -46679, -158968, -32016, -81346, -164272, -258548, -266207, -242407, -222590, 13124, 274469, 369022, 3436, -164524, -172429, -99416, -51440, 116924, 134494, 156580, 146477, 225239, 207424, 145275, 135253, -13291, -39253, 196917, 74165, 18788, 78813, -18301, 160771, 75888, -176408, 120417, 247329, 127689, -1995, 73042, 104206, 113351, 166188, 156094, 127895, 148100, 275585, 174439, 253245, 166370, -54457, 36522, 165063, 124215, 107155, 234492, 238034, 154363, 18910, -90925, 66472, 111723, 149725, 17275, -9326, 23752, -71097, -60783, -52952, 322518, 230151, 52243, 74560, 125129, 113376, 15554, -672, 3468, 38465, 12654, 84760, -42452, -25269, 132853, 116521, 66844]
62F6844l3662J8817J84244k1334j47783N6523j91206j38985L12068J22505j99379
51B8652J45073j23340N9309Q542k7832O7068j42827J43087j03143m1826J82445
40A95208J4852k6519j64519K9684J50011n4212J12504Q3210n71q4582J35382j03375
28B87073p9838j06094r4862q2525K26490Q8831j8936r2727k04859P3100K3351
17A9004R7094j2337n412M1253Q3706j50868j15854j22664J28921J31571k0802
6G3612o6424r6110J09058Q3017O1819n8006
0A06966
$$ y = [66844, 33182, 51999, 236243, 214909, 67126, 123649, -67557, -206542, 105526, 228031, 28652, 173725, 50385, 109694, 118236, 90404, 157472, 14645, 157732, 54589, 12763, 195208, 210060, 183541, 19022, 48706, 198717, 144505, 257009, 340219, 339648, 255066, 390448, 287073, 207235, 101141, 6279, -76246, 150244, 239075, 220139, 127412, -77447, -4347, 19004, 116098, 103761, 98349, 139602, 223308, 72440, -43414, -166078, -37157, 94414, 73612, 7188, -88922, 20136, 103153, 164972, 106966]
$$ Imaginary data points
##PAGE= N=2
##DATA TABLE= (X++(I..I)), XYDATA
16383b379617J8411J55694L9014l5873r6195J08450J35935j39715J83887O5434
16373a944575r4627N1468O0235J59027K22401j2846j40250o3995L3925O2220l7996
16362a705013K03539K0291k3942q9821l9097P3123K01169R0725q3811n6700j5482
16351a425019j7065J30727Q0339p9382n6649J69859J07040J13097n3626L9081
16341i91598n5757J47161Q9223k65932J54584R6018M8730L5206r8265J9176J28173
16330f93281p8315J98968p9587J4537N6803Q5832J55540O1476J6764m9538J2542
16319b98259J10279N6010m5789l260O8352j17713J3027N8323M5548o7022o3383
16308b43887L23892r348K3009j07373P513J18418J46044N0555p5464j851L9029
$$ y = [-2379617, -2361206, -2205512, -2166498, -2202371, -2298566, -2190116, -2054181, -2193896, -2010009, -1944575, -2039202, -1987734, -1927499, -1768472, -1546071, -1558917, -1699167, -1763162, -1729237, -1667017, -1705013, -1501474, -1481183, -1505125, -1594946, -1634043, -1560920, -1359751, -1269026, -1352837, -1409537, -1425019, -1442084, -1311357, -1231018, -1310400, -1367049, -1197190, -1090150, -977053, -1030679, -991598, -1047355, -900194, -810971, -1076903, -922319, -826301, -777571, -742365, -840630, -821454, -693281, -771596, -572628, -652215, -637678, -580875, -495043, -339503, -278027, -261263, -310801, -298259, -187980, -131970, -177759, -181019, -112667, -230380, -217353, -159030, -113482, -180504, -243887, 80005, 70657, 93666, -13707, -6194, 112224, 258268, 308823, 233359, 231508, 270537]
16297B70537P1008j80451j75468K95784K7625j4464k312M7383J69973q205o0164
16286D41246J6469J51437J02877j09608p2163L8362O84O796l877L3954Q7334m8938
16274F44573O1251r0565J47398R6544j82351K26301l3061J2785K32511J29662
16264A245048J9052N0904m0542j99128o1786R4796O8306J18667n3418R7089J64252
16253A503240j12979j79439L5870O1950L4319n5406j1653j66555J33803K90181
16243A533331j31639j5340J18829J41724o8584J0985q6947j01737K0825K50298
16233A671745M744K5056j9670n9262J77087l9707l02844p3941K33790K22126k0714
16222A818410j67186m8817J41443K90192j72352N6561p0880k06442K17060O1242
$$ y = [270537, 341545, 161094, -14374, 281410, 309035, 294571, 292259, 339642, 509615, 501410, 441246, 457715, 609152, 712029, 602421, 530258, 568620, 569304, 576100, 572223, 606177, 693511, 644573, 705824, 615259, 762657, 859201, 676850, 903151, 870090, 882875, 1115386, 1245048, 1264100, 1315004, 1274462, 1075334, 1013548, 1108344, 1176650, 1295317, 1241899, 1338988, 1503240, 1390261, 1210822, 1246692, 1308642, 1342961, 1287555, 1275902, 1109347, 1243150, 1533331, 1401692, 1386352, 1505181, 1646905, 1578321, 1589306, 1502359, 1400622, 1421447, 1671745, 1676489, 1701545, 1681875, 1622613, 1799700, 1759993, 1457149, 1383208, 1616998, 1839124, 1818410, 1651224, 1602407, 1743850, 2034042, 1861690, 1918251, 1847371, 1640929, 1857989, 1919231]
16212A919231n0595Q2297j56496P9816K43768O4825l8384j1336j08271j02762
16202A922093L4457O0130o6255q5909O9255L934J49537L2446K11155k95697l3339
16191B001807L83005n8444o0418k19891J01385L0070m1900N731J52501M011J00378
16180B398235j64447j58818k83807L12499J17404j18515L19798k12804k1611R369
16170B197303K80807J34357J29976j21539o3329j92683n6594k49424J9417K50380
$$ y = [1919231, 1868636, 1950933, 1794437, 1874253, 2118021, 2182846, 2144462, 2133126, 2024855, 1922093, 1956550, 2016680, 1950425, 1864516, 1933771, 1937705, 2087242, 2119688, 2330843, 2035146, 2001807, 2384812, 2326368, 2265950, 2046059, 2147444, 2177514, 2135614, 2141345, 2293846, 2297857, 2398235, 2233788, 2074970, 1791163, 2103662, 2221066, 2102551, 2422349, 2209545, 2187934, 2197303, 2478110, 2612467, 2742443, 2620904, 2557575, 2364892, 2308298, 2058874, 2078291, 2328671]
$$ [...]
##END NTUPLES=NMR SPECTRUM
##END=
