##TITLE=1H_CA-9071-1x
 DMSO
 8 sc, 
 21.10.2022
##JCAMPDX= 6.0         $$ Bruker NMR JCAMP-DX V2.0
##DATA TYPE= NMR SPECTRUM
##DATA CLASS= NTUPLES
##ORIGIN= UXNMR, Bruker Analytische Messtechnik GmbH
##OWNER= root
$$ XWIN-NMR		Version 3.5
$$ Fri Oct 21 14:16:51 2022 Russian Standard Time (UT+4h)  she@DPX200
##.OBSERVE FREQUENCY= 200.1313499994
##.OBSERVE NUCLEUS= ^1H
##.ACQUISITION MODE= SIMULTANEOUS
##.ACQUISITION SCHEME= undefined
##.AVERAGES= 8
##.DIGITISER RES= 18
##SPECTROMETER/DATA SYSTEM= spect
##.PULSE SEQUENCE= zg30
##.SOLVENT NAME= DMSO
##.SHIFT REFERENCE= (INTERNAL, DMSO, 0, 15.7502)
##AUDIT TRAIL= $$ (NUMBER, WHEN, WHO, WHERE, WHAT)
$$ ##TITLE= Audit trail, XWIN-NMR		Version 3.5
$$ ##JCAMPDX= 5.01
$$ ##ORIGIN= Bruker BioSpin GmbH
$$ ##OWNER= she
$$ F:/spectra/data/she/nmr/H-F/1/pdata/1/auditp.txt
$$ ##AUDIT TRAIL=  $$ (NUMBER, WHEN, WHO, WHERE, WHAT)
(   1,<2022-10-21 14:15:35.01 +0400>,<she>,<DPX200>,
      <created by zg, POWCHK disabled, PULCHK disabled
       configuration hash MD5:
       00 E9 B6 7A A2 85 ED C7 34 08 36 98 17 FE 4E 26
       data hash MD5: 16K
       7B 6C D1 27 6E F3 F4 7A E4 3A D6 75 67 38 1A BD>)
(   2,<2022-10-21 14:15:37.48 +0400>,<she>,<DPX200>,
      <Start of raw data processing
       efp BC_mod = 2 LB = 0.24 FT_mod = 6 PKNL = 1 PHC0 = -18038.47 PHC1 = 15.6007 SI = 16K 
       data hash MD5: 16K
       5D C2 73 91 43 E9 34 88 7B F5 7B B1 63 BB 67 90>)
(   3,<2022-10-21 14:15:56.15 +0400>,<she>,<DPX200>,
      <pk PHC0 = 0.3458956 PHC1 = -3.2 
       data hash MD5: 16K
       3E 44 BB AE C2 B7 48 15 99 E4 E6 60 0F 20 32 ED>)
(   4,<2022-10-21 14:15:59.59 +0400>,<she>,<DPX200>,
      <abs ABSG = 5 
       data hash MD5: 16K
       BD BF 79 88 65 5A 40 E1 0C 44 C7 21 C2 D3 3A CA>)
$$ ##END=
$$ 
$$ hash MD5
$$ A2 11 FB C3 A6 60 53 A2 10 B7 24 FD 75 39 5B BD
##$RELAX= 
##$RELAX= 
##$RELAX= 
##$RELAX= 
##$RELAX= 
##$RELAX= 
$$ Bruker specific parameters
$$ --------------------------
##$DU= <F:/spectra>
##$EXPNO= 1
##$NAME= <H-F>
##$PROCNO= 1
##$TYPE= <nmr>
##$USER= <she>
##$AMP= (0..31)
100 100 100 100 100 100 100 100 100 100 100 100 100 100 100 100 100 100 
100 100 100 100 100 100 100 100 100 100 100 100 100 100 
##$AQSEQ= 0
##$AQ_mod= 1
##$AUNM= <au_zg>
##$AUTOPOS= <>
##$BF1= 200.13
##$BF2= 200.13
##$BF3= 200.13
##$BF4= 200.13
##$BF5= 200.13
##$BF6= 200.13
##$BF7= 200.13
##$BF8= 200.13
##$BYTORDA= 1
##$CFDGTYP= 0
##$CFRGTYP= 5
##$CHEMSTR= <none>
##$CNST= (0..31)
1 1 145 1 1 1 1 1 1 1 1 1 1 1 1 1 1 1 1 1 1 1 1 1 1 1 1 1 1 1 1 1 
##$CPDPRG= <>
##$CPDPRG1= <>
##$CPDPRG2= <>
##$CPDPRG3= <>
##$CPDPRG4= <mlev>
##$CPDPRG5= <mlev>
##$CPDPRG6= <mlev>
##$CPDPRG7= <mlev>
##$CPDPRG8= <mlev>
##$CPDPRGB= <>
##$CPDPRGT= <>
##$D= (0..31)
0 1.2 0 0 0 0 0 0 0 0.06 0 0.03 0 0 0 0 0.0002 0 0 0 0 0 0 0 0 0 0 0 0 
0 0 0 
##$DATE= 1666347334
##$DBL= (0..7)
120 120 120 120 120 120 120 120 
##$DBP= (0..7)
150 150 150 150 150 150 150 150 
##$DBP07= 0
##$DBPNAM0= <>
##$DBPNAM1= <>
##$DBPNAM2= <>
##$DBPNAM3= <>
##$DBPNAM4= <>
$$ [...]
##$SUBNAM3= <"">
##$SUBNAM4= <"">
##$SUBNAM5= <"">
##$SUBNAM6= <"">
##$SUBNAM7= <"">
##$SUBNAM8= <"">
##$SUBNAM9= <"">
##$SW= 18.0517283424941
##$SWIBOX= (0..15)
0 0 2 0 0 0 0 0 0 0 0 0 0 0 0 0 
##$SW_h= 3612.71676300578
##$TD= 16384
##$TD0= 1
##$TE= 0
##$TE2= 300
##$TE3= 300
##$TEG= 300
##$TL= (0..7)
0 120 120 120 120 120 120 120 
##$TP= (0..7)
150 150 150 150 150 150 150 150 
##$TP07= 0
##$TPNAME0= <>
##$TPNAME1= <>
##$TPNAME2= <>
##$TPNAME3= <>
##$TPNAME4= <>
##$TPNAME5= <>
##$TPNAME6= <>
##$TPNAME7= <>
##$TPOAL= (0..7)
0.5 0.5 0.5 0.5 0.5 0.5 0.5 0.5 
##$TPOFFS= (0..7)
0 0 0 0 0 0 0 0 
##$TUNHIN= 0
##$TUNHOUT= 0
##$TUNXOUT= 0
##$USERA1= <user>
##$USERA2= <user>
##$USERA3= <user>
##$USERA4= <user>
##$USERA5= <user>
##$V9= 5
##$VALIST= <valist>
##$VCLIST= <CCCCCCCCCCCCCCC>
##$VD= 0
##$VDLIST= <DDDDDDDDDDDDDDD>
##$VPLIST= <PPPPPPPPPPPPPPP>
##$VTLIST= <TTTTTTTTTTTTTTT>
##$WBST= 1024
##$WBSW= 4
##$XGAIN= (0..3)
0 0 0 0 
##$XL= 0
##$YL= 0
##$YMAX_a= 171397
##$YMIN_a= -363489
##$ZGOPTNS= <>
##$ZL1= 120
##$ZL2= 120
##$ZL3= 120
##$ZL4= 120
##$ABSF1= 15.77113
##$ABSF2= -2.28072
##$ABSG= 5
##$ABSL= 3
##$ALPHA= 0
##$AQORDER= 0
##$ASSFAC= 0
##$ASSFACI= 0
##$ASSFACX= 0
##$ASSWID= 0
##$AUNMP= <proc_1d>
##$AZFE= 0.1
##$AZFW= 0.1
##$BCFW= 0
##$BC_mod= 2
##$BYTORDP= 0
##$COROFFS= 0
##$CY= -3
##$DATMOD= 1
##$DC= 0
##$DFILT= <>
##$DTYPP= 0
##$F1P= 0
##$F2P= 0
##$FCOR= 1
##$FTSIZE= 16384
##$FT_mod= 6
##$GAMMA= 0
##$GB= 0
##$INTBC= 1
##$INTSCL= 3.70164e-10
##$ISEN= 128
##$LB= 0.24
##$LEV0= 0
##$LPBIN= 0
##$MAXI= 10000
##$MC2= 0
##$MEAN= 0
##$ME_mod= 0
##$MI= 1.114404
##$NCOEF= 0
##$NC_proc= -7
##$NLEV= 6
##$NOISF1= 3.799351
##$NOISF2= 2.8
##$NSP= 0
##$NTH_PI= 0
##$NZP= 0
##$OFFSET= 15.75019
##$PC= 1
##$PHC0= -18038.12
##$PHC1= 12.4007
##$PH_mod= 1
##$PKNL= yes
##$PPARMOD= 0
##$PSCAL= 0
##$PSIGN= 0
##$REVERSE= no
##$SF= 200.1300042708
##$SI= 16384
##$SIGF1= 3
##$SIGF2= 2
##$SINO= 5.538805
##$SIOLD= 16384
##$SREGLST= <1H.CDCl3>
##$SSB= 0
##$STSI= 16384
##$STSR= 0
##$SW_p= 3612.71676300578
##$SYMM= 0
##$S_DEV= 0
##$TDeff= 16384
##$TDoff= 0
##$TI= <>
##$TILT= no
##$TM1= 0
##$TM2= 0
##$TOPLEV= 0
##$USERP1= <user>
##$USERP2= <user>
##$USERP3= <user>
##$USERP4= <user>
##$USERP5= <user>
##$WDW= 1
##$XDIM= 16384
##$YMAX_p= 302442493
##$YMIN_p= -880532
$$ End of Bruker specific parameters
$$ ---------------------------------
##NTUPLES= NMR SPECTRUM
##VAR_NAME=  FREQUENCY,     SPECTRUM/REAL,   SPECTRUM/IMAG
##SYMBOL=    X,             R,               I
##VAR_TYPE=  INDEPENDENT,   DEPENDENT,       DEPENDENT
##VAR_FORM=  AFFN,          ASDF,            ASDF
##VAR_DIM=   16384,         16384,           16384
##UNITS=     HZ,            ARBITRARY UNITS, ARBITRARY UNITS
##FACTOR=    0.220516191357247, 1,           1
##FIRST=     3152.08554817526, 0,            0
##LAST=      -460.631214830522, 0,           0
##MIN=       -460.631214830522, -880532,     0
##MAX=       3152.08554817526, 302442493,    0
$$ Real data points
##PAGE= N=1
##DATA TABLE= (X++(R..R)), XYDATA
$$ [...]
8177a16879m5736k32672J94828r5076n894j46452q100J12694M4782J26830J24730
$$ -116879 -162615 -395287 -200459 -295535 -301429 -447881 -455981 -343287 -298505 -171675 -46945
8166d6945R4456j02483M6888O1477j68168k15452L6594K39197O482p1509m0591
$$ -46945 47511 -54972 -8084 53393 -114775 -330227 -293633 -54436 -47954 -119463 -160054
8155a60054r7204k74682K97727M9893k4760J74987k12496J21255J08548j68935
$$ -160054 -257258 -531940 -234213 -184320 -209080 -34093 -246589 -125334 -16786 -185721
8145a85721l8301J09888K2570O29K3259m7706J5690L9560P9507m1517q9732N5127
$$ -185721 -224022 -114134 -91564 -90935 -67676 -115382 -99692 -60132 19375 -22142 -111874 -56747
8133e6747n2697M7646J80629p2118k5695k71713j40443R3934n7288o6395k5760
$$ -56747 -109444 -61798 118831 46713 21018 -250695 -391138 -297204 -354492 -420887 -446647
8122d46647K16607J76070l428k37395l07494r566Q9086J57560J40259j55838N9497
$$ -446647 -230040 -53970 -57398 -294793 -602287 -611853 -522767 -365207 -224948 -380786 -321289
8111c21289J02938O1100o969j00457J17268j26113J15755J75106r8472m9021J4632
$$ -321289 -218351 -157251 -164220 -264677 -147409 -273522 -157767 17339 -81133 -130154 -115522
8100a15522k89283m7692K27181Q2759j05426q986j95300J77691Q8472K75855N4355
$$ -115522 -404805 -452497 -225316 -142557 -247983 -256969 -452269 -274578 -186106 89749 144104
8089A44104j99878r4823k35776J77408J98676L2494k5678m0108j18976l8891L2590
$$ 144104 -55774 -150597 -386373 -208965 -10289 22205 -3473 -43581 -162557 -201448 -168858
8078a68858J04026l7925O8762P9067l36954k57393L16481K14513j00505k25192
$$ -168858 -64832 -102757 -33995 45072 -291882 -549275 -232794 -18281 -118786 -343978
8068c43978r343n539J25714j42233K97444J27109j97466j21661J64402j19622
$$ -343978 -353321 -358860 -233146 -375379 -77935 49174 -148292 -269953 -105551 -225173
8058b25173j97167J26623N4008o2140N1542J5986M3923j48303n614L02839q0047
$$ -225173 -422340 -295717 -241709 -303849 -252307 -236321 -192398 -340701 -346315 -43476 -123523
8047a23523L309J29161q4905j68380J5393L0000m8428r5001R5748J97514j57701
$$ -123523 -120214 8947 -75958 -244338 -228945 -198945 -247373 -342374 -246626 -49112 -206813
8036b06813R1236r0924j72407J03820J66800q0323n6010o5016J40332O3830K04353
$$ -206813 -115577 -206501 -378908 -275088 -108288 -188611 -244621 -309637 -169305 -105475 98878
8025I8878r6824j91001J90082L6248p8193j15587j30846k3228L12120j86134k810
$$ 98878 2054 -188947 1135 37383 -40810 -156397 -287243 -310471 1649 -184485 -187295
8014a87295O3803N8460k08041l56165n7199P5810J06808J58219R8887k3501L2684
$$ -187295 -123492 -65032 -273073 -629238 -686437 -610627 -503819 -345600 -246713 -270214 -237530
8003b37530l1947l8020J02226K6423M0247k62254K62799j23414p3210Q6642J4129
$$ -237530 -269477 -307497 -205271 -178848 -138601 -400855 -138056 -261470 -334680 -248038 -233909
7992b33909L4619P102P6230m7833O9341k8171j31863J24913k6857k74882j6131
$$ -233909 -199290 -192188 -115958 -163791 -94450 -122621 -254484 -129571 -156428 -431310 -447441
7981d47441J38383p9528k2780j21609L1456L40158J16683o2625l92025J32949
$$ -447441 -309058 -388586 -411366 -532975 -501519 -161361 -44678 -107303 -499328 -366379
7971c66379Q3459r505K7557l4159O0959K98881K7698j12286n1203p0863Q4015
$$ -366379 -282920 -292425 -264868 -299027 -238068 60813 88511 -23775 -74978 -145841 -61826
7960f1826j97199k76210L74880J47809l8816j64808j15235K97339k08889r0270
$$ -61826 -259025 -535235 -160355 -12546 -51362 -216170 -331405 -34066 -242955 -333225
7950c33225K09934M4235l6307j62781q7908P4079R6360L93188j01505j28182j17758
$$ -333225 -123291 -79056 -115363 -278144 -366052 -291973 -195613 197575 96070 -32112 -149870
7939a49870j5914J60859k5372j18913n8903M1655j78901K27679Q5973m0080k03828
$$ -149870 -165784 -4925 -30297 -149210 -208113 -166458 -345359 -117680 -31707 -71787 -275615
7928b75615O4556R6457j86691K40476J5461L2054j99306r475J71111o8461K5834
$$ -275615 -211059 -114602 -301293 -60817 -45356 -13302 -212608 -222083 -50972 -119433 -93599
7917i3599q669j57223j05281K42872K35033K3680j08758n6791K3335R1221Q35
$$ -93599 -102268 -259491 -364772 -121900 113133 136813 28055 -28736 -5401 85820 86655
7906H6655R5321l12069k5317K97028N024j96238l69558K74232K59036o2613K69565
$$ 86655 181976 -130093 -155410 141618 146642 -49596 -419154 -144922 114114 51501 321066
7895C21066j0927j52810r8511o8805M7195j60211l8961J10757N3121P256j13496
$$ 321066 310139 157329 58818 -9987 37208 -123003 -161964 -51207 1914 9170 -104326
7884a04326j24608R4678J25379J38599r8986k88362k98063K16261O1577O8455
$$ -104326 -228934 -134256 -8877 129722 30736 -257626 -555689 -339428 -277851 -209396
7874b09396J30160j52410k9463L26523q6881n1703M5222q9518J04176o8973j15250
$$ -209396 -79236 -231646 -261109 65414 -21467 -73170 -27948 -117466 -13290 -82263 -197513
7863a97513j18991P9535K97641j45840j28128L9214K79744K28798k62627k60096
$$ -197513 -316504 -236969 60672 -85168 -213296 -174082 105662 334460 71833 -188263
7853a88263P5541N3739J01439j40207k74473J13277L20550r1676M6836K48090
$$ -188263 -112722 -58983 42456 -97751 -372224 -258947 61603 -30073 16763 264853
7843B64853Q2081j49955k03949k4075j88870O6192J28962K40264j93879P505K7770
$$ 264853 346934 196979 -6970 -31045 -219915 -153723 -24761 215503 21624 29129 56899
7832E6899k9268N2421l4341q730l2923L6586p8782k31923J8423J29307R0641M3050
$$ 56899 27631 80052 45711 36981 4058 40644 -38138 -270061 -251638 -122331 -31690 11360
7820A1360k7104j02862L5386K16183l7173k86361K32521k48315j24878J9567Q63233
$$ 11360 -15744 -118606 -83220 132963 95790 -190571 41950 -206365 -331243 -311676 551557
7809E51557j56233j55348O4723j42199J32951M8386R8446j27880R2352k9519K16526
$$ 551557 395324 239976 304699 162500 295451 343837 442283 314403 406755 377236 593762
7798E93762n9048j62584J73846q7430q8475P0453j82555j37638j71388J40793
$$ 593762 534714 372130 545976 458546 370071 440524 257969 120331 -51057 89736
7788H9736p7705q6840K89209J13250l57977k36180J84606L65737l631p1684j963
$$ 89736 12031 -74809 214400 327650 -30327 -266507 -81901 283836 280205 208521 206558
7777B06558J24819n8514N7341K63606p2704j41765j43353k63701J42547J12454
$$ 206558 331377 272863 330204 593810 521106 379341 235988 -27713 114834 227288
7767B27288p7504K77474k9284j86241j12088j90404n0893L53156J35423k73375
$$ 227288 149784 427258 397974 211733 99645 -90759 -141652 211504 346927 73552
7757G3552J04767J10586N0231l7522J7001j2077J26747L597J73738j67607J17188
$$ 73552 178319 288905 339136 301614 318615 306538 433285 436882 610620 443013 560201
7746E60201j76846k30497J85831j40809L62245l33096j72335K49852j1408Q7443
$$ 560201 383355 152858 338689 197880 560125 227029 54694 304546 293138 380581
7736C80581J04552R59o0292R7248m6736k89185K34507L0461k8688J3856p9767
$$ 380581 485133 486092 425800 523048 476312 187127 421634 452095 423407 437263 357496
7725C57496K72726j2374r1357J22516l5072j74586K6611J09355m4378o7905K57230
$$ 357496 630222 617848 526491 649007 613935 439349 465960 575315 530937 463032 720262
7714G20262k55389j30868K86998L19898j00991q0034r7315k35063j1557J37963
$$ 720262 464873 334005 621003 940901 839910 759876 662561 427498 415941 553904
7704E53904J15659j94383Q3026J37650j33755J27405j36297l1782L19912k74707
$$ 553904 669563 475180 558206 695856 562101 689506 553209 521427 841339 566632
7694E66632K22513l1824J8044L7188j40829m1999K72575J90424j02679l97256
$$ 566632 789145 757321 775365 812553 671724 629725 902300 1092724 990045 592789
7684E92789J02733P2557M8950K63702l29375J57133j8105m9649j4160N1334k37024
$$ 592789 695522 768079 817029 1080731 751356 908489 890384 840735 826575 877909 640885
7673F40885j8352K27973O377K5508J39806k11104J21996k102m2086Q1049O248
$$ 640885 622533 850506 856883 882391 1022197 811093 933089 930987 888901 969950 976198
7662I76198N3039O3641l81363l3699J77855Q6228j8269q0453J84042J36545j04040
$$ 976198 1029237 1092878 711515 677816 855671 941899 923630 843177 1027219 1163764 1059724
7651A059724n5301j94888J6409P9773K42474p0163j34111J59182k732j24883j24982
$$ 1059724 1004423 809535 825944 905717 1148191 1078028 943917 1103099 1100367 975484 850502
7640H50502k9901J5503K01768J76170k58053K0219J52537j50350K04010j17312
$$ 850502 820601 836104 1037872 1214042 955989 976208 1128745 978395 1182405 1065093
7630A065093M5914j59795L95606R7511k66910l80690N6585Q927K91863R3370k5247
$$ 1065093 1111007 951212 1346818 1444329 1177419 796729 853314 862241 1154104 1247474 1222227
7619A222227j00323l8430n7658m639o2691m5107L68698j00237q1411K42459j00793
$$ 1222227 1121904 1083474 1025816 1021177 958486 913379 1282077 1181840 1100429 1342888 1242095
7608A242095j46579P2437L17098O7842j8085j13286K6184J70608L204J31524J56215
$$ 1242095 1095516 1167953 1485051 1552893 1534808 1421522 1447706 1618314 1621518 1753042 1909257
7597A909257n7451j25242J0428p9220k00626J50908q9910J74735M4224k3592Q6540
$$ 1909257 1851806 1726564 1736992 1657772 1457146 1608054 1518144 1692879 1737103 1713511 1800051
7586A800051n2480R6823j2358l7838m23208K25252J4790O7363J59963j64078l7707
$$ 1800051 1747571 1844394 1832036 1794198 1370990 1596242 1611032 1678395 1838358 1674280 1636573
7575A636573j55336J02427L58948r0941j9709l90582p6035L67812L0956l5144
$$ 1636573 1481237 1583664 1942612 1851671 1831962 1441380 1365345 1733157 1764113 1728969
7565A728969K21304j8129j86356J36493K8017j84112J35842N3240m8548J33850
$$ 1728969 1950273 1932144 1745788 1882281 1910298 1726186 1862028 1915268 1866720 2000570
7555B000570j38580J77549l6753j0482j49845K44167J2588j75532j53192L3347
$$ 2000570 1861990 2039539 2002786 1992304 1842459 2086626 2099214 1923682 1770490 1803837
7545A803837K96765L2522k9757o8746l6155m0381J366j39954j16693K09280L437
$$ 1803837 2100602 2133124 2103367 2034621 1998466 1958085 1959451 1819497 1702804 1912084 1915521
7534A915521q8471J22044m5455L3309P8405J39112j99215n1660M1926K36780j76314
$$ 1915521 1827050 1949094 1903639 1936948 2015353 2154465 1955250 1903590 1945516 2182296 2005982
7523B005982p1620K48260J05857j3680J21711j29184J2613J91009j9596J1558
$$ 2005982 1934362 2182622 2288479 2274799 2396510 2267326 2279939 2470948 2451352 2462910
7513B462910O1757q7547P7939k02327j08013J55377K13149j39927M0537m9220
$$ 2462910 2524667 2437120 2515059 2312732 2204719 2360096 2573245 2433318 2473855 2424635
7503B424635K23614Q615j53886J04251J98169L1239j78941l7410J20335J2875
$$ 2424635 2648249 2656864 2502978 2607229 2805398 2836637 2657696 2620286 2740621 2753496
7493B753496l2679p6085J19516j10852m02697K92741P1743l0933P97Q8744J55815
$$ 2753496 2720817 2644732 2764248 2653396 2250699 2543440 2615183 2584250 2585047 2673791 2829606
7482B829606l616k65459l6275J72059K26230n7136j42920K45506p2453L3100K6482
$$ 2829606 2825990 2560531 2524256 2696315 2922545 2865409 2722489 2967995 2895542 2928642 2955124
7471B955124K8369O6533k64189J9407M8507j9428M7145J86990J02545q1142k30724
$$ 2955124 2983493 3050026 2785837 2805244 2853751 2834323 2881468 3068458 3171003 3089861 2859137
7460B859137N4781M2247K05806m60050J10860J13747j76211J3880r9811K23154
$$ 2859137 2913918 2956165 3161971 2701921 2812781 2926528 2750317 2764197 2664386 2887540
7450B887540N3405r4470J22284Q5068j17648o2125l9536q8470M5050Q2113l4595
$$ 2887540 2940945 2846475 2968759 3053827 2936179 2874054 2834518 2746048 2791098 2873211 2838616
7439B838616J76812P2095k11655K95260J711r2899o9447j46985J72827J68447
$$ 2838616 3015428 3087523 2875868 3171128 3172839 3079940 3010493 2863508 3036335 3204782
7429C204782M5800k48690k6436j80345k7100K73630R0111j81976m6179n3128J31562
$$ 3204782 3250582 3001892 2975456 2795111 2768011 3041641 3131752 2949776 2903597 2850469 2982031
7418B982031R4313j65178L8268K27302j30821o9141O5110P1296Q3452J3195j41501
$$ 2982031 3076344 2911166 2949434 3176736 3045915 2976774 3041884 3113180 3196632 3209827 3068326
7407C068326k14753L1475N5564Q5777j14025J65793L0334m8158p9472j62353m4169
$$ 3068326 2853573 2885048 2940612 3026389 2912364 3078157 3108491 3060333 2980861 2818508 2774339
7396B774339P6509J55123N5998J4330K14305l03877P0186k1578K02941n9649l60217
$$ 2774339 2850848 3005971 3061969 3076299 3290604 2986727 3056913 3035335 3238276 3178627 2818410
7385B818410J38467m9291j6713J46514q3412J7062J19945k0608p9766j57941R253
$$ 2818410 2956877 2907586 2890873 3037387 2953975 2971037 3090982 3070374 2990608 2832667 2841920
7374B841920r2761K05231j09650q2139J1762K52906k45839j7540J87098k4670
$$ 2841920 2749159 2954390 2844740 2762601 2774363 3027269 2781430 2763890 2950988 2926318
7364B926318L5687L6459o3864K42745N5006l02999m8464j61533Q9059R325n1667
$$ 2926318 2962005 2998464 2934600 3177345 3232351 2929352 2880888 2719355 2808414 2817739 2766072
7353B766072Q5194j4961J52533O182k07250j01185R0198N5358j82670J89811j06363
$$ 2766072 2851266 2836305 2988838 2995020 2787770 2686585 2776783 2832141 2649471 2839282 2732919
7342B732919J6882k16017J08940K36013j8137j29968q1508J3945O5342J87357
$$ 2732919 2749801 2533784 2642724 2878737 2860600 2730632 2649124 2663069 2728411 2915768
7332B915768l1297q084p4719n6100k39598J44763n4353N8305J1606j41485J9520
$$ 2915768 2884471 2876387 2801668 2745568 2505970 2650733 2596380 2654685 2666291 2524806 2544326
7321B544326j04928k3915m010K13985J17442j00331J71180j50711k4702k677j14233
$$ 2544326 2439398 2415483 2411473 2625458 2742900 2642569 2813749 2663038 2638336 2635659 2521426
7310B521426o8126O0841J8896L625j9752j04232M2043K9099j49858o1958R8347
$$ 2521426 2453300 2514141 2533037 2536662 2516910 2412678 2454721 2483820 2333962 2272004 2370351
7299B370351j38960m3033k8345n1051J31753p3650K13321R170J69771j9693k51932
$$ 2370351 2231391 2188358 2160013 2108962 2240715 2167065 2380386 2389556 2559327 2539634 2287702
7288B287702O4647j94393R3826j04307j79758M1098P0087K6365k32623K6718J64031
$$ 2287702 2352349 2157956 2251782 2147475 1967717 2008815 2078902 2105267 1872644 1899362 2063393
7277B063393K65562p3549j35622k6121l7493O3273J22704m1572j1475N5289j69288
$$ 2063393 2328955 2255406 2119784 2093663 2056170 2119443 2242147 2200575 2189100 2244389 2075101
7266B075101k8435j89144M2024k26593M2690K46121m421n0973J84220o8200j72041
$$ 2075101 2046666 1857522 1899546 1672953 1715643 1961764 1957343 1906370 2090590 2022390 1850349
7255A850349j18076J05098K04111Q0184Q376j28938n0033J03656j61874J34418
$$ 1850349 1732273 1837371 2041482 2121666 2130042 2001104 1951071 2054727 1892853 2027271
7245B027271J41711j35039j61544j57835P347J8635Q5203o6755j8463R1484J10159
$$ 2027271 2168982 2033943 1872399 1714564 1721911 1740546 1825749 1758994 1740531 1832015 1942174
7234A942174J55107l9231l59817j41898j36027J61852J74830j99073p7613L55939
$$ 1942174 2097281 2058050 1698233 1556335 1420308 1582160 1756990 1557917 1480304 1836243
7224A836243j21638j51463J5481j60504N024J2645J29488J0413K06324q5988k23034
$$ 1836243 1714605 1563142 1578623 1418119 1423143 1435788 1565276 1575689 1782013 1696025 1472991
7213A472991J17291J19667k4851j78094J23322j9820J29416N9568n9514R0660
$$ 1472991 1590282 1709949 1685098 1507004 1630326 1610506 1739922 1799490 1739976 1830636
7203A830636j34493k63665K7277P9685n3508J23550j06201O9880N1022j61021
$$ 1830636 1696143 1432478 1459755 1539440 1485932 1609482 1503281 1573161 1624183 1463162
7193A463162J79225m8032p9107R4606j14924Q3828k9421j00729m3110J13007J41052
$$ 1463162 1642387 1594355 1515248 1609854 1494930 1578758 1549337 1448608 1405498 1518505 1659557
7182A659557l34691o7239K96689j36363k57170J47430j8027N5370n0175j31768
$$ 1659557 1324866 1257627 1554316 1417953 1160783 1308213 1290186 1345556 1295381 1163613
7172A163613J28856m6624m7081J8464J17007p1174J03572J89408k71827j72046
$$ 1163613 1292469 1245845 1198764 1217228 1334235 1263061 1366633 1556041 1284214 1112168
7162A112168K29149J58221l8427l34646j42040K02953J97836j5731n4495j17753
$$ 1112168 1341317 1499538 1461111 1126465 984425 1187378 1385214 1369483 1314988 1197235
7152A197235K62617J47182m4682k15654j03279R5730j41832j36378K09108J01977
$$ 1197235 1459852 1607034 1562352 1346698 1243419 1339149 1197317 1060939 1270047 1372024
7142A372024j98486j4726j05632R9137Q76L5796J69648o8136O6723N9582j18540
$$ 1372024 1173538 1158812 1053180 1152317 1153193 1188989 1358637 1290501 1357224 1416806 1298266
7131A298266j08310P611o129q6582J17783J11021o8245j63906j47187K20941J64161
$$ 1298266 1189956 1197567 1191438 1104856 1222639 1333660 1265415 1101509 954322 1175263 1339424
7120A339424k17572l30145j8787M9018J07971L02968R1597K7908j89801p0629
$$ 1339424 1121852 791707 772920 821938 929909 1232877 1324474 1352382 1162581 1091952
7110A091952R0255l995N5096j74051j07688L30116k7453k1226n4530j55500o016
$$ 1091952 1182207 1178212 1233308 1059257 951569 1281685 1254232 1233006 1178476 1022976 1016960
7099A016960j09659J2256R3979K05539j33926l65029J17348j05161J36893m1767
$$ 1016960 907301 919557 1013536 1219075 1085149 720120 837468 732307 869200 827433
7089H27433R6407M4447L7232K29324q6238n136j2845R6417k49383j24516k97469
$$ 827433 923840 968287 1005519 1234843 1148605 1143469 1130624 1227041 977658 853142 555673
7078E55673K58737M03959k94956J9149J06648k48635j09009J85847R3051j00094
$$ 555673 814410 1218369 923413 942562 1049210 800575 691566 877413 970464 870370
7068H70370j7485J9045J71194J9775j06252k56739J48048J65602k72314P7816
$$ 870370 852885 871930 1043124 1062899 956647 699908 847956 1013558 741244 819060
7058H19060R4122J69022k52195R284k629O3495K94158q6174j64166L6280K8703
$$ 819060 913182 1082204 830009 839293 836664 900159 1194317 1108143 943977 980257 1008960
7047A008960j2784k27084l5800J05807L58472j37744k45650n8986J20229J39462
$$ 1008960 996176 769092 733292 839099 1197571 1059827 814177 755191 875420 1014882
7037A014882p8526P8265j58714Q338J44378o0186M5966j52650L2124K26798j88334
$$ 1014882 936356 1014621 855907 864245 1008623 948437 994403 841753 873877 1100675 912341
7026I12341o5390P2600O836p2243L3658j63839L4130J12141j44606K2273M2942
$$ 912341 846951 919551 926387 854144 887802 723963 758093 870234 725628 747901 790843
7015G90843q3791k1846k2936K32633q6386p4363J02801j4654m8997J31292j7332
$$ 790843 707052 685206 662270 894903 808517 734154 836955 822301 773304 904596 887264
7004H87264k50189K28370J97755k11627k05149r4967Q7643J55118m4503m08598
$$ 887264 637075 865445 1063200 851573 646424 551457 639100 794218 749715 341117
6994C41117M5647K4021K71765L85461l04580p9016K11074L2852o4265j59679j10190
$$ 341117 386764 410785 682550 1068011 763431 684415 895489 928341 864076 704397 594207
6983E94207M304J60470J07161j47320l5592M7863J35000p8021M9861j67459k24379
$$ 594207 598511 758981 866142 718822 683230 731093 866093 788072 837933 670474 446095
6972D46095j1125Q7225K58792q9333q7883J08291k3697k04479o73J3999K01035
$$ 446095 434970 522195 780987 691654 603771 712062 688365 483886 483213 497212 698247
6961F98247J00273j16676j03281l3567M1122J28633j12036K02834l7953o9689
$$ 698247 798520 681844 578563 544996 586118 714751 602715 805549 767596 697907
6951F97907o9204K8063L7805q7329J5499P1710L6978k39847k83595p8123J54213
$$ 697907 628703 656766 694571 607242 622741 694451 731429 491582 207987 129864 284077
6940B84077M03919L47265k65836q813j44570j27659N5463N7165J00349M844K6664
$$ 284077 687996 1035261 769425 760612 616042 488383 543846 601011 701360 706204 732868
6929G32868J48453j89514k75083J7074j7841N9340l4037N4832k8188P6693K23182
$$ 732868 881321 691807 416724 433798 415957 475297 441260 496092 467904 544597 767779
6918G67779j59365K3914K2330P207p718J97055q9579l50065N4711j16675q5128
$$ 767779 608414 632328 654658 661865 654147 851202 761623 411558 466269 349594 264466
6907B64466L82610J45822j02391J58528Q4744m07227M9200l4440K33270o1105
$$ 264466 647076 792898 690507 849035 933779 526552 575752 541312 774582 713477
6897G13477k9217P0326j50801k07062j5503J00222Q7380J76242j5664l00816M9089
$$ 713477 684260 754586 603785 396723 381220 481442 568822 745064 729400 428584 477673
6886D77673J73011l03322j07377J03823q9460O2077K6252p606l8508l9844J12245
$$ 477673 650684 347362 239985 343808 254348 316425 342677 335071 296563 256719 368964
6875C68964K9597J42376J45768j85330o0200R1665j22735K04197K8948O0936L1749
$$ 368964 398561 540937 686705 501375 441175 532840 410105 614302 643250 704186 735935
6864G35935M3820j62460j05906k21328j17082J31670J5759P3237K72510P8086
$$ 735935 779755 617295 511389 290061 172979 304649 320408 393645 666155 744241
6854G44241M0717l8788j5169n2283J36062K657j95687J30915j96921j46429K77661
$$ 744241 784958 746170 731001 678718 814780 817437 621750 752665 555744 409315 686976
6843F86976m3844j19605j01902J48447j98249j23725J87818r3378k6032P868j00010
$$ 686976 643132 523527 421625 570072 371823 248098 435916 342538 316506 324374 224364
6832B24364j65243K91686J17700k79176J04433J64962m4371k13142q8619q8844
$$ 224364 59121 350807 468507 189331 293764 458726 414355 201213 112594 23750
6822B3750M58136R4689j23956k01237L5617L0371J3742R66j20275J00535n1356
$$ 23750 481886 576575 452619 251382 286999 317370 331112 332078 211803 312338 260982
6811B60982L17040j40911o8366j66535O4932J80692k2150k9787n6400J23005l7388
$$ 260982 578022 437111 368745 202210 267142 447834 425684 395897 339497 462502 425114
6800D25114m1493j04580J06239r4215J37169K06114m5891l79433k40392K37495
$$ 425114 383621 279041 385280 291065 428234 634348 588457 209024 -31368 206127
6790B06127K4161l835M614J02432K791j32519R7471j7461p3974J05124N104J42877
$$ 206127 230288 226453 231067 333499 336290 203771 301242 283781 209807 314931 320035 462912
6778D62912L494K8067j08953l19422q9050M27208N542J10547k714q0199N1958
$$ 462912 466406 494473 385520 66098 -22952 404256 409798 520345 517631 437432 489390
6767D89390k6669q3575J73511k62134J10452n2590k6992N7469Q9074q9244j7170
$$ 489390 462721 379146 552657 290523 400975 348385 321393 378862 467936 378692 361522
6756C61522J07827R2493j3873j77374j07970o1830j69620K10430L3063j12730
$$ 361522 469349 561842 547969 370595 262625 200795 31175 241605 274668 161938
6746A61938J32079O8540K1869m1905K50987p2773J02154l04574J12110J17054
$$ 161938 294017 362557 384426 342521 593508 520735 622889 318315 430425 547479
6736E47479L0924j45735n2808O1647O9266p5485j86867j17658L47838R4469K8880
$$ 547479 578403 432668 379860 441507 510773 435288 248421 130763 478601 573070 601950
6725F01950J7429l139m5318j11428k5814m0064k8911n8319J11542q8638m1725
$$ 601950 619379 616240 570922 459494 433680 393616 364705 306386 417928 329290 287565
6714B87565o8172K2690o249J01763k9267J62119j41318J40553M046j33210Q3570
$$ 287565 219393 242083 235834 337597 308330 470449 329131 469684 473730 340520 424090
6703D24090J70763P4975k32511Q0547L2318K67219j64597k2947j40033K1475R6376
$$ 424090 594853 669828 437317 517864 550182 817401 652804 629857 489824 511299 607675
6692F07675m8892L3348q6374K0904j37242n1060Q851j91671L74863K31006j6047
$$ 607675 558783 592131 505757 526661 389419 338359 347210 155539 530402 761408 745361
6681G45361j05590q9636j61733r183J18618R1718R083j08736O9162J34469j33109
$$ 745361 639771 550135 388402 379219 497837 589555 598638 489902 559064 693533 560424
6670E60424K8697J18774j08663J73611j47544J35585p2314j25917K69623j347
$$ 560424 589121 707895 599232 772843 625299 760884 688570 562653 832276 830929
6660H30929m2642j40316q003R875j10329K01429M3156k05053l395K9678k52172
$$ 830929 788287 647971 639968 649843 539514 740943 784099 579046 575651 605329 353157
6649C53157p3855J26904l5504L8315K56445J29918o6421j556K2052L5310j10266
$$ 353157 279302 406206 370702 409017 665462 795380 728959 727403 749455 784765 674499
6638F74499l5974o0399M3430p0979j88926J70081J58778k2144r6472k7207K13376
$$ 674499 638525 578126 621556 550577 361651 531732 690510 668366 571894 544687 758063
6627G58063p7708k70487K7543J42553O2122p3385j18859j13881J46983o2737l3723
$$ 758063 680355 409868 437411 579964 642086 568701 449842 335961 482944 420207 386484
6616C86484J43310J25926R0263m72j68119r3577l6954J68812L94138p5178l5064
$$ 386484 529794 655720 745983 745511 577392 483815 446861 615673 1009811 934633 899569
6605H99569j93248k35771j90394N4893Q0635J45253j83855l019O6585j77632L9037
$$ 899569 706321 470550 280156 335049 415684 560937 377082 374063 440648 263016 302053
6594C02053R1862L65050m1957k59578R623K32927o4510q8776J52309k99829k47
$$ 302053 393915 758965 717008 457430 467053 699980 635470 546694 699003 399174 398927
6583C98927K97873k56908k2091J9821j21017k9380K32117M5734J54444q5124r9830
$$ 398927 696800 439892 417801 437622 316605 287225 519342 565076 719520 634396 534566
6572E34566L03829q3539q3945K41811m00014L4482p8211P0599J34708j23369J04339
$$ 534566 838395 754856 670911 912722 512708 547190 468979 539578 674286 550917 655256
6561F55256K65600k64563o2938J3409K16383m3388m04940J8905K64475J48238
$$ 655256 920856 656293 593355 606764 823147 779759 374819 393724 658199 806437
6551H06437j82038N5944L9711k94433j30178J10671j10125J40951J90232L7526
$$ 806437 624399 680343 720054 425621 295443 406114 295989 436940 627172 664698
6541F64698j19026j11888J40181L8090L665l6435K4731L84816j08451l25806O3826
$$ 664698 545672 433784 573965 612055 615720 579285 604016 988832 880381 554575 618401
6530F18401j3048r8013P608O6964O5193J07215Q0237j14344l8888q6025N78J55450
$$ 618401 605353 507340 514948 581912 647105 754320 834557 720213 681325 595300 595878 751328
6518G51328K45949j17657j03698j14428Q6684O2778L5534p9J30033m758J54332
$$ 751328 997277 879620 775922 661494 748178 810956 846490 846411 976444 971686 1126018
6507A126018j32940l35219j91982O7608Q983N3114J02579Q768j19447j51753J27876
$$ 1126018 993078 657859 465877 533485 542468 595582 698161 706929 587482 435729 563605
6496E63605O3369J519o3161K9245K49796J30673k17090k04405J47701M6104j75119
$$ 563605 626974 628493 565332 594577 844373 975046 757956 553551 701252 747356 572237
6485E72237m0203J58278o2301P5897k40049l4869L70231r6829q126r4131j29045
$$ 572237 532034 690312 628011 703908 463859 428990 799221 702392 694266 600135 471090
6474D71090J79389L9300J92196r9555j54160L70082j37148J75016j6370j32146
$$ 471090 650479 689779 881975 782420 628260 998342 861194 1036210 1019840 887694
6464H87694J05142j16110R819P4860J76943n4612J74845M372j7846K3915q9133
$$ 887694 992836 876726 886545 961405 1138348 1083736 1258581 1262953 1245107 1269022 1179889
6453A179889q5700J21824m7621j06027o1461j6724K2551j75192J83249O883j80094
$$ 1179889 1094189 1216013 1168392 1062365 1000904 984180 1006731 831539 1014788 1021671 841577
6442H41577m1139J45087K57893L5666k79711P5112O0588J55954O9831j81531J2573
$$ 841577 800438 945525 1203418 1239084 959373 1034485 1095073 1251027 1320858 1139327 1151900
6431A151900K6675o5458J63536K80686k23810l61226j93229R0697K90323j9837
$$ 1151900 1178575 1113117 1276653 1557339 1333529 972303 779074 869771 1160094 1140257
6421A140257K10603j11847j18578J08532j81385M6687P7686n5524p4449L5361
$$ 1140257 1350860 1239013 1120435 1228967 1047582 1094269 1171955 1116431 1041982 1077343
6411A077343j76091J94955L06885q4371k08511j425K48578j00266j15500n1540
$$ 1077343 901252 1096207 1403092 1318721 1110210 1108785 1357363 1257097 1141597 1090057
6401A090057l1923j10796J65674J54500K216J97860j10624k85781p7363J95263
$$ 1090057 1058134 947338 1113012 1267512 1269728 1467588 1356964 1071183 993820 1189083
6391A189083J77785r0294J13230m37170N8965J52986Q5649J32079J86q4302P7229
$$ 1189083 1366868 1276574 1389804 952634 1011599 1164585 1250234 1382313 1382499 1298197 1375426
6380A375426j27890r9578J88378K46363j63143j94756R6846n2684J18175o6845
$$ 1375426 1247536 1147958 1336336 1582699 1419556 1224800 1321646 1268962 1387137 1320292
6370A320292J45918J33674Q0309n1649J0590N3802j17479j80346Q2576l8226k19591
$$ 1320292 1466210 1599884 1680193 1628544 1639134 1692936 1575457 1395111 1477687 1439461 1219870
6359A219870J1909J17982K84048m1898p9242J86483J54273M7292k21416l6862
$$ 1219870 1231779 1349761 1633809 1591911 1512669 1699152 1853425 1900717 1679301 1642439
6349A642439L9628P607p7078J72371K04836j91478Q0208k2124r9762J7589p8202
$$ 1642439 1682067 1689674 1612596 1784967 1989803 1798325 1878533 1856409 1756647 1774236 1696034
6338A696034J11232l798O7888j0260K0742R0328K15479l06646L1724M9583O7392
$$ 1696034 1807266 1803468 1871356 1861096 1881838 1972166 2187645 1880999 1912723 1962306 2029698
6327B029698J63398k16707J50360J80432J6746J45349K32349l12495n6258K0336
$$ 2029698 2193096 1976389 2126749 2307181 2323927 2469276 2701625 2389130 2332872 2353208
6317B353208l221O6414K4141n4528J58132L64533q1972n1034J01714k00997J59581
$$ 2353208 2349987 2416401 2440542 2386014 2544146 2908679 2826707 2775673 2877387 2676390 2835971
6306B835971J72017J41361l07363J01056L08157N345Q8185q9279K87841J01006
$$ 2835971 3007988 3149349 2841986 2943042 3251199 3256544 3344729 3255450 3543291 3644297
6296C644297j22391J45048R9622n1477J14554K57309k9733M3503N6947j40947
$$ 3644297 3521906 3666954 3766576 3715099 3829653 4086962 4057229 4100732 4157679 4016732
6286D016732J67286K26280Q3014K07733P4804p1937K68218K48686p356N2647L65313
$$ 4016732 4184018 4410298 4493312 4701045 4775849 4703912 4972130 5220816 5213460 5266107 5631420
6275E631420L23877j47414R344K31230J67614M19031M22146K61710K45788N12888
$$ 5631420 5955297 5807883 5817227 6048457 6216071 6635102 7057248 7318958 7564746 8077634
6265H077634J00176K55538M11445L86400K38800K89195K46693N77274K92752K55349
$$ 8077634 8177810 8433348 8844793 9231193 9469993 9759188 10005881 10583155 10875907 11131256
6255A1131256M5131K53967L76404K51726N62552M27477k8991K13837M03537M45617
$$ 11131256 11176387 11430354 11806758 12058484 12621036 13048513 13019522 13233359 13636896 14082513
6245A4082513M45816J43568L26172J37857J14553L38321J80293L64622N4742k52229
$$ 14082513 14528329 14671897 14998069 15135926 15250479 15588800 15769093 16133715 16188457 15936228
6235A5936228Q1950K20219j34761o1109K07565q5506o0221M700J6780R9801m9051
$$ 15936228 16018178 16238397 16103636 16042527 16250092 16164586 16104365 16109065 16125845 16225646 16176595
6224A6176595l18174J05460j52860j70416k80048k28781J0566j95138P4506R187
$$ 16176595 15858421 15963881 15811021 15640605 15360557 15131776 15142342 14947204 15021710 15030897
6214A5030897j3616j79895n32514j60616p0610k38423l218L8209M7587n0853J40722
$$ 15030897 15017281 14837386 14304872 14144256 14073646 13835223 13832005 13870214 13917801 13866948 14007670
6203A4007670J36696j62639L18727N48867J11257l1435L68558L41404N85223L80193
$$ 14007670 14144366 13981727 14300454 14849321 14960578 14929143 15297701 15639105 16224328 16604521
6193A6604521J81425N25818M73024K56717N44706J12907L46238L34725J93178
$$ 16604521 16785946 17311764 17784788 18041505 18586211 18699118 19045356 19380081 19573259
6184A9573259M79732J03749K59117M79146O03144M42508O3367L05690K00802R9851
$$ 19573259 20052991 20156740 20415857 20895003 21498147 21940655 22004022 22309712 22510514 22610365
6174B2610365K78158M03867m6252n027L3856n940j88691j57194k35808m94707
$$ 22610365 22888523 23292390 23246138 23241111 23274967 23269027 23080336 22923142 22687334 22192627
6164B2192627l80183q2227p3269k48778m49206k94125p6854m43990n76593l09701
$$ 22192627 21812444 21730217 21656948 21408170 20958964 20664839 20587985 20143995 19567402 19257701
6154A9257701m51233p92769m19469k96815l89408o28133k59793n47454n81631
$$ 19257701 18806468 18013699 17594230 17297415 16908007 16279874 16020081 15472627 14890996
6145A4890996m88718m70133n70135m60076l75791m82254l40973j69993j83382
$$ 14890996 14402278 13932145 13362010 12901934 12526143 12043889 11702916 11532923 11349541
6136A1349541k92916m19610j77907j9716m03106l89279l53538k87109l22040M2356
$$ 11349541 11056625 10637015 10459108 10439392 10036286 9647007 9293469 9006360 8684320 8726676
6126H726676k5374J01759k03187r2893o2268J75747R3122l12968q9303J23535
$$ 8726676 8701302 8803061 8599874 8506981 8444713 8620460 8713582 8400614 8311311 8434846
6116H434846J2745K45570j25226P163J56931j7336K93037K01865j49945j20752
$$ 8434846 8447591 8693161 8567935 8575098 8732029 8714693 9007730 9209595 9059650 8938898
6106H938898M43072J93528O6567p6112j67983K10726L13219M40276K85268L75781
$$ 8938898 9381970 9575498 9642065 9565953 9397970 9608696 9921915 10362191 10647459 11023240
6096A1023240K20049J71489K23671K54409M28392M48293N65J28273M25269K90872
$$ 11023240 11243289 11414778 11638449 11892858 12321250 12769543 12770108 12898381 13323650 13614522
6086A3614522M90681J32522L63304R6790K87328J32108j4490q5155N6568r6833
$$ 13614522 14105203 14237725 14601029 14697819 14985147 15117255 15102765 15017610 15074178 14977345
6076A4977345J4970j48526r109N2939K05102P1028n4815K30938Q7270P5073J05875
$$ 14977345 14992315 14843789 14834680 14887619 15092721 15163749 15108934 15339872 15427142 15502215 15608090
6065A5608090L47313J64435l6216L51586J37541O9294P7255P2160J04896O9l55020
$$ 15608090 15955403 16119838 16083622 16435208 16572749 16642043 16719298 16791458 16896354 16896423 16541403
6054A6541403J07343l18146m22400m1924k60142j16008j06642k66534J89367j32947
$$ 16541403 16648746 16330600 15908200 15866276 15606134 15490126 15383484 15116950 15306317 15173370
6044A5173370k16178j15993J18361M69046K8598L02925K48577M54990N97893M7185
$$ 15173370 14957192 14841199 14959560 15428606 15457204 15760129 16008706 16463696 17061589 17108774
6034A7108774J63214K98819N78473M29120L51817L46650M73096M88845M93821
$$ 17108774 17271988 17570807 18149280 18578400 18930217 19276867 19749963 20238808 20732629
6025B0732629N44345j72776j16693L54972M57425L52728J03645J2799L6577R6296
$$ 20732629 21276974 21104198 20987505 21342477 21799902 22152630 22256275 22269074 22305651 22401947
6015B2401947J67313K35412M86297J18190J46426P3929O74n5578K84064K98333
$$ 22401947 22569260 22804672 23290969 23409159 23555585 23629514 23630188 23574610 23858674 24157007
6005B4157007l8732K7903J91588J84736J2321k02486l1567r0069r5562L4139n5592
$$ 24157007 24118275 24146178 24337766 24522502 24534823 24332337 24300770 24210701 24115139 24149278 24093686
5994B4093686j48552p439j75356J2759J48958J30153L1162N1615k2211J28204
$$ 24093686 23945134 23937695 23762339 23775098 23924056 24054209 24085371 24136986 24114775 24242979
5984B4242979n8498K52011J21130K95781L57743J50516J25144K20459J04393K13960
$$ 24242979 24184481 24436492 24557622 24853403 25211146 25361662 25486806 25707265 25811658 26025618
5974B6025618J33261J73276K65194j20011J20861J42877l30449K54205K47179
$$ 26025618 26158879 26332155 26597349 26477338 26598199 26741076 26410627 26664832 26912011
5965B6912011j01324j42645l1684J98725J29195j9579J56706K7293R0491L02354
$$ 26912011 26810687 26668042 26636358 26835083 26964278 26944699 27101405 27128698 27219189 27521543
5955B7521543R8786M89050j5239K56070M85356N9492K41151N88428M41845L10967
$$ 27521543 27620329 28109379 28094140 28350210 28835566 28895058 29136209 29724637 30166482 30477449
5945C0477449L60918R4093K9214q5701J93676K71902o7784J30060k3205l5124
$$ 30477449 30838367 30932460 30961674 30875973 31069649 31341551 31273767 31403827 31380622 31345498
5935C1345498j99168L0685j71624l34830J06668k03924j40480J85306N0860j88307
$$ 31345498 31146330 31177015 31005391 30670561 30777229 30573305 30432825 30618131 30668991 30480684
5925C0480684J38289L6849N0273J92305J68204J88295L8828J35445N18057M96105
$$ 30480684 30618973 30655822 30706095 30898400 31066604 31254899 31293727 31429172 31947229 32443334
5915C2443334K41508N13149N08696K72978K18148J80064l7020N49012O02436L16419
$$ 32443334 32684842 33197991 33706687 33979665 34197813 34377877 34340857 34889869 35492305 35808724
5905C5808724J56784M2054L68678K8447n6968K18525p1163J72461j58627J9113
$$ 35808724 35965508 36007562 36376240 36404687 36347719 36566244 36495081 36667542 36508915 36528028
5895C6528028r2101k9538n4507m8049j211j70805k15593K55465J80935k30020
$$ 36528028 36435927 36406389 36351882 36303833 36302622 36131817 35916224 36171689 36352624 36122604
5885C6122604j31675L36823K45380j17023J64893J75356K42915N7638J67105Q3718
$$ 36122604 35990929 36327752 36573132 36456109 36621002 36796358 37039273 37096911 37264016 37347734
5875C7347734j03984Q5612L65573L23226M0093J15546J41549r038J32003J11611
$$ 37347734 37243750 37329362 37694935 38018161 38058254 38173800 38315349 38306311 38438314 38549925
5865C8549925M19047K79315J93776L07369J03026L2933L17920J70071k61361J59121
$$ 38549925 38968972 39248287 39442063 39749432 39852458 39885391 40203311 40373382 40112021 40271142
5855D0271142J72960j94629j20904k50833l10562n05916n53880m90435o50733
$$ 40271142 40444102 40249473 40128569 39877736 39567174 39061258 38507378 38016943 37366210
5846C7366210o40275q44341j012947j076298r82010j295860r41898j086647j139741
$$ 37366210 36725935 35881594 34868647 33792349 32810339 31514479 30572581 29485934 28346193
5837B8346193r82343r91181r30831q39590j003047q55052p07302o63966m13965
$$ 28346193 27363850 26372669 25441838 24602248 23599201 22744149 22036847 21372881 20958916
5828B0958916l05181o54222m60066l63003m22092m84413k57773o374l69111k79775
$$ 20958916 20653735 19999513 19539447 19176444 18754352 18269939 18012166 18005792 17636681 17356906
5818A7356906n9795m263P8818K3490m25684J542k3963o2914m8941k29895o4041
$$ 17356906 17297111 17292848 17371666 17395156 16969472 16971014 16947051 16884137 16835196 16605301 16541260
5807A6541260K0000M7140k08527k97140O4649J38567R4205q7791J47478J33100
$$ 16541260 16561260 16608400 16399873 16102733 16167382 16305949 16400154 16312363 16459841 16592941
5797A6592941J27552J24829k1313M5853K27436K32296K37665P0964J43689k11065
$$ 16592941 16720493 16845322 16824009 16869862 17097298 17329594 17567259 17638223 17781912 17570847
5787A7570847j19125n6438m76389o05929k22075l53946l68066m90803n86416o30598
$$ 17570847 17451722 17395284 16918895 16312966 16090891 15736945 15368879 14878076 14291660 13661062
5777A3661062l81911l36364k84568l25521k76656l28719m35503j69076Q0544j75806
$$ 13661062 13279151 12942787 12658219 12332698 12056042 11727323 11291820 11122744 11203288 11027482
5767A1027482k08458L5964J7878k58741j5534q5759k68279P0225L3896P5969K69359
$$ 11027482 10819024 10854988 10872866 10614125 10598591 10512832 10244553 10314778 10348674 10424643 10694002
5756A0694002Q571j47906J83172q0788M0037q4306k23503j59737l96312j65774
$$ 10694002 10702573 10554667 10737839 10657051 10697088 10612782 10389279 10229542 9833230 9667456
5746I667456j85713l17044k34556j96039j61571l93751k97611l85270l81797k33236
$$ 9667456 9481743 9164699 8930143 8734104 8572533 8178782 7881171 7495901 7114104 6880868
5736F880868r0953j57486k59275k34735j40249k11276J9389L2246n4490k27061
$$ 6880868 6789915 6632429 6373154 6138419 5998170 5786894 5806283 5838529 5784039 5556978
5726E556978j71710k24409n8966k18533k2696N7845O5274j06804k04996j84465
$$ 5556978 5385268 5160859 5101893 4883360 4860664 4918509 4983783 4876979 4671983 4487518
5716D487518Q8510J18235K6574k71820k03026J703k67612J04314M1834j8516K90048
$$ 4487518 4576028 4694263 4720837 4449017 4245991 4247694 3980082 4084396 4126230 4107714 4397762
5705D397762j64061k2277j17734J764j03247k7483M565k290P0210j53013K20674
$$ 4397762 4233701 4211424 4093690 4095454 3992207 3964724 3969289 3966999 4037209 3884196 4104870
5694D104870m875k98789k00345k3680m0626K86191o4182P3677j90161p2802J40726
$$ 4104870 4099995 3801206 3600861 3577181 3536555 3822746 3758564 3832241 3642080 3569278 3710004
5683C710004Q4806j04177J19228k67965p1962P4416K5310l2217j12485J82624
$$ 3710004 3794810 3690633 3809861 3541896 3469934 3544350 3569660 3537443 3424958 3607582
5673C607582j967l2903j17359k3475K99k02570R5373L55278p6070p2766l1683
$$ 3607582 3605615 3572712 3455353 3431878 3432177 3229607 3324980 3680258 3604188 3531422 3499739
5662C499739R3624J18481j19468n0667j02224J36493m0699n4261R8654o8325J6995
$$ 3499739 3593363 3711844 3592376 3541709 3439485 3575978 3535279 3481018 3579672 3511347 3528342
5651C528342j37642J94019j2852J3418m3480N0057n4525J8807j59282J02131N6539
$$ 3528342 3390700 3584719 3571867 3585285 3541805 3591862 3537337 3556144 3396862 3498993 3555532
5640C555532M14949J60520m87948n2889k4876j33890K2699L28001j40782P8512
$$ 3555532 3970481 4131001 3643053 3590164 3565288 3431398 3454097 3782098 3641316 3719828
5630C719828j75377j67490j50388K00168K77816O514m7042L5352J05313J8419
$$ 3719828 3544451 3376961 3226573 3426741 3704557 3711071 3664029 3699381 3804694 3823113
5620C823113J05751J28971k01465j33987J89552O7463j07325K05335P0464N8426
$$ 3823113 3928864 4057835 3856370 3722383 3911935 3979398 3872073 4077408 4147872 4206298
5610D206298j04340m0397K62971k63061O2967o0471J25424J11864J99967J34895
$$ 4206298 4101958 4061561 4324532 4061471 4124438 4063967 4189391 4301255 4501222 4636117
5600D636117L0548j22366l1438l2338J16252J67997j00063m3279P6184J9177J59568
$$ 4636117 4666665 4544299 4512861 4480523 4596775 4764772 4664709 4621430 4697614 4716791 4876359
5589D876359N3827q9154R5413L7594j29204j92787K17856J12347J54763J08234
$$ 4876359 4930186 4841032 4936445 4974039 4844835 4652048 4869904 4982251 5137014 5245248
5579E245248j98232J16858J88408k9869O6361O2861J30865q1872k923P6397R3078
$$ 5245248 5047016 5163874 5352282 5322413 5388774 5451635 5582500 5500628 5497705 5574102 5667180
5568E667180m1534P1381K20803J92711K6705R6885N0840R231R575J05308K01599
$$ 5667180 5625646 5697027 5917830 6110541 6137246 6234131 6284971 6294202 6303777 6409085 6610684
5557F610684J67585P2313K07522K63031K75282K32872M8718j1598j14940K20328
$$ 6610684 6778269 6850582 7058104 7321135 7596417 7829289 7878007 7866409 7751469 7971797
5547G971797M06701R1143o4673N54705M4229J7910K03625K01550L07739l0855
$$ 7971797 8378498 8469641 8404968 8959673 9003902 9021812 9225437 9426987 9734726 9703871
5537I703871K89403J29148J04341L00101R091J96645R9440K47731N15635L5901
$$ 9703871 9993274 10122422 10226763 10526864 10535955 10732600 10832040 11079771 11595406 11631307
5527A1631307M2617M41621M49588Q8773K37884J23685J98351M08067K21695J55513
$$ 11631307 11673924 12115545 12565133 12653906 12891790 13015475 13213826 13621893 13843588 13999101
5517A3999101N20720K04992j12607N53111K67042J81609L57393K37900R5303K46414
$$ 13999101 14519821 14724813 14612206 15165317 15432359 15613968 15971361 16209261 16304564 16550978
5507A6550978K92953K29869K71800O3737J05303J25893q3362J29305M69279L64373
$$ 16550978 16843931 17073800 17345600 17409337 17514640 17640533 17557171 17686476 18155755 18520128
5497A8520128N65513p7246j465L29490J23381j1874r8910L17220K94838j3453
$$ 18520128 19085641 19008395 19006930 19336420 19459801 19447927 19349017 19666237 19961075 19947622
5487A9947622K0632J14485l6899K8854J83976Q7279K03724K47468K65744K83649
$$ 19947622 19968254 20082739 20045840 20074694 20258670 20345949 20549673 20797141 21062885 21346534
5477B1346534K81955R8264K4879L11107J63467J36747K41462J46386J50191R9031
$$ 21346534 21628489 21726753 21751632 22062739 22226206 22362953 22604415 22750801 22900992 23000023
5467B3000023K91459R2291K44168r162r2928O9090K05769j970Q0294j32926J63181
$$ 23000023 23291482 23383773 23627941 23618779 23525851 23594941 23800710 23798740 23879034 23746108 23909289
5456B3909289J47718j39936K51547k43190J74066N5587Q4863k89605L5871J37458
$$ 23909289 24057007 23917071 24168618 23925428 24099494 24155081 24239944 23950339 23986210 24123668
5446B4123668J29123k35315O1539J55178l45598l1701j92534n6265l02088m9124
$$ 24123668 24252791 24017476 24079015 24234193 23888595 23856894 23664360 23608095 23306007 23256883
5436B3256883k92598l87186l41399r7471k0486n22922r9410j93017k12145k34392
$$ 23256883 22964285 22577099 22235700 22138229 22117743 21594821 21495411 21302394 21090249 20855857
5426B0855857j89582l06113l00184j47480n6246m9870m7561k10491j76683j30367
$$ 20855857 20666275 20360162 20059978 19912498 19856252 19806382 19758821 19548330 19371647 19241280
5416A9241280j32080j36044J90827q0759l23108j61560j74732l26392m5058N6481
$$ 19241280 19109200 18973156 19163983 19083224 18760116 18598556 18423824 18097432 18052374 18108855
5406A8108855K5006R081j55216L1125n4070j78603n00K1611j52518k16277m6591
$$ 18108855 18133861 18142942 17987726 18018851 17964781 17786178 17785678 17807289 17654771 17438494 17391903
5395A7391903r3098l3987K30084p4373q8549K66331j28262q4065O0382m1167L65426
$$ 17391903 17298805 17264818 17494902 17420529 17331980 17598311 17470049 17385984 17446366 17405199 17770625
5384A7770625P700K34113k2308J9091K6930K7943J91052O4700O6607J10343P5189
$$ 17770625 17778325 18012438 17990130 18009221 18036151 18064094 18255146 18319846 18386453 18496796 18571985
5373A8571985K19084n9901J65858O1142N5336K05824j87039k15136N15449L8275
$$ 18571985 18791069 18731168 18897026 18958168 19013504 19219328 19032289 18817153 19332602 19370877
5363A9370877m1252L19840p7091K00736J9956K32852J52991J41632L33367N57698
$$ 19370877 19329625 19649465 19572374 19773110 19793066 20025918 20178909 20320541 20653908 21211606
5353B1211606K35666K82711K1860Q3305O68763L23754n7265R4785N41433M17088
$$ 21211606 21447272 21729983 21751843 21835148 22503911 22827665 22770400 22865185 23406618 23823706
5343B3823706L44980K17292N70912N07333K24565M24598K27279N84849O27474
$$ 23823706 24168686 24385978 24956890 25464223 25688788 26113386 26340665 26925514 27552988
5334B7552988K99702L45303N13891K42268M57931O65036O35256N99592M67078
$$ 27552988 27852690 28197993 28711884 28954152 29412083 30077119 30712375 31311967 31779045
5325C1779045M48790M08300L46300P35669N46424N49148Q93129O09016O73290
$$ 31779045 32227835 32636135 32982435 33718104 34264528 34813676 35706805 36315821 36989111
5316C6989111O97366Q50245N91000O98138J008239J006740O05888P10113Q12218
$$ 36989111 37686477 38536722 39127722 39825860 40834099 41840839 42446727 43156840 43969058
5307D3969058P92439J080909O47903P52534J113314J182397J160580J283215J008672
$$ 43969058 44761497 45842406 46490309 47242843 48356157 49538554 50699134 51982349 52991021
5298E2991021J217034J360153R00445J213087J463630J300633J464150J397545
$$ 52991021 54208055 55568208 56468653 57681740 59145370 60446003 61910153 63307698
5290F3307698J676077J523113J471733J637158J467236J699210J894820J944497
$$ 63307698 64983775 66506888 67978621 69615779 71083015 72782225 74677045 76621542
5282G6621542J775267J905454J797402K167752K075245K390940K010331K163219
$$ 76621542 78396809 80302263 82099665 84267417 86342662 88733602 90743933 92907152
5274I2907152K583454K531654K591416K779183K585467L045914K780563L154029
$$ 92907152 95490606 98022260 100613676 103392859 105978326 109024240 111804803 114958832
5266A14958832L185974K843175L272593L719525L710465L860610L945815M092112
$$ 114958832 118144806 120987981 124260574 127980099 131690564 135551174 139496989 143589101
5258A43589101M232890M145333M582749M791693N092158M735285N298757N287384
$$ 143589101 147821991 151967324 156550073 161341766 166433924 171169209 176467966 181755350
5250A81755350N754588N857484N735631O225799O452050O496589O260721O531115
$$ 181755350 187509938 193367422 199103053 205328852 211780902 218277491 224538212 231069327
5242B31069327O789090O674835O507486O291146O437024O057397N693626N593669
$$ 231069327 237858417 244533252 251040738 257331884 263768908 269826305 275519931 281113600
5234B81113600M891484M253058L967462L135820K530410J825677P24982m44179
$$ 281113600 286005084 290258142 294225604 297361424 299891834 301717511 302442493 301998314
5226C01998314j398596k185562l091732m045383m366121n185460n623222o143228
$$ 301998314 300599718 298414156 295322424 291277041 286910920 281725460 276102238 269959010
5218B69959010o097142o504950p087102p095643o817929o746151p103265p168971
$$ 269959010 263861868 257356918 250269816 243174173 236356244 229610093 222506828 215337857
5210B15337857o560925o751997o608747o085906o053967n822687n655677n600898
$$ 215337857 208776932 202024935 195416188 189330282 183276315 177453628 171797951 166197053
5202A66197053n133756m810594m703395m352968m189483l827860m200206m065939
$$ 166197053 161063297 156252703 151549308 147196340 143006857 139178997 134978791 130912852
5194A30912852l931775l888823l615355l712609l448786l245445l169419k759459
$$ 130912852 126981077 123092254 119476899 115764290 112315504 109070059 105900640 103141181
5186A03141181k884111k806875k500977k445231k433588k289461k167638j985027
$$ 103141181 100257070 97450195 94949218 92503987 90070399 87780938 85613300 83628273
5178H3628273j826874k253069j737525j521931j601932j762413j595471j323201
$$ 83628273 81801399 79548330 77810805 76288874 74686942 72924529 71329058 70005857
5170G0005857j569814j310223j375998j508867j251730p05115j073741j392475
$$ 70005857 68436043 67125820 65749822 64240955 62989225 62284110 61210369 59817894
5162E9817894j732012j302725j249610r95538r42162r69504j296713j089249p13646
$$ 59817894 58085882 56783157 55533547 54538009 53595847 52626343 51329630 50240381 49526735
5153D9526735j182045r64135q84331j168486j127613o88580q33738q65855q05089
$$ 49526735 48344690 47380555 46496224 45327738 44200125 43511545 42677807 41811952 41006863
5144D1006863j023109o78532n36223p67800q61259q99692n37205l23219n76309
$$ 41006863 39983754 39305222 38768999 38001199 37139940 36240248 35703043 35379824 34803515
5135C4803515n30697o08149o17562m54253n90149o29077q19986l67935m23861
$$ 34803515 34272818 33664669 33047107 32592854 32002705 31373628 30553642 30185707 29761846
5126B9761846k29125k07915l97076p47629o62930j81288j54930k65111k58600
$$ 29761846 29532721 29324806 28927730 28180101 27517171 27335883 27180953 26915842 26657242
5117B6657242l18802j95556j4847k72966j70073k38974l53587j07825J04612j74274
$$ 26657242 26338440 26142884 26128037 25855071 25684998 25446024 25092437 24984612 25089224 24914950
5107B4914950j2029q5924j19672K57528K70508r5833j58264p2012J77921l1839
$$ 24914950 24902921 24816997 24697325 24954853 25225361 25129528 24971264 24899252 25077173 25045334
5097B5045334o1886r5591K64255K80204R2374R3878j03203o098K049J77960n6050
$$ 25045334 24983448 24887857 25152112 25432316 25524690 25618568 25515365 25509267 25511316 25689276 25633226
5086B5633226k0016J96785N952K58309k09018k6032K78588N5591j14909L75199
$$ 25633226 25613210 25809995 25815947 26074256 25865238 25839206 26117794 26173385 26058476 26433675
5076B6433675K06521k2338P2807M00993K01718M3383M33438L29717J15988L41301
$$ 26433675 26640196 26617858 26690665 27091658 27293376 27336759 27770197 28099914 28215902 28557203
5066B8557203M24804J25698J96883M19733L34136O77935M57783K42001M92713
$$ 28557203 28982007 29107705 29304588 29724321 30058457 30736392 31194175 31436176 31928889
5057C1928889L82766N34572N30442L46820N84556O69167L90730O66179L99825
$$ 31928889 32311655 32846227 33376669 33723489 34308045 34977212 35367942 36034121 36433946
5048C6433946P11960O43633K33380N18494M47590J69418M23524M22643O01048
$$ 36433946 37145906 37789539 38022919 38541413 38989003 39158421 39581945 40004588 40605636
5039D0605636j1723N85058N12569J21903K74331L70924J37433L55537J37247J72666
$$ 40605636 40593913 41178971 41691540 41813443 42087774 42458698 42596131 42951668 43088915 43261581
5029D3261581N64074O46906K62048J74630Q7161K87831J40559L09467K35853K85213
$$ 43261581 43825655 44472561 44734609 44909239 44996400 45284231 45424790 45734257 45970110 46255323
5019D6255323j7559m0400K33514r908P2079j6886l103j22569J44284k48203l47472
$$ 46255323 46237764 46197364 46430878 46420970 46493049 46476163 46473060 46350491 46494775 46246572 45899100
5008D5899100K3701P5478k50751j27868q9530k40538k64684R9711j78541j05206
$$ 45899100 45922801 45998279 45747528 45619660 45530130 45289592 45024908 45124619 44946078 44840872
4998D4840872r6541l42672k68473l059J343k07539k75981j93641l69350k92792
$$ 44840872 44744331 44401659 44133186 44130127 44131470 43923931 43647950 43454309 43084959 42792167
4988D2792167l59061k06505j68416k06972k52652m86839o35535m87437j08339
$$ 42792167 42433106 42226601 42058185 41851213 41598561 41111722 40476187 39988750 39880411
4979C9880411j12472n54233p03381m74598l37947o30764k10287o53404o54847
$$ 39880411 39767939 39213706 38510325 38035727 37697780 37067016 36856729 36203325 35548478
4970C5548478r8059k28554n99609m44750m13502o54379l78662k07415k25054m11944
$$ 35548478 35450419 35221865 34622256 34177506 33764004 33109625 32730963 32523548 32298494 31886550
4960C1886550l91773m31803l84236m42114k55972l42208l07605l84506j87166
$$ 31886550 31494777 31062974 30678738 30236624 29980652 29638444 29330839 28946333 28759167
4951B8759167m40457k34580m88652k82113m44567m50678j07906k02842l33199
$$ 28759167 28318710 28084130 27595478 27313365 26868798 26418120 26310214 26107372 25774173
4942B5774173n25167k34933l48507l96497j01319m82217n31239j9607J8072l99743
$$ 25774173 25249006 25014073 24665566 24269069 24167750 23685533 23154294 23134687 23152759 22753016
4932B2753016l90007m8173k1421j06610m81737j12763l15576j77404j81589m86339
$$ 22753016 22363009 22314836 22293415 22186805 21705068 21592305 21276729 21099325 20917736 20431397
4922B0431397J2120J15910M1390j96269j69562K1776j47795j7165k34124R605
$$ 20431397 20443517 20559427 20600817 20404548 20234986 20256762 20108967 20091802 19857678 19867283
4912A9867283M9219l78289k79224j84345k97446r2799j25736Q9788k06544m13301
$$ 19867283 19916502 19538213 19258989 19074644 18777198 18684399 18558663 18648451 18441907 18028606
4902A8028606m35441k31298j98464j93816J25886j94610k96424l27558j00630
$$ 18028606 17593165 17361867 17163403 16969587 17095473 16900863 16604439 16276881 16176251
4893A6176251q5545n90697n4886J02837j64831J30401j29531k5929j58756l50003
$$ 16176251 16090706 15500009 15445123 15547960 15383129 15513530 15383999 15358070 15199314 14849311
4883A4849311j91502J4904r5497m88736k86796P0882r6546k29090m1174j6611
$$ 14849311 14657809 14672713 14577216 14088480 13801684 13872566 13776020 13546930 13505756 13489145
4873A3489145k13621j3833K33614j78163j55829j62136r3457k926k1390k06800
$$ 13489145 13275524 13261691 13495305 13317142 13161313 12999177 12905720 12902794 12881404 12674604
4863A2674604m9956J05604k68327k96081K14075j78858J29925J3370j76086J45770
$$ 12674604 12624648 12730252 12461925 12165844 12379919 12201061 12330986 12344356 12168270 12314040
4853A2314040K54475j06560N5551M8639j67424j29229M0202K41666O9177K43061
$$ 12314040 12568515 12461955 12517506 12566145 12398721 12269492 12309694 12551360 12620537 12863598
4843A2863598k25744L64454L95139k15117J14691K81878J56965K93419L30716
$$ 12863598 12637854 13002308 13397447 13182330 13297021 13578899 13735864 14029283 14359999
4834A4359999J07087j25129M31734K47618J33853J93012N21158K76535L32621
$$ 14359999 14467086 14341957 14773691 15021309 15155162 15348174 15869332 16145867 16478488
4825A6478488L08988L32188K99339M0557L93918N69668O54308K64984K26549M71264
$$ 16478488 16787476 17119664 17419003 17459560 17853478 18423146 19077454 19342438 19568987 20040251
4815B0040251M66462L83490M49686N49012K67920K73006P23190O06305M13318
$$ 20040251 20506713 20890203 21339889 21888901 22156821 22429827 23153017 23759322 24172640
4806B4172640P68839N06073L81255O32169O98891N48789N67985Q07458R57274
$$ 24172640 24941479 25447552 25828807 26460976 27159867 27708656 28276641 29084099 30041373
4797C0041373P89655J002553Q94305Q41278J019201J249942J111870J130242J145865
$$ 30041373 30831028 31833581 32727886 33569164 34588365 35838307 36950177 38080419 39226284
4788C9226284J369950J480314J301444J617566J751190J719440J659750J921998
$$ 39226284 40596234 42076548 43377992 44995558 46746748 48466188 50125938 52047936
4780E2047936K206371K398963K687628K590632K522144K820645K945219L080744
$$ 52047936 54254307 56653270 59340898 61931530 64453674 67274319 70219538 73300282
4772G3300282L302127L614198L345807L223730K921171K977815K894798K614156
$$ 73300282 76602409 80216607 83562414 86786144 89707315 92685130 95579928 98194084
4764I8194084K733911K554151K514477J858559K532116K359174K238428J652125
$$ 98194084 100927995 103482146 105996623 107855182 110387298 112746472 114984900 116637025
4756A16637025J071118Q47141K79294l2400n03835p88621r27600p04520q81427
$$ 116637025 117708143 118555284 118834578 118802178 118298343 117509722 116582122 115877602 114996175
4747A14996175p61251p23800j043187j460825j373401j444075j047843j643051
$$ 114996175 114234924 113511124 112467937 111007112 109633711 108189636 107141793 105498742
4739A05498742j759452j382480j679949j990419k530483k796167l361368l725960
$$ 105498742 103739290 102356810 100676861 98686442 96155959 93359792 89998424 86272464
4731H6272464l998457l966130m045668m107062l588898l391051l019981k919393
$$ 86272464 82274007 78307877 74262209 70155147 66566249 63175198 60155217 57235824
4723E7235824k474367k566886k174026k161583k013217j584569j443377j833961
$$ 57235824 54761457 52194571 50020545 47858962 45845745 44261176 42817799 40983838
4715D0983838j498847j358679j198117r26513r62654j014534q66090j068052r85458
$$ 40983838 39484991 38126312 36928195 36001682 35039028 34024494 33158404 32090352 31104894
4706C1104894p83509q47989m85871n18173q95597o16344q88570p37811k58962
$$ 31104894 30321385 29473396 28987525 28469352 27573755 26957411 26068841 25331030 25072068
4697B5072068m66994m15372m18971n55669n34023m70756o18601n02517l56949
$$ 25072068 24605074 24189702 23770731 23215062 22681039 22210283 21591682 21089165 20732216
4688B0732216l40228n30214j71329n38864l94444l21229m95600n15501n48951
$$ 20732216 20391988 19861774 19690445 19151581 18757137 18435908 17940308 17424807 16875856
4679A6875856q9592l99989k38333l36680m42998k56281p03511m13511r7184k91454
$$ 16875856 16786264 16386275 16147942 15811262 15368264 15111983 14408472 13994961 13897777 13606323
4669A3606323k06593m98901l70846o0612m51056k88745o8339m48893k94654r2994
$$ 13606323 13399730 12900829 12529983 12469371 12018315 11729570 11661231 11212338 10917684 10824690
4659A0824690l19508l16033k32335j64284q4126k60317l30614k57078j67010J39850
$$ 10824690 10505182 10189149 9956814 9792530 9708404 9448087 9117473 8860395 8693385 8833235
4649H833235j44989k19630n33634Q949j091j63235k4882k81789l58681N339O9806
$$ 8833235 8688246 8468616 7934982 7943931 7942840 7779605 7754723 7472934 7114253 7119592 7189398
4638G189398k18420k49590R1980j56122j24683l34947k07123O5422j38335j98797
$$ 7189398 6970978 6721388 6813368 6657246 6532563 6197616 5990493 6055915 5917580 5718783
4628E718783l33555m9849j47855j01170J6135j42431k49513m9785j07622p0423
$$ 5718783 5385228 5335379 5187524 5086354 5102489 4960058 4710545 4660760 4553138 4482715
4618D482715q5706j39327K10559q9172r139J7867r8389k38226j22171k02504j07997
$$ 4482715 4397009 4257682 4468241 4379069 4369930 4387797 4289408 4051182 3929011 3726507 3618510
4607C618510r0197J7452q5358k09316R5035k153K04054l4825l8165k73293j30772
$$ 3618510 3528313 3545765 3460407 3251091 3346126 3343973 3548027 3513202 3475037 3201744 3070972
4596C070972N7494o0960J31581j26901l07268n331K2138q3907J14554o3046m7600
$$ 3070972 3128466 3067506 3199087 3072186 2764918 2759587 2781725 2697818 2812372 2749326 2701726
4585B701726K7477K2737J8949k97651J23715l9099j11435K46773j78381J46331
$$ 2701726 2729203 2751940 2770889 2473238 2596953 2557854 2446419 2693192 2514811 2661142
4575B661142J52753n2375k79116j24126Q3943r8818M9526K26960l40588k66753
$$ 2661142 2813895 2761520 2482404 2358278 2442221 2343403 2392929 2619889 2279301 2012548
4565B012548P9912J38818M8597P310n2255J32749J65463k41434k03026O9202J5515
$$ 2012548 2092460 2231278 2279875 2287185 2234930 2367679 2533142 2291708 2088682 2157884 2173399
4554B173399o3888R1050J8810J17866j70120J81419k32727k21792K50985P502
$$ 2173399 2109511 2200561 2219371 2337237 2167117 2348536 2115809 1894017 2145002 2152504
4544B152504j99657J97438q9082O7861n982p6004M6312J03431N2773q6937M4051
$$ 2152504 1952847 2150285 2061203 2129064 2123082 2047078 2093390 2196821 2249594 2162657 2206708
4533B206708m1650J7141j33788o5922J29351O1511j78078j86077R0157N3485J72353
$$ 2206708 2165058 2182199 2048411 1982489 2111840 2173351 1995273 1809196 1899353 1952838 2125191
4522B125191J01610j45592j09613j85718p9588p4655K13935o7903j72289K64522
$$ 2125191 2226801 2081209 1971596 1785878 1706290 1631635 1845570 1777667 1605378 1869900
4512A869900j38076J73081J62640j55744J1935J1235J10097J94147J68088p1176
$$ 1869900 1731824 1904905 2067545 1911801 1923736 1934971 2045068 2239215 2407303 2336127
4502B336127m11455j46834K33737o0949r2964J63274j59170O9773K56533j96565
$$ 2336127 1924672 1777838 2011575 1950626 1857662 2020936 1861766 1931539 2188072 1991507
4492A991507l28718K994J09179L05687J57942k48208k07323J8146L28650J71477
$$ 1991507 1662789 1665783 1774962 2080649 2238591 1990383 1783060 1801206 2129856 2301333
4482B301333k63714j53810K7651J95500n3696J60536k8821j38875J06357l4105
$$ 2301333 2037619 1883809 1911460 2106960 2053264 2213800 2184979 2046104 2152461 2118356
4472B118356M1283K5629L05973J2471j8690j01754M945L19180j07717k01765K56243
$$ 2118356 2159639 2185268 2491241 2503712 2485022 2383268 2388213 2707393 2599676 2397911 2654154
4461B654154j40210N9929J00828l3328p5334K12231P8152K8213J70770O5802k36899
$$ 2654154 2513944 2573873 2674701 2641373 2566039 2778270 2856422 2884635 3055405 3121207 2884308
4450B884308O2016N4868N7347K06891N7845J05262J36576o4533P1084J02206j67982
$$ 2884308 2946324 3001192 3058539 3265430 3323275 3428537 3565113 3500580 3571664 3673870 3505888
4439C505888K35232m6016J16425L18208K38526J1513J24879J33409R1431R102
$$ 3505888 3741120 3695104 3811529 4129737 4368263 4379776 4504655 4638064 4729495 4738597
4429D738597L7415J97882K94148J81353j01124j58724L96642J24658J65192M60530
$$ 4738597 4776012 4973894 5268042 5449395 5348271 5189547 5586189 5710847 5876039 6336569
4419F336569l8360J25487j23915J66354J33514L71170K50256K58945M70543p0402
$$ 6336569 6298209 6423696 6299781 6466135 6599649 6970819 7221075 7480020 7950563 7880161
4409G880161J16748L25710J49924L65627K12888J28806N11694O04505O26773K88049
$$ 7880161 7996909 8322619 8472543 8838170 9051058 9179864 9691558 10296063 10922836 11210885
4399A1210885L51263K66053N21798N00335P37195Q23611P89769J165174J105743
$$ 11210885 11562148 11828201 12349999 12850334 13587529 14411140 15200909 16366083 17471826
4390A7471826J085180J430791J438507J633698K000528K045892K422320K958321
$$ 17471826 18557006 19987797 21426304 23060002 25060530 27106422 29528742 32487063
4382C2487063K893774K338416K194329J975771K266952K523897K802587L224112
$$ 32487063 35380837 37719253 39913582 41889353 44156305 46680202 49482789 52706901
4374E2706901L457680K979441J986075J095410O09453N51147J456163J846722
$$ 52706901 56164581 59144022 61130097 62225507 62834960 63386107 64842270 66688992
4366F6688992K124748K040002Q56629j179684k462208k578998k503678k116052
$$ 66688992 68813740 70853742 71710371 70530687 68068479 65489481 62985803 60869751
4358F0869751j302183o97946j252890k173237l024473l728669l687095l184140
$$ 60869751 59567568 58869622 57616732 55443495 52419022 48690353 45003258 41819118
4350D1819118k566934k197993j880024k208082k582321k344749k746619k603359
$$ 41819118 39252184 37054191 35174167 32966085 30383764 28039015 25292396 22689037
4342B2689037k000151k007849j621520j007286j092970r83449q31525r84769q41912
$$ 22689037 20688886 18681037 17059517 16052231 14959261 13975812 13144287 12159518 11317606
4333A1317606n96245n74057k62852m43085n11667m74333m63576j89816j34114
$$ 11317606 10721361 10147304 9884452 9441367 8929700 8455367 7991791 7801975 7667861
4324G667861k51251j62497m71822j23559N7934k52209l96035m02626k26155k89959
$$ 7667861 7416610 7254113 6782291 6658732 6716666 6464457 6068422 5665796 5439641 5149682
4314E149682j2014k6213k25469p1107L4471R7390m34946l46199l1040n7180q5339
$$ 5149682 5137668 5111455 4885986 4814879 4849350 4946740 4511794 4165595 4134555 4077375 3992036
4303C992036j60613j06270J5134j90073k1361j17232k43669K7210Q7475o949n4317
$$ 3992036 3831423 3725153 3740287 3550214 3528853 3411621 3167952 3195162 3282637 3275688 3221371
4292C221371m4166O0745O5420m00788p1044j28283l36049j01150L8021K38604
$$ 3221371 3177205 3237950 3303370 2902582 2831538 2703255 2367206 2266056 2304077 2542681
4282B542681r1926r0031J08498j82042l4894j56940J30602j8221k93431N6552
$$ 2542681 2450755 2360724 2469222 2287180 2252286 2095346 2225948 2207727 1914296 1970848
4272A970848j41027m9436j64049Q9600p5469j50093K06929k0750k4315J21333
$$ 1970848 1829821 1780385 1616336 1705936 1630467 1480374 1687303 1666553 1642238 1763571
4262A763571P5241O6742j60349J2326j03484l93349M1869K4814j21408o6891J42574
$$ 1763571 1838812 1905554 1745205 1757531 1654047 1260698 1302567 1327381 1205973 1139082 1281656
4251A281656K30407R8002j25205R5341j54527j68720j0306J08250k4152j42247
$$ 1281656 1512063 1610065 1484860 1580201 1425674 1256954 1246648 1354898 1330746 1188499
4241A188499o4612K11964J28869m5078N2406M5791p1578q2003N4922o9229j45270
$$ 1188499 1123887 1335851 1464720 1419642 1472048 1517839 1446261 1364258 1419180 1349951 1204681
4230A204681O2052P3215r2490P6928j1210J5902J64795k82614j36854P9035m8916
$$ 1204681 1266733 1339948 1247458 1324386 1313176 1329078 1493873 1211259 1074405 1153440 1104524
4219A104524L07817N8508j06066j42887o5695R428Q6611j13650O1511K13605J23378
$$ 1104524 1412341 1470849 1364783 1221896 1156201 1165629 1252240 1138590 1200101 1413706 1537084
4208A537084m2703o8195q7438j30767m3364L86420r3634J3993j70707j43348K59669
$$ 1537084 1494381 1426186 1338748 1207981 1164617 1551037 1457403 1471396 1300689 1157341 1417010
4197A417010K7073j07363K9640p6363o5790r1697J66300O9513j51840K19714M1269
$$ 1417010 1444083 1336720 1366360 1289997 1224207 1132510 1298810 1368323 1216483 1436197 1477466
4186A477466L7560j99206R862j26755J44648J84322L38655j26402M8793Q8157
$$ 1477466 1515026 1315820 1325682 1198927 1343575 1527897 1866552 1740150 1788943 1877100
4176A877100j49934J86776k54883J34015j68026K8701K14431N3275j2184j79752
$$ 1877100 1727166 1913942 1659059 1793074 1625048 1653749 1868180 1921455 1909271 1729519
4166A729519K50775L18125K8495l05459M18103n8605O0735n6519r7085l403J30880
$$ 1729519 1980294 2298419 2326914 2021455 2439558 2380953 2441688 2385169 2288084 2284681 2415561
4155B415561J08758J8110l8499J50525J11347j82733J05155K03136j82456K32662
$$ 2415561 2524319 2542429 2503930 2654455 2765802 2583069 2688224 2891360 2708904 2941566
4145B941566L26515J18417N5351k01410r3646K53054m3974J41936K21209M0609
$$ 2941566 3268081 3386498 3441849 3240439 3146793 3399847 3355873 3497809 3719018 3759627
4135C759627L11739K02591J46194m4339r151k9177J27282M24108l6937P8876L11283
$$ 3759627 4071366 4273957 4420151 4375812 4366661 4337484 4464766 4888874 4851937 4930813 5242096
4124E242096K22989L41006J23691R8438K10642J00816J34373L03398K79645Q8929
$$ 5242096 5465085 5806091 5929782 6028220 6238862 6339678 6474051 6777449 7057094 7146023
4114G146023J0744N00168L11930M06302M10089L92901M08191K35781M00417P90503
$$ 7146023 7156767 7656935 7968865 8375167 8785256 9178157 9586348 9822129 10222546 11013049
4104A1013049M96585M74095N27709O92576L41781O00373L98359Q95118Q29678
$$ 11013049 11509634 11983729 12511438 13204014 13545795 14146168 14544527 15439645 16269323
4095A6269323L61767P31709N69635O16079P80059O46078L90090O75412Q91203
$$ 16269323 16631090 17362799 17932434 18548513 19328572 19974650 20364740 21040152 21931355
4086B1931355Q99544P36718N30915L53730N78810P38059N28340M31701L76418
$$ 21931355 22830899 23567617 24098532 24452262 25031072 25769131 26297471 26729172 27105590
4077B7105590K26018M70032N86523L54910L74500L05694J02067M802N4195k28339
$$ 27105590 27331608 27801640 28388163 28743073 29117573 29423267 29525334 29530136 29584331 29355992
4067B9355992M3252j20762k57412l14185m51161k59037k35414o65664m09921n14415
$$ 29355992 29399244 29278482 29021070 28706885 28255724 27996687 27761273 27095609 26685688 26171273
4057B6171273k37141l83279p15879o92073n07367m72107p32597p76237p84035
$$ 26171273 25934132 25550853 24834974 24142901 23635534 23163427 22430830 21654593 20870558
4048B0870558q79721m89431l39826p46260n05448p94093r25971n23556o94996
$$ 20870558 19990837 19501406 19161580 18415320 17909872 17115779 16189808 15666252 14971256
4039A4971256q26947m84147l05020m84741n76458m47767n75661l11872n60585
$$ 14971256 14144309 13660162 13355142 12870401 12293943 11846176 11270515 10958643 10398058
4030A0398058o57648m18759j25123r2087l83937m51888j90075l27069k51543k02676
$$ 10398058 9740410 9321651 9196528 9104441 8720504 8268616 8078541 7751472 7499929 7297253
4020G297253j18225k57594j01862j60430k82354j43301j25382j59858L0349p9042
$$ 7297253 7179028 6921434 6819572 6659142 6376788 6233487 6108105 5948247 5978596 5899554
4010E899554j20331k7494k06032j50031J69171q0670K6477R9948j90759J8744
$$ 5899554 5779223 5751729 5545697 5395666 5564837 5484167 5510644 5610592 5419833 5438577
4000E438577L22632j02571p9956M13602J23989j6513K54193L93144J73829M89138
$$ 5438577 5761209 5658638 5578682 5992284 6116273 6099760 6353953 6747097 6920926 7410064
3990G410064Q24974O42972J156109J338767J735099K165682J882578L89731j612153
$$ 7410064 8235038 8878010 10034119 11372886 13107985 15273667 17156245 17545976 15933823
3981A5933823k172806k213154k216285j441618o49166q05142m78969l65199m43480
$$ 15933823 13761017 11547863 9331578 7889960 7240794 6435652 5956683 5591484 5148004
3972E148004n27837k09898j45016m0567o3102j97971p825n73843j27047j28285
$$ 5148004 4620167 4410269 4265253 4224686 4161584 3963613 3955788 3381945 3254898 3126613
3962C126613j00246l02980P7407j06762j40014J60403k682r5469M3954k65612
$$ 3126613 3026367 2723387 2800794 2694032 2554018 2714421 2711739 2616270 2660224 2394612
3952B394612j96357q5342N0899K25842N6582O2231j182p5845j76853R0862j91079
$$ 2394612 2198255 2112913 2163812 2389654 2446236 2508467 2507285 2431440 2254587 2345449 2154370
3941B154370q4077j86609K66377P3831O9739j16074j77144P9473k47466N6994
$$ 2154370 2070293 1883684 2150061 2223892 2293631 2177557 2000413 2079886 1832420 1889414
3931A889414m906j5295N7653J88912j46766j71477m5241l8349K5158k3649J56362
$$ 1889414 1884508 1869213 1926866 2115778 1969012 1797535 1752294 1713945 1739103 1715454 1871816
3920A871816P6045k82798P1259R6388k03215J47195L3753R9503j14710q5154j15830
$$ 1871816 1947861 1665063 1736322 1832710 1629495 1776690 1810443 1909946 1795236 1710082 1594252
3909A594252K1338j03888K53273O5862n2840O4700K21725j1306l08044l07410
$$ 1594252 1615590 1511702 1764975 1830837 1777997 1842697 2064422 2053116 1745072 1437662
3899A437662K26772K22856j11723q3717J42004K75148r4868n8045j35765J97759
$$ 1437662 1664434 1887290 1775567 1691850 1833854 2109002 2014134 1956089 1820324 2018083
3889B018083L3266r3924J3477M8044n9124l586o5720o8660K28163J73687J14047
$$ 2018083 2051349 1957425 1970902 2018946 1959822 1956236 1890516 1821856 2050019 2223706 2337753
3878B337753l36066k274M5805K65711o4937r6542K67034r3753J28674j46312j06482
$$ 2337753 2001687 1999413 2045218 2310929 2245992 2149450 2416484 2322731 2451405 2305093 2198611
3867B198611J11502j30772J52502j4006n1107k0383J85134O6830j0141l2843r5740
$$ 2198611 2310113 2179341 2331843 2317837 2266730 2246347 2431481 2498311 2488170 2455327 2359587
3856B359587J1698N760K05647M193k42522p0864J77756J35099L430N4288N3235
$$ 2359587 2371285 2377045 2582692 2586885 2344363 2273499 2451255 2586354 2589784 2644072 2697307
3845B697307j72205K07275R6828j50923J90077J09911j2278l1648Q4440m4562
$$ 2697307 2525102 2732377 2829205 2678282 2868359 2978270 2965992 2934344 3018784 2974222
3835B974222L8363r3972Q7196K24860k14252R9035K2770L74439P8276J75240l1429
$$ 2974222 3012585 2918613 3005809 3230669 3016417 3115452 3138222 3512661 3590937 3766177 3734748
3824C734748m6851M1332r1663o5403L48086J9775l7226m2551P2983Q4648R3802
$$ 3734748 3687897 3729229 3637566 3572163 3920249 3940024 3902798 3860247 3933230 4017878 4111680
3813D111680J08988p6740K19551L27208m7198k5678J75071k1952R5073J5659K40222
$$ 4111680 4220668 4143928 4363479 4690687 4643489 4617811 4792882 4770930 4866003 4881662 5121884
3802E121884k8109N4899J15851R9107p279k5706J35998N9679K43824O9194k45240
$$ 5121884 5093775 5148674 5264525 5363632 5356353 5330647 5466645 5526324 5770148 5839342 5594102
3791E594102m0662K21045K2618M14326O76788Q0872O4454k04332j07833M26055
$$ 5594102 5553440 5774485 5797103 6211429 6888217 6969089 7033543 6829211 6721378 7147433
3781G147433M64062k0658J35226L12312j07111K36061L46366K13567K41747K82518
$$ 7147433 7611495 7590837 7726063 8038375 7931264 8167325 8513691 8727258 8969005 9251523
3771I251523L88928K73718K19523K29433J99894J24318L44652L27470K55268J26717
$$ 9251523 9640451 9914169 10133692 10363125 10563019 10687337 11031989 11359459 11614727 11741444
3761A1741444L33246L32512K31290K08071J93837r377J09242K15360J82240K81981
$$ 11741444 12074690 12407202 12638492 12846563 13040400 13031023 13140265 13355625 13537865 13819846
3751A3819846o894J83803J80738K95916k1584J23835K13924J20056M39951J89048
$$ 13819846 13812952 13996755 14177493 14473409 14451825 14575660 14789584 14909640 15349591 15538639
3741A5538639M9926O19691J01061K15615L82727L24038K70095L72887L58550O09611
$$ 15538639 15588565 16208256 16309317 16524932 16907659 17231697 17501792 17874679 18233229 18842840
3731A8842840L68097L49620Q79220O85741P33635P84987N06550N40987J018916
$$ 18842840 19210937 19560557 20439777 21125518 21859153 22644140 23150690 23691677 24710593
3722B4710593R51193J280131P88944Q28239R46253J139723J298546J162540J125030
$$ 24710593 25661786 26941917 27730861 28559100 29505353 30645076 31943622 33106162 34231192
3713C4231192J232331J198829J240210J174221J100642J075027R64304J323653
$$ 34231192 35463523 36662352 37902562 39076783 40177425 41252452 42216756 43540409
3705D3540409J172082P71488P34253R08331O38812P51955N15157O80914M13485
$$ 43540409 44712491 45483979 46218232 47126563 47765375 48517330 49032487 49713401 50126886
3696E0126886L13316K28531K09338L31843N9209l45718k30880m24394o43700n05704
$$ 50126886 50440202 50668733 50878071 51209914 51269123 50923405 50692525 50268131 49624431 49118727
3686D9118727l56725l80467q32363p67706r32228q70484q20489o93098j061693
$$ 49118727 48762002 48381535 47549172 46781466 45849238 44978754 44158265 43465167 42403474
3677D2403474p52124q38346j018441j121194r57747j175512j302390j105286j078002
$$ 42403474 41651350 40813004 39794563 38673369 37715622 36540110 35237720 34132434 33054432
3668C3054432j045717j040268j152525j010628r79062j058992o17937o69576j071725
$$ 33054432 32008715 30968447 29815922 28805294 27826232 26767240 26149303 25479727 24408002
3659B4408002q31718n55549n61197p99091l95574m79762k95789k40744k40813
$$ 24408002 23576284 23020735 22459538 21660447 21264873 20785111 20489322 20248578 20007765
3650B0007765l35152k10414k17005j90751J63058q5405l71702j98315J52617j58022
$$ 20007765 19672613 19462199 19245194 19054443 19217501 19132096 18760394 18562079 18714696 18556674
3640A8556674K64103j10494j22198J08057J4322L709J07292J19301k80336L37799
$$ 18556674 18820777 18710283 18588085 18696142 18710464 18714173 18821465 18940766 18660430 18998229
3630A8998229k04357j94881k12371J39466J76011M6232K593J9721J32430l6134
$$ 18998229 18793872 18598991 18386620 18526086 18702097 18748329 18750922 18770643 18903073 18866939
3620A8866939R735J8990j63271k9831R3363K28657M71777J03412m3057p7837M19003
$$ 18866939 18876674 18895664 18732393 18702562 18795925 19024582 19496359 19599771 19556714 19478877 19897880
3609A9897880K58700N06151L50305K83777L47352L68762N12696M32880K87431
$$ 19897880 20156580 20662731 21013036 21296813 21644165 22012927 22525623 22958503 23245934
3600B3245934n934L11521M68148K24759J75543K45484M73438m5654K1156N045
$$ 23245934 23240000 23551521 24019669 24244428 24419971 24665455 25138893 25093239 25114395 25119440
3590B5119440Q7910J39263l474j59531j31038J54750K37769k56993j9488J87255
$$ 25119440 25207350 25346613 25343139 25183608 25052570 25207320 25445089 25188096 25168608 25355863
3580B5355863N25226J03642q6870J43777M80239K84842K87820L45065N70564N13975
$$ 25355863 25881089 25984731 25897861 26041638 26521877 26806719 27094539 27439604 28010168 28524143
3570B8524143N57553Q19197N92954L88398N79153Q69987Q46007Q75565J388982
$$ 28524143 29081696 29900893 30493847 30882245 31461398 32331385 33177392 34052957 35441939
3561C5441939R64153J139671R09380J111861J431158J380873J486920J582048
$$ 35441939 36406092 37545763 38455143 39567004 40998162 42379035 43865955 45448003
3553D5448003J422923J693902J725990J595612J770873J820181J761638J536888
$$ 45448003 46870926 48564828 50290818 51886430 53657303 55477484 57239122 58776010
3545E8776010J742012J415300J644252J498827J573232J580819J509578J232241
$$ 58776010 60518022 61933322 63577574 65076401 66649633 68230452 69740030 70972271
3537G0972271J401240J520564J337710J523319J799340J384425J694701J652236
$$ 70972271 72373511 73894075 75231785 76755104 78554444 79938869 81633570 83285806
3529H3285806J548494J688013J699408J436443J639726J226790P55875L55616
$$ 83285806 84834300 86522313 88221721 89658164 91297890 92524680 93280555 93636171
3521I3636171M78750r6613j40219k39344p89868j394166j237281j358499j875935
$$ 93636171 94114921 94018308 93878089 93638745 92848877 91454711 90217430 88858931 86982996
3512H6982996k107776j850805k053998j765605j587499k143625j766253j379682
$$ 86982996 84875220 83024415 80970417 79204812 77617313 75473688 73707435 72327753
3504G2327753j296812j421412j539499j707962j535357j382985j452603j372698
$$ 72327753 71030941 69609529 68070030 66362068 64826711 63443726 61991123 60618425
3496F0618425j423009j977322j628267j662268j787232j621631j820677j793071
$$ 60618425 59195416 57218094 55589827 53927559 52140327 50518696 48698019 46904948
3488D6904948j459039j587432j654642j790202j411836j120039j360718j116129
$$ 46904948 45445909 43858477 42203835 40413633 39001797 37881758 36521040 35404911
3480C5404911j416671q23766j093776j044251p17363q24451r05224q54422m84677
$$ 35404911 33988240 33164474 32070698 31026447 30309084 29484633 28579409 27724987 27240310
3471B7240310n20885p70581p80272p87421j43357k65212n46586l6633k49397m92803
$$ 27240310 26719425 25948844 25168572 24381151 24237794 23972582 23425996 23389363 23139966 22647163
3461B2647163l08428q4032p2620O2420k13583j29147k03404J76892p3839L53908
$$ 22647163 22338735 22254703 22182083 22244503 22030920 21901773 21698369 21875261 21801422 22155330
3451B2155330J68819l5389j48561j05300j79199k01655k0914m18394l39767k89785
$$ 22155330 22324149 22288760 22140199 22034899 21855700 21654045 21633131 21214737 20874970 20585185
3441B0585185m03939k93114l40410m54216n35636m18895l07990p10619l24779
$$ 20585185 20181246 19888132 19547722 19093506 18557870 18138975 17830985 17120366 16795587
3432A6795587m92626l11988k79145k89935r79272l94603R5549o92624n91888l24951
$$ 16795587 16302961 15990973 15711828 15421893 14442621 14048018 14143567 13450943 12859055 12534104
3422A2534104j52511o5901k49542q9568k53683j95938J35869o0418n3219n85947
$$ 12534104 12381593 12315692 12066150 11976582 11722899 11526961 11662830 11602412 11549193 10963246
3412A0963246o849q6658l86637j75687L19089j03532k47709o0367K20248O6752
$$ 10963246 10956397 10869739 10483102 10307415 10626504 10522972 10275263 10214896 10435144 10501896
3402A0501896l6900k82759m7726n0852r2847n9609j20492j09990R5002N3958j80286
$$ 10501896 10464996 10182237 10134511 10083659 9990812 9931203 9810711 9700721 9795723 9849681 9669395
3391I669395J7197L3468m5942J29709R7429l30K2072j08474J3723J81405J37935
$$ 9669395 9686592 9720060 9674118 9803827 9901256 9900926 9922998 9814524 9828247 10009652 10147587
3380A0147587k12808l1334N7145K06354K21570m6925R8806l0428J23031K67056
$$ 10147587 9934779 9903445 9960590 10166944 10388514 10341589 10440395 10409967 10532998 10800054
3370A0800054p1158J01588L75469P4978j24504R36M75682K23361L81306p0029
$$ 10800054 10728896 10830484 11205953 11280931 11156427 11157363 11633045 11856406 12237712 12167683
3360A2167683L6543J84342R7208N38534m2511K27089L13418J99031N4195J90921
$$ 12167683 12204226 12388568 12485776 13024310 12981799 13208888 13522306 13721337 13775532 13966453
3350A3966453N07323L62624J62469J96805N61665M73839M64995J15927L73934
$$ 13966453 14473776 14836400 14998869 15195674 15757339 16231178 16696173 16812100 17186034
3341A7186034L69646N05216O68253K11596O38107K91697M03764J46664M09179
$$ 17186034 17555680 18060896 18729149 18940745 19578852 19870549 20274313 20420977 20830156
3332B0830156L33292O58291M98057M97324N50265M46208M86017Q70301O11019
$$ 20830156 21163448 21821739 22319796 22817120 23367385 23813593 24299610 25169911 25780930
3323B5780930P74232O00111P45605R62970R63278O74189Q95776P70262Q43035
$$ 25780930 26555162 27155273 27900878 28863848 29827126 30501315 31397091 32167353 33010388
3314C3010388J275497J377889J133218J155857J473355J329369J578322J634118
$$ 33010388 34285885 35663774 36796992 37952849 39426204 40755573 42333895 43968013
3306D3968013J723335J942479J816789K129035K391644K243319K425858K743793
$$ 43968013 45691348 47633827 49450616 51579651 53971295 56214614 58640472 61384265
3298F1384265K686742K962415L465834L052757L297812L759822L725117L507623
$$ 61384265 64071007 67033422 70499256 73552013 76849825 80609647 84334764 87842387
3290H7842387L715200L994470M301704L516684L690344L479389L004468K770672
$$ 87842387 91557587 95552057 99853761 103370445 107060789 110540178 113544646 116315318
3282A16315318K635762J978464J353244J450395J016721N77694N10353j90652
$$ 116315318 118951080 120929544 122282788 123733183 124749904 125327598 125837951 125647299
3274A25647299m16312q65301j066656j340239k024811k044645k578120k679118
$$ 125647299 125230987 124365686 123299030 121958791 119933980 117889335 115311215 112632097
3266A12632097k738861l325416l658466l592687l838546l645222l777812l660866
$$ 112632097 109893236 106567820 102909354 99316667 95478121 91832899 88055087 84394221
3258H4394221l636472l841291l726929l274080l088458l212235k859352k582161
$$ 84394221 80757749 76916458 73189529 69915449 66826991 63614756 60755404 58173243
3250E8173243k488138k171088k109398k452128k072332j478915j548028j825187
$$ 58173243 55685105 53514017 51404619 48952491 46880159 45401244 43853216 42028029
3242D2028029j498488j340461r36473j580239j156252r83780q18394r50789r58580
$$ 42028029 40529541 39189080 38252607 36672368 35516116 34532336 33713942 32763153 31804573
3233C1804573n74504p30376p89564o77854o72054p14262m80085m97074n27862
$$ 31804573 31230069 30499693 29710129 29032275 28360221 27645959 27165874 26668800 26140938
3224B6140938l49405j81783o28984n27583l30124m02115k47179k53038j62855
$$ 26140938 25791533 25609750 24980766 24453183 24123059 23720944 23473765 23220727 23057872
3215B3057872m74770k27022l17031o47898j32974p2374k19641k92465j90390k47131
$$ 23057872 22583102 22356080 22039049 21391151 21258177 21185803 20966162 20673697 20483307 20236176
3205B0236176J03828q8951l88937n2129j59911k86284M1490N9609J27866K6936
$$ 20236176 20340004 20251053 19862116 19809987 19650076 19363792 19405282 19464891 19592757 19619693
3195A9619693n6861J44641j60715j87063L06750P5526j76387J39029j2740n4682
$$ 19619693 19562832 19707473 19546758 19359695 19666445 19741971 19565584 19704613 19691873 19637191
3185A9637191L57098N1311l66426l07519l5195n054K19208k46938j53334K64788
$$ 19637191 19994289 20045600 19679174 19371655 19336460 19331406 19550614 19303676 19150342 19415130
3175A9415130L30219L8598J9017j3987Q0328M20911M87509K43169j5868M22522
$$ 19415130 19745349 19783947 19802964 19788977 19869305 20290216 20777725 21020894 21005026 21427548
3165B1427548K72120M02577O05697O73983O81014N80721O50777O85879Q02664
$$ 21427548 21699668 22102245 22707942 23381925 24062939 24643660 25294437 25980316 26782980
3156B6782980N48164P24834R69221O12830Q22211J390578J095197J041605J188057
$$ 26782980 27331144 28055978 29025199 29638029 30460240 31850818 32946015 33987620 35175677
3147C5175677J150910J465893J493152J579689J761581J702297J900306J830663
$$ 35175677 36326587 37792480 39285632 40865321 42626902 44329199 46229505 48060168
3139D8060168J985274K064113K071078K285184J736261J787314J568592J588036
$$ 48060168 50045442 52109555 54180633 56465817 58202078 59989392 61557984 63146020
3131F3146020J233666R38296Q94418M46861K12317m1497j45416n20267q61000
$$ 63146020 64379686 65317982 66212400 66659261 66871578 66830081 66684665 66164398 65303398
3122F5303398q44217j301093j205942j395903j621458j993700k167291k040896
$$ 65303398 64459181 63158088 61952146 60556243 58934785 56941085 54773794 52732898
3114E2732898k187834j975853k259962j845158k019118j761435j975890j893081
$$ 52732898 50545064 48569211 46309249 44464091 42444973 40683538 38707648 36814567
3106C6814567j622452j638455j517051j362017j402187j196589j206025j051637
$$ 36814567 35192115 33553660 32036609 30674592 29272405 28075816 26869791 25818154
3098B5818154j093982q60091n91460p61503q19914q00568m34839m54370l91492
$$ 25818154 24724172 23864081 23272621 22511118 21691204 20890636 20455797 20001427 19609935
3089A9609935o39563k86795k54624l30583l83188J385l81229k33469O2100L34415
$$ 19609935 18970372 18683577 18428953 18098370 17715182 17716567 17335338 17101869 17163969 17498384
3079A7498384J99458k10711l95485l45664o01714m62048l44764m14285l10693
$$ 17498384 17697842 17487131 17091646 16745982 16144268 15682220 15337456 14923171 14612478
3070A4612478l8375K4729j45895P5962k7922J27569j37681q5820k49446Q9976
$$ 14612478 14574103 14598832 14452937 14528899 14500977 14628546 14490865 14405045 14155599 14245575
3060A4245575j42903j59399l22536j70900n8306N9915p3164j72572j25216K19527
$$ 14245575 14102672 13943273 13620737 13449837 13391531 13451446 13378282 13205710 13080494 13300021
3050A3300021N56532N12890L96464J43091p2844q16636r19766m21182q74688o38548
$$ 13300021 13856553 14369443 14765907 14908998 14836154 14019518 13099752 12678570 11803882 11165334
3040A1165334n26869m63427n4947j36553p2949j09844l25197l50565J15920R302
$$ 11165334 10638465 10175038 10120091 9983538 9910589 9800745 9475548 9124983 9240903 9250205
3030I250205j35816j58856N3667l49314R7716k1823k04410k5498J92502K20048
$$ 9250205 9114389 8955533 9009200 8659886 8757602 8735779 8531369 8505871 8698373 8918421
3020H918421K79411Q9820L63889N26638J26133J9147j12621j76732l33902n04289
$$ 8918421 9197832 9287652 9651541 10178179 10304312 10323459 10210838 10034106 9700204 9195915
3010I195915l24683j34902l8378r3249j48503R3099n902P7286j65915j07195P8726
$$ 9195915 8871232 8736330 8697952 8604703 8456200 8549299 8543397 8620683 8454768 8347573 8426299
2999H426299O5074J51405j84318k12052m2933L27736o3224o0164Q7060l8123J38846
$$ 8426299 8491373 8642778 8458460 8246408 8203475 8531211 8467987 8407823 8494883 8456760 8595606
2988H595606j102K99106K60018P4902p7754J31057J08172K28671n217K1073j3188
$$ 8595606 8594504 8893610 9153628 9228530 9150776 9281833 9390005 9618676 9613459 9634532 9621344
2977I621344M7006L19582L4140o3547J18985K7638K79769M34141J30561k676L44946
$$ 9621344 9668350 9987932 10022072 9958525 10077510 10105148 10384917 10819058 10949619 10946943 11291889
2966A1291889J32156N6779l0057K6997M71069L46712L53290l0012n8630M18556
$$ 11291889 11424045 11480824 11450767 11477764 11948833 12295545 12648835 12618823 12560193 12978749
2956A2978749M18882J76224N27500K62671J97894J53710L23056M44176K38720
$$ 12978749 13397631 13573855 14101355 14364026 14561920 14715630 15038686 15482862 15721582
2947A5721582L63331L06411K90404N21022N25609L18918L58358N60116N69996
$$ 15721582 16084913 16391324 16681728 17202750 17728359 18047277 18405635 18965751 19535747
2938A9535747P81939M11079M08502M80453P58827N39858N66435O00614O16404
$$ 19535747 20317686 20728765 21137267 21617720 22376547 22916405 23482840 24083454 24699858
2929B4699858P34119P03928P82098J177931Q06867O64240R26039Q30894J026006
$$ 24699858 25433977 26137905 26920003 28097934 28904801 29569041 30495080 31325974 32351980
2920C2351980J268515J273469J178171J191029J352784J323152J345026J829106
$$ 32351980 33620495 34893964 36072135 37263164 38615948 39939100 41284126 43113232
2912D3113232J578923J847164J849783J771082K247803K267061K130279K192611
$$ 43113232 44692155 46539319 48389102 50160184 52407987 54675048 56805327 58997938
2904E8997938K641913K711439K536706K996281L236010L130099L740347M200165
$$ 58997938 61639851 64351290 66887996 69884277 73120287 76250386 79990733 84190898
2896H4190898M342929M685958M841141N725637O193838O750929P308760Q214808
$$ 84190898 88533827 93219785 98060926 103786563 109980401 116731330 124040090 132254898
2888A32254898Q449062R437562J0272249J1680806J2552420J3364508J4308553
$$ 132254898 140703960 150141522 160413771 172094577 184646997 198011505 212320058
2881B12320058J4980959J5425984J5046591J4157921J1961137Q524856M359888
$$ 212320058 227301017 242727001 257773592 271931513 283892650 292417506 296777394
2874B96777394p67578n759335j0843283j3952697j6028927j7269647j6817120
$$ 296777394 296009816 290250481 279407198 265454501 249425574 232155927 215338807
2867B15338807j6135105j4743894j3619438j2606812j1104160j0265821r457632
$$ 215338807 199203702 184459808 170840370 158233558 147129398 136863577 127405945
2860A27405945q269635p422958o685249o116201n504878m849603m886061m516381
$$ 127405945 119136310 111713352 105028103 98911902 93407024 88557421 83671360 79154979
2852G9154979m044206l701025l431973l467722l121013k752372k662972k595455
$$ 79154979 75110773 71409748 67977775 64510053 61389040 58636668 55973696 53378241
2844E3378241j868252k118376k002397k168939j635873j563000j455660j122805
$$ 53378241 51509989 49391613 47389216 45220277 43584404 42021404 40565744 39442939
2836C9442939j439792j336201j397931j302513j054310j335897q99417q44022
$$ 39442939 38003147 36666946 35269015 33966502 32912192 31576295 30676878 29832856
2828B9832856r29842r67292r88100p21894p26098q45399q18916l75087o02751
$$ 29832856 28903014 27935722 26947622 26225728 25499630 24654231 23835315 23460228 22857477
2819B2857477p50586n32360n88669m82991n82397n65879q10818l70142j94353
$$ 22857477 22106891 21574531 20985862 20502871 19920474 19354595 18543777 18173635 17979282
2810A7979282p06306n64065o22974m34959l00985k75973m58392q4988l65256o46050
$$ 17979282 17272976 16708911 16085937 15650978 15349993 15074020 14615628 14530640 14165384 13519334
2800A3519334j70238l78728o18919j40349l30230k56592k35312j87682k53280
$$ 13519334 13349096 12970368 12351449 12211100 11880870 11624278 11388966 11201284 10948004
2791A0948004l38590p9375l91969l70714l22879l45079l72122J05104j27562l00837
$$ 10948004 10609414 10530039 10138070 9767356 9444477 9099398 8727276 8832380 8704818 8403981
2781H403981j56956J7893j27988k02462o3780J08235n08989k04742n0001k91709
$$ 8403981 8247025 8264918 8136930 7934468 7870688 7978923 7469934 7265192 7215191 6923482
2771F923482q4013j39239j63257K7257n7737m58024j80986k62688j40483J60565
$$ 6923482 6839469 6700230 6536973 6564230 6506493 6048469 5867483 5604795 5464312 5624877
2761E624877k90460r1818N387Q8216k37937k29462j0681J55954n8077q0027k86362
$$ 5624877 5334417 5242599 5247986 5336202 5098265 4868803 4858122 5014076 4955999 4875972 4589610
2750D589610J44820j30073k55313K83336j02526l59711j34854j07503j23682N921
$$ 4589610 4734430 4604357 4349044 4632380 4529854 4170143 4035289 3927786 3804104 3810025
2740C810025j10792k86491O5033j94483N1188K22023q0077j18961n4413k9787
$$ 3810025 3699233 3412742 3477775 3283292 3334480 3556503 3476426 3357465 3303052 3273265
2730C273265k33398k27074M6478J72825K8655K17045m04037j75351N8945J08107
$$ 3273265 3039867 2812793 2859271 3032096 3060751 3277796 2873759 2698408 2757353 2865460
2720B865460k19170j61818j94585J02584K3649P7495p1782r0787k2300K456k35217
$$ 2865460 2646290 2484472 2289887 2392471 2416120 2493615 2421833 2331046 2308746 2311202 2075985
2709B075985J98988P1424j30082Q5628m71810k87988J09226j90636K35918L8522
$$ 2075985 2274973 2346397 2216315 2301943 1830133 1542145 1651371 1460735 1696653 1735175
2699A735175J35740j1615k68273J33958J73317J15502P7215j68474r7304P6726
$$ 1735175 1870915 1859300 1591027 1724985 1898302 2013804 2091019 1922545 1825241 1901967
2689A901967K5392j88290J69227J05068m5406k5624r0389k17398K77965j4419
$$ 1901967 1927359 1739069 1908296 2013364 1967958 1942334 1851945 1634547 1912512 1898093
2679A898093J06072j42236J0749l4525K9282j88021o2097K43552k20018J0342
$$ 1898093 2004165 1861929 1872678 1838153 1867435 1679414 1617317 1860869 1640851 1651193
2669A651193J11483O4315j75446Q1670L2106j48589j50369J84915P8339j73926
$$ 1651193 1762676 1826991 1651545 1733215 1765321 1616732 1466363 1651278 1729617 1555691
2659A555691j74402K59499j88772Q8860N0477k08071o1925K0692j7544L9528J38276
$$ 1555691 1381289 1640788 1452016 1540876 1591353 1383282 1321357 1342049 1324505 1364033 1502309
2648A502309l8030j30057M599j85018K90335K9620k80132j31639J09335J49985
$$ 1502309 1464279 1334222 1338821 1153803 1444138 1473758 1193626 1061987 1171322 1321307
2638A321307k38656Q5730j026o5838P7218l6988M550O1810L0930m0713K23248
$$ 1321307 1082651 1168381 1167355 1101517 1178735 1141747 1146297 1208107 1239037 1198324 1421572
2627A421572j23449j20860Q7330j32372m6114N48747j57647k34068K7838j22222
$$ 1421572 1298123 1177263 1264593 1132221 1086107 1634854 1477207 1243139 1270977 1148755
2617A148755L1032J22423J20170J09801L2958k55663q1274L3869J09715q5747
$$ 1148755 1179787 1302210 1422380 1532181 1565139 1309476 1228202 1262071 1371786 1286039
2607A286039M0855Q8836j00625K25080k4969Q753l1438P5922M27481n1643k33444
$$ 1286039 1326894 1415730 1315105 1540185 1515216 1523969 1492531 1568453 1995934 1944291 1710847
2596A710847M9782p544J54830Q7244L70907q4644k73724k91893m4978K40514j73841
$$ 1710847 1760629 1753085 1907915 1995159 2366066 2281422 2007698 1715805 1670827 1911341 1737500
2585A737500j70124j51234J93890K2164k29760j25682k7990r3627r2006J16380
$$ 1737500 1567376 1416142 1610032 1632196 1402436 1276754 1248764 1155137 1063131 1179511
2575A179511Q0088q9858j65557N4423m5493M7923r0841k15289J00312J7426q5837
$$ 1179511 1259599 1169741 1004184 1058607 1013114 1061037 970196 754907 855219 872645 786808
2564G86808Q6102j53993N0141J26425j62657j42551J03549K40257j88480O0972
$$ 786808 872910 718917 769058 895483 732826 590275 693824 934081 745601 806573
2554H06573P2653k44368L5911q6319r1190k47792M4611K91756l3698J84274l55391
$$ 806573 879226 634858 670769 584450 493260 245468 290079 581835 548137 732411 377020
2543C77020j49410K2495K75553j36819r7432j065J86861L3385j25023N4884m5940
$$ 377020 227610 250105 525658 388839 291407 290342 477203 510588 385565 440449 394509
2532C94509j65758Q0804K88437j48033j23253k57047Q9309K51362p5223O4638
$$ 394509 228751 309555 597992 449959 326706 69659 158968 410330 335107 399745
2522C99745j86581J58722J35617r5577o5125p0479M0372Q6101j50793J38727L8181
$$ 399745 213164 371886 507503 411926 346801 276322 316694 402795 252002 390729 428910
2511D28910k56494J36827J32899j41494j61750R4389K95552n8803j09434L2741
$$ 428910 172416 309243 442142 300648 138898 233287 528839 470036 360602 393343
$$ [...]
##END NTUPLES=NMR SPECTRUM
##END=
