##TITLE=1H_CA-9071-1
 CDCl3
 8 sc, 
 19.10.2022
##JCAMPDX= 6.0         $$ Bruker NMR JCAMP-DX V2.0
##DATA TYPE= NMR SPECTRUM
##DATA CLASS= NTUPLES
##ORIGIN= UXNMR, Bruker Analytische Messtechnik GmbH
##OWNER= root
$$ XWIN-NMR		Version 3.5
$$ Wed Oct 19 16:34:58 2022 Russian Standard Time (UT+4h)  she@DPX200
##.OBSERVE FREQUENCY= 200.1313499994
##.OBSERVE NUCLEUS= ^1H
##.ACQUISITION MODE= SIMULTANEOUS
##.ACQUISITION SCHEME= undefined
##.AVERAGES= 8
##.DIGITISER RES= 18
##SPECTROMETER/DATA SYSTEM= spect
##.PULSE SEQUENCE= zg30
##.SOLVENT NAME= CD2Cl2
##.SHIFT REFERENCE= (INTERNAL, CD2Cl2, 0, 15.7304)
##AUDIT TRAIL= $$ (NUMBER, WHEN, WHO, WHERE, WHAT)
$$ ##TITLE= Audit trail, XWIN-NMR		Version 3.5
$$ ##JCAMPDX= 5.01
$$ ##ORIGIN= Bruker BioSpin GmbH
$$ ##OWNER= she
$$ F:/spectra/data/she/nmr/H-F/1/pdata/1/auditp.txt
$$ ##AUDIT TRAIL=  $$ (NUMBER, WHEN, WHO, WHERE, WHAT)
(   1,<2022-10-19 16:33:46.89 +0400>,<she>,<DPX200>,
      <created by zg, POWCHK disabled, PULCHK disabled
       configuration hash MD5:
       00 E9 B6 7A A2 85 ED C7 34 08 36 98 17 FE 4E 26
       data hash MD5: 16K
       32 06 A7 92 86 5E EF 74 F4 56 16 E1 F1 7E DF 26>)
(   2,<2022-10-19 16:33:51.34 +0400>,<she>,<DPX200>,
      <Start of raw data processing
       efp BC_mod = 2 LB = 0.24 FT_mod = 6 PKNL = 1 PHC0 = -18033.55 PHC1 = 11.0007 SI = 16K 
       data hash MD5: 16K
       1A 2B BC D8 1D 32 92 CD E1 A9 B6 44 81 50 22 57>)
(   3,<2022-10-19 16:34:11.92 +0400>,<she>,<DPX200>,
      <pk PHC0 = -2.165224 PHC1 = 3.4 
       data hash MD5: 16K
       FA 87 0D D6 41 B7 B0 CD 84 27 38 D1 A8 50 2E 30>)
(   4,<2022-10-19 16:34:14.98 +0400>,<she>,<DPX200>,
      <abs ABSG = 5 
       data hash MD5: 16K
       BD D5 F2 1C FC FB C6 E0 17 62 D4 1A EB 01 7C EC>)
$$ ##END=
$$ 
$$ hash MD5
$$ F4 02 BF 2C 67 4A 2A 11 A9 2A 73 E4 4A EC 73 4D
##$RELAX= 
##$RELAX= 
##$RELAX= 
##$RELAX= 
##$RELAX= 
##$RELAX= 
$$ Bruker specific parameters
$$ --------------------------
##$DU= <F:/spectra>
##$EXPNO= 1
##$NAME= <H-F>
##$PROCNO= 1
##$TYPE= <nmr>
##$USER= <she>
##$AMP= (0..31)
100 100 100 100 100 100 100 100 100 100 100 100 100 100 100 100 100 100 
100 100 100 100 100 100 100 100 100 100 100 100 100 100 
##$AQSEQ= 0
##$AQ_mod= 1
##$AUNM= <au_zg>
##$AUTOPOS= <>
##$BF1= 200.13
##$BF2= 200.13
##$BF3= 200.13
##$BF4= 200.13
##$BF5= 200.13
##$BF6= 200.13
##$BF7= 200.13
##$BF8= 200.13
##$BYTORDA= 1
##$CFDGTYP= 0
##$CFRGTYP= 5
##$CHEMSTR= <none>
##$CNST= (0..31)
1 1 145 1 1 1 1 1 1 1 1 1 1 1 1 1 1 1 1 1 1 1 1 1 1 1 1 1 1 1 1 1 
##$CPDPRG= <>
##$CPDPRG1= <>
##$CPDPRG2= <>
##$CPDPRG3= <>
##$CPDPRG4= <mlev>
##$CPDPRG5= <mlev>
##$CPDPRG6= <mlev>
##$CPDPRG7= <mlev>
##$CPDPRG8= <mlev>
##$CPDPRGB= <>
##$CPDPRGT= <>
##$D= (0..31)
0 1.2 0 0 0 0 0 0 0 0.06 0 0.03 0 0 0 0 0.0002 0 0 0 0 0 0 0 0 0 0 0 0 
0 0 0 
##$DATE= 1666182826
##$DBL= (0..7)
120 120 120 120 120 120 120 120 
##$DBP= (0..7)
150 150 150 150 150 150 150 150 
##$DBP07= 0
##$DBPNAM0= <>
##$DBPNAM1= <>
##$DBPNAM2= <>
##$DBPNAM3= <>
##$DBPNAM4= <>
$$ [...]
##$SUBNAM3= <"">
##$SUBNAM4= <"">
##$SUBNAM5= <"">
##$SUBNAM6= <"">
##$SUBNAM7= <"">
##$SUBNAM8= <"">
##$SUBNAM9= <"">
##$SW= 18.0517283424941
##$SWIBOX= (0..15)
0 0 2 0 0 0 0 0 0 0 0 0 0 0 0 0 
##$SW_h= 3612.71676300578
##$TD= 16384
##$TD0= 1
##$TE= 0
##$TE2= 300
##$TE3= 300
##$TEG= 300
##$TL= (0..7)
0 120 120 120 120 120 120 120 
##$TP= (0..7)
150 150 150 150 150 150 150 150 
##$TP07= 0
##$TPNAME0= <>
##$TPNAME1= <>
##$TPNAME2= <>
##$TPNAME3= <>
##$TPNAME4= <>
##$TPNAME5= <>
##$TPNAME6= <>
##$TPNAME7= <>
##$TPOAL= (0..7)
0.5 0.5 0.5 0.5 0.5 0.5 0.5 0.5 
##$TPOFFS= (0..7)
0 0 0 0 0 0 0 0 
##$TUNHIN= 0
##$TUNHOUT= 0
##$TUNXOUT= 0
##$USERA1= <user>
##$USERA2= <user>
##$USERA3= <user>
##$USERA4= <user>
##$USERA5= <user>
##$V9= 5
##$VALIST= <valist>
##$VCLIST= <CCCCCCCCCCCCCCC>
##$VD= 0
##$VDLIST= <DDDDDDDDDDDDDDD>
##$VPLIST= <PPPPPPPPPPPPPPP>
##$VTLIST= <TTTTTTTTTTTTTTT>
##$WBST= 1024
##$WBSW= 4
##$XGAIN= (0..3)
0 0 0 0 
##$XL= 0
##$YL= 0
##$YMAX_a= 226489
##$YMIN_a= -386701
##$ZGOPTNS= <>
##$ZL1= 120
##$ZL2= 120
##$ZL3= 120
##$ZL4= 120
##$ABSF1= 15.72816
##$ABSF2= -2.323689
##$ABSG= 5
##$ABSL= 3
##$ALPHA= 0
##$AQORDER= 0
##$ASSFAC= 0
##$ASSFACI= 0
##$ASSFACX= 0
##$ASSWID= 0
##$AUNMP= <proc_1d>
##$AZFE= 0.1
##$AZFW= 0.1
##$BCFW= 0
##$BC_mod= 2
##$BYTORDP= 0
##$COROFFS= 0
##$CY= -3
##$DATMOD= 1
##$DC= 0
##$DFILT= <>
##$DTYPP= 0
##$F1P= 0
##$F2P= 0
##$FCOR= 1
##$FTSIZE= 16384
##$FT_mod= 6
##$GAMMA= 0
##$GB= 0
##$INTBC= 1
##$INTSCL= 3.70164e-10
##$ISEN= 128
##$LB= 0.24
##$LEV0= 0
##$LPBIN= 0
##$MAXI= 10000
##$MC2= 0
##$MEAN= 0
##$ME_mod= 0
##$MI= 1.114404
##$NCOEF= 0
##$NC_proc= -6
##$NLEV= 6
##$NOISF1= 3.799351
##$NOISF2= 2.8
##$NSP= 0
##$NTH_PI= 0
##$NZP= 0
##$OFFSET= 15.73036
##$PC= 1
##$PHC0= -18035.72
##$PHC1= 14.4007
##$PH_mod= 1
##$PKNL= yes
##$PPARMOD= 0
##$PSCAL= 0
##$PSIGN= 0
##$REVERSE= no
##$SF= 200.130008240109
##$SI= 16384
##$SIGF1= 3
##$SIGF2= 2
##$SINO= 5.538805
##$SIOLD= 16384
##$SREGLST= <1H.CDCl3>
##$SSB= 0
##$STSI= 16384
##$STSR= 0
##$SW_p= 3612.71676300578
##$SYMM= 0
##$S_DEV= 0
##$TDeff= 16384
##$TDoff= 0
##$TI= <>
##$TILT= no
##$TM1= 0
##$TM2= 0
##$TOPLEV= 0
##$USERP1= <user>
##$USERP2= <user>
##$USERP3= <user>
##$USERP4= <user>
##$USERP5= <user>
##$WDW= 1
##$XDIM= 16384
##$YMAX_p= 283581164
##$YMIN_p= -353443
$$ End of Bruker specific parameters
$$ ---------------------------------
##NTUPLES= NMR SPECTRUM
##VAR_NAME=  FREQUENCY,     SPECTRUM/REAL,   SPECTRUM/IMAG
##SYMBOL=    X,             R,               I
##VAR_TYPE=  INDEPENDENT,   DEPENDENT,       DEPENDENT
##VAR_FORM=  AFFN,          ASDF,            ASDF
##VAR_DIM=   16384,         16384,           16384
##UNITS=     HZ,            ARBITRARY UNITS, ARBITRARY UNITS
##FACTOR=    0.220516191357247, 1,           1
##FIRST=     3148.11708264951, 0,            0
##LAST=      -464.599680356267, 0,           0
##MIN=       -464.599680356267, -353443,     0
##MAX=       3148.11708264951, 283581164,    0
$$ Real data points
##PAGE= N=1
##DATA TABLE= (X++(R..R)), XYDATA
$$ [...]
5722H252343L29444J88088L44955M83431L70933L38183N64477N82983M87906P85699
5712A2728442Q99807Q94305J042329J082931J290526J192000J315957J096667
5704B1542964R72203O24833L43327O2295k49990o00947n65598n06263k86020k68487
5694B1068317k84581l29586j27069n6621j23446j47801j72715k00701l73464l08353
5684A8943980l46082k03558j85627o4854J1970Q4536L51654L85865O20573N87570
5674B0186027O33952P39915O94712N54541K56124O5389j59995o23079p14361p56429
5664B0876796j075341r01972p25140p43950n31032m80878l56717m39599k59567
5655A5362600k90027k31594K14691J59797L2698Q2960K62704L51643K75908M36429
$$ y = [8252343, 8581787, 8769875, 9114830, 9598261, 9969194, 10307377, 10871854, 11454837, 11942743, 12728442, 13628249, 14522554, 15564883, 16647814, 17938340, 19130340, 20446297, 21542964, 22515167, 23140000, 23483327, 23545622, 23295632, 22694685, 22129087, 21622824, 21336804, 21068317, 20783736, 20454150, 20327081, 20270460, 20147014, 19999213, 19826498, 19625797, 19252333, 18943980, 18597898, 18394340, 18208713, 18143859, 18155829, 18240365, 18592019, 18977884, 19598457, 20186027, 20819979, 21559894, 22254606, 22809147, 23065271, 23130660, 22970665, 22347586, 21633225, 20876796, 19801455, 18899483, 18174343, 17430393, 16899361, 16418483, 16061766, 15622167, 15362600, 15072573, 14840979, 15055670, 15215467, 15248165, 15331125, 15593829, 15945472, 16221380, 16657809]
5645A6657809M64072O12011Q28158Q52296J050713R15477J032034J256930J053819
5636B4723319Q09097N34797j07236n36059q50275j239116j345608j281306j224894
5627A9482719j259967r80446q50442p49855o26425p99159n46206k68101m17603
5618A2984515m26485l47493l03252k11212j06909j78918j91210J5329L8059P1744
5608A1344168K4181L04953K23710J01914J39512K13575L31817M80029M18541N62570
5598A4144970O87956P06806Q32184P81938Q39812J023354R06838P53699P26638
5589B1404195O23924M91263M15992K76862K00439K29825N5215N671O902p7427
5579B3632861n216o0604p0528O2481q0155j25984j79199k08481m44257p03412
$$ y = [16657809, 17121881, 17733892, 18562050, 19414346, 20465059, 21380536, 22412570, 23669500, 24723319, 25532416, 26067213, 25959977, 25423918, 24573643, 23334527, 21988919, 20707613, 19482719, 18222752, 17242306, 16391864, 15642009, 15015584, 14216425, 13670219, 13402118, 12984515, 12558030, 12210537, 11907285, 11696073, 11589164, 11410246, 11219036, 11234365, 11272424, 11344168, 11368349, 11673302, 11897012, 11998926, 12138438, 12352013, 12683830, 13163859, 13582400, 14144970, 14832926, 15539732, 16371916, 17153854, 17993666, 19017020, 19923858, 20677557, 21404195, 22028119, 22519382, 22935374, 23212236, 23412675, 23642500, 23697715, 23703386, 23710288, 23632861, 23627645, 23567041, 23496513, 23558994, 23478839, 23352855, 23173656, 22965175, 22520918, 21817506]
5569B1817506q30587q28409o98467n35879n68015l14941l14435m06184j47271
5560A7173318j32474j47722k33756k90802k55878m21448m88349m38087n42111
5551A4222691l44144l46248l27582l25899k73601j69319k12734k56455k55004
5542A1711705k01092p4857j73118k23040m09055k95706l44777l53530k30815k0361
5532I385354j78759k43408k47442j62581l8834j5643m5340j03087m4370j36583
5522H169307j71478j23987j35951j96585k93473n6620j58304l31469j83489j59221
5512F358730j79913l46206Q3604r7772j78069J3282O3702l00942l3970j93741
5502E188705k33298j65792j03240q2592q7674j19076j40085j23603n6507p4998
$$ y = [21817506, 20986919, 20158510, 19460043, 18924164, 18356149, 18041208, 17726773, 17320589, 17173318, 17040844, 16893122, 16659366, 16368564, 16112686, 15691238, 15202889, 14764802, 14222691, 13878547, 13532299, 13204717, 12878818, 12605217, 12435898, 12223164, 11966709, 11711705, 11510613, 11435756, 11262638, 11039598, 10630543, 10334837, 9990060, 9636530, 9405715, 9385354, 9206595, 8963187, 8715745, 8553164, 8514330, 8498687, 8453347, 8350260, 8305890, 8169307, 7997829, 7873842, 7737891, 7541306, 7247833, 7191213, 7032909, 6701440, 6517951, 6358730, 6178817, 5832611, 5916215, 5818443, 5640374, 5653656, 5717358, 5416416, 5382446, 5188705, 4955407, 4789615, 4686375, 4603783, 4516109, 4397033, 4256948, 4133345, 4076838, 4001840]
5492D001840j46162n223j89488k0365j1528j31076j38059l1123P6864p416L8685
5481C436949j44240r4010J8228k7411Q234r8651l9231P824K4035m4500l3328O8287
5469C082186M2700J35642m7554j47737N9696r4642P5396R25m1969R8544m9705
5458C113482n778R1549j6788O8920Q021L819p777M6581l9846k7080o4414L2426
5446C203115L8634k0402L9791N5390l5539K0585M4570l9788Q7234n5069K5619
5435C364140K11940O0583n6671K182J69553R2327m0384J0942J26639J52801M4124
5424D138176j4220M0189M7466O3281q1737J31156J52783K58596O9612n0359J39367
5413D894310R7869K55897J28522J69273L8951K44305K99191M18261J96119K58517
$$ y = [4001840, 3855678, 3850455, 3660967, 3640602, 3629074, 3497998, 3359939, 3328816, 3405680, 3398264, 3436949, 3292709, 3198699, 3216927, 3189516, 3197750, 3099099, 3059868, 3067692, 3091727, 3047227, 3013899, 3082186, 3124886, 3260528, 3212974, 3065237, 3124933, 3030291, 3105687, 3106612, 3064643, 3163187, 3113482, 3107704, 3199253, 3182465, 3251385, 3259406, 3263225, 3255448, 3302029, 3262183, 3235103, 3170689, 3203115, 3241749, 3221347, 3261138, 3316528, 3280989, 3301574, 3346144, 3306356, 3393590, 3338521, 3364140, 3576080, 3636663, 3579992, 3582174, 3751727, 3844054, 3803670, 3814612, 3941251, 4094052, 4138176, 4123956, 4164145, 4211611, 4274892, 4193155, 4324311, 4477094, 4735690, 4805302, 4754943, 4894310, 4992179, 5248076, 5376598, 5545871, 5584822, 5829127, 6128318, 6546579, 6742698, 7001215]
5403G001215L37204L20800M79459N21842L49857N02936N50865M56140M90683M78833
5393A1489834M30786L64693L12615L41721J82666J01406k40859k72056k93716
5384A2417090k49473j59184k80755j69752l09528k56730m6862o7783j76272j23233
5374A0577518q4968J70593M1424R6615J81914K12755L04852K13275L63040N58910
5364A2635928M13918N37367Q40501Q34044P43071P94330Q96669P44839Q64859
5355A9305526R28636P92995P57952Q52597O16346K39687P7596p5877j20179j50884
5345B3224395q2364J91637J14907K55487M05137N20603Q74786R56505J033372
5336B7494465J039546J182466J227787J209841J015145J015595R18566M03493
$$ y = [7001215, 7338419, 7659219, 8138678, 8660520, 9010377, 9513313, 10064178, 10520318, 11011001, 11489834, 11920620, 12285313, 12597928, 12939649, 13122315, 13223721, 12982862, 12710806, 12417090, 12167617, 12008433, 11727678, 11557926, 11248398, 10991668, 10944806, 10877023, 10700751, 10577518, 10492550, 10663143, 10704567, 10801182, 10983096, 11195851, 11500703, 11713978, 12077018, 12635928, 13049846, 13587213, 14427714, 15261758, 16004829, 16799159, 17695828, 18440667, 19305526, 20234162, 21027157, 21785109, 22637706, 23254052, 23493739, 23571335, 23495458, 23375279, 23224395, 23142031, 23333668, 23448575, 23704062, 24109199, 24629802, 25504588, 26461093, 27494465, 28534011, 29716477, 30944264, 32154105, 33169250, 34184845, 35103411, 35506904]
5328C5506904l9514m21177p83346r34089j253422j323691j424477j500533j366890
5319B6459765j256232j117711j070539r62163q23052o42019m76710k77042K0619
5310A9854916j5689J47546L61792N46901N27011P30840R72543J040246J013299
5301B5179405J125666J121978J133824J015731J013368R52364M54598L05527L5543
5292C2338004n45341q12578j181512j324815j356821j406979j491072j466332
5284B2752554j535700j455403j443093j329285j127073j074070q60951q61628
5276A3065351q63343n30390n45498n03931m52899m03340k53049l34094m13525
5267H765282l31509k00546j82735k55591j96268j20413j59187j99915j84338j60497
$$ y = [35506904, 35467390, 35046213, 34262867, 33328778, 32075356, 30751665, 29327188, 27826655, 26459765, 25203533, 24085822, 23015283, 22053120, 21230068, 20588049, 20111339, 19834297, 19854916, 19839227, 19986773, 20348565, 20895466, 21422477, 22153317, 23125860, 24166106, 25179405, 26305071, 27427049, 28560873, 29576604, 30589972, 31542336, 31996934, 32302461, 32338004, 31792663, 30980085, 29798573, 28473758, 27116937, 25709958, 24218886, 22752554, 21216854, 19761451, 18318358, 16989073, 15862000, 14787930, 13926979, 13065351, 12202008, 11671618, 11126120, 10622189, 10169290, 9765950, 9512901, 9178807, 8765282, 8433773, 8233227, 8050492, 7794901, 7598633, 7478220, 7319033, 7119118, 6934780, 6774283]
5257F774283j53979r3208j50808l8061j11518o235n8653L0588R3115J05951J37585
5246F529060J15814L2008K92852J43140K87405K44895K31717K70582M32134K85561
5236H865168J58323R1976K77366L5958j03118k6782l07560k49101k42292m61192
5226H038746m34885m71347l75641m02473k51857l93393m16695k11393k53827l50801
5216D476434j66206j70899l04274l1599j59197r0593j82953j14704j84509o5176
5206C006324q2499q3038k5362K547j0873N0384j57126o2925j32128l5457j3904
5195B455943q8438o9013j64904M0893p7237Q2133M5620n5738J879k13583q0365
5184A877190r3716m9657K11810l5586P7329q7236l0471Q7260j24694j33080k0753
$$ y = [6774283, 6620304, 6527096, 6376288, 6338227, 6226709, 6220474, 6161821, 6192409, 6285524, 6391475, 6529060, 6644874, 6676882, 6969734, 7112874, 7400279, 7645174, 7876891, 8147473, 8579607, 8865168, 9023491, 9115467, 9392833, 9428791, 9325673, 9298891, 8991331, 8742230, 8499938, 8038746, 7603861, 7132514, 6756873, 6354400, 6102543, 5709150, 5292455, 5081062, 4827235, 4476434, 4310228, 4139329, 3835055, 3803456, 3644259, 3553666, 3370713, 3256009, 3071500, 3006324, 2923825, 2840787, 2815425, 2817972, 2807099, 2857483, 2700357, 2637432, 2505304, 2469847, 2455943, 2367505, 2298492, 2133588, 2174481, 2097244, 2179377, 2224997, 2169259, 2171138, 1957555, 1877190, 1783474, 1733817, 1945627, 1910041, 1987370, 1900134, 1869663, 1956923, 1832229, 1699149, 1678396]
5173A678396M8868K5877j03529k3668j5336j5J2678j05251j15435N8206j61197
5162A299594k4266J61111J09619N253J4226r3606j7311J45461P2618L2528j40590
5151A564637k1815j08349O386o4832k4559K1919J01613K235l2031j49279m9043
5140A246882L5041M6952p1789N8565R608L5686j09987J15106k9736J4396O125
5129A356849l2310l2832L7179M493r002M3316R7871j85321N2800N0288l6451J4005
5117A360885J00314p6475j46778K16134l0812O62o2804M9654Q7582L2482j32688
5106A398156j4821J3573K209o6651M9559o4948l271j83996m3529P8963P0990J3431
5094A249665p3873q5677K3466R571k989M54j11202j5076J38305l0260J1571J3985
$$ y = [1678396, 1727264, 1753141, 1649612, 1625944, 1610608, 1610593, 1623271, 1518020, 1402585, 1460791, 1299594, 1275328, 1436439, 1546058, 1551311, 1565537, 1471931, 1454620, 1600081, 1672699, 1705227, 1564637, 1542822, 1434473, 1440859, 1376027, 1351468, 1373387, 1475000, 1477235, 1445204, 1295925, 1246882, 1281923, 1328875, 1257086, 1315651, 1325259, 1360945, 1250958, 1366064, 1336328, 1350724, 1356849, 1324539, 1291707, 1328886, 1333379, 1324377, 1367693, 1465564, 1280243, 1333043, 1383331, 1346880, 1360885, 1461199, 1384724, 1237946, 1454080, 1423268, 1423930, 1361126, 1410780, 1498362, 1530844, 1398156, 1383335, 1396908, 1399117, 1332466, 1382025, 1317077, 1313806, 1129810, 1086281, 1165244, 1236234, 1249665, 1175792, 1090115, 1113581, 1123152, 1120163, 1120617, 1009415, 994339, 1132644, 1102384, 1113955, 1127940]
5082A127940q391l9985O8948q500r142Q4721k7630m8535J9153p6696l9182M0842
5070A083543M8968o0137r6433N1146m0314K5427j4231n9137j3748N5919Q7112
5059A068115j21572n4737L0888Q9616J1908j5637L037J8304K2654o8342P6444
5048A060678J5988l4823r856Q1038O8604m0229q8604O5177K6065l5289q1662j1624
5036A015463J21261p235m6918M6383J81825l6100j04339j00078K4888O9444n271
5025A159323Q5674n2619P689N1960j5415q6532l2006J6350J2170j20263J07151
5014A133482L2554j00586k3851J24936o0584j38706P5609j254L9787p2781o0684
5003I47922O3664q3670O5357l8039R9145J44276j31030L1089R6951o3582m783
$$ y = [1127940, 1119549, 1079564, 1148512, 1140012, 1130870, 1215591, 1187961, 1139426, 1158579, 1081883, 1042701, 1083543, 1132511, 1072374, 975941, 1027087, 986773, 1012200, 997969, 938832, 925084, 981003, 1068115, 946543, 891806, 922694, 1012310, 1024218, 1008581, 1011618, 1029922, 1052576, 984234, 1060678, 1076666, 1041843, 1031987, 1113025, 1181629, 1141400, 1052796, 1117973, 1144038, 1108749, 1027087, 1015463, 1136724, 1129489, 1082571, 1128954, 1310779, 1274679, 1170340, 1070262, 1095150, 1164594, 1159323, 1244997, 1192378, 1200067, 1252027, 1236612, 1150080, 1118074, 1134424, 1146594, 1026331, 1133482, 1166036, 1065450, 1041599, 1166535, 1105951, 967245, 1042854, 1041600, 1081387, 1008606, 947922, 1011586, 927916, 993273, 955234, 1054379, 1198655, 1067625, 1098714, 1195665, 1132083, 1127300]
4992A127300k9999N5073J10141r3422l6091l5241Q9201K8149j32352m9102J10392
4981A144049m1599n7444J795n1572J21359J52747j19555P897P4014n302o3362
4970A163027j23107O2885M9840j8914Q696J09636j00223K6397r010N7897K1631
4959A248755l8061R4252n6524Q122l3321N9552k8639k1357l2704k3834q2266j18983
4947I74992O2885N1610r6894O3520J5889n411Q1994K4119o9677M1395j18724N5172
4935A080870o0917Q3776J4885l1404q1596J2250N3867K6102M8545r4675q0462
4924I71241K3188J33512J0108Q0064k8800P4292J30234j24818o168m9976J67232
4913A380109M9266j22665m1361o6393J6545o3116J1871O2644J33429n9602R9777
$$ y = [1127300, 1097301, 1152374, 1262515, 1169093, 1133002, 1097761, 1186962, 1215111, 1082759, 1033657, 1144049, 1102450, 1045006, 1046801, 995229, 1116588, 1269335, 1149780, 1157677, 1231691, 1226389, 1163027, 1039920, 1102805, 1152645, 1133731, 1142427, 1252063, 1151840, 1178237, 1169227, 1227124, 1248755, 1210694, 1304946, 1248422, 1256544, 1223223, 1282775, 1254136, 1232779, 1200075, 1176241, 1093975, 974992, 1037877, 1089487, 992593, 1056113, 1072002, 1066591, 1148585, 1172704, 1103027, 1144422, 1025698, 1080870, 1019953, 1103729, 1118614, 1087210, 1005614, 1017864, 1071731, 1097833, 1146378, 1051703, 971241, 994429, 1127941, 1138049, 1218113, 1189313, 1263605, 1393839, 1269021, 1262853, 1212877, 1380109, 1429375, 1306710, 1265349, 1198956, 1215501, 1152385, 1164256, 1226900, 1360329, 1300727, 1400504]
4902A400504j01577j29618K4876L6473q843r6761q6171J05456r3441N3523N2542
4891A156963L7632N7926k3570N9433O2793r5968J2480k3751O5491l4948P3269
4880A347750k3830L2091N5940K9817K8773j51317N379k1175M9475P4442K5740
4869A453085n0119L90O5706K2430J4392n8673J3947p6672m4538N2008P8672l3150
4857A437478Q2035O0869p293N3000J03100L8743p6805L6639n5963K1372q1577
4846A611598k5591j8363L316M710J35873L3272j28032n3004O4759P1464J0307
4835A710309l2403n0148N5456M5804k272m2734K7115n755J01276J1498n7238j5990
4823A744918l2725Q6279M0981l3988n4111m2229j1185J11323J5620K2819M6291
$$ y = [1400504, 1298927, 1169309, 1194185, 1230658, 1221815, 1125054, 1038883, 1144339, 1050898, 1104421, 1156963, 1194595, 1252521, 1228951, 1288384, 1351177, 1255209, 1267689, 1243938, 1309429, 1274481, 1347750, 1323920, 1356011, 1411951, 1441768, 1470541, 1319224, 1324603, 1303428, 1352903, 1427345, 1453085, 1402966, 1403356, 1469062, 1491492, 1505884, 1447211, 1461158, 1384486, 1339948, 1391956, 1470628, 1437478, 1519513, 1580382, 1573089, 1626089, 1729189, 1767932, 1691127, 1727766, 1671803, 1693175, 1611598, 1586007, 1567644, 1570960, 1575670, 1711543, 1744815, 1616783, 1563779, 1628538, 1700002, 1710309, 1677906, 1627758, 1683214, 1729018, 1726746, 1684012, 1711127, 1705372, 1806648, 1818146, 1760908, 1744918, 1712193, 1798472, 1839453, 1805465, 1751354, 1709125, 1697940, 1809263, 1824883, 1847702, 1893993]
4812A893993j52870P5439J68352j61356j3158L4695J16094K6747p7494K7500J01265
4801B039207l7917P9040J39970M3001R0178k6803p9441L6684M5937Q9712O3586
4790B483154J16785J01745J05792J98111J17815Q5018K43533K31856L03585K27570
4780D214964K67206R530o5903k38307l06362l45280j89102r8741o1092O8824m3566
4769C212171k0171J97126P9171o4085p9923o9824J42646J34403J04566R2422K9098
4758C757600K477J02116K64547J32848j01778O9418J87678J37241J04969K21932
4748D879048J07481J70177k9532K6870m1816J13437J09639Q3062J50170J19721
4738E688257J46450j1956K6511Q2810R5525K72441J79662O8529K29027K27004
$$ y = [1893993, 1741123, 1816562, 1984914, 1823558, 1810400, 1845095, 1961189, 1987936, 1910442, 1937942, 2039207, 2001290, 2080330, 2220300, 2263301, 2353479, 2326676, 2247235, 2283919, 2329856, 2419568, 2483154, 2599939, 2701684, 2807476, 3005587, 3123402, 3208420, 3451953, 3683809, 3987394, 4214964, 4482170, 4491700, 4425797, 4187490, 3881128, 3535848, 3346746, 3248005, 3186913, 3255737, 3212171, 3192000, 3389126, 3468297, 3404212, 3324289, 3254465, 3397111, 3531514, 3636080, 3728502, 3757600, 3760077, 3862193, 4126740, 4259588, 4157810, 4227228, 4414906, 4552147, 4657116, 4879048, 4986529, 5156706, 5127174, 5154044, 5112228, 5225665, 5335304, 5418366, 5568536, 5688257, 5834707, 5822751, 5849262, 5932072, 6027597, 6300038, 6479700, 6548229, 6777256, 7004260]
4728G004260J91689K66195L44668K10670K43945J44756K57659L30108K96856L90805
4718I681611L36746L22031m646j56597m4896k43371m74700l89716l40665k31935
4708H453862j0021n8352j91680l3890J09544j9426k009J70688M6887N8537L8287
4697H562427J26821J98695J31153J32942K70492J16731K95514K20438J51807J92607
4687A0399627Q3337Q2711K04716J67934K1258K12906J77805J86505P2896O8135
4677A1677830J79025K68109J16014O837M6195k0996k4472J40054P4574L2680J47687
4666A2643537N5691K6204M0273J32417J39100L21509K83087L35052L76568L89111
4656A4742549L64635N08283L70026O45476N53519M24192M25366L09877M21083
$$ y = [7004260, 7195949, 7462144, 7806812, 8017482, 8261427, 8406183, 8663842, 8993950, 9290806, 9681611, 10018357, 10340388, 10335742, 10179145, 10134249, 9890878, 9416178, 9026462, 8685797, 8453862, 8443841, 8385489, 8193809, 8159919, 8269463, 8250037, 8248028, 8418716, 8465603, 8524140, 8562427, 8689248, 8887943, 9019096, 9152038, 9422530, 9539261, 9834775, 10055213, 10207020, 10399627, 10482964, 10565675, 10770391, 10938325, 10959583, 11172489, 11350294, 11536799, 11609695, 11677830, 11856855, 12124964, 12240978, 12247815, 12294010, 12273014, 12248542, 12388596, 12463170, 12495850, 12643537, 12699228, 12725432, 12765705, 12898122, 13037222, 13358731, 13641818, 13976870, 14353438, 14742549, 15107184, 15615467, 15985493, 16630969, 17184488, 17608680, 18034046, 18343923, 18765006]
4647A8765006K41152Q4724J98422J0883k50945l48186l20696k81598l59081m37353
4637A7302328n51250k41464j89862m21182k17522j41403k43426j09937J6922J97842
4627A5401046O6373J5295O3294J75419J85831L19864K93283K94167K56911K31070
4617A7302553K05376K91403J83285K04771J43362O4120l449J24773l6013j28064
4607A8352117n7278k3289j73534l4429P8889J78286M8797K43223J16172J48668
4597A8877622L59488K69186L41110M61490L86630O18265P28826O15413P77115
4588B3435145Q77549P46875N44475M29167M12735M81338O00951O23346Q28588
4579B8980169J274981J304215J318297J301649J266373Q13949N19799K92143j62167
$$ y = [18765006, 19006158, 19090882, 19289304, 19300187, 19049242, 18701056, 18380360, 18098762, 17739681, 17302328, 16751078, 16509614, 16319752, 15898570, 15681048, 15539645, 15296219, 15186282, 15203204, 15401046, 15467419, 15482714, 15546008, 15721427, 15907258, 16227122, 16520405, 16814572, 17071483, 17302553, 17507929, 17799332, 17982617, 18187388, 18330750, 18394870, 18391421, 18516194, 18480181, 18352117, 18294839, 18271550, 18098016, 18063587, 18142476, 18320762, 18369559, 18612782, 18728954, 18877622, 19237110, 19506296, 19847406, 20308896, 20695526, 21313791, 22042617, 22658030, 23435145, 24312694, 25059569, 25604044, 26033211, 26445946, 26927284, 27528235, 28151581, 28980169, 30255150, 31559365, 32877662, 34179311, 35445684, 36259633, 36779432, 37071575, 36909408]
4570C6909408m61500n63855o36535q96243j051919j055438j099137j082519r25154
4561B9137108p69468n94955n51029m61719j48920m19814k61014j03196l06620
4552B5520373l04937k67260l41379l13785l42072l96065m44884m94416m83638
4543B2131937n23976o60524n00026m19727n14295l58944k48905l01319j33510
4534A8470711o8435M5296J1672Q0353L09055L50598L11484L10298M41722N56529
4524B0819283M54707M72920N58789K98067J93488O9559j05392k3560k9383l7469
4514B2671009L1572J06385K01467M95454L79006M56212N52247M73884N87993O62945
4504B6618174K80987J97586J86150J11866J0190j58553j37723k59904l35949j82588
$$ y = [36909408, 36447908, 35884053, 35247518, 34351275, 33299356, 32243918, 31144781, 30062262, 29137108, 28367640, 27772685, 27221656, 26759937, 26611017, 26191203, 25930189, 25826993, 25520373, 25215436, 24948176, 24606797, 24293012, 23950940, 23554875, 23109991, 22615575, 22131937, 21607961, 20947437, 20447411, 20027684, 19513389, 19154445, 18905540, 18604221, 18470711, 18402276, 18447572, 18459244, 18539597, 18848652, 19199250, 19510734, 19821032, 20262754, 20819283, 21273990, 21746910, 22305699, 22603766, 22797254, 22866813, 22761421, 22737861, 22708478, 22671009, 22702581, 22808966, 23010433, 23505887, 23884893, 24341105, 24893352, 25367236, 25955229, 26618174, 26899161, 27096747, 27282897, 27394763, 27404953, 27246400, 27108677, 26848773, 26512824, 26330236]
4494B6330236k01804j01672j74466j52378j11158q8828m3593j60188O212J28118
4484B5430479L08279K29470M76358N75880O35769R80677J010282J091971J344970
4475C2084135J427539J431860J607415J549001J387259J190888R54139N18710
4467D2150946J84316q7491l80459m16963o01412n17823m51287m75865k54343k51056
4457C8898563l07982l70582l71537l83534l63273m85885n49018l90418l89355
4448C5286979k70885m56606l66637l15829k64389l71640m12113k46927j36582
4439C2445371l53730j62013l69951l05411k44148k29589k92024L3635L12784J66560
4429C1001484M54730O85630P54492R71363J023550R63772J121639J090661J047798
$$ y = [26330236, 26128432, 26026760, 25852294, 25699916, 25588758, 25499930, 25456337, 25296149, 25302361, 25430479, 25738758, 25968228, 26444586, 27020466, 27656235, 28636912, 29647194, 30739165, 32084135, 33511674, 34943534, 36550949, 38099950, 39487209, 40678097, 41632236, 42150946, 42335262, 42247771, 41867312, 41450349, 40848937, 40331114, 39879827, 39403962, 39149619, 38898563, 38590581, 38219999, 37848462, 37464928, 37101655, 36615770, 36066752, 35676334, 35286979, 35016094, 34559488, 34192851, 33877022, 33612633, 33240993, 32828880, 32581953, 32445371, 32091641, 31929628, 31559677, 31254266, 31010118, 30780529, 30488505, 30522140, 30834924, 31001484, 31456214, 32141844, 32896336, 33867699, 34891249, 35855021, 36976660, 38067321, 39115119]
4420C9115119R08138O47674M30792N3935l55330m94009n50405o04638q08297o38451
4410C7704528o19547p17980n14885l04087l20631k71320L2402K00414K78355N47963
4400C6015212P19439Q98287Q95830J147050J351480J472571J613242J617424J700260
4391D7430795J725508J864143K052059K251783K196839K037769J204456o57378
4383F0105974k793515m049067l951342l464638k753638k408588j820722j522922
4375C7341542j183596p06275m10306j36890j1185K7688J61114j5394n27772q42240
4365C3696686j008345j132849j217783j250772j205748r84624q49713o85885q11413
4356B4549554r19304o47750n59455o21437n66027m25026l34532l62597k36229
$$ y = [39115119, 40023257, 40670931, 41101723, 41155658, 40800328, 40306319, 39755914, 39151276, 38342979, 37704528, 37084981, 36367001, 35852116, 35548029, 35227398, 34956078, 34988480, 35188894, 35467249, 36015212, 36734651, 37632938, 38528768, 39675818, 41027298, 42499869, 44113111, 45730535, 47430795, 49156303, 51020446, 53072505, 55324288, 57521127, 59558896, 60763352, 60105974, 57312459, 53263392, 49312050, 45847412, 43093774, 40685186, 38864464, 37341542, 36157946, 35451671, 35041365, 34904475, 34893290, 34920978, 35082092, 35066698, 34538926, 33696686, 32688341, 31555492, 30337709, 29086937, 27881189, 26896565, 26046852, 25360967, 24549554, 23630250, 22982500, 22423045, 21801608, 21235581, 20810555, 20476023, 20113426, 19877197]
4347A9877197j08215o92p7022l9610j1239j7450k3636K3034j1461r4142j18301
4336A9398463k83592k05006j65874j52239k31720k97291l75297m31347m36733
4327A6819364l46432k85882m89859k65841k38613k44075k06408p8671o2016O9996
4317A4671563J1387o5033j6519j56978j16062j38923L4710j14173j55771j61615
4307A3792586j74397P2074L5131m1075M189J7541M5575q2063P7214K08631J76268
4296A4131674J53842J48246L36290L02052L13245J63195M52016M44691K66780
4287A6712031N16368O13976N27332O79795O57451P36633P57813P21572Q46452
4278B2769423R55691J174645J090147J171754J311856J447521J508892J807026
$$ y = [19877197, 19768982, 19768290, 19691268, 19651658, 19640419, 19622969, 19599333, 19622367, 19610906, 19516764, 19398463, 19114871, 18909865, 18743991, 18591752, 18360032, 18062741, 17687444, 17256097, 16819364, 16472932, 16187050, 15697191, 15431350, 15192737, 14948662, 14742254, 14663583, 14601567, 14671563, 14682950, 14617917, 14601398, 14444420, 14328358, 14189435, 14224145, 14109972, 13954201, 13792586, 13618189, 13690263, 13725394, 13684319, 13688508, 13706049, 13751624, 13669561, 13746775, 13955406, 14131674, 14285516, 14433762, 14770052, 15072104, 15385349, 15548544, 16000560, 16445251, 16712031, 17228399, 17842375, 18369707, 19049502, 19706953, 20443586, 21201399, 21922971, 22769423, 23725114, 24899759, 25989906, 27161660, 28473516, 29921037, 31429929, 33236955]
4270C3236955K122870K329187K610514K881061L286764L840532M420948N009921
4262E9738752N650901O495592P411475Q704466R516773J0094893J0064981Q684945
4254A26362778N480954P35130m809784r123831j1363151j1665009j0678857r499882
4246G5438348q030951o914844n872909m958035m179308l530031l073984k617614
4238C6260672k382026k182573j932231j629245j403282j352353j359285j078240
4230B2941437r98355j084519q67143q33052p32806o84633o58733o38120o07083
4221A5836993n64114n12312n30142o34712l49214m46533n24129k80095l37803
4212A1657939l25557l28324k74788l29479l04646j40476m5419k03245j20580l04125
$$ y = [33236955, 35359825, 37689012, 40299526, 43180587, 46467351, 50307883, 54728831, 59738752, 65389653, 71885245, 79296720, 88001186, 97517959, 107612852, 117677833, 126362778, 131843732, 132578862, 127769078, 118645247, 107282096, 95617087, 84938230, 75438348, 67407397, 60492553, 54619644, 49661609, 45482301, 41952270, 38878286, 36260672, 33878646, 31696073, 29763842, 28134597, 26731315, 25378962, 24019677, 22941437, 21943082, 20858563, 19991420, 19158368, 18425562, 17740929, 17082196, 16444076, 15836993, 15272879, 14760567, 14230425, 13595713, 13246499, 12799966, 12275837, 11995742, 11657939, 11332382, 11004058, 10729270, 10399791, 10095145, 9954669, 9909250, 9706005, 9585425, 9281300]
4202I281300k62724j14547k23362o9900l00382j06942n5223k26227j93262j33640
4192G595091j54779r0810j31654j74183p0203j48872m0619q8027j19807q4242
4182F491895r5319r2496j17801l4776o419j37917n8850j35052k2896j53006n5456
4171E581907K5847r5299p2885l8720J3194l9829j41742J6603q162m4114l9090
4160E157710j1055m9558j79074q9485o2798q5372p0808q9614O880n5970m560R5044
4148D561340k4499o8506J36140O617J5548J15172j73219J6079J92779J00123j00046
4137D777528Q2968m454o8511K7334k09730j73773j55850j57810k3881r4525o2716
4126C936580q8161L2025o6840n6559L1073j02080L7956R047j26448M8251o1985
$$ y = [9281300, 9018576, 8904029, 8680667, 8610767, 8310385, 8203443, 8148220, 7921993, 7728731, 7595091, 7440312, 7349502, 7217848, 7043665, 6973462, 6824590, 6783971, 6695944, 6576137, 6491895, 6396576, 6304080, 6186279, 6151503, 6145084, 6007167, 5948317, 5813265, 5790369, 5637363, 5581907, 5607754, 5512455, 5439570, 5400850, 5414044, 5374215, 5232473, 5249076, 5240914, 5196800, 5157710, 5146655, 5097097, 4918023, 4828538, 4765740, 4680368, 4609560, 4519946, 4526826, 4470856, 4466296, 4561340, 4536841, 4468335, 4604475, 4611092, 4626640, 4741812, 4568593, 4584672, 4777451, 4877574, 4777528, 4860496, 4856042, 4787531, 4814865, 4605135, 4431362, 4275512, 4117702, 4093821, 3999296, 3936580, 3848419, 3880444, 3813604, 3757045, 3788118, 3686038, 3723994, 3733041, 3606593, 3654844, 3592859]
4115C592859J6068M4295m3841l3279L0098J53403k0432k17576p242J16911R3329
4104C724593j65795l7603o8112J294Q2776n1666M3526J07563N6386O095k7490
4093C671567J11744J16048r0151R4407l676N724P9414k1309K0739L9109m6027
4082C977589p171R8108J39275j47703j7985K1353P245O2394k2342r5741R2673
4071D107695L2858l9186K18842K5349j4001R0988O5728N235q5215O7190J26344
4060D601827K5853L7638l286J01642J98640P416P8090J42760R0181l1676M4110
4049E293195K40582l6758J30425J73277R5338R3832l9331R1834J49380K11061
4039F402835K69088J19186J59808R7529J57219K68303J53553J59574K17655K64145
$$ y = [3592859, 3608927, 3653222, 3609381, 3576102, 3606200, 3759603, 3739171, 3521595, 3514353, 3631264, 3724593, 3558798, 3521195, 3453083, 3454377, 3537153, 3485487, 3529013, 3636576, 3692962, 3699057, 3671567, 3783311, 3899359, 3809208, 3903615, 3899939, 3905663, 3985077, 3963768, 3984507, 4023616, 3977589, 3970418, 4068526, 4207801, 4060098, 4042113, 4063466, 4070711, 4133105, 4110763, 4015022, 4107695, 4140553, 4101367, 4320209, 4345558, 4331557, 4422545, 4488273, 4493508, 4408293, 4475483, 4601827, 4627680, 4665318, 4662032, 4763674, 4962314, 4969730, 5047820, 5190580, 5280761, 5249085, 5293195, 5533777, 5497019, 5627444, 5800721, 5896059, 5989891, 5950560, 6042394, 6191774, 6402835, 6671923, 6791109, 6950917, 7048446, 7205665, 7473968, 7627521, 7787095, 8004750, 8268895]
4029H268895J26602K70147K03891K24287L54202K30158L98351J81840K21906N20484
4019A1000763M60950M90735L90389K29626K55291M37073L98012M33308K96821
4010A4392968K12658M59482N40513M72734M90186O98072N94431N22376O81109
4001A9064529M20032K59980K17385M8409N9699P4889K00112K77160K55466L76642
3991B1254303N01069N55675L40201L02985K17239j06073k81858n29086m36700
3982B1817755o64220m46702l33199k99584j70680j07833n9207k94147j23129k69596
3972A9049458l96084n96186p73743o73146q16868n86995m81721n44102m89289
3963A3691324m04035k12735l67525m48951k50816m20850m78875m44232n14325
$$ y = [8268895, 8395497, 8665644, 8869535, 9093822, 9448024, 9678182, 10076533, 10258373, 10480279, 11000763, 11461713, 11952448, 12342837, 12572463, 12827754, 13264827, 13662839, 14096147, 14392968, 14605626, 15065108, 15605621, 16078355, 16568541, 17266613, 17861044, 18383420, 19064529, 19484561, 19744541, 19961926, 20010335, 20070034, 20144923, 20345035, 20622195, 20877661, 21254303, 21755372, 22311047, 22651248, 22954233, 23171472, 23065399, 22783541, 22254455, 21817755, 21153535, 20706833, 20373634, 20074050, 19903370, 19795537, 19736330, 19442183, 19319054, 19049458, 18653374, 18057188, 17283445, 16610299, 15793431, 15206436, 14724715, 14180613, 13691324, 13287289, 13074554, 12707029, 12258078, 12007262, 11586412, 11107537, 10663305, 10148980]
3954A0148980l65060l78629k97941l75887m26592m07318k31379m56894k13585
3945F995695k66823k19847j21934k71331k83573j70205j67079l12941k31311k68385
3935D682266k46062o0362q9197j37689p2173k87431J1409p0413j72892p4465o8744
3924C414247q3669q0805q6649o4172O8577j06561p4981J32997j20405j15228r1302
3913B792049q5928J306j73010l8001J8875L6560k7725j06204r6205n5916k1824
3902B243977l3512K9695j5690o1313n5384j1099k238L798K1224j44734j19980
3891A854744J06991l6977R116J07648j6807j19253j24302L7912j0738N297L9818
3880A853449K1231q3048j74026R2297N7083o0717o6675j5572p8466O2146R6575
$$ y = [10148980, 9783920, 9405291, 9107350, 8731463, 8304871, 7897553, 7666174, 7209280, 6995695, 6728872, 6509025, 6387091, 6115760, 5832187, 5661982, 5494903, 5181962, 4950651, 4682266, 4436204, 4375842, 4286645, 4148956, 4076783, 3789352, 3800761, 3730348, 3557456, 3482991, 3414247, 3330578, 3249773, 3163124, 3098952, 3167529, 3060968, 2985987, 3118984, 2998579, 2883351, 2792049, 2706121, 2707427, 2534417, 2496416, 2515291, 2551851, 2524126, 2417922, 2321717, 2265801, 2243977, 2210465, 2240160, 2224470, 2163157, 2107773, 2096674, 2094436, 2098234, 2119458, 1974724, 1854744, 1961735, 1924758, 1933874, 2041522, 2024715, 1905462, 1781160, 1819072, 1808334, 1813631, 1853449, 1874680, 1791632, 1617606, 1709903, 1766986, 1706269, 1639594, 1624022, 1545556, 1607702, 1704277]
3869A704277J1139j40052O1001q2164j05551m2492j2066R3424l5961N5045o3402
3858A443198n2130n6647J91921l1938o7917j9251l3855J5625O5177J31627k36194
3847A349616j50082J38406J12248M139M572j53113M0560N8826o1384M8362J9030
3836A411180j95699n5785J3146R3031J0031J06431J5629j47150N7346K5928j1155
3825A322933j09030n3414J50886o2505o8921K5322m9470l0643p5274q094K9231
3814A071021J8001J1257O5344r4893m577O39L412J29310R6906r4093N8176j65869
3802A094634P2742Q8275K7594n0293j82040L7371M4523r8798J4118J17296J6805
3791A182227L7700p9048j4935K7229r1987j14443J9831L6876L3961Q8529m9808
$$ y = [1704277, 1715416, 1575364, 1636365, 1554201, 1448650, 1406158, 1394092, 1487516, 1451555, 1506600, 1443198, 1391068, 1334421, 1526342, 1494404, 1426487, 1407236, 1373381, 1389006, 1454183, 1585810, 1349616, 1199534, 1337940, 1450188, 1454327, 1458899, 1305786, 1346346, 1405172, 1343788, 1392150, 1411180, 1215481, 1159696, 1172842, 1265873, 1275904, 1382335, 1397964, 1250814, 1308160, 1334088, 1322933, 1213903, 1160489, 1311375, 1248870, 1179949, 1205271, 1155801, 1125158, 1049884, 1041790, 1071021, 1089022, 1100279, 1165623, 1070730, 1066153, 1066792, 1070204, 1199514, 1296420, 1202327, 1260503, 1094634, 1167376, 1255651, 1283245, 1232952, 1050912, 1088283, 1132806, 1034008, 1048126, 1165422, 1182227, 1219927, 1140879, 1125944, 1153173, 1061186, 946743, 966574, 1003450, 1037411, 1125940, 1076132]
3780A076132k6537k0256m965J7614J34790j9454j25861O0015k0935l2746p6944
3769I60853J45535j00974o5310K8005j2568N6908j21595P4187R4617L8493J2171
3758A110322j2819p607r3902n9269k754O5644l5575J21028n3919m8279J08429
3747A091299Q5813n9567p7820M044o7847o5628q159J52906j08726P6971P6533
3736A099819l2549J0008m6015j2464J2232j00749N8840o5380q4027K54295J63250
3725A257260l1083q3081r2921m7816J12552m8100o4407P8080n2897L594p947R7743
3713A120977l8886k2805o513M2152J37183m6769j8099Q3121L8296j20698j17167
3702A050792M5107J11214J0083l1355o5617j7449p3551n6232R7378N4298p643
$$ y = [1076132, 1049595, 1029339, 1024374, 1041988, 1176778, 1157324, 1031463, 1091478, 1070543, 1037797, 960853, 1106388, 1005414, 940104, 968109, 955541, 1012449, 890854, 965041, 1059658, 1098151, 1110322, 1097503, 1089896, 995994, 936725, 933971, 999615, 964040, 1085068, 1031149, 982870, 1091299, 1177112, 1117545, 1039725, 1043769, 975922, 910294, 902135, 1055041, 946315, 1023286, 1099819, 1067270, 1077278, 1031263, 1018799, 1031031, 930282, 989122, 923742, 839715, 1094010, 1257260, 1226177, 1143096, 1050175, 1002359, 1114911, 1066811, 1002404, 1080484, 1027587, 1031181, 1023234, 1120977, 1082091, 1059286, 1052773, 1094925, 1232108, 1185339, 1167240, 1250361, 1288657, 1167959, 1050792, 1095899, 1207113, 1217196, 1185841, 1120224, 1102775, 1029224, 972992, 1070370, 1124668, 1117025]
3691A117025J27124j2898m3379o5029q775R4692k7164J6132J67943m4261q1786
3680A239624r8791Q8266P9028O3031l007j10092P780M4276p7430p6624L4659n1408
3668A139312L00P6609j31613P735M2896P4636P4257n2439p9080P5332J5481m6897
3656A196529q0317J01348n9181o5689j1921m7972J17298o0374N4237L9415N8099
3645A241472J18072J05761j32870j20703J05287l8223m9591J22844J9524j15876
3635A255697k5629o1168L6882J4567Q7849j9809j2479J07024j5947q4069M7861
3624A330779K9818o6817J18548o4816l8846Q7866o0134J3208J29773m3162O7444
3613A503661n2273O5759l8311j14584J2907J34932L0912M7755r7370Q0900O165
$$ y = [1117025, 1244149, 1231251, 1187872, 1122843, 1114068, 1208760, 1181596, 1197728, 1365671, 1321410, 1239624, 1140833, 1229099, 1308127, 1371158, 1368151, 1258059, 1265839, 1310115, 1232685, 1156061, 1190720, 1139312, 1139612, 1216221, 1084608, 1092343, 1135239, 1209875, 1284132, 1231693, 1152613, 1227945, 1243426, 1196529, 1116212, 1217560, 1158379, 1092690, 1080769, 1032797, 1150095, 1089721, 1143958, 1183373, 1241472, 1359544, 1465305, 1332435, 1211732, 1317019, 1278796, 1229205, 1352049, 1371573, 1255697, 1230068, 1168900, 1205782, 1220349, 1308198, 1288389, 1275910, 1382934, 1366987, 1282918, 1330779, 1360597, 1293780, 1412328, 1347512, 1308666, 1396532, 1336398, 1349606, 1479379, 1436217, 1503661, 1451388, 1517147, 1478836, 1364252, 1377159, 1512091, 1543003, 1590758, 1493388, 1574288, 1580453]
3602A580453M6779k7829n1280k0465L1469R82K1370O657k6553o126M3862M6216
3590A645535N5948q85L7437K9401j13055l187R6817l6888O0879P5734k02699J32843
3578A777880N0257M495J18911r1967q1407J11377R583j9735J8239k1572J17045
3567A993106J49660p3336m2065M392Q4570J20231q3232n29Q0129r5725L0722J16153
3555B284076q5272K3533P2301l6473J9l853N7348k1040o1258k1828j4077Q3421
3543B276897O7039M9359K195j15912L1358j2491P821j39564K9229R8291K6008
3532B320230K5241J14139q4260K3680l440J21227j0050k0541O3169l079j19741
3521B426575K053J19889j2747p2772O255p2939n6130O9471J10261k8976P9794
$$ y = [1580453, 1627232, 1599403, 1548123, 1527658, 1559127, 1560109, 1581479, 1588136, 1561583, 1555457, 1599319, 1645535, 1701483, 1700598, 1738035, 1767436, 1654381, 1651194, 1748011, 1711123, 1772002, 1847736, 1645037, 1777880, 1828137, 1832632, 1951543, 1859576, 1778169, 1889546, 1899129, 1879394, 1897633, 1876061, 1993106, 2142766, 2069430, 2027365, 2031757, 2116327, 2236558, 2153326, 2152797, 2232926, 2137201, 2167923, 2284076, 2198804, 2222337, 2294638, 2258165, 2258184, 2254331, 2311679, 2290639, 2229381, 2207553, 2193476, 2276897, 2343936, 2393295, 2395490, 2279578, 2310936, 2298445, 2306266, 2166702, 2195931, 2294222, 2320230, 2345471, 2459610, 2375350, 2399030, 2395590, 2516817, 2506767, 2486226, 2549395, 2546316, 2426575, 2428628, 2548517, 2535770, 2462998, 2469253, 2396314, 2340184, 2409655, 2519916, 2490940, 2570734]
3510B570734O3214o2302l9703j09186m1120j5974O9588n825M3148m5473j28680
3499B298421j1546J23361q7618j04864l2967J15474J74018O4358j37290P2826
3489B474173J8706j37164q9613N6979O4691l8279l1523n7409P9677l2146J63571
3478B471663n1529p3386J63289n3290n7143n8243K2462J0824J73948J6397j7426
3467B547566m0782N0945j0548L115R6282l1815k1116J40525L7647j09246N826
3456B668399J07643J8826J35180Q1352p3101p3834R1206M2886J0036N3470o499
3445C055564L8717J2936N7572J13357o3471o2366Q2883J31398J86299O743l9655
3434C519977J78332K742J29305J05833L1712J7535R9106J67848J64308m5030L1483
$$ y = [2570734, 2633948, 2571646, 2531943, 2422757, 2381637, 2365663, 2435251, 2429426, 2472574, 2427101, 2298421, 2286875, 2410236, 2322618, 2217754, 2184787, 2300261, 2474279, 2538637, 2401347, 2474173, 2492879, 2355715, 2266102, 2323081, 2387772, 2349493, 2317970, 2260561, 2340238, 2308092, 2471663, 2420134, 2346748, 2510037, 2456747, 2399604, 2341361, 2363823, 2374647, 2548595, 2564992, 2547566, 2506784, 2557729, 2547181, 2550296, 2646578, 2614763, 2593647, 2734172, 2771819, 2662573, 2668399, 2776042, 2794868, 2930048, 3011400, 2938299, 2864465, 2955671, 2998557, 3008593, 3062063, 3055564, 3094281, 3107217, 3164789, 3278146, 3214675, 3152309, 3235192, 3366590, 3552889, 3559632, 3519977, 3698309, 3701051, 3830356, 3936189, 3967901, 3985436, 4084542, 4252390, 4416698, 4371668, 4403151]
3423D403151N8687J392J12854q4905N2724J8360J19229K7627M6923l2570R4468
3412D817940k8456J6590Q8301O0144k6283O4875R2961Q7237l1520o1475l9642
3401E040672J79043O6071M391j59700j19511J27570J15662Q9565J3157M9341M0875
3390E447136J22354n8972R0910o9O27N3294l4288m111J95563L2281l5258M1672
3378E851139O7900K5676P1455p753M4163K0290Q3942J04735L6613P4861L5553
3367F408574P0947N806N3557K89030P5837J0560J36364L1422j665N6810J95076
3356G332318L9761J38448j25001J38075J67763J84165K62626Q1052K8275R8056
3346H345538J68771J55352N7504J17951K14742R8476J99800K10156K12688J26115
$$ y = [4403151, 4461838, 4463230, 4576084, 4491179, 4543903, 4562263, 4681492, 4709119, 4756042, 4723472, 4817940, 4789484, 4806074, 4894375, 4954519, 4928236, 4993111, 5086072, 5173309, 5141789, 5080314, 5040672, 5219715, 5285786, 5290177, 5130477, 5010966, 5138536, 5254198, 5343763, 5356920, 5406261, 5447136, 5569490, 5510518, 5601428, 5601359, 5601986, 5655280, 5620992, 5616881, 5812444, 5844725, 5809467, 5851139, 5919039, 5944715, 6016170, 6008417, 6052580, 6072870, 6156812, 6261547, 6298160, 6373021, 6408574, 6479521, 6485327, 6538884, 6827914, 6903751, 6914311, 7050675, 7082097, 7080432, 7137242, 7332318, 7372079, 7510527, 7385526, 7523601, 7691364, 7875529, 8138155, 8219207, 8247482, 8345538, 8514309, 8669661, 8727165, 8845116, 9059858, 9158334, 9358134, 9568290, 9780978, 9907093]
3336I907093K40256K67732J22051K38649K16359K5973K02626K51559K05638K29774
3326A1907710J49995L12064K17057P0883K44216K01938K56936K39156K89638J74746
3316A4064339J48734L04974K93788P1094M11233K88538K71065M05920K91382L44388
3306A6895455L65097L23551M03702N59261M17711N31597N08131O67202O19554
3297B1291261O04533O54708P49469R49260R23053J012000J017039J192495J339865
3288B9733683J256382J659632J696521J738607J900301K195255K050329K321182
3280D4551892K421792K271390K514858K413953K348934K450445K518691K255326
3272F3747281K208004K329307K099435J932756J775204J605630J340215J117951
$$ y = [9907093, 10147349, 10415081, 10537132, 10775781, 10992140, 11018113, 11220739, 11472298, 11677936, 11907710, 12057705, 12369769, 12586826, 12657709, 12901925, 13103863, 13360799, 13599955, 13889593, 14064339, 14213073, 14518047, 14811835, 14882929, 15294162, 15582700, 15853765, 16259685, 16551067, 16895455, 17260552, 17584103, 17987805, 18547066, 18964777, 19496374, 20004505, 20671707, 21291261, 21895794, 22550502, 23299971, 24249231, 25172284, 26184284, 27201323, 28393818, 29733683, 30990065, 32649697, 34346218, 36084825, 37985126, 40180381, 42230710, 44551892, 46973684, 49245074, 51759932, 54173885, 56522819, 58973264, 61491955, 63747281, 65955285, 68284592, 70384027, 72316783, 74091987, 75697617, 77037832, 78155783]
3264G8155783J045880R17382Q34708R77091J136425J126207J097834J236224J381174
3255H7908708J428032J637530J573691J765504J991512K193218K391772K744086
3247A03634053L158419L348250L674976L781528L466899L136323K658576J976937
3239A28835961J077672L06670m82193j025571j235086j424518j444699j220613
3231A23387623r36714p65104p42475p87347j218765j866063k578423l502261m341332
3222A06649139m859357n277657n604291n703793n534531n218629m902549m339798
3214F5208534l868928l682972l162297k703405k585866k532582k149570j844597
3206D2678317j658831j577621j383344j175315j256928j018512j059250j111311
$$ y = [78155783, 79201663, 80119045, 80953753, 81930844, 83067269, 84193476, 85291310, 86527534, 87908708, 89336740, 90974270, 92547961, 94313465, 96304977, 98498195, 100889967, 103634053, 106792472, 110140722, 113815698, 117597226, 121064125, 124200448, 126859024, 128835961, 129913633, 130220303, 129738110, 128712539, 127477453, 126052935, 124608236, 123387623, 122450909, 121685805, 120943330, 120155983, 118937218, 117071155, 114492732, 110990471, 106649139, 101789782, 96512125, 90907834, 85204041, 79669510, 74450881, 69548332, 65208534, 61339606, 57656634, 54494337, 51790932, 49205066, 46672484, 44522914, 42678317, 41019486, 39441865, 38058521, 36883206, 35626278, 34607766, 33548516, 32437205]
3198C2437205p76054q72868q99023p43697p70899p02604o53040n53998n12506
3189B5952516n41013n97837l87562l48781m71395l17314l02484j76340k79211
3180B2530579k84311k81103k08645j52823j85907r3202m8345j88667k55341j04433
3170B0727802J16007R440j67081K1622q9477K9951J99447j5005P8174J36592L32989
3159B1380461M90972L33064L62109L70050N59932M16730L75766M37165M27625
3150B5153874L27899L87034N25636L08266L72203J63394P4017K40462j5624r4422
3140B7442739j62457k79843j65106q6039j44501j70236l64342l61995k56995j66088
3130B5285137r8182j14412q2687O5820J68344L00169J72389L08736K58232L68176
$$ y = [32437205, 31661151, 30788283, 29889260, 29145563, 28374664, 27672060, 27019020, 26465022, 25952516, 25411503, 24813666, 24426104, 24077323, 23605928, 23288614, 22986130, 22809790, 22530579, 22246268, 21965165, 21756520, 21603697, 21417790, 21324588, 21276243, 21087576, 20832235, 20727802, 20843809, 20853249, 20686168, 20707790, 20618313, 20648264, 20847711, 20832706, 20910880, 21047472, 21380461, 21871433, 22204497, 22566606, 22936656, 23496588, 23913318, 24289084, 24726249, 25153874, 25481773, 25868807, 26394443, 26702709, 27074912, 27238306, 27312323, 27552785, 27537161, 27442739, 27280282, 27000439, 26835333, 26749294, 26604793, 26434557, 26070215, 25708220, 25451225, 25285137, 25186955, 25072543, 24989856, 25055676, 25224020, 25524189, 25696578, 26005314, 26263546, 26631722]
3120B6631722M24170M16959M56517M44090M26808O10905P58024O71343P24444
3111C1564982R60302Q23290Q60892J189358J173586J287723J522717J596403J658884
3102D2638137J821296J885459K017449K005803K136209K059007K069735J965693
3094E8598788J968975J856447J916177J871121J617480J558375J424722J491360
3086G2303445J241807J321058J214422R73205Q73616P19281R09420Q81142Q69980
3077H1307376Q96484J095559J299984J369236J682348K271229K224411K550329
3069I4696956K757179K820850K890259K878754K666833K162797J583140R57089
3061A13413857L51554o88963j535060k414169l119988l739108m059968m340182
$$ y = [26631722, 27055892, 27472851, 27929368, 28373458, 28800266, 29411171, 30169195, 30840538, 31564982, 32525284, 33348574, 34209466, 35398824, 36572410, 37860133, 39382850, 40979253, 42638137, 44459433, 46344892, 48362341, 50368144, 52504353, 54563360, 56633095, 58598788, 60567763, 62424210, 64340387, 66211508, 67828988, 69387363, 70812085, 72303445, 73545252, 74866310, 76080732, 77053937, 77927553, 78646834, 79556254, 80437396, 81307376, 82203860, 83299419, 84599403, 85968639, 87650987, 89922216, 92146627, 94696956, 97454135, 100274985, 103165244, 106043998, 108710831, 110873628, 112456768, 113413857, 113765411, 113076448, 111541388, 109127219, 106007231, 102268123, 98208155, 93867973]
3053I3867973m281808m175081l894893l643431l514826k906999k457494k404242
3045F6589199k255672k082674j771910j957155j945626j886656j996933j877041
3037E0815532k136385k143547j838933k052076k064603j745351j870895j643601
3029C5320141j434498j541606j332280j175733r34858r18932q89590p01476p53996
3020B5637172n88458o19013m72864m12790k78288l11559k25044m7480j22568m3058
3010B2516050J35943k7600l2786J91874l1398Q4833J20210m1254o2941k92388
3000B2560543j66451k11490j20884k49159j40497n1060j01196k76568j73964j59450
2990B0909824k33208k03715r3571l41346l89315l83354l10826m63610m96355n21452
$$ y = [93867973, 89586165, 85411084, 81516191, 77872760, 74357934, 71450935, 68993441, 66589199, 64333527, 62250853, 60478943, 58521788, 56576162, 54689506, 52692573, 50815532, 48679147, 46535600, 44696667, 42644591, 40579988, 38834637, 36963742, 35320141, 33885643, 32344037, 31011757, 29836024, 28901166, 27982234, 27092644, 26391168, 25637172, 25048714, 24429701, 23956837, 23544047, 23265759, 22954200, 22729156, 22681676, 22559108, 22516050, 22651993, 22624393, 22591607, 22783481, 22752083, 22836916, 22957126, 22915872, 22852931, 22560543, 22394092, 22182602, 22061718, 21812559, 21672062, 21621002, 21519806, 21243238, 21069274, 20909824, 20676616, 20472901, 20379330, 20037984, 19648669, 19265315, 18954489, 18490879, 17994524, 17473072]
2980A7473072n74732n67984p22721n44413m18807k75169m75651n42861m10081
2971A2940653j55419k01485k71578k34300j86068j88407j08740k21781k01932
2962A1170943r7405k15893l9979j33832q2666r4033j19178r9671l0254R8684j21244
2951A0235472L1366K4207q8401j7306J226j37988k0163k3027J55566P8464L4961
2940A0274377p8233J98216N2760m7994l8952J44944O0012N404J29763O8560j4782
2929A0754075K6045J15508o3278J27098K14745J77269J01041J03366K12474P5081
2919A1843424K55365J97241L26354J25353J69633L38461K98352J62806J67052
2910A3884041L05588K27652K04324L90460L90088K45607K93365L03098K94056
$$ y = [17473072, 16898340, 16330356, 15607635, 15063222, 14644415, 14369246, 13893595, 13350734, 12940653, 12785234, 12583749, 12312171, 12077871, 11891803, 11703396, 11594656, 11372875, 11170943, 11073538, 10857645, 10817666, 10683834, 10601168, 10507135, 10387957, 10288286, 10258032, 10356716, 10235472, 10266838, 10291045, 10202644, 10185338, 10186564, 10048576, 10028413, 10005386, 10160952, 10239416, 10274377, 10196144, 10394360, 10447120, 10399126, 10360174, 10505118, 10565130, 10570534, 10700297, 10768857, 10754075, 10780120, 10895628, 10832350, 10959448, 11174193, 11351462, 11452503, 11555869, 11768343, 11843424, 12098789, 12296030, 12622384, 12747737, 12917370, 13255831, 13554183, 13716989, 13884041, 14189629, 14417281, 14621605, 15012065, 15402153, 15647760, 15941125, 16244223, 16538279]
2901A6538279K13169L47863K72250L64733L17998K97127M39498M91068M71807
2892A9753792N76852N63181M27795N98824O40388N41720P93288O31235O92770
2883B5219845N18435P02265Q42802R00460Q85364J092639J192011J229361J472423
2874C4055605J594426J659121J828213J883537K030411K068486K090378K312369
2866D9522546K311664K479536K717404K860685L098741L498978L776994M050797
2858G4317345M398080M861201N152986N363938N903496O632231P647271Q858230
2850A23134778J0211801J1847562J3893414J6261868J8696314K1325225K2404400
2843B37775362K1167969J6829382P808451m149731j5809739k3492373k6175585
$$ y = [16538279, 16751448, 17099311, 17371561, 17736294, 18054292, 18351419, 18790917, 19281985, 19753792, 20330644, 20893825, 21321620, 21920444, 22560832, 23102552, 23895840, 24527075, 25219845, 25738280, 26440545, 27283347, 28183807, 29069171, 30161810, 31353821, 32583182, 34055605, 35650031, 37309152, 39137365, 41020902, 43051313, 45119799, 47210177, 49522546, 51834210, 54313746, 57031150, 59891835, 62990576, 66489554, 70266548, 74317345, 78715425, 83576626, 88729612, 94093550, 99997046, 106629277, 114276548, 123134778, 133346579, 145194141, 159087555, 175349423, 194045737, 215370962, 237775362, 258943331, 275772713, 283581164, 279431433, 263621694, 240129321, 213953736]
2836B13953736k5019327k2119155j8811385j5829986j3259570j0999598r585815
2829I8328900q302970p121171o375478n499111m665790m076132l646668l400000
2821E5241580l075175k689006k281858k344924j998912j883981j796076j629404
2813C7542244j411066j454124j338982j284267j331701j144249j198414j341296
2805B7038145r37778r54167j068647j002899p39565o26531p20764o98941p22401
2796A9566452o82079o32234n16744o38728m24667m00118m27772l66110m31351
2787A5046649m29517j97064l64319l39997k65485l15390l87958k62965k92892
2778A2191062k05765j75960k06726l41925j03204j61829j30812j86466k03775
$$ y = [213953736, 188934409, 166815254, 148003869, 132173883, 118914313, 107914715, 98328900, 90025930, 82904759, 76529281, 71030170, 66364380, 62288248, 58641580, 55241580, 52166405, 49477399, 47195541, 44850617, 42851705, 40967724, 39171648, 37542244, 36131178, 34677054, 33338072, 32053805, 30722104, 29577855, 28379441, 27038145, 26100367, 25146200, 24077553, 23074654, 22335089, 21708558, 20987794, 20288853, 19566452, 18884373, 18252139, 17735395, 17096667, 16672000, 16271882, 15844110, 15478000, 15046649, 14617132, 14420068, 14055749, 13715752, 13450267, 13134877, 12746919, 12483954, 12191062, 11985297, 11809337, 11602611, 11260686, 11157482, 10995653, 10864841, 10678375, 10474600]
2769A0474600k6862j53537j81917j50542j03421k59431j70287l03279l45563q9942
2759H689819k24373j41971j53411l42801k3128j49025r9125n3244k60820k27514
2749G014407k10483k68363j87448j34644j26319j87425k83822q8816l9339k33344
2739E254404j27524l3468j65434r2190m9703m8731r4704q1477k809m3777k23792
2728D290795p4385j7889m9908N946j24263l7990M9227j51917o2380M548n6844
2717C774940K8260j37339k1758m2109M5769n0529n5638J42403j39619q8619l0995
2706C424766j62099m130Q1631M8310m8228q6656P5006o9823q9542m0799n7528
2695C070908j06561J8458r2572n7211R1094n9342o1525K9607L2282j10952J0127
$$ y = [10474600, 10447738, 10294201, 10112284, 9961742, 9858321, 9598890, 9428603, 9125324, 8779761, 8689819, 8465446, 8323475, 8170064, 7827263, 7804135, 7655110, 7555985, 7502741, 7241921, 7014407, 6803924, 6535561, 6348113, 6213469, 6087150, 5899725, 5615903, 5527087, 5487748, 5254404, 5126880, 5093412, 4927978, 4835788, 4786085, 4737354, 4642650, 4561173, 4558364, 4514587, 4290795, 4216410, 4198521, 4148613, 4154559, 4030296, 3992306, 4041533, 3889616, 3827236, 3831784, 3774940, 3803200, 3665861, 3644103, 3601994, 3647763, 3597234, 3541596, 3683999, 3544380, 3455761, 3424766, 3262667, 3258537, 3340168, 3388478, 3340250, 3253594, 3328600, 3258777, 3169235, 3128436, 3070908, 2964347, 2982805, 2890233, 2833022, 2924116, 2864774, 2803249, 2832856, 2865138, 2754186, 2764313]
2684B764313j14084j18304r4935J43220K8301P3635j02363r2305P921J27740o2708
2673B560431j12569m498N0666Q242j32212N2741M9285j17811L598m9776L952j09246
2661B202803r3999j21640k6719J43079O8704o78O3442n9686j17156K1981q4469
2650A995662J0812k7318M8774P5765P3813k35495j88125Q4960R731J1586K5838
2639A886003j11363q926j3290j3305j3683k1788J0731N7524m0079K317P114l0862
2627A710393M1191Q1077N9248L5307q0803m6540j12266m917J6813L7984j38211
2616A599276K1800o3956r1514J50164N15k3727q0368J5452l3278j6091J18901
2605A597174N6710n3513n2671J31188J12859R955j32412J6949j26434K1017q6155
$$ y = [2764313, 2650229, 2531925, 2436990, 2580210, 2608511, 2682146, 2579783, 2487478, 2495399, 2623139, 2560431, 2447862, 2443364, 2494030, 2502272, 2370060, 2422801, 2472086, 2354275, 2357873, 2308097, 2312049, 2202803, 2108804, 1987164, 1960445, 2103524, 2172228, 2171550, 2234992, 2175306, 2058150, 2080131, 1995662, 2006474, 1979156, 2027930, 2103695, 2177508, 1942013, 1753888, 1838848, 1848579, 1860165, 1886003, 1774640, 1765714, 1752424, 1739119, 1725436, 1703648, 1714379, 1771903, 1731824, 1734141, 1741255, 1710393, 1751584, 1832661, 1891909, 1927216, 1846413, 1799873, 1687607, 1682690, 1699503, 1737487, 1599276, 1621076, 1557120, 1465606, 1615770, 1616285, 1592558, 1512190, 1527642, 1494364, 1478273, 1597174, 1653884, 1600371, 1547700, 1678888, 1791747, 1801702, 1669290, 1686239, 1559805, 1580822, 1494667]
2594A494667j2527J27923K4371j11371j48469Q4520J7790j7956k9633q115k3751
2583A397449j4830N9314J71902o4356Q4228J0037k8022N6720K1734L9088j21424
2572A611840J34598Q1276R227j21330p7270k1638J9575K06001R5500J05201o326
2561B036654J44184J39363o4097K5223M8344j15625P6500n9407j12847k37982
2551A880310j41938j26629j41860J8036j37693o0820R084o214M9373j5537r4441
2540A231671O742n0015j30269J83067p720j79696k2148m7013N7790m0703l7181
2529I64525J9167k6619j03139R4638O5752r1563K2701R040P3484J4947j81868
2518H61065R5799J24629O9170j42671q8913n4981o1299K1230m5845J3207L8696
$$ y = [1494667, 1482140, 1610063, 1634434, 1523063, 1374594, 1459114, 1476904, 1458948, 1429315, 1421200, 1397449, 1382619, 1441933, 1613835, 1549479, 1633707, 1643744, 1615722, 1672442, 1694176, 1733264, 1611840, 1746438, 1827714, 1836941, 1715611, 1638341, 1616703, 1636278, 1842279, 1937779, 2042980, 2036654, 2180838, 2320201, 2256104, 2281327, 2329671, 2214046, 2290546, 2231139, 2118292, 1880310, 1738372, 1611743, 1469883, 1487919, 1350226, 1289406, 1298490, 1292276, 1341649, 1326112, 1231671, 1238413, 1188398, 1058129, 1241196, 1233476, 1053780, 1031632, 984619, 1042409, 1001706, 964525, 983692, 957073, 853934, 948572, 1014324, 922761, 945462, 954502, 1027986, 1042933, 861065, 956864, 1081493, 1150663, 1007992, 919079, 864098, 802799, 824029, 778184, 791391, 830087]
2507H30087j0701p7291J04563J01763j36278J681r3321p0292N8856Q3960J6554
2496H09581l7290J19099j27427j45976o8995L2112p6401J0392Q2487O8922J6449
2485F82953n4311k773l984o9409J79669M8304j2297q645n4681p3411l5132J09829
2473G06112j8911j7317J2394n0704N0673j3422o0489M0049M0130m4147l6474n254
2461F02640l8809L3205N6013j22240j14615P0474P3350J9831l4827m0121J75451
2450F80352K2712l2929j08086K9236n784N4358l5961p2511n0449O330Q7506P4947
2438F49721P192j33576L1967N5913k08751q3135J11749m3596P6767J6101j1328
2427D69024p8406K6498J23300o4271P141J55860p9297q7167r3008K546J01196
$$ y = [830087, 819386, 742095, 846658, 948421, 812143, 813824, 720503, 650211, 709067, 793027, 809581, 772291, 891390, 763963, 617987, 548992, 581104, 504703, 515095, 597582, 666504, 682953, 628642, 625869, 621885, 552476, 732145, 780449, 768152, 759507, 704826, 631415, 596283, 706112, 687201, 669884, 682278, 631574, 682247, 668825, 608336, 648385, 688515, 644368, 607894, 602640, 563831, 597036, 653049, 530809, 416194, 486668, 560018, 579849, 545022, 504901, 680352, 703064, 670135, 562049, 591285, 585501, 639859, 603898, 531387, 480938, 487268, 574774, 649721, 656913, 523337, 555304, 611217, 402466, 319331, 431080, 387484, 464251, 480352, 469024, 390618, 417116, 540416, 476145, 483286, 639146, 559849, 472682, 379674, 382220, 483416]
2416D83416m5978j8100N914o9357J07025l3084L366J71570j13419j05428n5891
2405C30034M6078K1816j6266K626l9076J22128k1421K1881N059K6546n3976n0619
2393C94810n245J4378n5424j3523K3910J22310O6338J5525K6369p8517p9761N568
2381D36738p83O9943J0030J9384O3298O450n0703J01372n7234j49009k9954K9032
2369D48564j40810q1716J21804O9634R013K0738J6968j88829p041J11265M3866
2358D23456O0549j3287Q000r9182k8718N2925J25148p971r0224p8225P5021J1643
2346D39135n4680K455M7434K7044o6766m3929m347M9957j4784j2448J71660n0238
2334D90493p1088K2539o0290J07639j74306n6837J3370J03253K2050j6962L2512
$$ y = [483416, 437438, 419338, 425252, 355895, 462920, 429836, 433202, 604772, 491353, 385925, 330034, 376112, 397928, 381662, 384288, 345212, 467340, 445919, 467800, 472859, 499405, 445429, 394810, 389565, 403943, 348519, 334996, 358906, 481216, 547554, 563079, 589448, 510931, 431170, 436738, 435955, 505898, 515928, 535312, 598610, 605060, 554357, 655729, 598495, 449486, 419532, 448564, 307754, 226038, 347842, 417476, 426489, 447227, 464195, 275366, 268325, 379590, 423456, 484005, 470718, 478718, 379536, 350818, 403743, 528891, 520920, 430696, 352471, 427492, 439135, 384455, 386910, 434344, 461388, 394622, 350693, 346346, 396303, 381519, 369071, 540731, 490493, 419405, 441944, 381654, 489293, 314987, 258150, 271520, 374773, 396823, 379861, 412373]
2323D12373q9671j22789n986P2423L3303N553P3290m9856k8442p8902J02856l2391
2311B91761N5868n8773n0345O004j8780k4118l5724N9020J0202O1048m2402L7256
2299B91017M347l121O0538Q3012o965j52688P6157j11094n9983J49954Q7235j13601
2287C04808p3128J14151n1083m4768N6393J03876j8532j01992K5735q7946J0550
2276B38064J25065J5343m4313l6145l3749K8223J70401l9321r8198j6650O9188
2265C77908O0526R5095l2863n6812j30876k9118P2464n9237j3516L7293m2281
2254B78583K1Q6857o4323O1484O499r9966P1863J12529m6323j9014M3593r8300
2242C33503m322J02118p4972O6866q0857J00839J4033k6038J04270q1380m6857
$$ y = [412373, 322702, 199913, 193927, 266350, 299653, 305206, 378496, 328640, 300198, 221296, 324152, 291761, 347629, 288856, 238511, 244515, 225735, 201617, 165893, 224913, 235115, 296163, 253761, 291017, 295364, 292243, 352781, 435793, 428828, 276140, 352297, 241203, 181220, 331174, 418409, 304808, 231680, 345831, 294748, 249980, 306373, 410249, 391717, 289725, 315460, 227514, 238064, 363129, 378472, 334159, 298014, 264265, 292488, 462889, 423568, 325370, 308720, 377908, 438434, 533529, 500666, 443854, 312978, 283860, 356324, 297087, 283571, 320864, 278583, 278604, 365461, 301138, 362622, 369121, 269155, 341018, 453547, 407224, 388210, 431803, 333503, 329181, 431299, 356327, 423193, 342336, 443175, 457208, 431170, 535440, 454060, 407203]
2231D07203L944l709P9053R3149q5920o6971l819R7955J7981k309j00256J36035
2219E72336J5744l9036j03443l6610Q4325R8206j05546n0208J84021O926p5424
2208E51291j0507j7329L3386q055P8601O4090L915k1709J9020o7016p5753p5053
2196D74881M8214J29087k5805o0723o4865J48609K8960N0858k3061J03311o6941
2185G42525l1407J04150K8774O4060r388p26J04716J00232o6744q0135j57628
2174G98429M9297Q4270O0133R7606o526K6489O9695O4417o625k3152K2351M0972
2162A277356m7605l8802J43189J40149q0207Q0854K04161j00859p39L8787L0623
2151A646907L3465j6161m3193O5654K24333J46242J12289n521m3355J35666J40812
$$ y = [407203, 411147, 407438, 486491, 579640, 493720, 426749, 422930, 520885, 538866, 536557, 436301, 572336, 588080, 549044, 445601, 408991, 493316, 591522, 485976, 435768, 619789, 626715, 551291, 540784, 523455, 556841, 548786, 627387, 691477, 695392, 673683, 692703, 625687, 549934, 474881, 523095, 652182, 626377, 565654, 500789, 649398, 678358, 729216, 706155, 809466, 742525, 711118, 815268, 844042, 908102, 898714, 897988, 1002704, 1102936, 1036192, 956057, 798429, 847726, 931996, 992129, 1089735, 1083209, 1109698, 1179393, 1243810, 1237185, 1214033, 1236384, 1277356, 1229751, 1190949, 1334138, 1474287, 1394080, 1474934, 1679095, 1578236, 1577497, 1616284, 1646907, 1680372, 1664211, 1621018, 1686672, 1911005, 2057247, 2169536, 2164015, 2120660, 2256326, 2397138]
2140B397138J34722J68701N8963K46548J74719J18416L11030K80392K36533K27629
2130D354791J24827K13081J67293L34097M39639M34200O27144N58727N18708K79985
2120H052492N02241P46561J022552J241266J518879J699586K168855K987382L970813
2111B3910627M857054O101223N913963M614012j494746p904255p852584o108414
2103B2036880l951390k807216k149449j772281j271833j129880o95837n28230
2095G730764n00089m26727l00038l11123m88209m18745m69285l60483k56500k87044
2085C912521j48784r5728j50067p2867p6388l22237l05465k3707n3039l694k32995
2074B427550k11268n4010j29839p1845j3089k7464o3253q4925j33300k8321n7057
$$ y = [2397138, 2531860, 2700561, 2759524, 3006072, 3180791, 3299207, 3610237, 3890629, 4127162, 4354791, 4479618, 4692699, 4859992, 5194089, 5633728, 6067928, 6695072, 7253799, 7772507, 8052492, 8554733, 9301294, 10323846, 11565112, 13083991, 14783577, 16952432, 19939814, 23910627, 28767681, 34868904, 40782867, 45396879, 43902133, 35997878, 28145294, 22036880, 18085490, 15278274, 13128825, 11356544, 10084711, 8954831, 8258994, 7730764, 7230675, 6803948, 6503910, 6192787, 5704578, 5285833, 4816548, 4456065, 4199565, 3912521, 3763737, 3668009, 3517942, 3445075, 3368687, 3046450, 2740985, 2717278, 2664239, 2660545, 2427550, 2216282, 2162272, 2032433, 1960588, 1947499, 1920035, 1856782, 1771857, 1638557, 1610236, 1553179]
2063A553179j29527n2410k8709K180O0195m7099q7031K7231n6670q6925L6427
2052A190841j15269j36571J16929M1606j54176m3494L7254j50574Q8470O2429
2042I37445j1751J3423j6355m268m583J03592n8589J0309o5927m7206o9404p4341
2030G12345M5209J8204o8205n0458k5795O1566m6037k2052Q2583N5069n4220j01251
2018F06958M7181n8528q8179j5496K0311J47743P591k05511j4629R7286k1368
2007E23359l2738o0198n4737J23369l4486o3277j1900N3908K63K0269J8696K2175
1995E04703k9956n0366o3718j09642l9766j2926J5445O5435R5769j4096n0823
1984C10059n546K6671j02141Q355m824M9165r455N5459o0845k0070M2503j63452
$$ y = [1553179, 1423652, 1371242, 1342533, 1344713, 1404908, 1357809, 1270778, 1298009, 1241339, 1154414, 1190841, 1075572, 939001, 1055930, 1097536, 943360, 899866, 937120, 786546, 875016, 937445, 925694, 939117, 922762, 918494, 913911, 1017503, 958914, 969223, 903296, 856090, 786686, 712345, 757554, 775758, 707553, 657095, 631300, 692866, 646829, 624777, 707360, 762429, 708209, 606958, 654139, 595611, 507432, 491936, 512247, 659990, 667581, 462070, 447441, 544727, 523359, 490621, 430423, 375686, 499055, 464569, 401292, 389392, 443300, 443563, 463832, 482528, 504703, 474747, 424381, 360663, 251021, 211255, 198329, 213774, 279209, 374978, 360882, 310059, 304513, 331184, 229043, 237398, 232574, 281739, 272284, 327743, 266898, 246828, 289331, 125879]
1972A25879j0233J26419Q2322K11k1334l3102k2167L5919O0245R311l240m9170
1960C01060l3774k6920k6569O8540k597o0266P1737N7475J00712k8735m6919j16281
1948B57463J9669j04884p6391J19996J3201K3861P1324n9204q5985j8934k3629
1937A36487N097j541o1949L2637L4514N5237L87L984J3814j13383J38141J7919
1925B61344j8196r9423k8956K65467j1576q3832J9456n2570l3612l722m7016m7338
1913A20026q2501M3710J23538q5493N462j7487j02174k4054K2968J33106Q0070
1902B17171j62342l8340J2806J1758J16373j7690R7919o5414l1564L1014p269
1891A64422n413m2947N053J53231J8062p8749l6462j2168m6913M7941m501k7853
$$ y = [125879, 115646, 242065, 324387, 324598, 303264, 270162, 247995, 283914, 344159, 353470, 350230, 301060, 267286, 240366, 213797, 282337, 279740, 219474, 291211, 348686, 449398, 420663, 373744, 257463, 277132, 172248, 95857, 215853, 229054, 252915, 324239, 265035, 179050, 160116, 136487, 141584, 140043, 78094, 110731, 145245, 200482, 200869, 204853, 218667, 105284, 243425, 261344, 243148, 143725, 114769, 380236, 368660, 284828, 304284, 251714, 218102, 214380, 167364, 120026, 37525, 81235, 204773, 119280, 124742, 107255, 5081, -18973, 3995, 137101, 217171, 54829, 16489, 29295, 41053, 157426, 139736, 237655, 172241, 140677, 171691, 164422, 159009, 116062, 121115, 274346, 292408, 213659, 177197, 165029, 118116, 166057, 161556, 133703]
1879A33703k7011Q2940j4846q3035l0858J36752M2853p3893k8445j22474R4373
1868A10059m5648J11098l7716L3090j6475k6032P2391m4801Q037P864j09078j2711
1856E0078R4594k3605K4754Q7259N0455m740m2088p4866N4072n1767J3892Q0939
1844B58977K0571k3296o6999L5407P0710N4596M9983Q1609r0909j11353m5065
1833B34231j0068K7785P8231J9483k7003j04467k0097n2325l0806M5587r2252
1822F8299m66r273P8717O258l1295j6026L1989l2754r286L3380n3766Q8466j87839
1809c3596L3109P0461J23457k2552o5666n094Q0695l8043p0915J4139P0275K3075
1797A79345q9227j6282M8465o8990L9113O2229n1966P7072m3064k7457j42416
$$ y = [133703, 106692, 189632, 174786, 91751, 60893, 197645, 240498, 166605, 138160, 15686, 110059, 64411, 175509, 137793, 170883, 154408, 128376, 200767, 155966, 164003, 171867, 62789, 50078, 144672, 121067, 145821, 233080, 283535, 278795, 236707, 161841, 215913, 164146, 178038, 258977, 279548, 256252, 189253, 224660, 295370, 349966, 399949, 481558, 390649, 279296, 234231, 224163, 251948, 330179, 349662, 322659, 218192, 198095, 145770, 114964, 160551, 68299, 67833, 58560, 137277, 143535, 112240, 96214, 128203, 95449, 86163, 119543, 65777, 154243, -33596, -487, 69974, 193431, 170879, 105213, 100119, 180814, 142771, 71856, 85995, 156270, 179345, 90118, 73836, 122301, 53311, 92424, 154653, 102687, 179759, 136695, 109238, -33178]
1786c3178o7936J82137O962l6032L9326p0008m117L6473l1800R3306N6890K5428
1774A97451n5657j60439j01015R3448k4982o3409J13879M7531m7422P3330J64352
1763B37067j14403l7640P7487k4854k4723M3268L4057J6435p1239K0176l8481
1752A17150k1847j03302L130q5076P7574m24j8246n52J09728K1353P0746k6126
1740A44108j901l2054n0688l3884j83891J42345N1699J7125m1485M4829j2020
1729D4183m9265L5085O4864l1235p1407O8470p0114o9210k7060J08584M7435k9360
1717B0970l739m1030J12171l0805m2492l8413K2658J42857j7095n9982o2050n3179
1705e0129L8588o8906N8187O8041M3292Q6154l2897j84617j16930J27350l3642
$$ y = [-33178, -101114, 81023, 87985, 51953, 91279, 21271, 17154, 53627, 21827, 115133, 172023, 197451, 141794, -18645, -119660, -26212, -51194, -114603, -724, 46807, -615, 72715, 237067, 122664, 85024, 162511, 137657, 112934, 156202, 190259, 206694, 135455, 155631, 117150, 95303, -7999, -4869, -89945, -12371, -12795, -31041, -31593, 78135, 99488, 170234, 144108, 142207, 110153, 59465, 25581, -158310, -15965, 35734, 52859, 11374, 56203, 44183, -5082, 30003, 94867, 63632, -7775, 60695, -9419, -78629, -105689, 2895, 50330, 20970, 17231, -23799, 88372, 57567, 15075, -23338, -680, 142177, 125082, 65100, 3050, -50129, -11541, -80447, -22260, 45781, 89073, 175227, 142330, -42287, -159217, -31867, -65509]
1694f5509L2050N8901J8644N992m2821J9480J9394m2721J78066M9316n9478j28271
1682D3043n1607r1878k3640P0332R4752J05926n2837j03334l6152J43451j04795
1671f739M065K2509K7927K1128n3871j36181N2030N8041L135p1436R4563J4121
1659B9292M1027L6984m3774L9871k1349m2071j7555M4627Q836M9406k2217k0114
1647H2963L6707j4621J52784j03039k01535J40853J3462M4337j02265j3209K2698
1636E9135k5607M9743P89O8528J7169j1805m4826r2605K6216N8150n9344N3512
1624I9055m8632p2695K4726M9242J20901j21808J7475M739r6169k7416O0283n1302
1612d1601P9106P2893n2917J3191m3155k6553N4635M8507p8166J5415N7055Q0725
$$ y = [-65509, -33459, 25442, 44086, 50078, 7257, 26737, 46131, 3410, 181476, 230792, 171314, 43043, -8564, -100442, -124082, -53750, 41002, 146928, 94091, -9243, -45395, 98056, -6739, -2674, 19835, 47762, 68890, 15019, -121162, -69132, -11091, -7956, -79392, 15171, 29292, 70319, 107303, 63529, 103400, 82051, 39980, 22425, 67052, 75888, 125294, 103077, 82963, 119670, 105049, 257833, 154794, -46741, 94112, 107574, 151911, 49646, 36437, 59135, 33528, 83271, 84060, 152588, 169757, 157952, 113126, 20521, 46737, 104887, 45543, 99055, 50423, -22272, 2454, 51696, 172597, 50789, 68264, 73003, -23166, -50582, 9701, -41601, 37505, 110398, 57481, 70672, 27517, 964, 55599, 104106, 25940, 41355, 98410, 179135]
1600A79135p7197o0954L6473R636p1281l9380J01451o7811J3343J58627n0511
1589A31531j31914r3139R7579M3477L5711l0782l5149j2763m7985m459J50547
1578A02654l5371k7078J12792J2666p1349r4314L0j1830Q6178l9669j3571j9770
1566A368m2154q7466J15877J5111K6190J06899L728j80701k3552P3238j01229
1555i2691J34421l1699J7044l6121m3064R6660r2521l4073J62033j33642J2768
1544d0885J33j0501P693O8344p1839m686N5628m6257J17025l0914r895o4957j03073
1531a34184L5861R4019L3311R6482l9101n440J4056j15997J20149j1658J8011
1520A05509k3901p6673M402k736l6821j7796K3384L2392j6242o3262Q7361l5232
$$ y = [179135, 101938, 40984, 77457, 87093, 15812, -23568, 77883, 10072, 23415, 182042, 131531, -383, -93522, 4057, 47534, 83245, 52463, 17314, 4551, -43434, -47893, 102654, 67283, 40205, 152997, 165663, 94314, 0, 30, -11800, 74378, 34709, 21138, 1368, -40786, -128252, -12375, 2736, 28926, 135825, 139553, -41148, -64700, 8538, -92691, 41730, 10031, 27075, -9046, -52110, 44550, -47971, -82044, 79989, -53653, -40885, -40752, -51253, -43560, 24784, -47055, -51741, 3887, -42370, 74655, 43741, 33846, -31111, -134184, -98323, -4304, 29007, 125489, 86388, 80948, 95004, -20993, 99156, 87498, 105509, 81608, 4935, 9337, 6601, -30220, -48016, -24632, 7760, -8482, -71744, 15617, -19615]
1508a9615j58736J01600J08172Q1064n1212o552K4624r1913M4395k8098k4045
1497b0316p0863K0086j4162J35820n7609j7833J6349J9714O4713p9022r904Q5939
1485G2912o6234M1893O4326M7670r169o5682m58j30652m9623Q1467k054q5688
1473a01292Q3005N5446j14416n6101P7382l3594O5535R3162J24415m3989j05459
1462D4094k035p9638k0466K190k3272K5040J40690r8951Q328j8465N3025q7250
1450e6710N2360M845j77962o681J85036j7571P1662j1015k36063Q3063Q2174q629
1438c5491k0845L4988J74368q147O0761p5208j5992j6643J6497m5293J027N3848
1426A23870N4085K9827j15209M4953q2413L5858O8480j8008r8025o0820L9084
$$ y = [-19615, -178351, -76751, 31421, 112485, 61273, 54721, 79345, -12568, 31827, 3729, -20316, -91179, -71093, -85255, 50565, -7044, -24877, -8528, 11186, 75899, -3123, -13027, 72912, 6678, 48571, 112897, 160567, 151398, 85716, 85258, -45394, -95017, -13550, -15604, -101292, -18287, 37159, -77257, -133358, -55976, -89570, -24035, 69127, 193542, 149553, 44094, 42059, -37579, -58045, -55855, -79127, -54087, 86603, -12348, -4020, -22485, 30540, -56710, -4350, 495, -177467, -184148, 888, -16683, 54979, 43964, -192099, -109036, -26862, -35491, -56336, -21348, 153020, 144873, 205634, 130426, 114434, 97791, 114288, 68995, 70022, 123870, 177955, 207782, 92573, 137526, 55113, 90971, 159451, 141443, 43418, -17402, 21682]
1415B1682k6290m2707m3346n6305J22357P8992k5789o1260M384K591M8502j34669
1403a11858l575j6970J25926L8597K8301O075j733q6195R9386L6570j37848M9914
1391B6590J2369M3135N2821j44242P8831J1244j59979j21912J1848J61149M548
1380b3598j47458L8658J37418q7246L9258M781L323J41630J5722o421j06155N609
1368A5521m8916j24028k1472K5528l5172K0127M8909o4455P0012J9800L4805P7431
1356A8090n807K8433N4653n9879K6900J4998p1457M8537k7332M1512m9152J987
1344B1483L5606o556o9473M0446J55310M5187p3620J4096K4744j45843M6821J7168
1332A05369j68196k3998n5402J58557o3786K5351Q7228j62104m6447R9760J12986
$$ y = [21682, -4608, -47315, -90661, -146966, -24609, 54383, 28594, -32666, -28282, -25691, 22811, -111858, -115433, -132403, -6477, 32120, 60421, 66496, 64763, -21432, 77954, 114524, -23324, 26590, 38959, 82094, 134915, -9327, 69504, 80748, -79231, -201143, -189295, -28146, -23598, -171056, -132398, 5020, -82226, -42968, -38187, -34864, 106766, 122488, 116067, 9912, 15521, -33395, -157423, -178895, -153367, -188539, -168412, -119503, -183958, -113946, -94146, -59341, 18090, 12283, 40716, 95369, 35490, 62390, 77388, 5931, 54468, 27136, 68648, 19496, 21483, 57089, 50533, -18940, 21506, 176816, 222003, 148383, 162479, 187223, 41380, 88201, 105369, -62827, -86825, -142227, 16330, -47456, -22105, 65123, -96981, -143428, -43668, 69318]
1321F9318o2394q434r4138Q8157M9212Q588j07126q719L2704N3163K188k7932
1309e413J9410j06527J48080J15219j16180j28363P0107N1384j50j9688p2231
1298d4352J818O8271m36r2520N0473l0963L0415P6815K7509j29610p7373j3391
1286a33344P3550p4722k8920M2819K2028J55737Q5121j37695k0383k8257J16055
1275G1989j26530L9845j7390L7376j14208O4784P5115k1020j4958q5671p3941
1264a64609O3799N1302m9622j4451P1308Q2548o7122m3880L1330J3440m8265l4729
1252a08951n9947N7657j8884j2029K6715R4718k9240L289o8350j0640J32946O1183
1240F8467J3250p6727k9352L9040M4186L1411J298L4702j82049M8977O1229k8327
$$ y = [69318, 6924, -1510, -95648, -7491, 41721, 50309, -56817, -65536, -32832, 20331, 22519, -5413, 13997, -92530, 55550, 170769, 54589, -73774, -3667, 47717, 47567, 27879, -44352, -42534, 25737, 25301, -67219, -16746, -47709, -17294, 59521, 87030, -42580, -119953, -133344, -59794, -134516, -163436, -120617, -98589, 57148, 142269, 4574, -15809, -44066, 71989, -54541, -14696, -32086, 5290, -108918, -44134, 30981, 9961, -4997, -90668, -164609, -100810, -49508, -99130, -113581, -42273, 40275, -26847, -70727, -39397, -25957, -74222, -108951, -168898, -111241, -130125, -142154, -115439, -20721, -49961, -46672, -115022, -125662, 7284, 68467, 81717, 4990, -24362, 14678, 58864, 90275, 91573, 126275, -55774, -6797, 54432, 26105]
1228B6105p0695k4260J78379J88819j08784j26109L2656n0708k8881k248j2223
1217B051P0727o195j34022n915K490m1025J5291p5985J35030R4643m0242q6239
1205f9391N2351n5326J59501n6686J3473n73m6188l419l892l661n1855p230p2821
1192a45717R1960K8256o2530J0129J9875r239J36813j23544n8095M9031J14738
1181E1677L2935j55430J8722P9265N154j59446Q7293J06845M4877O8705o1285
1170A19312j47178n4281R2971N7321L4582q0145k5890J4537j09084n295P4603
1159b8547o0796J02016J8764M0412Q2025j09182m1348p2922m4834O8223J31727
1148H5538o4923m9565l3857J28748Q5369k4462M1262r3997k7115p938r521M3914
$$ y = [26105, -44590, -68850, 109529, 298348, 189564, 63455, 96111, 45403, 16522, 14274, 2051, 72778, 66583, -67439, -73354, -70864, -111889, -96598, -172583, -37553, 57090, 16848, -69391, -17040, -72366, 87135, 30449, 43922, 43349, -2839, -6258, -10150, -13811, -65666, -72896, -145717, -53757, -25501, -88031, -77902, -58027, -67266, 69547, -53997, -112092, -63061, 51677, 84612, -70818, -52096, 27169, 32323, -127123, -39830, 67015, 111892, 180597, 119312, -27866, -82147, 10824, 68145, 102727, 22582, -3308, 11229, -97855, -103150, -28547, -89343, 12673, 31437, 71849, 153874, 44692, 3344, -69578, -114412, -46189, 85538, 20615, -28950, -62807, 65941, 151310, 126848, 168110, 74113, 46998, 39060, 29539, 73453]
1136G3453p2061q4014J34147n6640n6416o1428N1851N3415k3107K3850J7738j0718
1124i930k0965m5662l1650P2822L0417K8477J07576m6003k3434R0602j15336j0792
1112B6122j03934m629N6117J24054n56j51608J32000N689p9140K4350L9708Q93
1100F9066J32085j41301r3928j06655l9122L1847O5611R5424L0685j14411Q3198
1089A2499J1816k282N2757o2990j39855k9997P078Q7349K64711q8700j14333j07621
1077a09568M4268Q8120m6636M5698j05348l4142N1970m0004R0430J7040K4923
1066B6751j20943P4306P1334n9549K4358m5021N7479l0154q0021K3548q9541Q5745
1054f1708k4371j6519J04533R7452p2324j9516N5336K5845P9921j37822k2165
$$ y = [73453, 1392, -82622, 51525, -5115, -61531, -122959, -71108, -17693, -40800, -16950, 788, -9930, -30895, -76557, -108207, -35385, -4968, 23509, 131085, 85082, 61648, 152250, 36914, 26122, -77812, -82441, -26324, 97730, 97174, -54434, 77566, 83255, 4115, 28465, 68173, 69066, 201151, 59850, -34078, -140733, -179855, -148008, -82397, 13027, 43712, -70699, 12499, 24315, 22033, 74790, 11800, -128055, -158052, -150974, -63625, 201086, 112386, -1947, -109568, -65300, 22820, -23816, 21882, -83466, -117608, -65638, -105642, -15212, 1828, 26751, -94192, -19886, 51448, -8101, 16257, -28764, 28715, -1439, -81460, -57912, -147453, -61708, -86079, -102598, 1935, 99387, 27063, 7547, 62883, 88728, 168649, 30827, 8662]
1043H662n2492l136p7090J00511l8492p9064Q9258J04141q0681j58298K47267
1032F0586o1947J4896m1471P0568J39957k2669n6329m4588k5566m0255K4362j17463
1020i9919K202l5473K655O0177M3380k1245N8995j7311j4995j4726k2592J01393
1008D2541m5520M978r7235q6602J63741N6435n7749m277M5167o1718J226l0789
996f9802j1205M0655O769j9902M1071p6869l0762J3160q46Q3913j9492J28472
984H5162Q1558j10245j29396K7490O5623l4868L711K3461K57M4601N7592j04597
972A0349L2208J1603j43997J1354j19105J09705J81550L4556j18654j5084m4987
961e0502p571J68670k3740p9530q2429m0240J08281l3k1932M7566l6400j7929
$$ y = [8662, -43830, -46966, -124056, -23545, -62037, -141101, -51843, 52298, -28383, -186681, 60586, -1361, 13535, -27936, 42632, 182589, 159920, 103591, 59003, 33437, -6818, 17544, -99919, -97717, -133190, -130535, -70358, -26978, -48223, 10772, -6539, -21534, -36260, -58852, 42541, -2979, 1999, -95236, -181838, -18097, 38338, -19411, -23688, 21479, -40239, -39013, -69802, -81007, -40352, -33583, -53485, -12414, -89283, -120045, -106885, -107731, -23818, -43310, 85162, 166720, 56475, -72921, -45431, 20192, -14676, -10965, 12496, 12753, 57354, 114946, 10349, 42557, 54160, -89837, -78483, -197588, -87883, 93667, 128223, 9569, -5515, -50502, -58073, 110597, 86857, 7327, -75102, -115342, -7061, -7094, -29026, 18540, -17860, -35789]
949c5789Q2085L4962j10168l2732Q6912p9643r082j8000K5937L9015J05695M5060
937A34252j86125M47J74177P2679j39274p8387l3710K3318J00930n5062r2486
926g9241l5231P6245p2456l0268N7568M7688J28201j12418o6239P3700j107R275
914d283j34324L4790O7262l6738N4778l3395J3904l1967Q1114m359K678j00301
902i0841R2987J1487M045K7951J8789M3646p9346N1404J03610r643k23504K7683
890b1732J37797o8464J01345k6931l9654P9011j36754k5662Q6306J25281q1454
879A29089j16548n1073j03704K9565N6132J21990M884m2910O2149l6758J3400
868F6216L1105j51100j810R8145p7136l2116k6745o892p6512O4721L9469P0614
$$ y = [-35789, 46296, 81258, -28910, -61642, 25270, -54373, -63455, -81455, -55518, -16503, 89192, 134252, -51873, -51426, 122751, 195430, 56156, -22231, -55941, -32623, 68307, 13245, -79241, -114472, -38227, -110683, -140951, -83383, -35695, 92506, -19912, -86151, -12451, -13558, -4283, -138607, -103817, -36555, -73293, -18515, -51910, -38006, -69973, 11141, 6782, 9460, -90841, 2146, 13633, 17678, 45629, 64418, 108064, 28718, 80122, 183732, 174089, -49415, -21732, 116065, 47601, 148946, 122015, 82361, 161372, 24618, -1044, 85262, 210543, 129089, 12541, -38532, -142236, -112671, -56539, 65451, 70335, 27425, 89574, 52816, 66216, 97321, -53779, -55589, 42556, -34580, -66696, -93441, -100333, -176845, -112124, -72655, -2041]
856b041P6276j52399R160k4539p2104J89592N307j711o4662j28411R666R7357
844e8509J5260k6502M8874p8289J5181N1199M8141p9771l9787k4173M6127J77042
832I4793p1795j88448P3613P0171m2072p9528M9808N8847K1799J9646p4395Q5629
820A8068M39M6205Q7164p0303J500j15298P8861m5004l7933O4424k1222J17038
808A23939j25983O8617K1314K6823j20751R270k0340r5764P9605J10328q648r7860
796b9450Q67N9879N3224j85682J02144k9265M7099o1041r4128L3265L4186K4429
784d4473o7045J14492O6779j69241Q0038K10406j11321O531J2225k3242K4525
773I9674L7513o602j22656o1138L0782P2656l3092P9601j1717j37176J30843q8428
$$ y = [-2041, 74235, -78164, -69004, -93543, -165647, 23945, 29252, 27541, -37121, -165532, -155866, -58509, -43249, -69751, -20877, -99166, -83985, -32786, 15355, -64416, -104203, -128376, -82249, 94793, 22998, -165450, -91837, -21666, -63738, -143266, -93458, -34611, -12812, 6834, -67561, 18068, 18507, 64712, 151876, 81573, 83073, -32225, 46636, 1632, -36301, 28123, 6901, 123939, -2044, 66573, 87887, 114710, -6041, 3229, -17111, -112875, -33270, 77058, 68410, -29450, -28583, 31296, 84520, -101162, 982, -28283, 18816, -42225, -136353, -103088, -68902, -44473, -111518, 2974, 69753, -99488, -19450, 190956, 79635, 86166, 98391, 75149, 99674, 137187, 130585, 7929, -53209, -22427, 50229, 17137, 96738, 85021, -52155, 78688, -9740]
761i740K5880N8492j23949R7613p372P598l5057k0328K52m2615L5578l8589Q3678
748C1441k8114N040q5847q7042J14762J1763n239n059M7240K2703l7245J40213
736A24616p2241r0038J27867o493l7694p6397k9241K5875J6648J06460l7588P727
724E9501o545m0141j07289o7250J62748l0897m3839K9477R0404p8452L4926K9539
712C2182L7705m0691N8488n7418L9084J144M3639l4881m6002J14270O3592j56565
700E4547O8438q0053M2494J4047k25568r473M2154L3077k4642Q1284Q9716k2500
688F3521k401m6967m4153m348r3712J13857j06728J8438N6190J19816n8943m7924
676c3354K5858k6077j8109l5819J15652J85021r7118j12009j16342J94786j47933
$$ y = [-9740, 16140, 74632, -49317, 48296, 40924, 48522, 13465, -6863, -6611, -49226, -13648, -52237, 31441, 3327, 8367, -77480, -164522, -49760, -37997, -43236, -48295, -1055, 21648, -15597, 124616, 52375, -37663, 90204, 83711, 46017, -30380, -59621, -33746, -17098, 89362, 51774, 59501, 52956, 12815, -94474, -161724, 1024, -29873, -73712, -44235, 46169, -32283, 2643, 32182, 69887, 29196, 87684, 30266, 69350, 70494, 114133, 79252, 33250, 147520, 211112, 54547, 122985, 42932, 85426, 99473, -126095, -135568, -93414, -60337, -84979, -3695, 86021, 63521, 61120, 14153, -30000, -34348, -128060, -14203, -120931, -102493, -46303, 73513, 14570, -33354, -7496, -33573, -51682, -87501, 28151, 213172, 116054, 4045, -112297, 82489, -65444]
665f5444o3267Q7577O3247m8794p0780J4977K2115Q4120O5792m2507k0797q1347
653e5108J33772p9507P562M2880p9186m0662L5238Q3070J2590n8362j19437P7717
641c9433N8141J12190j38979j69917J65322K6931M917l6077o0880N4755k6525
630d9555R053l0497J01553O614j00107J03596J420J72269n2528r0776M4869p8409
618C7502l3055o7373l9123M523R9647m8446J01716j21395Q2728j05993j27313
607b16582m2380O1447K20639j8697r8436r1205R0297M9530q6545K8983J7972P7132
595g845J3877Q0654M0784n7269j39519p4106J32852P0760M8450n3309k25708L9675
583a30704J74522m7661n3656K1724N8107j3985j34669P22P3182q492Q9262Q1126
$$ y = [-65444, -128711, -41134, 22113, -26681, -97461, -82484, -60369, 23751, 89543, 47036, 26239, -55108, 78664, -843, 6719, 49599, -29587, -70249, -35011, 48059, 60649, 2287, -117150, -39433, 18708, 130898, -8081, -177998, -12676, 14255, 19172, -16905, -77785, -23030, -49555, -40502, -70999, 30554, 37168, -62939, 40657, 42077, 214346, 161818, 71042, 115911, 37502, 4447, -62926, -102049, -97526, 2121, -46325, 55391, -66004, 16724, -89269, -216582, -258962, -197515, 23124, 4427, -94009, -185214, -94917, -45387, -131932, -102949, -84977, -7845, 6032, 86686, 127470, 70201, -69318, -143424, -10572, 60188, 108638, 55329, -170379, -130704, 43818, -3843, -57499, -35775, 22332, 8347, -126322, -125600, -52418, -60910, 28352, 109478]
571A09478j01750j2109p8166J0276j08848j283l4537J38923M9278P5464m2888
560C838j09773r3991P3664k1233R8969N9025M0124J0659K920j0162l6326m3258
548b5544m4863k2736P4853K3441m8126K4409J9427O9711k8275m2268l8054r6985
536a35010L8788J42883l1869K4145k663M6399q0173j00659L3976M8448l5409M002
524d7142j19299K937R8610J32871r7683J29138R252j36190j46065J12104J64947
513A03480p113r8814N2571n0998m214M1714J9796o282N0850j11847p8221n8975
501a48053J17682O6759K6618k1899J5845j07409l5211J16114L6700J00941p0254
490I7833j13328k8077M6766k8169q1498n2959K8043R6880P8396M1548n0456o6247
$$ y = [109478, 7728, -4381, -82547, -72271, -181119, -182402, -216939, -78016, -28738, 46726, 3838, -105935, -199926, -126262, -147495, -48526, 10499, 50623, 61282, 64202, 54040, 17714, -25544, -70407, -93143, -18290, 5151, -42975, -18566, 861, 70572, 42297, 29, -38025, -135010, -96222, 46661, 14792, 38937, 36274, 82673, 2500, -98159, -64183, -15735, -51144, -47142, -166441, -163504, -64894, 67977, -29706, 99432, 108684, -27506, -173571, -61467, 103480, 96367, -2447, 50124, -874, -5088, 36626, 56422, 50140, 100990, -10857, -89078, -148053, -30371, 36388, 63006, 41107, 56952, -50457, -85668, 30446, 67146, 168087, 97833, -15495, -43572, 3194, -24975, -106473, -159432, -131389, -34509, 43887, 85435, 34979, -31268]
478c1268l6059k1909l9491J8013O1409P1564q3688k9752p4098M3038J02087m4306
466f4460J2787J4275q1940M0151Q7397Q038l8222j05632J57334p5242J2738P6176
454D3400J7471J5321K8343k1761j6104q6392n6715R0678j05528L1791R131k5903
442g6268J54537j05177N9517J51816j59949r6903j56441J24683J33509L3680M7386
431A10390j42103J2647M3090j858M3328o2999j36388J66134k0209k8800o4987
420h1755K6199J41721p7252J11333K9092j49703L3615Q8514l7498O794j38114
409d7054l6953N264N9044J90243p0823j6801k7941O6343n7060m6925K4772L1733
397G3842k8300Q7935Q1678M977j36185q9334J59M81L4184M1121j22403l756l773
$$ y = [-31268, -67327, -89236, -128727, -110714, -49305, 22259, -61429, -91181, -165279, -122241, -20154, -64460, -51673, -37398, -119338, -79187, 8210, 16248, -21974, -127606, 29728, -45514, -32776, 43400, 60871, 76192, 104535, 82774, 66670, -19722, -76437, 14241, -91287, -59496, -50365, -76268, 78269, -26908, 32609, 184425, 24476, -72427, -228868, -104185, 29324, 63004, 110390, -31713, -19066, 24024, 22166, 65494, 2495, -133893, 32241, 12032, -16768, -81755, -55556, 86165, 8913, 120246, 149338, -365, 33250, 121764, 84266, 91060, -47054, -84007, -78743, -19699, 170544, 99721, 82920, 54979, 121322, 64262, 17337, 42109, 73842, 45542, 133477, 215155, 220132, 83947, -5387, -5228, -4747, 29437, 70558, -51845, -55601, -59374]
384e9374P4557J1373m8625p2192J64107n4229p7764J4232J23135O9813j00920
373D4113N2836l8285k4297K7306j2476r0684l8631P433l3633J09801n9486j22125
361a78128J08825J47051K9166L2408r023j56217P6214K8441l8499P0672p897l9355
349F3658N2911n5262J49038j24513j39021O877Q8661j6413Q1663j7554j21143
338c1098N0445k324j11198r7548R0825M3975R951N4364P0643j0134M8140M8461
326A64502j13554j6226J5190m6747l7674J08417j4393Q0718k0727q5900j37132
315a03526q2949M1728P2287L9940q9405Q241k2799P4923J54456K9936l4448o0921
303B7463j18352l9136J97882j0344O917J02702J7017l9518N3774L1414M9965o057
$$ y = [-59374, 15183, 26556, -22069, -94261, 69846, 15617, -62147, -47915, 75220, 145033, 44113, 96949, 58664, 34367, 61673, 49197, -41487, -80118, -72685, -106318, 3483, -56003, -178128, -69303, 77748, 106914, 139322, 130299, -25918, 50296, 78737, 40238, 110910, 103013, 63658, 116569, 61307, 210345, 85832, -53189, -46312, 42349, 25936, 107599, 90045, -31098, 19347, 17023, -94175, -191723, -100898, -56923, -46972, 7392, 78035, 67901, 116041, 164502, 50948, 34722, 49912, 3165, -34509, 73908, 59515, 140233, 119506, 33606, -103526, -186475, -144747, -72460, -32520, -121925, -113684, -136483, -61560, 92896, 122832, 88384, 27463, -90889, -130025, 67857, 57513, 64430, 167132, 184149, 144631, 198405, 229819, 279784, 273727]
291B73727j33185k9536q4293n1564K4204N5421R1191K5198r6328p43m2893L0422
279F1621N1897j4960j09582n0833K9267N6296J5016j4387O1669L4469L2715o9364
267H3824r2198k8900M5769r4391J7713J15210n362j1153J01184j20604R1014J571
255A03677p9808Q0560j6247q244M8120j6926M9175q0864j09536N898J4004M5530
243C5339j32944p9013J5792J47626K5438m8608P418j1333L1358m7821k02338O9225
231a89861K21190p317k6432k3564m9768K775L3739M162o0577J27431n7633j0567
219c6422J42995m4730o6276P1993j01675j5637J6390K712p681k9046p2904M9621
207i0660R8804M8833q820p7752J1962Q0665n7307p9218O3590J2312O6043k4162
$$ y = [273727, 140542, 111006, 26713, -24851, -647, 54774, 145965, 171163, 74835, 74092, 31199, 61621, 113518, 98558, -11024, -61857, -32590, 23706, 38722, 24335, 86004, 120473, 153188, 83824, -8374, -37274, 8495, -85896, -68183, 47027, 41665, 30512, 131696, 11092, 102106, 103677, 23869, 104429, 88182, 79938, 128058, 111132, 160307, 79443, -30093, -24195, -10191, 35339, -97605, -176618, -160826, -13200, 12238, -36370, -28952, -40285, -8927, -56748, -259086, -189861, 31329, 24012, -2420, -25984, -75752, -72977, -39238, -35076, -95653, 31778, -25855, -36422, 106573, 61843, -4433, 67560, -34115, -49752, -33362, -30650, -38331, -67377, -140281, -90660, 8144, 56977, 48157, -29595, -17633, 63032, 5725, -73493, -9903, 2409, 68452, 44290]
195D4290L3969p010j13097N4190L1073q2937N8714M0989r1720Q7395O1712l9015
183G8553j8719Q9689l6966j40235R6404j4491M8618R6488j02640o7307L7837M1880
171A09111o9089O6967K9226j6539J2745p08j00732j44750m6155J77691j1647L1720
159C7840n865m4430O1184n9729j0812M9302q3481L8586J1624J6625k4745k4481
147c8382M8407L166L4229K202j5429n9476j2724J10583j26205m5150N7488J5123
135b6168Q340M8842Q4073l4509m2589j5733N394N746J40526m7093n0244j63167
123h6582j08515K08437L8705j29176P4989L391R583R352P4474j15279k6641O063
111d1199J13687p7271J04283J6917N0962L520j59542r0240J2815N6034L4037o3927
$$ y = [44290, 78259, 71249, -41848, 12342, 43415, -39522, 19192, 60181, -31539, 55856, 117568, 78553, 59834, 149523, 112557, -27678, 68726, 54235, 102853, 199341, 96701, 29394, 67231, 109111, 40022, 106989, 136215, 119676, 132421, 131713, 30981, -113769, -159924, 17767, 6120, 37840, 31975, -12455, 48729, -11000, -21812, 27490, -55991, -17405, -5781, 10844, -13901, -38382, 10025, 13191, 47420, 49622, 34193, -25283, -38007, 72576, -53629, -98779, -41291, -26168, -17828, 31014, 115087, 80578, 37989, 22256, 27650, 33396, 173922, 126829, 76585, -86582, -195097, 13340, 52045, -77131, -2142, 1249, 10832, 20184, 94658, -20621, -47262, -41199, 72488, -4783, 99500, 116417, 167379, 170899, 11357, -78883, -66068, -10034, 24003, -39924]
99c9924n1794L163N1576R2166m0457Q634R7192j24564j8976N414j09675P4666
87e2579o6165N7288R342K9286k25K847O5269L6166n7157N4789j23428l3826M2270
74c6123p9324P2331J39649M4534j6316l8241m5900m9717q447O2930P4308p8327
62D1357o0465m9408P1000j6717R4831K8963o6904L1112j7679J8658n7608J5788
50C2928K3053O0954j04650M3999m644l7807K35J7642M5869Q27r5624l993j0625
37c1836L4740l4507q0603n92K5402K7123m9466n862P0839M0734q3056J22780N9706
24I5402r0091L0658j0031n4504R0885r1478K3863j5877O9389L154r4569n8363
12a01562M8804Q8035K116P2247n6755P04q6436l2005J05529o181l1697O2369
$$ y = [-39924, -91718, -88555, -36979, 55187, 14730, 23364, 120556, -4008, -22984, -17570, -127245, -52579, -118744, -61456, -52114, -22828, -23053, -20206, 45063, 81229, 24072, 78861, -44567, -78393, -36123, -115447, -43116, 96533, 141067, 124751, 86510, 40610, -9107, -17554, 45376, 119684, 41357, -19108, -68516, 2484, -14233, 80598, 109561, 42657, 73769, 56090, 74748, 17140, 32928, 55981, 116935, 12285, 56284, 51640, 13833, 14068, 31710, 77579, 78406, -17218, -21211, -31836, 2904, -31603, -112206, -112798, -87396, -60273, -109739, -115601, -44762, -4028, -87084, 35696, 95402, 5311, 35969, 25938, -28566, 62319, -29159, -5296, -21173, 48216, 51370, -43199, -101562, -52758, 35277, 37393, 109640, 52885, 53589, -32847, -64852, 40677, 34496, 2799, 65168]
0F5168
$$ y = [65168]
$$ Imaginary data points
##PAGE= N=2
##DATA TABLE= (X++(I..I)), XYDATA
16383a684991P8870M3507j5872k2602O069K6492O4945k6461O1220P9225K4410
16372a365188K1354J8281l3446Q636M2002M5296Q3746q2926o3680J09950J9910
16361a196065p479J022K6792J02746l8301L3400P2925O1773R3212n3814j03916
16350a007705K8391J18933L8784M153l0537l7139J15831j525k188L392O6107n145
16338g08648P5262P9352j9845J8389j1061J2212N9420j7873L3534j5224l1050
16327e25532J22516o669M9522K3202M9904M7954N6192l0723q4655O9255K0022
16316b09012k2884K7092O0334l972p7342P7398P2207K8746J1207N4498N6760l8144
16304C6888o8725M4162K0079o7963N2560Q4042P5373O4953p4661N7872j9695q448
$$ y = [-1684991, -1606121, -1562614, -1578486, -1601088, -1595019, -1568527, -1503582, -1530043, -1468823, -1389598, -1365188, -1343834, -1325553, -1358999, -1350363, -1308361, -1263065, -1179319, -1262245, -1325925, -1215975, -1196065, -1203544, -1202522, -1175730, -1072984, -1111285, -1077885, -1004960, -943187, -849975, -903789, -1007705, -979314, -860381, -821597, -817444, -847981, -885120, -769289, -770814, -773002, -769610, -703503, -708648, -633386, -554034, -573879, -555490, -566551, -554339, -494919, -512792, -479258, -494482, -525532, -403016, -409685, -360163, -336961, -287057, -239103, -182911, -213634, -298289, -229034, -209012, -231896, -204804, -144470, -148442, -225784, -148386, -76179, -47433, -36226, 18272, 75032, 36888, -31837, 12325, 32404, -35559, 17001, 101043, 176416, 241369, 166708, 224580, 204885, 196437]
16292A96437k0672R209O2151M7743m0921n5145J18814k5183J06364M970j10677
16281B93090L6580L7173k97p998N280K1403N9572J72850j40819P6987j08415j01684
16269C43722Q2280P0282J00407Q7241N0516l18n4015k7977j5280K7047O8124M372
16257G36401l9717j4294Q7221j6222Q5156j58534L8521k2657k24K24257J58043
16246A077951n4000j61956O8398J515M3732r9746j2573M9279J97761M830m8239
16235A066952o9968J9939N6756l6924J31447j3859R9934q9436j2984M8705k8309
16224A172253N5313R3832k7717j81779K250J6360K7800O974J0717k1990L7989
16213A192002q4624K5618Q8368j8848p9028J12066J24699j88020K8630J01028
$$ y = [196437, 175765, 184974, 247125, 294868, 253947, 198802, 317616, 292433, 398797, 403767, 293090, 329670, 366843, 366546, 358548, 363828, 385231, 444803, 617653, 476834, 553821, 445406, 343722, 426002, 496284, 596691, 683932, 734448, 734130, 680115, 652138, 636858, 663905, 732029, 736401, 696684, 682390, 769611, 753389, 838545, 680011, 718532, 695875, 695651, 919908, 1077951, 1023951, 861995, 930393, 931908, 975640, 875894, 863321, 912600, 1110361, 1115191, 1066952, 996984, 1016923, 1073679, 1036755, 1168202, 1154343, 1254277, 1164841, 1151857, 1200562, 1172253, 1227566, 1321398, 1293681, 1111902, 1114152, 1130512, 1158312, 1165286, 1176003, 1154013, 1192002, 1107378, 1132996, 1221364, 1202516, 1123488, 1235554, 1360253, 1172233, 1200863, 1301891]
16203A301891L8685M5761j5169O1087q6390n6152L2234Q459J23724j061P2505
16192A525574k20594k6082M9753p9737J48110P4542j20337J39895K4643r0086
16182A425681n9552J41830m5888K0470j60526k0834K7288K5893Q5440M3012J2459
16171A495273j13697J10931J50155P2900O0033j09325m9389M515M0808n9983n8825
16160A543396M1260J7243m6716j49641N4987J37299K7014m7876r4204q850J21139
16149A595051R101M1197j5947k3026p0827J6838P0473P9613j41861k3777p0129
16138A466706J16209R5123Q2301O564o7039N8730n6965Q528J9016o3018k3214
16127A642941m2712J39933N2311p9529q3302p402O5949m8026j03188l7405M8777
$$ y = [1301891, 1340576, 1386337, 1371168, 1432255, 1345865, 1289713, 1321947, 1330406, 1454130, 1453069, 1525574, 1304980, 1278898, 1328651, 1248914, 1397024, 1471566, 1351229, 1491124, 1515767, 1425681, 1366129, 1507959, 1462071, 1482541, 1322015, 1301181, 1328469, 1354362, 1439802, 1482814, 1495273, 1381576, 1492507, 1642662, 1715562, 1775595, 1666270, 1616881, 1621396, 1662204, 1602221, 1543396, 1584656, 1601899, 1555183, 1405542, 1460529, 1597828, 1624842, 1576966, 1482762, 1473912, 1595051, 1604152, 1645349, 1629402, 1606376, 1535549, 1552387, 1622860, 1702473, 1560612, 1536835, 1466706, 1582915, 1678038, 1760339, 1766903, 1699864, 1758594, 1701629, 1710157, 1729173, 1666155, 1642941, 1600229, 1740162, 1792473, 1712944, 1629642, 1622240, 1688189, 1640163, 1536975, 1499570, 1548347]
16116A548347J61146l9027J0593R071J0263L2400L2793J15069n8093r9639N4051
16105A776974O5790o7439r9696o357L4201j7921K7301J42368O7918q8527j6287
16094A818325L5354M6009o8201l7485o9823M1448L7526m2219n6767o0181j1590
16083A632396J4207K317q3398j9295M2821P6566M1340L6064j6373Q0862l5428
16072A772079l4094L3008m5401o863o7540j918J06597N3165l61p4253Q0487P8883
16060A893789n1390j11622j9441R4876m9440k7824R395M7153J5641j7080K0176
16049A804233M0872j21246l0179J4767N9734P6017p8079o0866P2300q1536R1609
16038A787626J11622o3781L8282o712L5896n6664r6568q54p8464N7703Q1196n5641
$$ y = [1548347, 1709493, 1670466, 1681059, 1690130, 1700393, 1732793, 1765586, 1880655, 1822562, 1722923, 1776974, 1842764, 1775325, 1675629, 1669272, 1703473, 1685552, 1712853, 1855221, 1923139, 1834612, 1818325, 1853679, 1899688, 1831487, 1794002, 1724179, 1765627, 1803153, 1760934, 1704167, 1643986, 1632396, 1646603, 1648920, 1565522, 1546227, 1589048, 1665614, 1706954, 1743018, 1726645, 1807507, 1772079, 1737985, 1770993, 1725592, 1718729, 1651189, 1649271, 1755868, 1809033, 1808672, 1734419, 1814906, 1893789, 1842399, 1730777, 1711336, 1806212, 1756772, 1728948, 1738343, 1785496, 1801137, 1784057, 1804233, 1845105, 1723859, 1693680, 1708447, 1768181, 1844198, 1766119, 1705253, 1777553, 1696017, 1787626, 1899248, 1835467, 1873749, 1867037, 1902933, 1846269, 1749701, 1748847, 1670383, 1728086, 1809282, 1753641]
16026A753641j76041R3241J7532j8366J43237J07979j42528q4187J35810O4336
16016A894654K4660n1006m3879R8284m5563k1382m2292j5072J26466k009l992
16005A918869M9420j53515o3168L9531j00317J79726J38862j41345o2714o199
15995A799150m0154J56606r4729O5189O476o3977q7759Q4281O0781n5417l5318
$$ y = [1753641, 1577600, 1670841, 1688373, 1670007, 1813244, 1921223, 1778695, 1694508, 1830318, 1894654, 1919314, 1868308, 1824429, 1922713, 1877150, 1855768, 1813476, 1798404, 1924870, 1922861, 1918869, 1968289, 1814774, 1751606, 1791137, 1690820, 1870546, 2009408, 1868063, 1805349, 1799150, 1758996, 1915602, 1820873, 1886062, 1892538, 1828561, 1740802, 1825083, 1885864, 1830447, 1795129]
$$ [...]
##END NTUPLES=NMR SPECTRUM
##END=
