##TITLE=1H_CA-9065-3
 CDCl3
 8 sc, 
 27.09.2022
##JCAMPDX= 6.0         $$ Bruker NMR JCAMP-DX V2.0
##DATA TYPE= NMR SPECTRUM
##DATA CLASS= NTUPLES
##ORIGIN= UXNMR, Bruker Analytische Messtechnik GmbH
##OWNER= root
$$ XWIN-NMR		Version 3.5
$$ Tue Sep 27 13:58:22 2022 Russian Standard Time (UT+4h)  she@DPX200
##.OBSERVE FREQUENCY= 200.1313499994
##.OBSERVE NUCLEUS= ^1H
##.ACQUISITION MODE= SIMULTANEOUS
##.ACQUISITION SCHEME= undefined
##.AVERAGES= 8
##.DIGITISER RES= 18
##SPECTROMETER/DATA SYSTEM= spect
##.PULSE SEQUENCE= zg30
##.SOLVENT NAME= CDCl3
##.SHIFT REFERENCE= (INTERNAL, CDCl3, 0, 15.7326)
##AUDIT TRAIL= $$ (NUMBER, WHEN, WHO, WHERE, WHAT)
$$ ##TITLE= Audit trail, XWIN-NMR		Version 3.5
$$ ##JCAMPDX= 5.01
$$ ##ORIGIN= Bruker BioSpin GmbH
$$ ##OWNER= she
$$ F:/spectra/data/she/nmr/H-F/1/pdata/1/auditp.txt
$$ ##AUDIT TRAIL=  $$ (NUMBER, WHEN, WHO, WHERE, WHAT)
(   1,<2022-09-27 13:57:06.70 +0400>,<she>,<DPX200>,
      <created by zg, POWCHK disabled, PULCHK disabled
       configuration hash MD5:
       00 E9 B6 7A A2 85 ED C7 34 08 36 98 17 FE 4E 26
       data hash MD5: 16K
       3E 0A 50 32 2D 96 20 6A 13 14 30 C9 49 18 7D 0E>)
(   2,<2022-09-27 13:57:09.92 +0400>,<she>,<DPX200>,
      <Start of raw data processing
       efp BC_mod = 2 LB = 0.24 FT_mod = 6 PKNL = 1 PHC0 = -18040.33 PHC1 = 21.20069 SI = 16K 
       data hash MD5: 16K
       E3 10 CB EE 12 74 B3 CB 2C 91 84 86 CC CD 09 88>)
(   3,<2022-09-27 13:57:25.96 +0400>,<she>,<DPX200>,
      <pk PHC0 = 1.049157 PHC1 = -0.6 
       data hash MD5: 16K
       92 43 36 CE 9B EC 27 30 04 5E B9 0A BB A5 FD 6D>)
(   4,<2022-09-27 13:57:29.32 +0400>,<she>,<DPX200>,
      <abs ABSG = 5 
       data hash MD5: 16K
       48 C2 73 98 15 7A 18 AE CD F6 C2 45 00 B0 68 4F>)
$$ ##END=
$$ 
$$ hash MD5
$$ 88 17 1C 68 5D 9D 2C 96 69 1C 24 FC 1E FE 0A E6
##$RELAX= 
##$RELAX= 
##$RELAX= 
##$RELAX= 
##$RELAX= 
##$RELAX= 
$$ Bruker specific parameters
$$ --------------------------
##$DU= <F:/spectra>
##$EXPNO= 1
##$NAME= <H-F>
##$PROCNO= 1
##$TYPE= <nmr>
##$USER= <she>
##$AMP= (0..31)
100 100 100 100 100 100 100 100 100 100 100 100 100 100 100 100 100 100 
100 100 100 100 100 100 100 100 100 100 100 100 100 100 
##$AQSEQ= 0
##$AQ_mod= 1
##$AUNM= <au_zg>
##$AUTOPOS= <>
##$BF1= 200.13
##$BF2= 200.13
##$BF3= 200.13
##$BF4= 200.13
##$BF5= 200.13
##$BF6= 200.13
##$BF7= 200.13
##$BF8= 200.13
##$BYTORDA= 1
##$CFDGTYP= 0
##$CFRGTYP= 5
##$CHEMSTR= <none>
##$CNST= (0..31)
1 1 145 1 1 1 1 1 1 1 1 1 1 1 1 1 1 1 1 1 1 1 1 1 1 1 1 1 1 1 1 1 
##$CPDPRG= <>
##$CPDPRG1= <>
##$CPDPRG2= <>
##$CPDPRG3= <>
##$CPDPRG4= <mlev>
##$CPDPRG5= <mlev>
##$CPDPRG6= <mlev>
##$CPDPRG7= <mlev>
##$CPDPRG8= <mlev>
##$CPDPRGB= <>
##$CPDPRGT= <>
##$D= (0..31)
0 1.2 0 0 0 0 0 0 0 0.06 0 0.03 0 0 0 0 0.0002 0 0 0 0 0 0 0 0 0 0 0 0 
0 0 0 
##$DATE= 1664272626
##$DBL= (0..7)
120 120 120 120 120 120 120 120 
##$DBP= (0..7)
150 150 150 150 150 150 150 150 
##$DBP07= 0
##$DBPNAM0= <>
##$DBPNAM1= <>
##$DBPNAM2= <>
##$DBPNAM3= <>
##$DBPNAM4= <>
$$ [...]
##$SUBNAM3= <"">
##$SUBNAM4= <"">
##$SUBNAM5= <"">
##$SUBNAM6= <"">
##$SUBNAM7= <"">
##$SUBNAM8= <"">
##$SUBNAM9= <"">
##$SW= 18.0517283424941
##$SWIBOX= (0..15)
0 0 2 0 0 0 0 0 0 0 0 0 0 0 0 0 
##$SW_h= 3612.71676300578
##$TD= 16384
##$TD0= 1
##$TE= 0
##$TE2= 300
##$TE3= 300
##$TEG= 300
##$TL= (0..7)
0 120 120 120 120 120 120 120 
##$TP= (0..7)
150 150 150 150 150 150 150 150 
##$TP07= 0
##$TPNAME0= <>
##$TPNAME1= <>
##$TPNAME2= <>
##$TPNAME3= <>
##$TPNAME4= <>
##$TPNAME5= <>
##$TPNAME6= <>
##$TPNAME7= <>
##$TPOAL= (0..7)
0.5 0.5 0.5 0.5 0.5 0.5 0.5 0.5 
##$TPOFFS= (0..7)
0 0 0 0 0 0 0 0 
##$TUNHIN= 0
##$TUNHOUT= 0
##$TUNXOUT= 0
##$USERA1= <user>
##$USERA2= <user>
##$USERA3= <user>
##$USERA4= <user>
##$USERA5= <user>
##$V9= 5
##$VALIST= <valist>
##$VCLIST= <CCCCCCCCCCCCCCC>
##$VD= 0
##$VDLIST= <DDDDDDDDDDDDDDD>
##$VPLIST= <PPPPPPPPPPPPPPP>
##$VTLIST= <TTTTTTTTTTTTTTT>
##$WBST= 1024
##$WBSW= 4
##$XGAIN= (0..3)
0 0 0 0 
##$XL= 0
##$YL= 0
##$YMAX_a= 103550
##$YMIN_a= -137298
##$ZGOPTNS= <>
##$ZL1= 120
##$ZL2= 120
##$ZL3= 120
##$ZL4= 120
##$ABSF1= 15.67197
##$ABSF2= -2.379877
##$ABSG= 5
##$ABSL= 3
##$ALPHA= 0
##$AQORDER= 0
##$ASSFAC= 0
##$ASSFACI= 0
##$ASSFACX= 0
##$ASSWID= 0
##$AUNMP= <proc_1d>
##$AZFE= 0.1
##$AZFW= 0.1
##$BCFW= 0
##$BC_mod= 2
##$BYTORDP= 0
##$COROFFS= 0
##$CY= -3
##$DATMOD= 1
##$DC= 0
##$DFILT= <>
##$DTYPP= 0
##$F1P= 0
##$F2P= 0
##$FCOR= 1
##$FTSIZE= 16384
##$FT_mod= 6
##$GAMMA= 0
##$GB= 0
##$INTBC= 1
##$INTSCL= 3.70164e-10
##$ISEN= 128
##$LB= 0.24
##$LEV0= 0
##$LPBIN= 0
##$MAXI= 10000
##$MC2= 0
##$MEAN= 0
##$ME_mod= 0
##$MI= 1.114404
##$NCOEF= 0
##$NC_proc= -8
##$NLEV= 6
##$NOISF1= 3.799351
##$NOISF2= 2.8
##$NSP= 0
##$NTH_PI= 0
##$NZP= 0
##$OFFSET= 15.73257
##$PC= 1
##$PHC0= -18039.28
##$PHC1= 20.60069
##$PH_mod= 1
##$PKNL= yes
##$PPARMOD= 0
##$PSCAL= 0
##$PSIGN= 0
##$REVERSE= no
##$SF= 200.130007799602
##$SI= 16384
##$SIGF1= 3
##$SIGF2= 2
##$SINO= 5.538805
##$SIOLD= 16384
##$SREGLST= <1H.CDCl3>
##$SSB= 0
##$STSI= 16384
##$STSR= 0
##$SW_p= 3612.71676300578
##$SYMM= 0
##$S_DEV= 0
##$TDeff= 16384
##$TDoff= 0
##$TI= <>
##$TILT= no
##$TM1= 0
##$TM2= 0
##$TOPLEV= 0
##$USERP1= <user>
##$USERP2= <user>
##$USERP3= <user>
##$USERP4= <user>
##$USERP5= <user>
##$WDW= 1
##$XDIM= 16384
##$YMAX_p= 495355178
##$YMIN_p= -1661356
$$ End of Bruker specific parameters
$$ ---------------------------------
##NTUPLES= NMR SPECTRUM
##VAR_NAME=  FREQUENCY,     SPECTRUM/REAL,   SPECTRUM/IMAG
##SYMBOL=    X,             R,               I
##VAR_TYPE=  INDEPENDENT,   DEPENDENT,       DEPENDENT
##VAR_FORM=  AFFN,          ASDF,            ASDF
##VAR_DIM=   16384,         16384,           16384
##UNITS=     HZ,            ARBITRARY UNITS, ARBITRARY UNITS
##FACTOR=    0.220516191357247, 1,           1
##FIRST=     3148.55929567188, 0,            0
##LAST=      -464.157467333902, 0,           0
##MIN=       -464.157467333902, -1661356,    0
##MAX=       3148.55929567188, 495355178,    0
$$ Real data points
##PAGE= N=1
##DATA TABLE= (X++(R..R)), XYDATA
$$ [...]
9219 26723255 26437421 25657188 25412590 24584541 23535372 23019792 22601603 22001624 22200237
9210 22200237 21851113 20679720 20302305 20493718 20015931 19559399 18959024 19078329 18845323
9201 18845323 18598062 17973663 17941247 17725329 17399967 16987187 16493166 16830445 16446939 16191258
9191 16191258 16260563 15606878 15586459 14903833 15082793 15142065 14957950 15409674 15607805 15265643
9181 15265643 14472718 14503319 14080736 14615996 14625371 14551583 14437773 15011711 15105139 13980701
9171 13980701 13297407 13612093 14100605 13755865 13902942 13639509 13496248 13891010 13828360 13562831
9161 13562831 12589307 12665275 12650928 12591741 12441164 12159188 11684723 11862112 12288385 11962103
9151 11962103 11632737 11685929 11365568 11442390 11359979 11528497 11240059 10872920 10744058 11140787
9141 11140787 11372130 11142325 11118670 11129549 10702389 11304963 11407862 10647794 10394743 11354961
9131 11354961 11308131 10362604 10477247 10560476 10218740 9854522 9816356 10800760 10800676 9823363 10020817
9120 10020817 10203720 10000061 9928257 9860251 9577035 9441717 9109367 9241642 9457731 9006203
9110 9006203 8994003 8904543 8735091 9003895 8960854 8213282 8032819 8184312 7739027 7690388
9100 7690388 7407086 7516540 7381805 7537464 7433224 7422641 6931975 6589557 6774565 6563825
9090 6563825 6414331 6245325 6356601 6549775 6610675 6267596 6542373 6094831 5604305 5821030
9080 5821030 6387777 6268135 5840244 5390238 5732941 6435293 5854189 6030169 6339944 6201694
9070 6201694 6007667 6236285 6110268 5435029 6406084 6476056 5789018 5915505 5763166 5463364
9060 5463364 5438484 5784794 5221104 5400691 5693337 5940461 5440559 5119936 5636130 5444189
9050 5444189 5062738 4991138 4538016 4375275 4949388 5002488 4515612 4858988 4550207 4495975
9040 4495975 4436693 4951564 5676848 4848240 4320687 4545545 4539536 4782823 4628595 4409254
9030 4409254 3833497 3733317 4100510 4372922 3961950 4481515 4248664 4340870 4388007 4598017
9020 4598017 3767866 3722509 4089859 3779519 3448859 3927611 4332588 4206357 4550726 4674131
9010 4674131 4432848 4046822 4245003 4820029 4977500 4528120 3968352 4356719 4802053 4419838
9000 4419838 4769165 4688985 5242676 4713083 4401662 4635394 5022977 4879148 4711705 4356009
8990 4356009 4537875 4688498 5042414 4777056 4384173 4101490 4106977 4233131 4733913 5024565
8980 5024565 4544709 3965507 4100784 4268990 4072488 4148033 4571400 4720451 4619934 4485937
8970 4485937 4442369 4141971 3738182 4295928 4486838 4376775 4528824 5204988 4911557 4428824
8960 4428824 4221975 4216248 4501308 4241875 4624485 4624813 4655844 4408196 5615273 5612172 5640521
8949 5640521 4999193 4414528 4155587 4139682 4541238 4522409 4676810 5185157 5206277 5128332
8939 5128332 5155129 5768254 5974110 5471628 5811606 5895870 6444596 5905494 5392958 5931758
8929 5931758 5590279 5715408 5423110 5253551 6153861 6135251 6350588 6119240 5978959 6277408
8919 6277408 6260018 6045129 5869055 5525764 6130407 6190496 6478993 6338276 6351095 5766063
8909 5766063 6081646 7027556 7103663 6845636 6782665 6534368 6461270 7132683 7612818 8089043
8899 8089043 7672546 7242458 6903508 7189620 7250385 7865996 7754959 7226718 7190583 7193595
8889 7193595 7812064 7842118 7603948 7420961 7613554 7595858 7610685 8211536 8122678 7506603
8879 7506603 7554680 7641520 8061421 7783239 7485825 7547053 7734016 8145470 7969940 7757425
8869 7757425 7691969 7475137 7852608 7863581 8203166 8392907 8155785 8179062 8169825 8341603
8859 8341603 8876341 8942585 8671676 8756287 9297747 8745537 9033806 9525900 9471643 9720204
8849 9720204 9962281 9874609 9339396 9354425 9776670 10343377 10168602 10247435 10486887 10362344
8839 10362344 10286945 10342378 10441997 10753631 10431405 10236734 10707566 10376976 10737791 10179365
8829 10179365 10597076 11150228 11514999 11546803 11140798 11636239 11822207 12398718 12774993 12349020
8819 12349020 11964469 11936418 11763661 12157358 12246965 12222332 12413851 13272383 13462357 13611719
8809 13611719 13313056 13409332 14076082 14478340 14709673 14722547 14229668 14614076 14946159 14908596
8799 14908596 15816782 16305804 16246491 16811930 16210829 16566160 16716085 16930741 17269881 17643992
8789 17643992 17603713 18224069 18922284 19209586 20124366 20683465 20665347 20255478 19933483 20786577
8779 20786577 21059128 20890213 21717424 23168915 23929139 22892377 23600625 24068853 24423730
8770 24423730 25175982 25647821 26274631 26587880 26935479 27368008 28234430 28947904 29392762
8761 29392762 29695340 30452112 30712178 31493043 33377838 33631982 34426113 35297995 35675745
8752 35675745 36294833 37022933 38247133 39136202 39603724 40530674 41525185 42442575 43405913
8743 43405913 44391490 44483959 45949004 47395915 48367753 49330722 50982784 52674690 54204938
8734 54204938 55498896 56895204 58926135 61317364 62510074 64280314 66212482 68268032
8726 68268032 70754374 73797881 76871840 78977061 81443942 84621954 88241345 91688915
8718 91688915 95919833 99809577 104148055 108482708 113234682 118287674 123250888 129304047
8710 129304047 134782254 140255429 146628549 152789190 159643912 166099102 172458573 178544577
8702 178544577 184536918 190639502 196256767 201197310 204907714 207221021 209969905 212421436
8694 212421436 213373694 213230230 212485377 211078659 208581186 206198277 203541300 199525026
8686 199525026 195145327 190671281 186342309 182300006 176767069 172271714 168604746 164627957
8678 164627957 161763199 159861012 157508630 155247928 153684965 152629460 152436840 152183719
8670 152183719 152247769 152277111 153622379 155469131 156898691 158708658 160676565 163037476 164697994
8661 164697994 167239905 169508658 171249852 173151553 174270746 174701595 174807290 174200206
8653 174200206 172450646 171007574 168625262 165047808 161162293 156741236 151638453 146282812
8645 146282812 140627850 134808435 128592296 123235362 117427325 112289765 107069867 102189053
8637 102189053 97599277 93499583 89571150 85672724 82292489 78790053 75840908 72849302
8629 72849302 70045950 67135401 65590225 63588334 61078123 58519304 56146461 54203548
8621 54203548 52278812 50927986 49513393 47797983 46504120 44859358 43550938 42335308
8613 42335308 40819419 39460290 37815414 36859420 35694485 35044982 34797442 33580586 32227999
8604 32227999 31004305 30965030 30589257 29759747 29273224 28013885 27070293 26329867 26101813
8595 26101813 25147028 25055123 24614832 24112675 22942006 22117916 22031814 21316284 20787580 19813185
8585 19813185 20097399 19539409 18704204 18157376 17820680 17820514 17535718 17254523 17346969 16982976
8575 16982976 16808169 15714554 15877754 15796510 15578290 16017424 15044784 14699161 14211260
8566 14211260 14203064 13623619 12988942 13325064 13069485 12849330 12039167 12141005 12357956 12355054
8556 12355054 12857421 12401542 12021925 11704349 12257577 12243109 11563842 11309056 10871531 11464687
8546 11464687 11385734 11060426 10390294 10388097 9549906 8759459 9759281 9735119 9540063 9501677
8536 9501677 9491518 9508072 9807875 9534053 9114355 9110747 9261461 8993841 8744311 8992388
8526 8992388 8779005 7856460 7482917 7479356 7623407 8134410 8296111 8173735 7267908 7492853
8516 7492853 7332463 7126917 7303729 6550790 6887191 7126002 7244686 6897979 6198263 6120302
8506 6120302 5927816 5658469 6102097 6139069 6190336 6098354 5454272 5640084 6169170 5781809
8496 5781809 5653265 5461548 5191765 5863107 5499670 4932546 4895591 4654987 4782138 4976289
8486 4976289 4601116 4815991 4798875 4471622 4335040 3947034 3673878 3736163 4120181 3813844
8476 3813844 3964392 4251843 4109566 4085344 3862675 3243930 3360743 3746343 3333886 3226251
8466 3226251 3289597 3731462 3696682 3812817 3531610 3665184 3201630 2833904 3216665 3111771
8456 3111771 2724288 2793472 3215520 3092826 3094491 2757262 2742687 2471023 2515679 2803448
8446 2803448 2856487 2771860 2840072 3391034 3503849 3170364 3937082 3682497 3567087 3034577
8436 3034577 3261452 3028922 2463367 2684075 2249172 2045689 1976911 2327679 2340700 2315724
8426 2315724 2219381 2282336 2269429 2542889 2522294 2627310 3065347 3198916 2530422 2018477
8416 2018477 1477283 1383434 2090915 1907922 1772601 2024554 2759356 2124661 2044928 2393498
8406 2393498 1782231 2092669 2296937 1886139 2222987 2190318 2241172 1947634 1699275 1988235
8396 1988235 1792313 1197432 1187000 1708607 1478294 1373700 1381217 1810676 2161801 2321192
8386 2321192 2223511 1962094 1469950 1887521 2172094 1892070 1656772 2267015 1853236 1478647
8376 1478647 2225131 1741635 1945974 2011019 1436299 1591448 1525599 1804174 1133154 1135971
8366 1135971 1582714 1802924 2315862 2461211 1852128 1667857 1486705 1415989 2149905 1573062
8356 1573062 1600486 1273785 1003812 1039045 780298 858828 1534898 1380458 1460835 1609427
8346 1609427 1303792 1226883 1465912 1345338 964891 1590936 1916786 1970797 1888330 1161891
8336 1161891 1125179 1860067 2009229 1830600 1462165 1367523 1441700 2001621 2654324 2616480
8326 2616480 2437763 2373060 1584108 1589560 1654139 1744246 2026478 2004468 2270713 2408588 2403201
8315 2403201 2321508 1437788 1258489 1972213 2108617 1913384 2253987 2298070 1406233 1824413
8305 1824413 1650908 1677650 2166093 1536931 1989822 1828586 1895991 1649166 1880980 1993715
8295 1993715 1635222 1697624 1690758 1863618 1466636 1583267 1637132 1944434 1169599 627791
8285 627791 884478 1032159 1379395 1813525 2124765 2331899 1792437 1899318 1671780 1707017
8275 1707017 1311227 1012478 1117432 2488373 2099745 1623906 1846483 1008070 1576425
8266 1576425 1251375 1610569 1427278 1408239 1552786 727983 1424959 1834766 1031410 1106624
8256 1106624 974373 994674 1254452 1412794 1162203 898027 400106 1134666 1137023 1302077
8246 1302077 1254320 961518 956423 1456117 1306025 672922 639849 1271379 1297902 921423
8236 921423 751737 677598 124254 117111 992014 516352 1084014 649175 738189 903229
8226 903229 1342735 1589109 1451004 926868 516861 1000133 747703 452377 210023 -329473
8216 -329473 700448 924838 1045978 1442953 594987 249523 83518 389260 -75732 232905
8206 232905 904415 874561 253850 317436 371189 886693 954442 631802 318183 904930
8196 904930 1000001 731557 1360890 2809931 2536143 -1287888 -1189962 -756793 -135871 -486651
8186 -486651 259481 511541 141484 125204 39802 -78322 287448 205679 672402 1110560
8176 1110560 830054 723316 398152 893357 789916 713104 456590 836287 667663 399718
8166 399718 31011 449754 721237 327899 284229 1645 -298568 27790 -85684 700224
8156 700224 -1828 220781 458991 -30181 289991 -10618 -459435 111219 200564 -22810
8146 -22810 -220358 -496631 -266577 153496 8247 300491 354730 262692 483188 -47349
8136 -47349 235330 690543 341059 60907 243524 621100 937201 528026 538788 360247
8126 360247 588714 313993 284452 746972 375463 425125 96498 -644784 -179519 -68176
8116 -68176 -495626 -1042100 -784259 -416551 -247563 -704076 -588512 150408 51271 -66395
8106 -66395 -46314 -285978 179874 104234 -730934 -262553 -88361 11065 -185350 -493256
8096 -493256 -192347 -209373 -130720 -290391 -150460 115480 -67956 94238 -614096 -434715
8086 -434715 414379 259087 -58485 -198701 216952 352915 -131453 -121965 -36209 423425
8076 423425 297677 -542894 -246657 109776 10605 -485937 -182792 131406 223173 30449
8066 30449 -67545 431252 -119954 70545 -32749 -264277 -216723 -325949 -409688 1205
8056 1205 -251946 518969 568575 289140 133002 -212734 -170308 -509465 -532641 -505491 -66787
8045 -66787 -251610 -218967 370567 -59720 -172033 -18934 27432 -616271 -698065 -722310 -312658
8034 -312658 245630 -187636 -737607 -61975 -219539 -573256 38431 -527624 -577677 -192621
8024 -192621 -359950 -766812 -918775 -1119153 -6757 383388 395218 363829 -287374 -306075
8014 -306075 -184766 -563455 -258918 9071 -10230 499271 247661 365756 726486 252136
8004 252136 20924 -610622 -336228 -170766 -369486 -676347 -779916 -363363 -490018 -447299
7994 -447299 152559 238570 16306 180353 568463 449912 333605 355243 496700 3571
7984 3571 -90411 -4376 498774 59000 -248475 -417074 -428048 10405 262362 -284216 30654
7973 30654 -139027 -87794 -174846 -411541 -584570 -333000 252303 76741 -98640 126287
7963 126287 18656 127945 393760 122150 376176 345456 -54076 319697 75600 -492324
7953 -492324 86374 -346791 -318940 -631777 -944903 -1553349 -1412225 -506448 -464689 -267607
7943 -267607 -330735 -366771 -265585 -365408 -127470 -499213 -842987 -896440 -42900 -181743
7933 -181743 -124259 16806 67731 -113361 -169340 181340 319045 437318 513269 188685
7923 188685 65495 407578 -1388 -341043 -665269 -321723 -293657 -323722 -127615 -613758
7913 -613758 -706345 -470390 95262 -433528 -464106 -358920 -396118 -414 724067 46486
7903 46486 -238050 61223 -267585 -422190 -442972 -1037494 -1054877 -1045372 -634231 104437 75400
7892 75400 -645932 -254014 -170665 -752033 -545885 -147610 324556 473068 121304 -369442
7882 -369442 -568133 -820551 -950785 -299238 -475052 -700805 -245517 -154869 -418289 -497961
7872 -497961 -496635 -456660 -285754 -699596 -701423 -802726 -710621 -932424 -78418 -241551 40910
7861 40910 -183594 -859567 -1158736 -1592188 -1556831 -1269104 -925804 -502443 -207529 -926469
7851 -926469 -840909 -45785 -269889 122601 488025 -129476 -170536 -334891 -60165 -564865
7841 -564865 -749452 -512311 -356978 255594 -702714 -640517 -434181 -896847 -802950 -418942
7831 -418942 -521698 -477887 -217461 61269 -519659 -1083074 -1045707 -794803 -634660 -779972
7821 -779972 -518188 -847464 -201393 -586917 -97614 -427318 732311 1773917 256691
7812 256691 304411 233812 -116520 -442924 -350292 -378955 106663 155180 54975 -375269 -585137
7801 -585137 -177382 -176464 -517681 -113812 -175425 -104756 -673178 -1004969 -837246 -1188134 -851463
7790 -851463 -93907 -534466 -235688 -387761 -338661 -390196 -420327 -240802 78278 -117132
7780 -117132 -60790 -454170 -880606 -173768 -145664 -154259 -450734 -725025 -462387 -588925
7770 -588925 -794037 -665538 -962925 -1134413 -437515 -330224 -278868 123485 81665 -21605
7760 -21605 476784 249831 202223 27835 -97586 843567 350207 383449 252497 190957
7750 190957 -360971 -576356 160919 191101 -666319 -411252 -452518 -463687 -178164 -465335
7740 -465335 -757670 -652908 -729354 -210460 -11170 -275435 -929289 -498954 -730289 -469050
7730 -469050 168031 -248817 -399907 -1163216 -690912 336320 -525923 -477882 -193699 -538751
7720 -538751 -944543 -1063041 -364461 -154432 -1031957 -1079807 120186 97110 -219689 -584002
7710 -584002 -212933 7765 338297 38368 -64273 -55484 -293686 -425643 -295958 115039
7700 115039 -31913 170271 -965471 -803452 -523827 -167197 -357966 -634859 -12090 90120
7690 90120 4695 493258 342889 -265420 -423458 -600643 -793454 -442090 -428007 -278097
7680 -278097 -667977 -335859 171125 384722 204547 33872 22872 -388010 -1213454 -295744
7670 -295744 440694 -190588 -203625 93848 -109896 -261965 -1663 -392105 -502420 -822609
7660 -822609 -847933 -1124443 -633900 -425093 -670296 -306905 131359 -910929 -184730 -268977
7650 -268977 -636781 -316103 -697596 -975971 -776314 -632196 523584 383158 -134075 -308366
7640 -308366 -173827 -456994 -511849 -193641 188466 -240927 -282121 66965 -477352 -562584
7630 -562584 -553192 -410838 -985574 -990505 -418627 -1010141 -818994 -528970 -265674 -61927
7620 -61927 133080 121284 -272804 -96334 -123276 -635081 -424782 48986 -26347 -423493
7610 -423493 -315513 -518434 -1014670 -646276 -377078 -239397 -348462 405062 564341 -222856
7600 -222856 -770109 -1087360 -941796 -249848 -51685 -170972 -385055 -278492 -166309 -456103
7590 -456103 -660948 -490888 -778839 -839177 -170721 -220243 -371454 -488677 -1118102 -1078567
7580 -1078567 -879234 -948110 -440670 -317389 -626627 -146543 41528 -504325 -73365 12557
7570 12557 -30385 283339 575542 550712 575166 328287 341908 99147 136792 183079 -576743
7559 -576743 -670138 -757536 -981390 -702717 -89126 272398 482127 37631 75327 43441
7549 43441 5071 -29174 -5681 -224927 -399495 -612895 288810 219868 94585 -308070 -380162
7538 -380162 180390 36270 228550 -390177 -378595 -487066 -530641 234363 -549563 -622971
7528 -622971 -351029 -115976 -269755 302061 -43773 -159628 149988 673289 705950 189098
7518 189098 1038462 511720 -47158 115239 1222450 1543623 612983 203165 35760 330047
7508 330047 624276 531049 107584 472763 771643 555560 627247 884961 1093797 966873
7498 966873 813658 918595 818872 774575 479944 164209 160070 248134 500151 515184 583498
7487 583498 -131327 -707269 -517206 -194489 -229061 -390747 -570263 -342510 295182 -114485
7477 -114485 -937324 -662673 -589951 -53866 235899 256048 -110035 -754491 -406018 -637651
7467 -637651 -437502 356634 -137871 -503758 -978689 -725948 -484406 -333812 -117232 -259205
7457 -259205 -416067 -855677 -566887 -646808 -571803 -277369 -700711 -1033917 -1464299 -1097216
7447 -1097216 -273590 -634755 -782529 -321729 -567019 -491819 -719421 -704441 -910013 -364203
7437 -364203 41535 -684982 -819144 -184455 -311042 -774196 -954535 -309565 135745 400157
7427 400157 830392 527338 -279239 -30600 284384 -173399 118656 294182 157580 -5430
7417 -5430 -248243 -136159 305411 -87538 -595176 -870818 -469261 -60550 -654568 -510914
7407 -510914 -282687 -255858 -418486 -756219 -796871 -533303 -3618 174119 95213 -665463
7397 -665463 -901663 -1105247 -1145522 -923478 -389851 300954 319178 349104 251165 487640
7387 487640 -258495 -840531 -451484 -544553 -501555 -570729 -575934 -675979 -359237 -408771 -213849
7376 -213849 -27843 -59163 -148268 -298495 272650 -443359 -633057 -209955 -404920 313386
7366 313386 259647 -403877 -438905 -413875 52030 -26005 195099 55572 -158994 -38158
7356 -38158 -383164 -47397 -229947 128425 91626 -374857 -125191 286137 618294 21098
7346 21098 -778214 -729696 -824157 -930610 -341044 69841 21392 -403891 -954646 -1217119
7336 -1217119 -1454248 -1015413 -970300 -909770 -957018 -968791 -740330 -565042 206527 -176475
7326 -176475 -811187 -607419 -352286 -515367 -909819 -854113 -800540 -706706 -446415 -705457
7316 -705457 -355773 513139 541466 -100443 -550824 -770727 -620247 -841047 -303033 -222713
7306 -222713 -771347 -588525 -192054 256264 -29706 172538 -325212 -25481 -933890 -879899
7296 -879899 222888 -205181 17807 -96332 -406928 -677196 -943903 -604652 -162638 -532058
7286 -532058 -1043190 -514427 -266436 -275295 -757690 -80546 -240995 -178608 -265288 -685536
7276 -685536 -192757 -510914 -848937 -138455 513543 -80192 -460587 -418188 -286281 -415127
7266 -415127 -243419 -719933 -388573 -147056 -616514 264443 -25768 -643339 -44859 -171239
7256 -171239 -388340 -250054 -148439 -524587 -731646 -988707 -811354 -475017 -804032 -1063583
7246 -1063583 -353954 -228054 -179123 -319897 -244505 525490 -107108 -328755 -651264 -534600
7236 -534600 -808161 -828046 -856681 -316165 457972 -82078 -440780 -307603 -502081 -420972
7226 -420972 -184279 -516964 -33447 -151068 298026 -833854 -675775 -284330 120851 -284715
7216 -284715 -286085 -407502 -467884 -633730 -338530 -67033 -628848 -264586 19641 -428089
7206 -428089 -135469 -401413 -1160586 -975922 -657516 -358464 -472649 -283701 -313154 -585277
7196 -585277 -616149 -443399 -275454 -281996 -422342 78755 330348 203971 183389 -205243
7186 -205243 -536377 -291097 -626700 -1348071 -587291 234858 -279273 -540192 -10046 429063
7176 429063 157739 166052 154866 -662199 -629266 -114080 -250075 -156208 -469878 -147888 -189437
7165 -189437 -153644 -24346 550865 337188 -194906 -677758 -870810 -1189447 -949532 -764361
7155 -764361 -951043 -262985 -306680 -638884 -410406 -58383 312124 -28989 -137776 -274522
7145 -274522 -583768 -119263 -544652 -494956 -118785 180010 -407777 101837 212562 -27104
7135 -27104 -20874 -65314 166457 -401902 -758160 -836126 -497420 -569104 -371122 209583 272987
7124 272987 -374728 -460337 -622178 -501365 -868256 -785830 -489811 -366910 -1352523 -1233279
7114 -1233279 -546320 -401748 321769 -163133 216068 567825 230165 483056 535562 455776
7104 455776 853988 709260 -25764 -222232 -7746 703719 636372 373800 496294 589703
7094 589703 -134859 -230844 -69086 316802 668626 1020353 1274425 739202 167833 329388
7084 329388 1416308 1687695 1426717 1580897 2151547 2025738 1569112 1821144 2074446 1755318
7074 1755318 1667581 1690092 1464250 2191771 2455668 1643976 1139638 1205168 1109442 803088
7064 803088 1067433 729088 677016 185126 -298548 282808 350305 468400 666422 944951
7054 944951 688633 183012 391183 291143 158085 498087 593363 221900 -11442 -621645
7044 -621645 -680826 -653792 -557095 89256 -176943 -465917 -140764 -289392 -39611 194218
7034 194218 -53086 193522 472346 563867 348260 544381 -596917 -452305 -284534 -418323
7024 -418323 168906 903690 732644 25820 251543 825372 616503 -29748 -390718 -367782
7014 -367782 100833 138348 312577 -597067 -193287 -376532 192984 128980 346135 -203724
7004 -203724 -188724 -419442 -475843 -634947 -1077302 -864052 -1018175 -343295 -115386 -295690
6994 -295690 373835 778899 584547 397541 625180 63470 111582 -201930 -83122 642258
6984 642258 821142 641199 419184 -258101 -590986 -309198 -99059 -246557 -368398 -284786
6974 -284786 246030 757992 358732 600779 405124 336870 526647 -260622 -208759 -1000088
6964 -1000088 -925070 -810750 -219726 230804 -201520 -15404 -390822 -49102 99496 296626
6954 296626 59046 328395 -203862 20925 8821 614407 545238 272186 -442794 -228016
6944 -228016 363145 367014 -103267 -307487 -638579 -821210 -1067049 -1205756 -844160 -263969
6934 -263969 -616366 -598654 -83004 -120348 -282179 125229 -224190 95509 -9752 -494328
6924 -494328 -639132 -439999 352796 -247689 -640915 -246398 -252104 -151908 -258555 -434531
6914 -434531 -485573 -374827 -420511 -264763 127367 -19990 54709 109676 -228159 117631
6904 117631 -194779 -325286 -45001 -329358 -310225 -455218 367685 491453 -69487 -618746
6894 -618746 -407763 61912 -640927 -864218 -351309 -36283 220526 -458328 -282067 -100975
6884 -100975 -344854 -201978 -54575 -461550 -671844 -246153 -327474 470194 -281466 -472694
6874 -472694 -128557 -310342 -477675 -226691 -96701 -260467 -188409 -320858 -539977 -66959
6864 -66959 -596347 -1283958 -1364992 -1116157 -307350 -421485 -252660 -38282 -161210 -385097
6854 -385097 -161702 -599490 38449 -227738 -208475 33367 223326 276017 -8181 333244
6844 333244 597080 38668 -194437 188939 -223645 -407563 280979 -435651 -912401 -518587
6834 -518587 -425463 -837770 -604409 -828840 -897058 -862485 -66879 188558 733135 142938
6824 142938 -89314 -132836 -207646 181921 -348802 -410006 -507969 -684424 -1229297 -931105
6814 -931105 -21874 -183580 -565924 -838885 -371288 660844 516285 88478 -178520 -966463
6804 -966463 -632239 -561718 -725633 -553100 -403288 -409516 -473654 -416060 -744450 -262933 -418537
6793 -418537 -621135 -289508 -773150 -1006273 -418686 -454057 -213534 28736 253319 66258
6783 66258 -469314 -628573 67656 -646434 -1142943 -1133144 -29172 -350738 -378670 -314033
6773 -314033 -108133 65188 -278796 -184090 202742 -186158 -202352 287590 -64972 -673945
6763 -673945 -645830 -606667 -1499780 -822081 -687831 -1127818 -778690 -303629 -422264 -735040
6753 -735040 -682857 -490201 -616263 -113745 -83307 -460578 -678050 -868943 -505213 -349894
6743 -349894 190458 29269 -216317 12300 -138808 -388689 -131641 35408 -252082 -482261
6733 -482261 -611462 -225887 -247635 -477378 -719346 167938 265240 108420 470604 -383402
6723 -383402 -1049988 -501480 -406291 -525051 -477156 -892138 -255086 624525 -126345 -183629
6713 -183629 -503640 -1158752 -1039159 -899975 -462543 -315482 -128186 45382 98038 -628368
6703 -628368 -345798 -352573 -212311 71074 283594 -109966 -488388 -706603 -766707 -720944
6693 -720944 -474518 -533140 227948 28169 -608982 -223815 -354214 670421 484548 72638
6683 72638 118018 321071 43884 -173567 -491516 -782413 -736586 -1183101 -395801 -187041
6673 -187041 -345445 61246 -77535 181754 129127 198926 60517 -647735 -1098240 -366010
6663 -366010 -431551 -774258 -937600 -642037 -201229 -674499 -820853 -641730 -117986 -580435
6653 -580435 -739376 565 -19071 216264 691454 237713 432774 197728 -590515 -908767
6643 -908767 -323361 160535 -402831 -80770 -380897 -539849 -794003 -488890 -389382 -692663
6633 -692663 -502731 -221429 25661 224979 1437 -469551 -272542 -257071 -664357 -159726
6623 -159726 274156 -490636 -455965 -598052 -983039 -724799 -384507 -375911 -664482 -473302
6613 -473302 -942710 -931236 -461792 -520559 -890797 -784250 194471 129190 -11567 -518285
6603 -518285 -713951 -407977 -737365 -844727 -792188 -600393 -907126 -593102 -400879 -256846
6593 -256846 -53976 -488083 -608948 -630564 -615882 -414183 -647666 -885482 -302074 60994
6583 60994 -622813 -479206 -198211 -107163 86321 -41280 -356449 -334760 -1195596 -1422158
6573 -1422158 -533127 -9417 -248068 -653340 192605 -627835 -1159047 -1423160 -971338 -243837
6563 -243837 137343 297315 -1800 -393997 -475711 -371293 148800 -64865 -734611 -954183
6553 -954183 -689690 -282492 56861 -148774 -87366 56256 -501941 -431540 -410883 -543042
6543 -543042 -488815 122646 383836 78749 -380580 -476648 -273429 -35364 -380467 -264779
6533 -264779 8098 -411890 -607567 -970112 -852974 -623439 -267900 -740522 -327368 196905
6523 196905 400929 10454 -653417 -1116244 -851088 -55519 -80446 -471079 -619571 -287697
6513 -287697 -443636 -323708 -239024 -527362 -199307 -828167 -958204 -537502 288473 414949
6503 414949 -542389 -206556 -561023 -1177588 -1106382 -1024745 -768027 53341 32429 -119014
6493 -119014 -278927 -108175 -392432 257612 -201899 -996000 -635660 241647 -182665 -139955
6483 -139955 -54604 -430779 -417997 -57786 -386870 -644148 -478392 -509885 -148021 -593204
6473 -593204 -579899 -732042 -742278 -510487 -494652 -352863 -571092 191600 -14520 -305098
6463 -305098 81135 -475803 -370267 -28281 -192647 -509752 65762 -258176 22297 -45692
6453 -45692 302359 264941 -218819 103820 403554 288676 546601 467963 252386 -139697
6443 -139697 110806 -710160 -764626 -468939 -770221 -411898 -340591 -774620 -749367 -573749
6433 -573749 -1067172 -563218 -733097 -551433 -392182 -3655 -633059 -585646 -880799 -1214711
6423 -1214711 -1240552 -540720 -381052 -649661 -663150 -638339 -1142077 -813277 -276086 -364068
6413 -364068 -808283 -933110 -891472 -307801 -49962 -184008 -480809 -882902 -467900 -620399
6403 -620399 -551772 -690527 -443595 -977967 -472163 -196743 -516167 -505094 -780560 -853577
6393 -853577 -467851 -624842 -289312 -1088337 -1057482 -1329153 -1238181 -1227838 -1466040 -482594
6383 -482594 -628790 -610288 -716557 -550778 34957 -356801 -663543 -725198 -651044 -412252
6373 -412252 -195932 173914 151995 -86162 -504378 -928156 -454137 60112 -516481 -580104
6363 -580104 -523725 -491093 136392 -42263 56993 -378051 -540596 -368165 -905111 -443639
6353 -443639 -171899 282987 -299041 -368623 -428054 -128654 -87945 -490997 -175329 217629
6343 217629 303276 81328 -236939 214765 -70831 -616999 -532202 -594075 -376558 -471315
6333 -471315 232112 113228 315359 222612 -49274 -19739 124370 -220677 -138612 -6235
6323 -6235 -415369 -327126 101797 -264374 224457 -262820 -1045896 -315795 198648 -52280
6313 -52280 231901 136661 -384850 -1140064 -1333120 -560356 -73266 -292226 -571823 -792777
6303 -792777 -1055506 -507817 121909 406931 59556 281292 27804 22602 -487167 -641131
6293 -641131 -376249 -19812 -361250 -109666 -100359 281955 15178 48370 -247867 -357304
6283 -357304 -227167 -289769 -34690 -304996 -743077 -1145078 -978316 -806036 -454798 -533125
6273 -533125 -725567 -821896 -644044 -393324 -816742 -1125056 -996291 -548941 -287647 -220842
6263 -220842 174890 5055 -255397 -113433 -296321 -815783 -314463 50771 -399385 -493331
6253 -493331 -778348 -206132 188847 327637 -79005 -453077 -248769 32660 48271 -103713
6243 -103713 -144674 -387897 -629333 -220066 -477923 -1156025 -580265 -628116 -526313 -113135
6233 -113135 -178452 -602609 -765433 -220630 -409382 -372409 -72790 444705 -155879 -500588
6223 -500588 307102 743053 469539 -420370 -557173 232564 274200 -78591 158250 215393
6213 215393 779458 357979 -533807 -186226 -14671 93936 482399 288066 614540 862185
6203 862185 449759 248754 292197 -403893 326502 793433 418180 279304 -328885 -387679
6193 -387679 42800 -434054 719070 560360 57401 485028 793653 602505 421457 655041
6183 655041 1075538 783449 863134 64703 259493 574488 767746 978460 275774 207799
6173 207799 372665 373922 739666 914377 1235481 1121904 1041467 1478463 930947 363880
6163 363880 344780 846015 1377185 1060864 937095 1256409 1284924 1340122 358847 982849
6153 982849 1676040 1596215 1692574 1280390 1259430 1173487 772889 516982 761967 698715 1067120
6142 1067120 1515722 968592 1314914 2168745 1986642 1827734 2104692 1930365 2011270 1970630
6132 1970630 2881761 2740618 2243960 2237877 2681063 2552826 2536411 2614714 2131774 2623194
6122 2623194 2471194 2858527 2004476 1422647 2049708 1560921 1697140 1723595 1614473 1298994
6112 1298994 1767270 2118115 2194408 1794521 1707786 1553392 1701134 1654539 1374893 1458943
6102 1458943 2048623 2000181 2250323 1890609 1639064 1950461 1722993 1226416 1448222 793634
6092 793634 768137 824662 972019 1242154 1198089 1222678 844147 1564505 2007296 1257199
6082 1257199 1028931 699104 -22805 712844 1093152 1390884 1694667 1749527 1799775 2100376
6072 2100376 2206296 1295357 1117913 232136 -373973 200842 373604 534805 913757 1213902
6062 1213902 846606 836840 720929 924508 923280 838867 1110827 1173736 1117075 1097383 1103115
6051 1103115 790546 586369 448462 847262 833579 1193218 855142 858723 942788 1100119
6041 1100119 1425590 928846 846868 522924 380918 217793 933207 964395 1200731 1144656
6031 1144656 906976 535371 1048870 1004780 604303 258668 292739 487731 186056 147455
6021 147455 501473 836083 1164593 570775 809377 1074867 811028 1247863 1198679 1034264
6011 1034264 1187753 1562708 1422362 919678 1240920 1303835 769436 628529 1080634 893950
6001 893950 741317 131474 619254 399357 921578 1465340 856418 1233380 1482303 1375317
5991 1375317 1243677 1872026 2250251 1682375 1677196 2176078 2025028 1598157 1413077 1335466
5981 1335466 1143164 1245484 1271757 1517182 1893685 2283721 1568339 1518983 1623319 1876916
5971 1876916 1971418 2242881 1973212 1409102 1720977 1756604 2020704 2741897 2614976 2762732
5961 2762732 2713736 1772405 1975758 2320626 2140268 2448245 2765434 2398659 2587047 1974715
5951 1974715 2088835 1810642 2394139 2828007 2439715 2274969 1855878 1610671 1923970 2749433
5941 2749433 2583958 2535955 2581443 2754030 2931211 2560090 2147573 2430922 2122314 2560380
5931 2560380 2894127 2125764 2318306 2801351 3200484 3644549 3186062 3065992 3436764 3826794
5921 3826794 3603788 3134555 3065527 2718633 3037257 2993038 3622575 3822906 3226949 3655779
5911 3655779 3140010 2697394 2533416 3187940 3323932 3285911 2988296 3464193 3773742 3517331
5901 3517331 3174835 2993344 2683341 2603865 3396490 3603558 3490226 2984216 2990562 3310585
5891 3310585 3201975 3483704 3217830 3340872 2854529 3761355 3693196 3577233 3244149 3268125
5881 3268125 2971138 3013830 2824213 2708290 2953263 3074055 2478816 2227352 2676253 2182181
5871 2182181 2353795 1800095 2571288 2799688 2357702 2093838 1834445 2061133 2113630 2835418
5861 2835418 2954326 2779078 2701282 2464285 3309621 3295956 2771140 1896303 2060862 1988698
5851 1988698 1811356 2519827 2702712 1866199 2143268 2098635 1904571 1595514 1812694 1383766
5841 1383766 1387757 2262418 2505559 2338173 2345749 2244485 2011110 1477654 1183422 1890010
5831 1890010 1935234 2080693 1806490 1524474 1373503 1243292 891462 592593 948832 949459
5821 949459 1229053 2174032 2090232 2260968 2226366 1789519 1423134 285033 915839 1432426
5811 1432426 1641320 1549972 1419264 1292182 1020325 1239221 1016442 693109 340356 110142
5801 110142 18857 677942 1340704 873534 1121127 802753 1078976 1020558 1164401 877544
5791 877544 1206258 981585 578913 1091252 523376 703780 1342391 1297604 886650 128750
5781 128750 -76741 586982 392150 525326 946865 877895 1103590 966494 1118230 1461708
5771 1461708 1452519 439375 1091956 1203958 1234899 1449490 861501 1098102 1088147 581890
5761 581890 703769 1188560 320824 206385 852730 888849 1079674 478455 -498268 -467278
5751 -467278 237586 945388 653730 472416 603053 988688 427780 202470 68053 1157304
5741 1157304 796682 -248523 -432576 422462 372562 -163271 -88900 483388 750328 410866
5731 410866 -40916 678730 772720 777139 665545 734460 869868 836511 587087 -83448 145116
5720 145116 130452 401497 378655 8735 975018 704017 40668 249682 664300 868993
5710 868993 1539033 965367 888230 587606 427301 407916 -31989 181772 136700 370417
5700 370417 396403 942466 128834 -78431 590069 721647 614741 192628 6739 168642
5690 168642 393427 -81408 -200469 28503 44606 197813 -95240 563936 760745 944832
5680 944832 822203 551441 370539 717944 634156 1163645 757053 671485 744463 463486
5670 463486 93074 107453 -153701 -441439 268416 924280 519215 831054 376198 266441
5660 266441 810104 1132521 1308285 338911 380330 135141 602354 682758 136868 -323669
5650 -323669 -378387 -128337 253279 705165 319222 588143 920103 1107613 947397 391938
5640 391938 425965 -29909 572945 677568 1048353 1040592 957918 1059295 1280696 1335913 429514
5629 429514 456429 1074686 841512 83517 217756 470062 728709 600768 566631 967909
5619 967909 863223 855342 679944 623665 579421 988939 1268567 799218 552111 598658 1067234
5608 1067234 1035401 639287 661045 614259 873876 842185 953383 697098 390376 1090133
5598 1090133 1382012 1245258 1402180 766518 376299 114814 571694 1185031 929113 1341514
5588 1341514 1169024 1230919 991537 840397 887320 586893 1104191 1112985 827587 939597
5578 939597 835830 1252249 1543622 1310272 1398521 1749933 1522818 1186072 1179288 1734343
5568 1734343 1643114 1417699 1376545 1441982 1878432 2296819 2202646 1666907 1621203 1767939
5558 1767939 1767034 1829366 1849357 2295153 1921191 1611773 2298809 2667149 2404799 2003897
5548 2003897 1949917 2515559 2993583 3134193 2570673 2717424 2477726 2188266 2813520 2903657
5538 2903657 2880487 2901803 3032651 3632538 4252256 3948453 3637587 3960435 3512814 2876602
5528 2876602 2683856 2808603 2788258 3258354 2837120 2198372 2638718 2789149 2610215 2459281
5518 2459281 2888092 2945326 2505065 2204357 2437984 2617238 2271829 1743782 2033504 2555763
5508 2555763 2429595 2043435 2191012 3064414 3043742 2549150 2915535 3075712 2698013 2675820
5498 2675820 2493224 2271729 1957351 1478398 1959758 1939612 2445270 2313385 2283227 2602322
5488 2602322 2557099 2923438 2938280 2127906 1922692 2327939 2266611 2222400 2206077 2527765
5478 2527765 2251762 1677331 1680432 2393170 2989526 2507304 2670721 2494526 2686328 2702021
5468 2702021 2773901 2667722 2634998 3229733 2984387 3269279 3583015 3454634 3362288 3396552
5458 3396552 3543516 3065632 3696677 3585123 3825910 3474304 3343168 3601232 3933310 3638472
5448 3638472 3453211 3863376 4082915 4023684 4183317 4276889 4202579 3973996 3644162 3786088
5438 3786088 3688377 3428752 3879467 4388853 4031895 4847680 5170134 5043700 3772903 4473299
5428 4473299 4840896 4069170 4257684 4266859 4642243 5165075 5627651 5426837 4712405 4864811
5418 4864811 4967115 4952691 4802218 4976680 4588104 4802674 5289963 5425354 4922713 5124972
5408 5124972 5532249 5673999 6069361 5964903 5655623 5286714 4862939 5246629 6004721 5765445
5398 5765445 5673171 4877747 5292170 6264337 6547142 6367304 6139551 6502678 6291659 6009861
5388 6009861 6294550 7079299 7301013 7573372 7250860 7554129 7252669 7021123 7462617 7785441
5378 7785441 7715418 7734040 7178912 7584138 8252736 8310249 8763246 8495055 8003306 7845691
5368 7845691 8162574 8572288 8262731 8361146 9193487 9151141 8750472 8495667 8931740 9471361
5358 9471361 9384226 9551640 9377376 9386717 10241795 10190716 9990796 10909287 11125862 10895053
5348 10895053 11881371 12434951 12246770 12161544 12756867 12816664 12794706 12220934 12462741 12962619
5338 12962619 13629432 13311015 13498053 13635004 15018715 15760998 15260338 15495456 15423674
5329 15423674 16072591 15944139 16465280 16984747 17124316 18273772 18441391 18707093 19448646
5320 19448646 19931664 19738537 20029204 21152911 21080067 21831850 22492766 22716690 23173540
5311 23173540 23612547 23690334 24344601 24761082 25376617 26089722 26603035 27445449 28261661 29164378
5301 29164378 29794589 30130425 30759675 31906440 32693270 33460711 34457658 35124236 35791394
5292 35791394 36854489 38135855 38865953 39967863 40906205 41900002 43126645 43724648 44476166
5283 44476166 45597605 47045074 49037167 50178718 51057556 52288979 53475469 55563384
5275 55563384 57362944 59650652 61507700 63442640 65548158 67923656 70645514 72968861
5267 72968861 75840728 78763759 80897222 84220088 87847868 91247517 95275138 99510514
5259 99510514 104294185 108956559 115048488 120965767 126072672 132033552 138676965 146591314
5251 146591314 154579825 163649590 173444052 183069883 193741005 205140108 216524541 228358651
5243 228358651 240825846 253993246 265941808 278211845 289898498 300328036 309154414
5236 309154414 315632713 320830674 323156288 322950669 319730561 314469822 306377772 296598082
5228 296598082 284661141 272625419 259335375 244852915 230616716 216947163 204403762
5221 204403762 191979818 180322278 169666588 159895851 150417078 142265628 134715630 127803721
5213 127803721 120992910 114858332 109388914 104850375 100502129 95847761 91312513 87312576
5205 87312576 83635142 80375589 77055357 74594478 71843204 69042419 67033115 64131537
5197 64131537 61459208 59702300 58200410 56612598 54508029 53195751 51505635 49431896
5189 49431896 48419580 47217558 45891093 44318658 43408840 41769355 40784416 39953276 38899063
5180 38899063 37685480 37015527 36866986 34865494 33507425 32561210 31473829 31492389 31224880
5171 31224880 30132422 29031714 28509068 27478218 26711579 25980091 25543406 25106078 24713877
5162 24713877 24048469 23481621 23340060 22952994 22066061 22147089 21362833 20463991 20397795 19633847
5152 19633847 19357108 19441876 18959651 18484660 18129615 17000169 16739948 16635728 15988021
5143 15988021 15844918 16434856 16203211 15775401 15430178 14409619 14316184 14254094 13900830 14036169
5133 14036169 13978765 13625068 13619998 13118986 12631993 12557153 12801416 12175854 12051237 11908127
5123 11908127 11592213 11109504 10984301 11112409 10634296 11038231 11180366 10495016 10149069
5114 10149069 10576916 10270824 10465309 9985475 10057648 9940498 9516249 8480850 8233072
5105 8233072 7905286 8366180 8322373 7965217 8317626 8065659 7500388 7285343 7979630 7943077
5095 7943077 8034375 7323087 7050524 7343823 7065467 7270794 7545494 7438929 6575018 6516024
5085 6516024 6661290 6200166 5728426 5585820 5690357 5978232 6288391 5948109 5408959 5211077
5075 5211077 5851683 5709177 5671060 5235252 5040572 4855846 5358876 5775630 5084510 4968698
5065 4968698 5312024 5380862 4406491 4094624 4355445 4359779 4439217 5323338 4909354 4746054
5055 4746054 4922798 5116391 4654779 4116305 4505339 3704717 4023851 3940704 3575335 3630131
5045 3630131 3727231 4074974 3636000 4078381 3770195 3423530 3208957 2794718 3239235 3086623
5035 3086623 3329834 3637087 3247385 3413002 3986081 3825266 3568068 3082901 3222090 3200587
5025 3200587 2557978 2839676 3112475 3069034 3390918 3604700 3293612 2892174 2562819 2502583
5015 2502583 2827878 2833284 3401068 2794888 2349830 2151952 1770822 2208889 2254183 2985670
5005 2985670 3056696 2837445 2953810 2532411 2860056 2782445 2434760 2211089 2893718 3197843
4995 3197843 2515669 2076549 1945122 1748383 1940005 1860046 1838779 2813561 2745743 2532866
4985 2532866 2455879 2305206 2299261 1817665 2154668 2547391 2905836 2548243 2481266 2814309
4975 2814309 2807525 2354023 2140293 2184627 1916434 2385608 2946359 3162118 2675923 2766961
4965 2766961 2634406 2382617 2149120 2487097 2579425 2366266 2393343 2504637 2313554 2432224
4955 2432224 2517882 2489128 2508264 2342686 2412831 2239086 1998830 2399670 2613389 2612001 2140832
4944 2140832 2009879 2212177 2938913 3251031 3141276 2700465 3338286 2883561 2732859 3460130
4934 3460130 3925716 3283982 3262401 3813157 3679861 3622056 3051770 2920024 2850356 3194503
4924 3194503 3149648 3230915 3224462 3103187 3077385 4006253 3304203 3190791 2787079 2137672
4914 2137672 2077247 2061578 1899845 2143894 2801619 2565479 2676110 2649532 1981615 2007658
4904 2007658 2356870 1493898 1198978 1614086 1438363 1131171 787571 1385962 1146590 751883
4894 751883 1060005 1775739 1415654 1075499 1207119 916200 614279 1330740 956270 750053
4884 750053 642235 489837 480796 548571 495339 59597 230139 812702 1061121 776750
4874 776750 1829281 1086837 733017 925075 1567305 1396552 693552 793297 840217 1108993
4864 1108993 1824593 1465911 808508 1178721 1605289 1267213 841747 1148078 1609994 1292377
4854 1292377 838899 628557 729636 877818 945451 483780 596540 915264 1187775 1875359
4844 1875359 586921 372082 757417 1208551 1634178 1822915 1660181 925797 1280408
4835 1280408 783641 399225 1194994 1246863 1161204 1103454 838525 975758 753189 876715
4825 876715 864389 1230842 1216509 904755 900898 905477 1154179 415699 25743 608427 917539
4814 917539 627260 -17143 671442 604787 283397 -278154 111209 434566 549637 1344205
4804 1344205 740003 315109 170110 -329033 289819 1205916 1452587 1426102 661487 597822
4794 597822 566371 499759 732218 1118468 1138921 516863 282476 897449 598693 367498
4784 367498 471687 573052 533220 539025 285025 521790 973347 1270502 1022695 827852
4774 827852 973075 31737 -191180 -100620 402941 1072844 1738903 1699426 568170 562681
4764 562681 1201287 1127157 849919 830427 185207 612110 328536 164606 478351 737888
4754 737888 1035368 1653617 1382259 947477 1055725 1093992 779257 1077278 1665548 1534884
4744 1534884 793971 1107699 938780 414803 585909 605055 1285954 1117840 1594782 739817
4734 739817 597433 -103357 578404 1202891 1487808 1477818 918265 583989 527542 383928
4724 383928 208456 855324 787809 891462 745986 1456631 1050523 1163712 1375577 1092984
4714 1092984 949273 811931 1090617 1108241 896533 1010655 1198538 514084 402152 214813
4704 214813 323524 403297 582609 449742 276636 170622 206828 502642 346264 644078
4694 644078 757076 313933 518955 393393 288385 369817 354630 1013333 1437929 1042741
4684 1042741 1065056 868944 844108 676473 -89088 29221 232162 600854 737683 857021
4674 857021 682209 748674 252500 -185793 -42246 -30101 219419 659661 630590 -260483
4664 -260483 -340991 219604 312985 -30390 -255624 -84280 -91811 234697 810693 1142187
4654 1142187 575502 646649 624848 769114 456768 118285 169913 -16481 -11675 -85669 234
4643 234 98143 275743 780055 636596 310529 200051 -216256 439801 445579 831656 128577
4632 128577 145471 156962 238816 810121 965835 1215825 891166 341231 174103 583988
4622 583988 285352 385976 554749 716770 397425 499034 183993 166544 95364 399209
4612 399209 155526 438370 1035301 460669 -5055 202453 692226 343097 567971 1154065
4602 1154065 885111 883761 560520 466829 881111 937525 524738 401243 831741 529560
4592 529560 408185 635357 583107 546633 406945 338678 195265 632805 993831 888115
4582 888115 894076 920980 642699 45232 177853 477179 1609381 1456888 1527304 827217
4572 827217 397453 983802 635346 619861 1385420 1000175 962368 721376 790349 872563
4562 872563 629273 208096 303238 1356459 912127 563608 607984 1147043 1362127 1413626
4552 1413626 1519718 893742 70677 536865 453622 254635 405037 728264 1285167 1199616
4542 1199616 1139536 1446718 1917948 1483071 1074194 411588 529279 1465720 1242254 1438445
4532 1438445 1303228 1373479 955744 586097 899481 676933 987677 838766 736999 136850
4522 136850 766977 707567 496262 1431272 1312742 630482 680860 1429785 1048981 909254
4512 909254 1357771 1211813 1139168 737640 366601 215146 530425 1145938 942434 674719
4502 674719 1190603 1366195 925665 1196371 891025 844253 696356 1288387 1952932 2144790
4492 2144790 1732197 991441 1075593 1536355 1466443 1392719 1340506 1502538 1668629 1229032
4482 1229032 1129313 1330123 1504516 1674085 1722585 1910250 1740607 1979068 2264427 1608881
4472 1608881 1200348 1583954 2414658 2521400 2451705 2104953 1271539 1331621 1665280 1600698
4462 1600698 1676486 2155986 2108369 2086620 1907809 2144376 2121961 2387733 2287667 2117953
4452 2117953 2143059 2371376 2213720 2103603 2081303 2302299 2446650 1918173 2116699 1957722
4442 1957722 1908721 1630220 1974376 2239809 2728902 2448829 2421894 2457521 2415309 2446800
4432 2446800 3084074 3152210 3549259 3636503 2806964 2356031 2679262 2890444 2974176 3531746
4422 3531746 3458438 3361707 3466064 3399615 3621794 3786187 3996947 3918191 3906973 4042020
4412 4042020 4055634 3909285 3938231 4261552 3823228 4439124 5284027 5648056 5365923 4763547
4402 4763547 5401371 5535109 5531630 5648406 5429668 5623726 5376668 5795447 5864772 5969472
4392 5969472 5913024 5672461 5733475 6063154 5605965 5715186 5799219 5778439 5765398 5188761
4382 5188761 5438367 5568414 4701452 4554939 4861111 4376365 3855900 3570202 4612415
4373 4612415 5565262 4949426 4492857 5176225 4986950 4382858 4850898 4471747 4501549 4657750
4363 4657750 4615684 4723336 5034951 4857356 4685078 4241011 4165938 4443919 4646763 5270371
4353 5270371 4880371 4850332 4753885 4714304 5116009 5658799 5681908 5389716 5016168 5436555
4343 5436555 5307269 5005115 5212383 5592755 5386135 5821322 5901050 5479935 5817263 6245920
4333 6245920 6156381 5736837 5997707 6170355 6191415 6478714 6372744 6072097 6280097 6977083
4323 6977083 6442469 6059257 6150281 5715139 6057083 6265618 6400683 6671076 6424541 6217029
4313 6217029 6030382 6585081 6794704 6775960 5660319 6274850 7608548 6903368 7390323
4304 7390323 7291101 7666939 7333461 7106220 7035177 7525984 7924024 7852145 7548773 7521240
4294 7521240 7609497 7872645 7716425 7924192 8547088 8126096 8519339 8393581 8462691 8918579
4284 8918579 8728308 8826217 9379374 8836460 8595335 8640518 8943121 9250602 9440438 9889717
4274 9889717 9349133 9190035 9913821 10031237 9781965 9952890 10452487 10341789 10537567 10678924
4264 10678924 11294441 11367655 11057172 10664350 10819884 11187183 11768226 11590210 11799926 12018971
4254 12018971 12046336 12364222 12813604 13056278 12847138 12455667 12807419 13144168 13232926 13219008
4244 13219008 13321996 14413115 14101569 14399274 14375281 15372407 15742603 15666790 15008875 15584770
4234 15584770 15593080 16617796 16441312 15687337 15841564 16328620 17407577 17343289 17782695 17763453
4224 17763453 18119570 18859631 18944645 18963974 20235521 20416759 21078380 21293694 21807421 22449438
4214 22449438 22408626 23183044 23659418 24198766 24758775 25265346 25471319 26340405 26873132 27467064
4204 27467064 28653849 28827782 28675869 30051955 30423154 31401206 32296024 32382780 33145818
4195 33145818 34081296 34812999 34679866 35414926 35257771 35940410 37099459 37743114 38483195
4186 38483195 38868352 39041510 39545514 40388293 40689784 41291761 42284339 43118719 44119019
4177 44119019 45215501 46033238 46931517 47890415 48505688 49068626 49998949 51269394 52460376
4168 52460376 54152726 55468303 56900731 58318374 59382726 60635813 61792765 63838246
4160 63838246 65564637 67224589 68360452 70288899 72111529 73387465 74925341 76929463
4152 76929463 78196769 79930762 81450033 83376378 85045992 86967185 89689832 91591054
4144 91591054 94543206 96597205 99898326 102784304 106231473 109796641 113810992 118037154
4136 118037154 122371254 126980831 131656657 136333077 142127195 148220738 154241431 160763833
4128 160763833 167811671 175640109 184289860 193625534 203907205 214548000 226786379 240164540
4120 240164540 253197456 267412242 282696152 298868503 316183714 334926550 353829849
4113 353829849 372965715 392751801 412262594 431561644 449492739 465361920 478504109
4106 478504109 487953571 493898886 495355178 492300606 484803141 472852541 457887469 440752479
4098 440752479 420901902 399992261 378841724 357152420 336209906 315485206 295412707
4091 295412707 278207919 262374396 246679596 232271764 219523756 208289766 198128865
4084 198128865 188165886 179138353 171080715 162894294 155819830 149068821 142814345 136365667
4076 136365667 131820190 126893709 121622913 116922688 112815677 109526226 105396436 102159614
4068 102159614 98951375 95837088 92219299 89413811 87185944 84463864 81227798 79257691
4060 79257691 77764791 75909119 73932616 72156288 69646835 67577718 65944415 64411652
4052 64411652 62765397 60735759 59169589 58577794 57163390 54988268 53399207 52558477
4044 52558477 51567967 50314021 49079995 48502171 47304858 46507898 45326673 43580819 42562091
4035 42562091 42520409 41739780 40953916 40358815 39064137 38253892 37976043 36878655 35904328
4026 35904328 36205870 35489677 35416293 34640996 33533493 32702030 32791925 32327221 31406582 31178129
4016 31178129 30620206 30242909 29719679 29266826 29189852 28312179 27929019 27278543 27614792 27381052
4006 27381052 26805234 26679742 26243904 26169025 25136679 24425788 24053908 23919101 23589340
3997 23589340 24421508 23991140 23478906 23387809 22756188 22005457 22444170 22300499 21481519 21441477
3987 21441477 21109808 21088124 21207429 20464060 20695364 20602635 19910125 20041728 20040524 20238960
3977 20238960 19681718 19535445 19324960 19271159 19004092 18645971 18903617 18614151 17804227 18514625
3967 18514625 18240933 17811602 18128826 18510554 18379489 18469535 17622444 17009616 16922719 17040923
3957 17040923 16575945 16353786 16664353 15486532 15753807 15823031 15573425 14843905 14721361
3948 14721361 14108882 14275795 13847795 13290445 13205831 13073898 13089494 13448465 13478996 12623550
3938 12623550 13048137 13319435 13339553 13193827 13136244 13306333 13485637 12935437 12262252 12395612
3928 12395612 12656472 12443540 12694933 12846783 12679149 12464960 13206332 12483845 11599772
3919 11599772 11787087 12073223 11847504 11549050 11699623 11296739 11096783 11268638 10415454
3910 10415454 9561846 9778891 10330473 10264971 10264079 10315219 10519445 10163575 9816942 9603927
3900 9603927 9571539 10081627 9778311 9304037 9305337 9290960 9316617 9172424 9627146 9747388
3890 9747388 9661982 9915856 9865242 10115045 10422420 10025182 9707527 10007508 9767951 9420119
3880 9420119 9455682 9070434 9110790 9282370 9568665 9901944 9654552 8855060 8619127 8889684
3870 8889684 8916026 9460356 9176657 8658487 8353634 8414204 8526297 8498802 8277814 8264123
3860 8264123 8061136 8582056 8730910 8712362 8567124 8911571 8718834 8231721 8367187 8806957
3850 8806957 9294292 9197863 9305128 8352848 8478301 9272883 9063685 8766458 8122432 8614868
3840 8614868 8881584 9046836 9108780 9377662 9403507 9219830 9286947 9487345 9805102 9680213
3830 9680213 9298986 9253659 9253052 9971593 10672240 10264524 10012390 10001934 10674625 10927609
3820 10927609 10985374 11139000 11295666 10893451 10971985 11191735 11329867 11689011 11457333 12171585
3810 12171585 11665167 11114511 10960554 11511296 11953623 11570360 11998229 11902124 11501278 11160412
3800 11160412 11432623 11429430 11288440 11204380 10884027 10967798 10827596 11453308 11343855 10842649
3790 10842649 11092139 11377482 11412374 10060186 9815149 10235075 10886662 10325523 10749879
3781 10749879 11408723 11155165 11607791 11187246 10722338 10689023 10916341 11030539 11002010 10409673
3771 10409673 10258111 10799961 11402473 11314432 11119771 10667341 11102659 11323865 11364689 12217386
3761 12217386 12480026 11873763 11728708 11868649 11566821 11943061 11738560 12032021 11720954
3752 11720954 11685571 12344276 12688937 12716550 12172849 11572189 11813097 12363747 12390937 13045700
3742 13045700 13199528 13368800 13581771 13040773 12713244 13464154 13623023 14012203 14186900
3733 14186900 14219235 14090767 13932731 14114072 14214701 14007993 13294136 13781913 13949572 14309110
3723 14309110 13853477 14026741 14997569 14696161 14981490 15002359 15268542 15618357 15106266 15732845
3713 15732845 15793766 15351309 15779560 16248927 16314358 16491673 16088686 15434687 15664920 15654070
3703 15654070 15889439 16383383 16105989 16211644 16001392 16193617 17004717 17414332 16922467
3694 16922467 16395385 16352999 16535652 16705584 17014680 17122948 17237227 17087143 16294211 15951772
3684 15951772 16236278 16588675 16414542 16027961 16535998 17149073 17345952 17071207 16753257
3675 16753257 17246034 17408222 17253896 17120608 16550648 16962900 17330958 17200457 16953865
3666 16953865 16658588 16986151 17527612 17329396 17093501 16789680 16449032 16934922 16987346 16834564
3656 16834564 17012482 17115239 17070540 16883553 16855542 17256923 17042015 16236655 16085052 16145490
3646 16145490 16340634 16031416 15605222 15702779 15736366 15463932 15529991 15914323 15634790 15094624
3636 15094624 15375319 15605678 15615915 16093566 15673650 15369860 15539513 15657452 15404049 15585715
3626 15585715 15280361 15170370 14460110 13957067 14138740 14638128 14287775 14247345 14305914 14446095
3616 14446095 14379661 14029518 13938887 13517141 13410722 13891659 13929861 13538391 13244862 13399614
3606 13399614 13021562 13264941 13739302 13402775 13195688 13447772 12747203 11935012 12066497
3597 12066497 12248017 12573278 12492481 11912663 11995804 12234492 11441264 11384208 11665128 11536586
3587 11536586 11260319 11445391 11175754 10848558 10464787 10704792 10573833 10465967 10573439
3578 10573439 10807440 11021270 10300788 10211145 10368764 10229789 9880803 9230605 8895979 10140591
3568 10140591 10282351 9281072 9322983 9365380 9214117 9847348 10282851 9858852 9454217 9434108
3558 9434108 9461809 9186264 9228457 8548952 8555924 8220392 8504503 8529258 7749597 8831946
3548 8831946 9104224 8632285 8244783 7899115 8694644 8099357 8612026 8695471 7979533 7777910
3538 7777910 7693083 7739122 7492085 7189206 7468004 7552616 7269808 6844718 6773039 7230087
3528 7230087 7318505 7321012 6873795 6875531 6824139 6670425 7078304 6887990 7058010 6946564 6584468
3517 6584468 6482056 6561786 7113609 6649026 6814110 6453951 6704353 6535158 6276633 6117222
3507 6117222 6489513 6466724 6966459 6671791 6937057 6990322 6903772 7000102 6500941 6785576
3497 6785576 6677853 6134906 5959299 5458616 5514405 5611490 5599184 5363076 4789889 5153407
3487 5153407 5119967 5500550 5632595 6248656 6534707 6484050 6612006 6563743 6371393 6548155
3477 6548155 5367471 5597095 6015269 6272004 6913856 7238543 6660780 6762240 6896490
3468 6896490 6125331 6048331 6973897 7029516 7088478 6987719 6971466 6648459 6821049 7260172
3458 7260172 6774534 7120145 7715543 7273872 7073163 7566170 7457365 7025956 6756149 7354328
3448 7354328 7203372 7488722 6851018 6686722 6575545 6947923 7410870 7314920 6950645 7032099
3438 7032099 7274206 6664929 7172139 7045506 6601152 7550438 7958297 7730042 8263857 8605914
3428 8605914 8569160 8572378 9284610 9370424 9301824 9140066 9371986 9383716 9444371 9564232 9392542
3417 9392542 9621951 9379589 9184773 9173139 9392552 9251742 9174413 9503133 9324859 8724313
3407 8724313 8207616 8798697 8699303 8278911 8911049 8205383 8745136 9278954 9316414 9036770
3397 9036770 8710990 9164468 8855403 9335126 9769105 9729915 9636467 9574822 9654405 9246612
3387 9246612 9674592 9882090 9083655 8920680 9507829 9723879 9677211 9193174 9050223 9193726
3377 9193726 8668338 8891889 8430064 8179326 8236255 8263863 8715466 8570183 8193622 8197913
3367 8197913 8986642 9070507 8557389 8272838 8213859 8043126 8302532 7909129 8345156 8341564
3357 8341564 8706411 8907508 8972962 8865662 8665956 8909061 9218039 9359847 9112154 9027067
3347 9027067 9232763 9287114 9104976 9698052 9641752 9322126 8966600 8599431 8702634 9222245
3337 9222245 9692075 10155103 9671295 9719995 10017406 9641280 10327613 10258871 10631653 11003844
3327 11003844 11355351 10698641 10249175 10521657 10047584 10123537 10450638 11268602 11341863 11679431
3317 11679431 11705158 11516050 11264773 11650740 12418064 13113559 12826384 12509641 12518634 13089051
3307 13089051 13957144 13877488 13557807 13630066 14121862 14750822 14686819 15070249 15795098 16163036
3297 16163036 16199579 16521443 16879292 16659617 16654683 17594632 18492527 19155026 19148702 18688244
3287 18688244 19885988 20456971 20546516 20480083 20388227 21437844 22033833 22762351 22654904 23242319
3277 23242319 24072582 24064759 24345514 25199257 25972677 26396235 26716275 27750934 28849162
3268 28849162 29298526 29723823 30037031 30414403 30837899 31577026 32177369 33149888 32896328
3259 32896328 33845822 34350381 34812353 35082693 35364837 35599731 35111298 34916253 34601784
3250 34601784 34681718 33968319 32800067 32453645 32625717 31723733 31490852 31054579 30342349
3241 30342349 29562827 28446985 27447379 26898588 25941582 24830937 24456699 23901041 22847863
3232 22847863 21959757 22051732 21580947 20803775 20514733 19703930 18986041 17874504 16741347
3223 16741347 15663909 15565941 15500922 14939714 14223738 14691511 15007230 14509337 14232434 13805168
3213 13805168 12852184 12141599 12425727 11991527 11914300 12094036 11420584 11086255 10682312 10869593
3203 10869593 10151225 9498089 9829672 9379214 9389365 8913527 8756948 9081652 9365360 8626978
3193 8626978 7830775 7717826 7843459 7967794 6992206 6691010 7154522 6796701 7136447 7563482
3183 7563482 6706740 6296102 5915392 5913037 6246921 5570443 5781569 5879879 5873367 5788183 5470516
3172 5470516 5075244 5626588 5578948 5279059 4992645 5238296 5865283 5738360 5922385 5162381
3162 5162381 4945509 4597828 4348053 4564594 5005567 5499426 5214191 5056064 4520734 4618645
3152 4618645 4124865 4169992 4199222 4031726 3835454 3892655 3367211 3157185 3338645 4112966
3142 4112966 4504321 4117449 3556097 3483575 3690735 3322088 3663070 3374377 3340881 3742717
3132 3742717 4105997 3872356 3783104 3662413 3344800 2889194 3716429 4038637 3423189 3603286
3122 3603286 3396571 2837215 2351103 3127110 2921767 2656049 2465296 2154131 2477087 2699785
3112 2699785 2416128 2430006 2430953 2376430 2885796 3027840 2777525 2798362 2485064 2068557 2110964
3101 2110964 1870806 1913697 2132726 2278419 2062117 2146476 2079563 2483032 2806259 2850394
3091 2850394 2962627 3052827 2670237 2546305 2185237 2331701 2424978 2598235 2476168 2556534
3081 2556534 2649911 2998090 2701159 2536508 2027275 2469409 2599622 2656863 2603177 2921004
3071 2921004 2756578 2208979 2188721 1881793 1803238 1611014 2182223 1563378 1921463 2035572
3061 2035572 1980001 2282344 2015874 1271815 1427247 1860610 2261687 2530114 2572844 2234939
3051 2234939 1562079 1846488 1967340 1711150 2287166 2048711 2190424 2390120 1686136 1790252
3041 1790252 1854475 2331259 2349631 2175142 2514812 2404095 2366902 2606389 2597813 2565535 1885524
3030 1885524 1799669 1450684 1066796 1480007 2205011 2470951 2296936 1944232 2521668 2771735
3020 2771735 2580845 2187208 2087331 2810315 2907398 3459841 3225435 2798449 2287960 2450023
3010 2450023 2466048 1939749 2870117 2587587 3037455 3139786 2716871 3302107 2725034 2773820
3000 2773820 2236541 2459995 3004834 3447929 3435012 3146942 3282664 4200322 3368003 3172317
2990 3172317 3406263 4209644 4672696 4422538 4140151 3530109 3394440 3565523 3207308 3374941
2980 3374941 4080344 4668954 4726645 4474306 4814408 4441354 4509063 4999324 5028328 4680780
2970 4680780 4945194 5445513 5575368 5585274 5452661 5434691 5839460 6160499 6274702 6753609
2960 6753609 6703413 6607922 7689425 7693832 8051432 8313215 8473693 8672775 8537423 8856114
2950 8856114 8880423 9001671 9454178 9907601 10498278 10632243 10964386 10607161 11311516 12098781
2940 12098781 12772602 13408214 13477906 13116511 13387317 13817035 13774018 14494867 14985149 15211253
2930 15211253 15465482 15961227 16360565 16696759 16113723 16264657 16566674 17240988 17460654
2921 17460654 17700586 18197220 18592480 19442812 19198529 19216473 19277095 19383428 19714086 20166771
2911 20166771 21196808 21749274 21833614 21809164 21267960 21957660 22327607 21431333 21836198 21509419
2901 21509419 21189168 21177981 19912106 19537688 19323982 18572049 17251218 17040135 16520615
2892 16520615 15774928 15924568 15630401 15891036 15688817 15117736 15850516 15299207 15071243
2883 15071243 14526804 13979975 13528971 13909034 14574924 13640020 13427957 13161817 13060743
2874 13060743 12555241 12328335 11784679 11551825 11288043 10626068 10232736 10055110 9520688
2865 9520688 9012683 9042289 8728716 8498361 8216772 7590693 7491148 7357196 7330409 6587191
2855 6587191 6017700 5796159 6102308 5994893 6124917 6645338 5860097 5889240 5779266 4977221
2845 4977221 5062543 5399441 4773850 4615718 4755663 4874770 4397898 4384500 4026885 3618048
2835 3618048 3797784 3504847 3689617 4035381 3438597 2894605 2750898 2431235 3422219 3292651
2825 3292651 2547214 1963209 2140400 2562728 3312781 3315087 2430524 2551989 2359108 2436086
2815 2436086 2428893 1323148 2188921 1975562 1004242 1700429 1793082 1790925 2214217 2569929
2805 2569929 2740286 2353743 2479728 2072657 2030623 2161497 1642515 1487538 1885168 1905384
2795 1905384 1940379 2496688 1746031 1675199 1053341 967988 1093046 1432435 1440464 1258934
2785 1258934 1542403 1653366 1796362 1509964 1057609 1267537 1406877 1011104 805086 1148799
2775 1148799 1321867 976619 721094 690994 646293 827401 775665 1163 118845 698019
2765 698019 292588 447963 436484 488867 -414439 10784 486309 530477 829686 906540
2755 906540 1252114 1132770 530179 834720 1293395 999170 1389186 1538486 967594 757932
2745 757932 727106 336531 824643 387506 58726 348454 286187 212252 87755 49928
2735 49928 -177864 528419 1119798 714153 851705 850840 837270 1051460 833713 694958 850763
2724 850763 279522 -41367 452223 550609 -27572 426636 10098 -288327 17445 73347
2714 73347 1015485 385651 -312472 -80111 98324 200698 -29602 710628 580928 519022
2704 519022 22593 346041 107346 -283945 -404223 -472861 -240757 416577 324321 46188
2694 46188 -6091 -153496 348737 77608 -53916 273630 -306446 -626476 -95089 259597
2684 259597 355471 381049 566723 70008 455759 329605 440506 430956 513007 114806 542081
2673 542081 821150 548489 -402500 -308180 195907 672736 552183 -137624 -14205 -90852
2663 -90852 227451 652809 133551 250799 430463 810185 648896 -7942 115973 309686
2653 309686 243800 127316 900978 416972 159371 462162 533972 843324 504938 46207
2643 46207 90055 383917 839379 349176 221988 43906 -246527 -451650 407503 591694
2633 591694 48516 553181 153548 -442361 -325028 -228663 126997 -369807 -232939 -250488
2623 -250488 -118313 234267 234846 -166477 -366963 -234531 26232 -139135 562371 609571
2613 609571 422016 808652 -54186 -41588 48096 449211 -264339 -110816 39037 -392202
2603 -392202 -127658 374429 158986 182044 176026 -506112 -670960 -479809 27045 -405169
2593 -405169 42495 -48916 265088 635109 299658 206390 721086 901513 531710 440506
2583 440506 466610 213935 418793 320993 131528 156741 -76695 105758 -224477 -216438 -204409
2572 -204409 -372677 -156651 -295219 -420379 681795 548915 -476271 -215474 -81005
2563 -81005 198524 247316 -353064 120208 -221175 26673 -29842 -605155 -294097 -255286
2553 -255286 -465855 -576115 -425588 -1132670 -815974 -75721 -69822 246861 141186 -158944
2543 -158944 -305172 78737 149246 701290 525290 698123 591626 650821 1027584 381001
2533 381001 348390 322390 322656 187596 -173688 -249704 -738545 -139623 200266 -174174 -76980
2522 -76980 759678 384980 58981 -105584 60530 -114042 -456154 -478935 -41138 100377
2512 100377 -463079 -679443 -490759 -395763 -742879 -367586 -407783 -373578 -210219 181570
2502 181570 110301 -24715 -27284 8428 -351223 -554639 -55366 -165900 -252183 -508458 -401883
2491 -401883 22236 -157288 349870 211058 467407 47543 190660 392066 637547 795825
2481 795825 1038675 197639 60961 -321279 -700365 -8530 -155365 -133712 -385258 -729543
2471 -729543 -514590 -131339 92835 -1660 -452180 -125925 -99586 -63851 82628 327392
2461 327392 246989 127459 -306854 -107525 -277759 -73644 358751 343950 -174080 -407596
2451 -407596 28959 289929 -95511 -303310 -86236 114957 527334 -63279 -331922 -56387
2441 -56387 97580 594733 768994 367985 -487694 -544237 -230270 80858 926292 367259
2431 367259 201448 74025 -362647 -724137 -450824 -39803 158852 115563 -1889 306509
2421 306509 143348 -723606 -974666 -840637 -438443 -477276 -819379 -549378 -543404 -921199
2411 -921199 -530279 -107325 -371009 -509026 -39582 396406 406046 82686 56738 681873
2401 681873 670056 -59178 94299 -96466 194860 439590 408595 154668 278927 -95834
2391 -95834 -161873 -302 950809 753284 -481295 -16271 261164 158133 213225 631632
2381 631632 306263 193213 -177560 300339 1165798 869036 245638 338374 418171 821132
2371 821132 826565 595831 528776 286773 -216123 596712 142075 86177 377118 89490
2361 89490 421985 140935 -156857 39414 49844 78291 -244403 -327987 -350763 -182151 -260243
2350 -260243 -667146 -358047 -154141 290204 528952 1003121 596323 61447 2079 -161003
2340 -161003 -388934 -473528 -210735 -263407 411637 913518 849337 671100 823390 782836
2330 782836 571097 507562 364379 681355 670161 204498 294548 8236 595211 654438
2320 654438 371276 129052 8625 81898 -213062 49767 78839 -295116 -81904 -267264
2310 -267264 345811 711559 348002 -120959 -3987 228258 512656 460582 -174687 444463
2300 444463 988697 903718 1585514 1383254 735718 976470 430486 648044 325598 377834
2290 377834 814348 165662 227908 245731 416869 562808 526640 752749 239222 267968
2280 267968 520821 1133422 495104 299132 64366 531442 600181 832501 590821 399076
2270 399076 985911 1017694 1011789 800370 832079 940346 293039 876571 869663 880824 1312661
2259 1312661 1093633 1361101 1210198 1695947 1507549 1159525 1008713 1537467 1543807 1413099
2249 1413099 895828 1051867 1220920 1288145 1906264 1819642 958610 881637 1610900 1741476
2239 1741476 2087602 2049879 1900627 2295951 2262288 1948091 1470038 1395488 1650041 1639397
2229 1639397 1516925 1741212 1790030 1691844 1902122 1374576 1182617 2149364 1978902 1696348
2219 1696348 2238390 2136919 1711181 2011559 2320570 2202504 2028329 1579813 1909734 2796641
2209 2796641 2920878 2469102 2798471 2526224 2713282 2804909 2583888 2888370 2779239 2745829
2199 2745829 3251211 3536140 3638550 3597928 3153396 3973103 4258257 3721980 4070185 4137360
2189 4137360 4011762 3648936 4495185 4678977 4632763 4675966 4790596 5190697 5186002 5062727
2179 5062727 4833891 4773346 5643697 6118615 5968696 5732953 5808124 6341191 6926066 7625495
2169 7625495 7775777 7527000 7502434 7822234 8096889 8260953 8291609 8619887 9578440 9262903
2159 9262903 8914622 9546599 9859627 10186663 10304955 10305820 9888578 11004205 11832202 12432574
2149 12432574 13150412 12710294 13004096 13469152 14741958 14498531 15001814 15978854 16593007
2140 16593007 17344540 17805879 18415675 18505023 19390827 19945549 21013839 22164396 24175104
2131 24175104 24780266 25491872 26404142 27539498 28801208 30398584 32547713 34178315 36244577
2122 36244577 38513355 40344519 42992838 45252077 48329535 51014692 54350928 58016980
2114 58016980 61196297 65123121 68716109 72288043 75931851 79542047 82536963 84916438
2106 84916438 86897840 87842437 87622259 87123669 86038976 83522209 80611993 77698456 73374792
2097 73374792 69581097 64975914 60460878 57364429 53670229 50919631 48157930 44763559
2089 44763559 42903260 40798465 38068750 36121603 34748231 32974397 31208788 29277077
2081 29277077 27660896 26184755 25302198 24643420 23642694 22564329 21758638 21005093 19252737
2072 19252737 18526060 18583922 17918409 17357824 17957051 16611559 15316707 14624877 14349379
2063 14349379 13719355 13849603 13672713 13235918 13180167 12880923 12597801 12196107 11280340 10783652
2053 10783652 10558247 10793244 10892264 10389810 10438446 9984118 8602864 7716622 8004760 8262322
2043 8262322 8388252 8284760 8385277 8354348 8273895 7584013 6810112 7300152 8084174 7626608
2033 7626608 7052074 6202835 6245093 6073331 6164347 6034565 5776542 5573629 5506919 5390253
2023 5390253 5414677 5463910 5288123 5209962 5620539 5182372 5234981 5204611 4634698 3860656
2013 3860656 4244935 4761783 4309978 3978857 3934628 3894529 3930993 3898331 3624896 3725914
2003 3725914 3783122 3847520 3913496 3258824 3470820 3428616 3790240 3308194 3370573 3132216
1993 3132216 3209336 3141325 2573709 2821045 2209310 1985511 2346752 2659454 2969908 2764083
1983 2764083 2367260 1852145 1563827 1913891 2392099 2727410 2778461 2246617 1988973 2151743
1973 2151743 2699101 1972259 1667289 2429075 1991664 2364895 1832016 1760397 1465602 1072644
1963 1072644 1668160 1887972 1618929 1670383 1034663 986582 1105481 1438196 1394391 1517572
1953 1517572 1822083 1672843 1758156 1503783 1664322 2239438 2254116 1836215 731978 822691
1943 822691 1400512 1108792 1121852 1295229 1510589 1134254 1454626 1714167 1676707 822269
1933 822269 217468 834998 872318 740796 1231254 1656497 1160839 1613665 1624643 1479789
1923 1479789 1314644 1333434 1391782 1895299 2173444 1593044 1555526 1813350 1031420 801079
1913 801079 726662 940882 572122 141405 504843 1208770 943930 842167 314261 435343
1903 435343 611669 345617 1040661 1033557 1098441 909298 935146 949685 1477516 945989 542438
1892 542438 884664 676436 1483178 584238 432933 1049611 1186257 1285026 1201864 1104624
1882 1104624 1270409 736266 727540 -100225 30554 361218 401298 933506 923456 911189
1872 911189 898673 273917 532029 759436 662385 1126832 1336036 1393024 876508 680360
1862 680360 298180 1503342 1395155 855505 697696 428294 591287 1192711 884819 1147586
1852 1147586 1197150 822075 545814 799698 833326 863105 705076 966844 795415 910467
1842 910467 1039978 793660 547317 387757 175369 910468 842288 957790 1025497 862764
1832 862764 992069 569076 697567 647573 546299 656789 352963 304681 1103325 1051799
1822 1051799 202908 247226 678070 529815 393026 866712 583383 -45909 -169281 175736
1812 175736 -484173 -100084 573949 645340 680072 195583 375 570588 -175336 181857
1802 181857 322950 14828 -34313 -102962 -83962 -345353 126217 146696 360838 20997
1792 20997 -278363 -293916 -169538 6499 300833 209050 552742 1099210 725632 -267283
1782 -267283 -563716 -321558 -2568 68020 891124 749995 389800 809030 1110497 117442
1772 117442 -632237 -280668 -28837 -159353 -107788 -103399 186715 67837 631847 181845
1762 181845 112525 -206701 512938 438318 25007 44022 -449523 -407674 190232 601992
1752 601992 732253 145463 224330 709804 -8451 50376 -583668 -501885 6227 -502030
1742 -502030 -147732 286442 227949 705176 283473 444011 155328 -470549 -191804 -142999
1732 -142999 -170775 -260433 -305590 -436577 -595255 -53916 -834934 -650280 -488727 -1178894
1722 -1178894 -692607 63066 -147046 -577486 -178749 -45585 -229956 -464051 -325930 81992
1712 81992 56772 200408 441938 54 -554355 11697 -358426 -194631 -130789 63765
1702 63765 -87472 -40223 73777 -276797 -393739 531577 233173 177576 44945 73242
1692 73242 367957 141800 -4209 -245404 -311921 -393593 -248976 158754 519203 -93153
1682 -93153 -110584 -315994 200035 36900 298991 -181385 -347428 -728058 -450035 218709
1672 218709 42783 -369084 -197373 60830 41901 33057 -467314 -521132 -57000 -219234
1662 -219234 -228436 -956842 -982186 -203852 -139372 144828 326479 194305 166202 -379320 -776661
1651 -776661 -1197999 -304224 -208599 -92006 42702 400573 -41 -403858 -408228 -477033
1641 -477033 -9052 -52093 170443 215293 -24987 -247084 -194180 -371830 -281290 -273552 141762
1630 141762 177520 -203722 10425 -73122 -840552 -12457 660510 423928 -17920 -67886
1620 -67886 -96989 21850 462179 198815 167912 -40498 -126186 -149609 -519233 -319439 -292538
1609 -292538 -133583 -177831 -345271 -429570 -439488 -1093173 -732541 -1047786 -442695 32908
1599 32908 -253021 -75675 -661863 -787113 177922 349756 95968 -585480 -329717 -341593
1589 -341593 -352724 479453 317091 -9213 -8150 595545 817609 153094 -50970 -163806
1579 -163806 -162448 80600 274597 -278154 -448591 185332 529601 241994 -125072 -436837
1569 -436837 -797409 -445189 -178969 -227953 -132773 -529149 -592219 -54846 618380 715690
1559 715690 639268 299965 -348973 23731 158460 518740 -250564 -77113 230817 -323336
1549 -323336 36736 -509340 -113619 288140 338828 421508 405422 115820 -255837 -96107
1539 -96107 -3478 -266832 -500881 -657956 -635180 -238373 -112750 -275989 -37963 -109399
1529 -109399 -657693 -706622 -1224157 -854751 164695 619173 758450 1118844 400986 -5343
1519 -5343 -102132 -155888 -139563 -384735 -1027247 -1420882 -384466 309596 -225036 20748
1509 20748 -616963 -728523 -716231 -460369 -70414 -135474 -55485 -252678 -759082 -401740
1499 -401740 -196655 -249798 -217583 61749 466096 239953 -337027 -1021871 -169158 -788798
1489 -788798 -1368291 -761744 -527821 -366242 39992 348953 -216028 -517177 -336026 68873
1479 68873 -266542 -607820 -493453 -416430 -953950 -1288076 -937898 -278359 -283134 -551057
1469 -551057 -427017 131812 499388 27619 -242734 -237422 201205 23211 -329351 -484604
1459 -484604 -230972 -236362 -705998 352611 571934 -21804 -167433 124844 -320006 -438009
1449 -438009 -202568 -316231 -375985 -62073 122355 345871 206163 120213 352545 368779
1439 368779 175741 -94592 341043 -70253 149477 -541288 -192705 -646410 -605878 -134620
1429 -134620 9148 306472 82910 54612 -239109 -156185 171069 675048 583548 423219
1419 423219 211064 -16940 -487773 -615558 -219570 -289724 -377445 -58837 -303338 -326290
1409 -326290 -482507 -1030765 -643659 -803240 -778327 -477159 -337924 -234648 105842 -182331
1399 -182331 -613687 -532927 -209552 130637 615700 503289 315997 -296056 -655410 -420785
1389 -420785 -130866 -244870 -566463 -245748 -122986 -212659 -432352 -189586 552830 55453
1379 55453 -397828 -132437 44261 -538740 -561861 -126682 -270364 -458546 -449435 -83923
1369 -83923 191903 -333063 -872713 -690062 -520509 -297288 -83770 380308 334700 534538
1359 534538 280668 275715 299975 599202 887199 503513 -59918 -282485 -34672 -263491
1349 -263491 -576298 -1109829 -486356 -432267 -188149 -130170 -533029 -351141 -600205 -128987
1339 -128987 -254255 -234154 -156347 -91824 -448386 -49846 46390 -96165 -487635 -882204
1329 -882204 -638876 144603 419606 308138 -311949 -513519 -313902 -497043 -501253 -35780
1319 -35780 -206359 -11731 -49445 134857 343312 502636 672221 629767 345395 -717233
1309 -717233 -226080 -458171 -758602 -728606 -88740 -143682 308277 4399 -558921 -238713
1299 -238713 -142136 318603 -117416 -220334 -846469 -1018797 -437411 -483162 15689 -210834
1289 -210834 -562896 -329484 -300947 -123803 -80439 430448 -138428 -304511 44114 125770
1279 125770 835662 605966 113662 -246365 -180854 -600380 -820837 -107102 284577 630753
1269 630753 504650 -131795 -454989 -627149 -982551 -758938 -833108 -281794 -184304 -107320
1259 -107320 300499 110890 299810 370530 371395 123409 43998 144373 244204 -59587 -648845
1248 -648845 -298981 -190545 -438072 -400926 -398582 -653641 -711365 -875447 -510113 -75166
1238 -75166 -272973 -599642 -1272844 -819988 -386547 -48378 -298489 -185599 -562035 -174511
1228 -174511 414210 78555 -97099 602905 33035 -327719 -497779 -270978 -173434 -897302
1218 -897302 -1003411 -593380 -188258 -382843 -322168 -481818 -96476 -511775 -497976 -465983
1208 -465983 -726555 -876420 -331124 -72820 -390329 45743 -362979 -176961 -432293 -456601
1198 -456601 -594149 -420766 -379900 -328430 -657547 -830296 -535955 -28656 50307 -77210
1188 -77210 383696 415674 641515 -117721 -493845 -164380 -165881 -338513 -74504 336389
1178 336389 395685 -93340 -32076 155468 276810 -568541 -533989 -238704 -707159 2693
1168 2693 289242 90131 -88650 -99241 271293 -150945 -347604 -561050 -183166 -386864
1158 -386864 -556225 -13002 123909 60044 -339204 -291037 86972 -148943 -260265 -443252
1148 -443252 -242352 56575 -154662 -425794 -526676 -540168 -304703 -742086 -793452 -635413
1138 -635413 106852 -43319 -262865 -211821 -372437 -414235 -368918 3639 -284918 -354986
1128 -354986 -623927 -781377 -252230 -135290 -46360 -156160 -166123 -396788 -403033 110038 94998
1117 94998 315813 379258 33037 -196052 -65081 107974 -578705 -687551 -608951 -275741
1107 -275741 289797 -72496 -114608 -237324 -246178 -283457 244094 408024 158234 -19325
1097 -19325 -424530 -233697 -34185 212311 -567033 -521162 186091 -646873 -390268 -600432
1087 -600432 73950 684325 372578 69695 7538 20954 -124973 -430780 -587347 -240056
1077 -240056 -225242 -470839 -419959 -929524 -153677 -271334 31368 659899 196163 347475
1067 347475 -336679 -924942 -829371 -237775 54732 -84926 244231 -755 282474 106242
1057 106242 -354930 -6805 619616 207506 -192180 56669 2715 -454201 -265546 -564058
1047 -564058 -630767 -311639 -740653 -769951 -475831 -415200 -419531 -121280 -80702 98074 -233004
1036 -233004 446867 -30114 -176148 438168 -430401 -404396 -281183 -356442 -377854 -585900
1026 -585900 -258232 -279942 803141 363767 -42914 561052 -90413 202065 452759 182592
1016 182592 415782 189576 192245 257782 77055 -399998 -211403 70526 -407430 -481041
1006 -481041 -583093 -574355 -854489 -1543686 -904140 -444996 -615124 13714 124 47635
996 47635 19947 -712976 -847430 -127998 -594025 -251030 50614 374981 157425 -353455
986 -353455 40041 2962 -356874 -479100 -256106 -502987 -317446 -398060 -71584 -30928
976 -30928 -101845 -532852 -241661 -604398 -705280 -300616 -242923 -163388 -457749 -929205 131679
965 131679 905437 -199027 -769479 -175060 355676 102083 -401632 -212521 -183434 -134347
955 -134347 -507138 -184877 -209428 -484075 -251917 -573878 -110234 -425336 -703520 -256761
945 -256761 -628959 -528231 82741 -429718 -763959 -518732 -703245 -170200 179643 -403215
935 -403215 -309645 -22341 -246162 -599017 29324 -643911 -124023 -58930 -722198 -633011
925 -633011 -586256 -155353 -418032 -618518 -166456 -618616 -458215 242848 101972 77307
915 77307 20405 -721774 -59265 -192903 -609198 -397327 -505527 -190718 611511 616920 226479
904 226479 -6596 -485676 -301997 -508728 -656640 -635925 -766382 -1080561 249764 241245
894 241245 -255151 -11245 82381 -116821 -242659 -343556 -207480 -237723 -479672 -197107
884 -197107 -553887 -862924 -1278821 -1240615 -412481 441270 756736 805080 240897 49855
874 49855 441328 -4735 247774 275458 314318 -265428 -799655 -977411 -497812 -254176
864 -254176 -10427 -18184 54169 244436 144588 -407203 -279067 283825 -63210 58665 141064
853 141064 648907 51117 -53450 -510022 -442418 -516365 -310274 -487058 -503289 -607450
843 -607450 -490561 224732 -79212 -405042 -296211 -63791 -135815 -78952 490 15497 251969
832 251969 -111867 -280825 -55114 190843 -25533 -166336 157521 -686670 -729585 -676888
822 -676888 -220578 -174123 -86094 -289325 -352479 57535 155293 -32678 -264237 494995 1190376
811 1190376 356563 -54588 428386 808022 1142991 -317697 -509798 -387655 -420605 -380867
801 -380867 -242870 -344363 -850157 -440726 -143888 -761876 -491224 -262437 -353175 108524
791 108524 -239215 -1047610 -790514 -336053 -694607 -303372 136397 -372217 -174139 739630
781 739630 411757 200010 -122106 79676 477816 209806 106973 362936 170533 407001
771 407001 678637 304311 360003 574936 468775 254893 70224 -327983 -315945 348652
761 348652 643972 467175 -266699 22015 824200 1017054 1109912 473111 1015766 796295
751 796295 915191 591863 -402010 -82795 524862 -34417 39085 151159 -143555 242978
741 242978 -599576 -501043 65725 678664 469714 151566 -173797 -238050 225952 -253156
731 -253156 -560955 493 663653 739361 339260 93303 380554 720695 364193 874791
721 874791 619052 -217106 -226118 314248 -85853 -433536 82870 -8 369178 418722 -384488
710 -384488 -452896 58490 93280 137409 738977 736317 286555 -8690 298259 335157 -518354
699 -518354 -57373 -137842 -170069 326067 332854 -121354 -520672 121751 648557 95537 96036
688 96036 -448715 -92117 570858 151020 647445 139278 -263249 -709316 -732063 -337376
678 -337376 -200664 -115172 134284 455975 950682 327988 -69984 -187293 615826 473394
668 473394 -22154 30155 17623 504622 424857 267283 292434 367118 702937 467937 441306
657 441306 560150 599472 808998 -94293 386860 614875 31057 150195 160464 -41324
647 -41324 -657727 -810377 -542056 -268554 231725 118503 -12249 -50201 -338593 -285723
637 -285723 -29503 61349 -182274 -187342 164823 -184911 334705 293691 -120673 118737 561083
626 561083 735848 673605 506737 168311 439025 284942 343550 488823 268158 556079
616 556079 123162 -558438 -824693 -168790 1087 274428 868479 724263 455412 1000706
606 1000706 966237 414584 -250878 416990 -121107 -85706 -25854 287684 602539 848273
596 848273 771070 610244 621206 255997 339287 -192046 -478987 124200 32839 594410 14093
585 14093 430661 641188 237281 349508 400566 821709 797057 920742 313509 177116
575 177116 -27476 722513 821083 850141 329917 277231 567872 1003588 131189 -220888
565 -220888 -252419 -252137 -125642 -436811 -235432 -508085 -1157826 -500757 -145361 340624 221852
554 221852 452818 399064 476606 280399 -121837 -6793 -14973 190456 336376 508722 586562
543 586562 252495 -296962 59353 535893 -329712 -297448 339856 424091 545821 284600
533 284600 -1862 51268 387024 775547 336871 47075 -90352 -709450 -128233 325855
523 325855 -23722 337746 647685 387026 405635 456924 143139 227413 -416965 -108693
513 -108693 281838 740106 213305 -502712 -71436 43092 236741 154200 108932 109862 261886
502 261886 164104 440778 -362315 -838063 197790 542063 357319 837129 492617 6303
492 6303 -128763 814595 734560 468864 -75148 -166270 33734 69315 46827 79086 11822
481 11822 -344769 -125436 190743 312806 637708 275076 392991 632434 358125 330901
471 330901 334426 478579 -82838 282684 302244 403882 204484 -301547 121595 550912
461 550912 -27472 -182529 -145834 2179 -269772 -1021772 -437438 -413837 -128675 345244
451 345244 312495 -178008 -139049 -208356 -257604 5453 155116 224459 105699 297665 325529
440 325529 -77728 151743 605977 681009 537062 246315 14843 -78072 588682 472732
430 472732 230710 -474023 56153 132269 -44638 761691 396167 -356919 -43645 -303071
420 -303071 56606 661356 661679 331020 -251539 -296943 128147 696192 749779 244895 249937
409 249937 600259 80258 365057 299785 337763 235289 533739 -18399 -171434 -229478
399 -229478 -506095 -330921 -259327 -39118 -123478 -514664 -43198 399634 -157149 51988
389 51988 150862 -140411 37748 -62325 -396075 569688 -19910 379340 115559 21458
379 21458 440270 341905 1102542 691026 211171 364626 514903 91703 11427 157480
369 157480 201145 182111 167930 -146810 587695 594785 363093 882040 318994 -193406 683611
358 683611 713854 551752 723503 724642 372133 -158131 -317601 -274269 -370 49785 -683128
347 -683128 466039 634944 996641 476781 402087 623174 281863 234248 -264479 -403515
337 -403515 -446030 -163917 -298999 -337214 -278 187937 203232 81159 174338 608959 706776
326 706776 638057 536566 611938 534222 833235 308623 -40382 327735 766111 504551
316 504551 395040 165419 -20605 464363 496159 -356690 -164755 132285 453040 148463
306 148463 -194737 -354765 -30321 115032 492049 249886 150406 145005 -53120 110270
296 110270 -260155 -124943 -225789 74447 483347 319989 26339 257135 -117997 -327468
286 -327468 300091 -321533 -513275 -220786 -149854 431930 306933 -133937 70442 -216620
276 -216620 -149827 -486582 -10542 -80317 -518264 -134380 88982 593547 305022 -662383
266 -662383 -590458 -74190 487353 846428 332699 68878 349942 62270 396186 232780
256 232780 282161 195553 188675 928404 422005 81757 428034 471917 -18242 -132398 514328
245 514328 -91563 -281022 177179 -504416 -419434 -23219 441802 657947 439124 607039
235 607039 759234 594159 698469 107427 375503 335313 256407 130234 -98701 -288768
225 -288768 16933 202511 536978 630737 534252 338317 774217 764905 939327 1293949 271353
214 271353 79503 298719 209225 71591 94255 -260490 -298116 -364795 -90471 -357188 -171293
203 -171293 48299 -670963 -332611 224639 616180 829809 744801 230533 245005 684639
193 684639 519297 492419 552793 -82839 16728 551583 291607 96355 203632 444912
183 444912 327611 843895 1317927 640968 1348498 987585 886241 357779 143776 -65895
173 -65895 164815 536651 409301 497741 490962 286354 448337 406041 409927 829146 540770
162 540770 383414 310711 770370 622378 554323 -233046 120570 519412 340485 405197
152 405197 403655 -104829 4583 -533573 -351565 -181517 225256 481858 -181519 33125
142 33125 109155 249205 -246852 -159225 139974 202836 52421 156071 353045 589375 483860
131 483860 20162 151015 -221489 -488299 -189328 -133804 414842 189556 163735 -79572
121 -79572 -266312 -173249 -52012 513862 445412 -113303 -64872 69857 -338373 568068 636382
110 636382 507390 213843 -174950 -348307 138547 644565 706398 536633 -110496 30259
100 30259 107829 236233 124069 -219823 600493 349829 -252044 577803 475741 466089 681833
89 681833 622299 374212 -186523 -22969 370840 664071 857828 564167 329590 24725
79 24725 220206 518259 897879 595842 289947 318358 405652 394938 371397 357135 321625
68 321625 204964 82323 128867 456116 496315 213362 255706 81142 -190135 -166395 265970
57 265970 115826 323869 338176 779314 771283 474312 151502 172315 253931 416019 -45634
46 -45634 263852 333644 251445 556868 448543 180400 381924 909538 433648 336994 295782
35 295782 537248 451937 210221 399125 394732 -296978 18827 67725 -247570 24836 -265714
24 -265714 140503 381721 239146 46324 296370 527634 617710 118402 346861 150605
14 150605 232874 566794 240471 402663 678036 136493 233449 660934 355678 285006 350645
3 350645 410649 175874 253201
0 253201
$$ Imaginary data points
##PAGE= N=2
##DATA TABLE= (X++(I..I)), XYDATA
16383 -1538314 -1275563 -1436864 -1593880 -1167938 -1534813 -1549768 -1046200 -1125285 -1289752 -1206696
16373 -1206696 -1149282 -1051802 -1104734 -1310437 -1411070 -1346205 -1289395 -1046462 -746393 -833897
16363 -833897 -1095425 -1073810 -1056375 -1230159 -968284 -715482 -568477 -724869 -773583 -1447266
16353 -1447266 -1337260 -514587 -426775 -183504 -136522 -313027 -117300 -104643 -294415 323042
16343 323042 -147465 -432874 -182965 113568 172383 -25310 -185694 -209577 253498 383663
16333 383663 419698 624382 799719 579517 524861 188258 75557 113208 730952 596530
16323 596530 560370 666375 153131 314341 221524 -109329 -140392 254693 406854 336355
16313 336355 801683 940971 841887 745811 784408 577537 871469 914081 789124 1298900
16303 1298900 1601138 1372131 1489029 1555968 1726181 1444721 1243694 1489940 1201449 1111561
16293 1111561 946472 772467 800669 1206601 1222861 1546357 1878119 1812678 1748787 1461411
16283 1461411 1236171 1300066 2021841 1849461 1318933 1357572 1641502 2208005 2797185 2450948
16273 2450948 2048864 2150524 2388946 2041461 1147336 1056473 1330914 1823327 2720046 2878179
16263 2878179 2415665 2502252 2372825 2710194 2659510 2683226 2681214 2382545 2006595 1976797
16253 1976797 2202028 1992634 2067467 2054393 2053124 1627125 1680521 1719043 1842410 2185179
16243 2185179 2885038 2917141 2517354 2192632 2469694 2129911 2210659 2198948 2353895 2443774
16233 2443774 2541602 2286796 2231860 2376445 2573339 2826665 2896229 2616586 3204015 2709328
16223 2709328 2266621 2092981 2206726 2957623 2652149 2799435 2765248 3682911 3342243 2646009
16213 2646009 3056118 3181191 3004505 2639922 2364611 2964839 2777076 3271803 2957116
16204 2957116 2763941 2397080 2902032 3145032 3093882 3176370 2989818 2772228 2199573 2474959
16194 2474959 2771162 3004742 3419145 3044029 3033985 2720482 2811338 2989911 2849814 2837194
16184 2837194 3329929 3281912 3218791 3308206 2965255 2750346 2778280 3389626 3317250 3173139
16174 3173139 3519585 3908854 3764521 3556064 3951812 3635345 3264922 3352500 3008510 3306682
16164 3306682 3514557 3597058 4016804 3522049 3191425 3769179 3830817 3899473 3903668 3934694
16154 3934694 4169991 4039306 3328745 3819449 3827039 3975115 4188270 3707765 3805275 3927867
16144 3927867 3502912 3231170 3848971 3749851 3741525 3909167 3847086 3579048 4008666 3915568
16134 3915568 3778123 3916136 3757548 3522293 3719452 3985202 4543133 4388667 4040839
16125 4040839 4152302 3746202 3899097 3746687 3531140 3472969 3940490 4031433 4626116 4621149
16115 4621149 4025045 4350740 4575907 3519234 3919940 3721228 3011073 3582084 3575558 3382154
16105 3382154 3083194 2953458 3010846 3155589 3376338 3856471 3782905 3662104 3485870 2974764
16095 2974764 3259005 3984173 4213664 3917878 3832029 3491169 4033155 3906656 3552309 3746621
16085 3746621 4706162 4256234 3906973 3966053 4044547 4383307 4287427 4391064 4299349 4155581
16075 4155581 4069449 4665459 4559083 4341571 3716144 3473399 3545238 3733278 4130811 4185169
16065 4185169 3705684 3587485 3463740 3243058 3870211 4456937 4218098 3575404 3103769
16056 3103769 3585667 3543935 3944675 4280636 4581098 4217981 3992281 4646019 4553605 4468848
16046 4468848 4382133 4070101 4050992 3890324 4118937 3597175 3733861 3796705 3475825 4402168
16036 4402168 4255202 3769286 3552087 3422769 3560895 3569389 3550215 3314667 4574680 4324263
16026 4324263 4426584 4899356 3853645 3956750 3660788 3965699 3464582 3398734 4092958
16017 4092958 3854861 3924951 4264410 3668900 3849411 4120500 4252531 4447591 4187880 4571719
16007 4571719 4403714 4379564 4092944 4360653 4558991 4487843 4089287 3785603 3889503 3358280
15997 3358280 3493362 3776228 4193910 4236186 3754729 2954540 3431207 4073730 3799559 3666132
15987 3666132 3995714 3810476 3895064 4108474 4578942 4588572 4192697 4278160 4087015 3784432
15977 3784432 3737282 3485853 3609346 3857802 4255064 4207059 4553621 4707619 4657734 3863530
15967 3863530 3925508 3799429 4277388 4479331 3489369 4095866 4549819 4592195 4646175 4505286
15957 4505286 4027457 4129484 4213823 4200189 3905322 3949771 3930283 3604470 3792675 3945478
15947 3945478 4648315 4443953 3873329 3872744 4113918 4049104 3780547 4013217 4385105 5066569
15937 5066569 4069568 3688317 3492518 3000095 3436187 3735574 3228478 3779052 3771096 4439270
15927 4439270 4252962 3728800 4033951 3462960 3844967 3694917 3785672 4232596 4804222 5012883
15917 5012883 4595866 4404055 4288029 3907493 4351231 4445272 4134936 4308074 4438778 4810644
15907 4810644 3982107 3793141 4358195 4198631 4094368 3594801 3891697 4062208 3917922
15898 3917922 3863894 3994340 4256689 4180333 4087431 3866588 4085891 4090762 3761506 3570421
15888 3570421 3085103 2740941 3859281 4095632 4054898 3529974 3262167 3055445 4080443
15879 4080443 4436760 4134270 4436829 4521984 3832694 3393891 3605877 4037381 3736704 3632836
15869 3632836 3960935 4149023 4032302 3994439 4212228 4742753 4626496 3961672 4448873 4493681
15859 4493681 4206169 3842214 3831865 3197052 3108341 3841533 3535985 3402588 4101862 4361906
15849 4361906 3848193 3652610 3682941 3756634 4568367 4593137 4495849 3975144 4134880 4415062
15839 4415062 3874364 4342378 5019852 4750699 5034589 4789934 4610921 4171209 3128081
15830 3128081 2641840 3801373 4130877 4183865 4232617 3947303 4094403 3746688 4453567 4680289
15820 4680289 4560322 4397730 3748019 3911649 3934876 3860323 4314782 4299291 4267702 4100932
15810 4100932 3629055 3862442 3888748 3694713 3668829 3931942 4101721 3804470 3389281 4118289
15800 4118289 4440955 4218169 4482463 4128490 4305094 4069147 4258567 4659391 4717157 4082985
15790 4082985 4115734 3745272 4385354 3989682 3724610 4831839 4691775 4738537 4713141 4722606
15780 4722606 4232099 4875839 4170937 4116222 4125829 4137915 4219631 3870368 3612896 4033583
15770 4033583 4673299 4695786 3658270 3823785 4323507 4980865 4628090 3890353 3484833
15761 3484833 3942955 3886173 3682773 4504981 4342089 4101568 3992901 3889587 3682229 4222824
15751 4222824 4064741 3904798 4029302 4234335 4272813 4092294 4328359 4301765 4835521 4451361
15741 4451361 4567082 3649332 3625732 3639969 3652926 3482170 3416886 3923195 4143874 4897666
15731 4897666 4598729 4832674 4502816 4122757 4425337 4840292 4095311 4408264 4337673 4330470
15721 4330470 3456114 4262025 4590299 4858262 4938712 4943428 4310533 4005129 3616465 3795026
15711 3795026 3888970 3567408 3983165 3977687 3003943 2923895 3442003 3536223 4403334 4287666
15701 4287666 4048946 4198892 3862798 4351206 4321259 4229230 4596936 4626362 4283590 3970296
15691 3970296 3855197 2948568 3754761 4240727 4189969 3952721 3585796 4133394 4245005 4613559
15681 4613559 4962206 4627804 4130044 4174490 4348359 4488397 4892874 4184554 3814834 4000632
15671 4000632 4528320 4667164 4406212 4308199 3936035 3891227 4345966 4759062 4717432 4026073
15661 4026073 3723528 4204072 3760782 3880129 4081757 3845801 4576713 4643729 3986825 3726457
15651 3726457 3938192 3973937 4075419 4644506 4363030 4587070 4674752 4108423 4114209 4193797
15641 4193797 4753043 4930719 4903549 4622459 4093188 4030601 4429130 4022374 3855982 4332153
15631 4332153 4262228 3671557 3667165 3686126 3737006 4306347 3914893 3614211 4065491 4071581 4169875
15620 4169875 3996804 3927881 4397526 4518870 4173872 3555830 3396310 3702823 3599317 3884404
15610 3884404 3613370 3505349 3596514 4169636 4073556 4117036 4492008 4158604 3800984 4022290
15600 4022290 4242892 3651763 3758544 4245859 3857189 3136716 3550239 4376002 3931037
15591 3931037 3907452 3547825 3966336 4652187 4032005 3933152 4250111 4969159 5170110 5188059
15581 5188059 5133858 4405662 4297238 3710137 3663765 3921433 4296030 4289510 4212459 4601707
15571 4601707 3996662 4488464 4490716 4108315 4090518 4309652 3877994 4257603 4547562 4540324
15561 4540324 4209837 3669927 3960506 4378824 4321856 3638849 4198959 4095868 3826997 4556928
15551 4556928 4239729 3869884 4159668 4210985 4191495 4245074 4101969 4205537 4459604 4749236
15541 4749236 4507431 4480218 4412281 4010755 3877119 4010681 4222586 4594190 4595606 4142198
15531 4142198 4397448 4336673 4171796 4219612 4111926 4231307 3955376 3667212 4060521 3923723
15521 3923723 4341781 4466705 4391677 4489568 4607609 4717563 4707410 4932005 4552880 4410697
15511 4410697 4371984 4078491 3838700 4235256 4036947 3995229 4378240 4692234 4639084 4662085
15501 4662085 5061391 4798331 5164133 4639022 4694064 4421979 4211361 4403921 3936463 3904772
15491 3904772 3383192 3631679 4264386 4210002 4003000 4410057 4914578 4849954 4082093 3543185
15481 3543185 3861106 4194046 3847149 4066958 4111006 3709978 4142456 4516914 4811698 4686747
15471 4686747 3951212 3919568 4077917 3966847 4191371 4252118 4378050 4666940 4405213 4343189
15461 4343189 4726964 4866745 3893205 4006124 4417440 4376736 4414670 4031176 4110202 4284293
15451 4284293 4057936 4308459 3703023 3401720 3627946 4384422 4093785 3977210 4053769 4254500
15441 4254500 4273844 3771954 3704806 3507672 3572861 3823709 4279932 4214794 4142165 4686264
15431 4686264 4813797 4969694 4879850 4467452 3944962 3557604 3674366 3518481 3917895 3480263
15421 3480263 3384767 3927155 4243482 3916784 4170188 4083256 3817463 4275834 4805960 4808420
15411 4808420 4166415 3542308 3487736 3647794 3787132 4051011 4061798 4045333 4085841 4058547
15401 4058547 4264278 4628978 4454609 4411133 4169811 4610085 4493660 3722724 3913939 4082719
15391 4082719 3690837 3921372 4653130 4818825 4508557 4370569 4587608 4190346 4593553
15382 4593553 4779759 4895216 4545634 4275280 4642772 4226912 4414421 4479030 4432026 4515794
15372 4515794 4775615 4803123 4615964 4966313 4845796 4557128 4685568 4999271 4615066 4350472
15362 4350472 3847586 4152543 4185919 3776377 4299112 4526159 4071735 3928809 4234490 3540264
$$ [...]
##END NTUPLES=NMR SPECTRUM
##END=
