##TITLE=1H_CA-9065-2
 CDCl3
 8 sc, 
 26.09.2022
##JCAMPDX= 6.0         $$ Bruker NMR JCAMP-DX V2.0
##DATA TYPE= NMR SPECTRUM
##DATA CLASS= NTUPLES
##ORIGIN= UXNMR, Bruker Analytische Messtechnik GmbH
##OWNER= root
$$ XWIN-NMR		Version 3.5
$$ Mon Sep 26 14:34:35 2022 Russian Standard Time (UT+4h)  she@DPX200
##.OBSERVE FREQUENCY= 200.1313499994
##.OBSERVE NUCLEUS= ^1H
##.ACQUISITION MODE= SIMULTANEOUS
##.ACQUISITION SCHEME= undefined
##.AVERAGES= 8
##.DIGITISER RES= 18
##SPECTROMETER/DATA SYSTEM= spect
##.PULSE SEQUENCE= zg30
##.SOLVENT NAME= CDCl3
##.SHIFT REFERENCE= (INTERNAL, CDCl3, 0, 15.7403)
##AUDIT TRAIL= $$ (NUMBER, WHEN, WHO, WHERE, WHAT)
$$ ##TITLE= Audit trail, XWIN-NMR		Version 3.5
$$ ##JCAMPDX= 5.01
$$ ##ORIGIN= Bruker BioSpin GmbH
$$ ##OWNER= she
$$ F:/spectra/data/she/nmr/H-F/1/pdata/1/auditp.txt
$$ ##AUDIT TRAIL=  $$ (NUMBER, WHEN, WHO, WHERE, WHAT)
(   1,<2022-09-26 14:33:24.57 +0400>,<she>,<DPX200>,
      <created by zg, POWCHK disabled, PULCHK disabled
       configuration hash MD5:
       00 E9 B6 7A A2 85 ED C7 34 08 36 98 17 FE 4E 26
       data hash MD5: 16K
       5B 57 B1 61 3D 68 E3 6B D8 70 79 5C 22 F3 49 AE>)
(   2,<2022-09-26 14:33:27.15 +0400>,<she>,<DPX200>,
      <Start of raw data processing
       efp BC_mod = 2 LB = 0.24 FT_mod = 6 PKNL = 1 PHC0 = -18031.95 PHC1 = 13.20069 SI = 16K 
       data hash MD5: 16K
       34 C5 70 F5 8C 5A A0 26 DD 0A 03 24 DE 86 9F A5>)
(   3,<2022-09-26 14:33:41.56 +0400>,<she>,<DPX200>,
      <pk PHC0 = 0.5319692 PHC1 = -1.4 
       data hash MD5: 16K
       D5 8F E3 D2 BA B6 9A FA F1 C3 BC E5 D4 34 37 23>)
(   4,<2022-09-26 14:33:44.50 +0400>,<she>,<DPX200>,
      <abs ABSG = 5 
       data hash MD5: 16K
       D0 B5 C8 45 41 31 BE 87 00 9E 6E 8E BC 6C 55 B4>)
$$ ##END=
$$ 
$$ hash MD5
$$ B7 0B F6 92 1F 50 97 87 C9 8A E9 9A 2A 79 74 84
##$RELAX= 
##$RELAX= 
##$RELAX= 
##$RELAX= 
##$RELAX= 
##$RELAX= 
$$ Bruker specific parameters
$$ --------------------------
##$DU= <F:/spectra>
##$EXPNO= 1
##$NAME= <H-F>
##$PROCNO= 1
##$TYPE= <nmr>
##$USER= <she>
##$AMP= (0..31)
100 100 100 100 100 100 100 100 100 100 100 100 100 100 100 100 100 100 
100 100 100 100 100 100 100 100 100 100 100 100 100 100 
##$AQSEQ= 0
##$AQ_mod= 1
##$AUNM= <au_zg>
##$AUTOPOS= <>
##$BF1= 200.13
##$BF2= 200.13
##$BF3= 200.13
##$BF4= 200.13
##$BF5= 200.13
##$BF6= 200.13
##$BF7= 200.13
##$BF8= 200.13
##$BYTORDA= 1
##$CFDGTYP= 0
##$CFRGTYP= 5
##$CHEMSTR= <none>
##$CNST= (0..31)
1 1 145 1 1 1 1 1 1 1 1 1 1 1 1 1 1 1 1 1 1 1 1 1 1 1 1 1 1 1 1 1 
##$CPDPRG= <>
##$CPDPRG1= <>
##$CPDPRG2= <>
##$CPDPRG3= <>
##$CPDPRG4= <mlev>
##$CPDPRG5= <mlev>
##$CPDPRG6= <mlev>
##$CPDPRG7= <mlev>
##$CPDPRG8= <mlev>
##$CPDPRGB= <>
##$CPDPRGT= <>
##$D= (0..31)
0 1.2 0 0 0 0 0 0 0 0.06 0 0.03 0 0 0 0 0.0002 0 0 0 0 0 0 0 0 0 0 0 0 
0 0 0 
##$DATE= 1664188403
##$DBL= (0..7)
120 120 120 120 120 120 120 120 
##$DBP= (0..7)
150 150 150 150 150 150 150 150 
##$DBP07= 0
##$DBPNAM0= <>
##$DBPNAM1= <>
##$DBPNAM2= <>
##$DBPNAM3= <>
##$DBPNAM4= <>
$$ [...]
##$SUBNAM3= <"">
##$SUBNAM4= <"">
##$SUBNAM5= <"">
##$SUBNAM6= <"">
##$SUBNAM7= <"">
##$SUBNAM8= <"">
##$SUBNAM9= <"">
##$SW= 18.0517283424941
##$SWIBOX= (0..15)
0 0 2 0 0 0 0 0 0 0 0 0 0 0 0 0 
##$SW_h= 3612.71676300578
##$TD= 16384
##$TD0= 1
##$TE= 0
##$TE2= 300
##$TE3= 300
##$TEG= 300
##$TL= (0..7)
0 120 120 120 120 120 120 120 
##$TP= (0..7)
150 150 150 150 150 150 150 150 
##$TP07= 0
##$TPNAME0= <>
##$TPNAME1= <>
##$TPNAME2= <>
##$TPNAME3= <>
##$TPNAME4= <>
##$TPNAME5= <>
##$TPNAME6= <>
##$TPNAME7= <>
##$TPOAL= (0..7)
0.5 0.5 0.5 0.5 0.5 0.5 0.5 0.5 
##$TPOFFS= (0..7)
0 0 0 0 0 0 0 0 
##$TUNHIN= 0
##$TUNHOUT= 0
##$TUNXOUT= 0
##$USERA1= <user>
##$USERA2= <user>
##$USERA3= <user>
##$USERA4= <user>
##$USERA5= <user>
##$V9= 5
##$VALIST= <valist>
##$VCLIST= <CCCCCCCCCCCCCCC>
##$VD= 0
##$VDLIST= <DDDDDDDDDDDDDDD>
##$VPLIST= <PPPPPPPPPPPPPPP>
##$VTLIST= <TTTTTTTTTTTTTTT>
##$WBST= 1024
##$WBSW= 4
##$XGAIN= (0..3)
0 0 0 0 
##$XL= 0
##$YL= 0
##$YMAX_a= 244400
##$YMIN_a= -310892
##$ZGOPTNS= <>
##$ZL1= 120
##$ZL2= 120
##$ZL3= 120
##$ZL4= 120
##$ABSF1= 15.74689
##$ABSF2= -2.304959
##$ABSG= 5
##$ABSL= 3
##$ALPHA= 0
##$AQORDER= 0
##$ASSFAC= 0
##$ASSFACI= 0
##$ASSFACX= 0
##$ASSWID= 0
##$AUNMP= <proc_1d>
##$AZFE= 0.1
##$AZFW= 0.1
##$BCFW= 0
##$BC_mod= 2
##$BYTORDP= 0
##$COROFFS= 0
##$CY= -3
##$DATMOD= 1
##$DC= 0
##$DFILT= <>
##$DTYPP= 0
##$F1P= 0
##$F2P= 0
##$FCOR= 1
##$FTSIZE= 16384
##$FT_mod= 6
##$GAMMA= 0
##$GB= 0
##$INTBC= 1
##$INTSCL= 3.70164e-10
##$ISEN= 128
##$LB= 0.24
##$LEV0= 0
##$LPBIN= 0
##$MAXI= 10000
##$MC2= 0
##$MEAN= 0
##$ME_mod= 0
##$MI= 1.114404
##$NCOEF= 0
##$NC_proc= -6
##$NLEV= 6
##$NOISF1= 3.799351
##$NOISF2= 2.8
##$NSP= 0
##$NTH_PI= 0
##$NZP= 0
##$OFFSET= 15.74028
##$PC= 1
##$PHC0= -18031.42
##$PHC1= 11.80069
##$PH_mod= 1
##$PKNL= yes
##$PPARMOD= 0
##$PSCAL= 0
##$PSIGN= 0
##$REVERSE= no
##$SF= 200.130006255247
##$SI= 16384
##$SIGF1= 3
##$SIGF2= 2
##$SINO= 5.538805
##$SIOLD= 16384
##$SREGLST= <1H.CDCl3>
##$SSB= 0
##$STSI= 16384
##$STSR= 0
##$SW_p= 3612.71676300578
##$SYMM= 0
##$S_DEV= 0
##$TDeff= 16384
##$TDoff= 0
##$TI= <>
##$TILT= no
##$TM1= 0
##$TM2= 0
##$TOPLEV= 0
##$USERP1= <user>
##$USERP2= <user>
##$USERP3= <user>
##$USERP4= <user>
##$USERP5= <user>
##$WDW= 1
##$XDIM= 16384
##$YMAX_p= 507831995
##$YMIN_p= -543310
$$ End of Bruker specific parameters
$$ ---------------------------------
##NTUPLES= NMR SPECTRUM
##VAR_NAME=  FREQUENCY,     SPECTRUM/REAL,   SPECTRUM/IMAG
##SYMBOL=    X,             R,               I
##VAR_TYPE=  INDEPENDENT,   DEPENDENT,       DEPENDENT
##VAR_FORM=  AFFN,          ASDF,            ASDF
##VAR_DIM=   16384,         16384,           16384
##UNITS=     HZ,            ARBITRARY UNITS, ARBITRARY UNITS
##FACTOR=    0.220516191357247, 1,           1
##FIRST=     3150.10236515246, 0,            0
##LAST=      -462.614397853325, 0,           0
##MIN=       -462.614397853325, -543310,     0
##MAX=       3150.10236515246, 507831995,    0
$$ Real data points
##PAGE= N=1
##DATA TABLE= (X++(R..R)), XYDATA
$$ [...]
7122A616686O095J73630P1389K0902J13335L1917j31566r0640J0728K37208J97801
7111B257485J30342J12477O5263P4750J97219R7718m3J94043J93394J48082Q6920
7100C557650N1218K80187J97097J43920K2136K05858L52278L15089K17661L18319
7090E661413L06351N30768M38129M21856O79202N51570N85649P30747J003932
7081A0909617R14522J141147J408528J554985K215496K496463L471965M135922
7073B8248645N102957N881752N909365N013254K075209j485240m591165o619548
7065C9535229o809152n841546m721836l520759k576469k022054j588604j401200
7057A1053609j126454p73456r14405o02591o38651m17877m46017m03899k46234
$$ y = [1616686, 1622781, 1796411, 1867800, 1888702, 2002037, 2033954, 1902388, 1811748, 1822476, 2059684, 2257485, 2387827, 2500304, 2565567, 2640317, 2837536, 2935254, 2935211, 3129254, 3322648, 3470730, 3557650, 3608868, 3889055, 4086152, 4230072, 4252208, 4458066, 4810344, 5125433, 5343094, 5661413, 5967764, 6498532, 6936661, 7358517, 8037719, 8589289, 9174938, 9905685, 10909617, 11824139, 12965286, 14373814, 15928799, 18144295, 20640758, 24112723, 28248645, 33351602, 39233354, 45142719, 50155973, 52231182, 50745942, 46154777, 39535229, 32726077, 26884531, 22162695, 18641936, 16065467, 14043413, 12454809, 11053609, 9927155, 9153699, 8239294, 7636703, 6998052, 6580175, 6134158, 5730259, 5484025]
7048E484025k72455k73406j06193l40228l88362j21104k16835k74927j82450M2225
7038C350290k86678j86680j49983o7074L7919q9344k05894n1434j50605j09057
7028B091460j0899j83435r1421J07376j60265k87270n6782n4338J14319p0521
7018A398224m1259n8032j37915p2110J95462p1056P0969L5570p7765j05160P1804
7007A208732j46742L4273m3106j28206m983O0979J67764j87923j81137R4498P2530
6996I46679l4575q3962r1617n5827L709q1692K3407O1549R2730q7759r7722j44925
6984D49995L0275K46661j77990N9277r1969N6212q5671j31132r0295p1423p776
6973A86164M3265o1766k0674N9143q648K2289N1415m9762J22386o8425M6848j1586
$$ y = [5484025, 5211570, 4938164, 4831971, 4491743, 4103381, 3982277, 3765442, 3490515, 3308065, 3350290, 3063612, 2876932, 2726949, 2659875, 2697794, 2608450, 2402556, 2351122, 2200517, 2091460, 2080561, 1897126, 1805705, 1913081, 1752816, 1465546, 1408764, 1354426, 1468745, 1398224, 1356965, 1298933, 1161018, 1088908, 1284370, 1213314, 1284283, 1319853, 1242088, 1136928, 1208732, 1061990, 1096263, 1053157, 924951, 919968, 980947, 1148711, 960788, 779651, 874149, 946679, 912104, 828142, 736525, 680698, 684407, 602715, 626122, 687671, 780401, 692642, 594920, 449995, 480270, 726931, 548941, 608218, 516249, 572461, 486790, 355658, 265363, 193940, 186164, 229429, 167663, 146989, 206132, 197484, 219773, 271188, 221426, 343812, 275387, 322235, 310649]
6961C10649p6321J75922L4204J3789j96240J2916j7384m9604P6489o9767q9919
6950A24734K7570j8011J11483k1002k9393k029J7996j02243J4490P7926P1516
6939B73037J09843m1138j24828r0281N7246P7394j6554k6112Q7922j7851m9856
6928B38822j45444O8047j1573n718m7691j18175J65153P7820N55j63972J02319
6917A60143P5366k1912Q9908R0873J5720k08984j48961j36279J56484J77668M2567
6906B92593k09255p105J28206k3835L1241p2940L7381l5476l6904P8793K2217
6895B04916O1847n1062N6043M1679m0484j26744J75504K09332j18827k03846j61029
6884D7329M9381P8672K55643j8980o364J57314n3539Q3403k349j72035J81618
$$ y = [310649, 234328, 410250, 444454, 458243, 262003, 274919, 257535, 207931, 284420, 214653, 124734, 152304, 134293, 245776, 224774, 195381, 193352, 211348, 109105, 123595, 201521, 273037, 382880, 341742, 216914, 126633, 183879, 261273, 244719, 218607, 306529, 288678, 238822, 93378, 161425, 149852, 144134, 96443, -21732, 143421, 221241, 221796, 57824, 160143, 235509, 213597, 303505, 394378, 410098, 201114, 52153, -84126, 72358, 250026, 292593, 83338, 76233, 204439, 180604, 211845, 138905, 176286, 140810, 103906, 182699, 204916, 266763, 215701, 271744, 313423, 272939, 146195, 321699, 531031, 412204, 208358, 47329, 96710, 175382, 431025, 412045, 405681, 562995, 509456, 592859, 590510, 418475, 600093]
6873F00093m162M9932L244K1427J30410L9439P6042n0978p298Q7936n945O593
6861I46733m8269j27127j20130m2053m5217j07138Q5302K7111Q4120R0842j3179
6850G30995n9342k54542j58216P5144k2806P8890q8293j55791K2184R4425m5021
6839B17627p9119R4588J11061L2271q6512j14984K551K1153L536K7164j47967
6828H1369j18846M5396R9515J72751j46033j28416q5720j91707K10617K82762
6818B21688j14023n3904r2691R2065j36126P0251J00165j94797L5838J51403Q5353
6807A65222j06372p3217k8923K4276m2556N8372M6569J4291j16321M1031Q1733
6796F4105r1540N2474j27134l5676L4076m3666J60060O706l5686P2008k20648
$$ y = [600093, 595931, 645863, 649107, 670534, 800944, 840383, 916425, 865447, 858149, 946085, 940140, 946733, 898464, 771337, 651207, 609154, 563937, 456799, 542101, 569212, 653332, 744174, 730995, 671653, 417111, 258895, 334039, 311233, 390123, 301830, 146039, 168223, 262648, 217627, 138508, 233096, 344157, 376428, 289916, 174932, 177483, 198636, 202172, 229336, 81369, -37477, 7919, 107434, 280185, 134152, 5736, -79984, -271691, -61074, 221688, 107665, 53761, -38930, 53135, -82991, -12740, 87425, -107372, -71534, 79869, 165222, 58850, -14367, -43290, -19014, -61570, -3198, 43371, 57662, -58659, -17628, 64105, -27435, 25039, -102095, -137771, -103695, -147361, 12699, 19405, -16281, 55727, -164921]
6785a64921K0008J43130J61200o7423L3272o9855K13327J3896k77768n1435L0874
6774a5695R7438n3797M2115r5082P128q0965J51358o4535K0836J13837j08985
6763A3653j42918k5390K9203j5119Q407J63859r3476j4983J20043N365m915M4405
6751H8134p4200J72366j00383j17102J20345K46698k55573j50660k4799j223l285
6740i9682m7910L2435K0554J08809j00844M1697J13961K228L4390j82785p2491
6729a49638k7931O3131O8160N3476M0811O9910Q773l06226p5428M7290J56537
6718e1135J23936j9000l9060m9733p2764K03942l7143J2643j06196J3765n9387
6707h0132M8096R0074m4859j3613Q291j0476o1251J11976O8740K010M46k57534
$$ y = [-164921, -144913, -1783, 159417, 91994, 125266, 55411, 268738, 282634, 4866, -46569, -15695, 81743, 27946, 70061, -25021, -17893, -98858, 52500, -12035, 8801, 122638, 13653, -129265, -154655, -125452, -140571, -132164, 31695, -61781, -76764, 43279, 48644, 43729, 88134, 13934, 186300, 85917, -31185, 89160, 335858, 80285, -70375, -95174, -96397, -99682, -147592, -115157, -94603, 14206, -86638, -44941, 69020, 71248, 105638, -77147, -149638, -177569, -114438, -46278, 7198, 48009, 117919, 126692, -179534, -254962, -207672, -51135, 72801, 53801, 14741, -34992, -107756, 96186, 59043, 71686, -34510, -20745, -80132, -32036, 58038, 13179, -434, 7857, -2619, -63870, 48106, 116846, 118856, 119302, -138232]
6695a38232p1314J69934K12581j32779j64127J16028M9832J07459R3173j15614
6685A26941O4270p876l08241K0981Q4500N5302K17389j26959r1082L4481j18604
6674d8898J23488J09130J25807J51069j40918n7465P2236m0809O0124j30877j8698
6663B04189n4120j5697J1451q5951q6860N2132K09195m9260j55934j57558J1291
6652a17122k4844L7763P4943m9450Q9184k4898o0656K08892j0952j42968J83285
6641A63177j25609P3J27467k05854N0872K3086m9329O3389J06899m0620j0592
6630A02959n2611j25500P686Q9051m0022R4836n7997j35058R6716K2654p2216
6619f9502j03814l6038O8081K5014k3215K9263P426k7956m9231J04903j6655N0467
$$ y = [-138232, -209546, -39612, 172969, 40190, -123937, -7909, 41923, 149382, 242555, 126941, 191211, 183335, -124906, -103925, -19425, 35877, 253266, 126307, 35225, 69706, -48898, 74590, 183720, 309527, 460596, 319678, 262213, 334449, 293640, 353764, 222887, 204189, 150069, 134372, 145823, 59872, -26988, 25144, 234339, 185079, 29145, -128413, -117122, -141966, -104203, -29260, -78710, 10474, -14424, -75080, 133812, 122860, -20108, 163177, 37568, 37641, 165108, -40746, 10126, 33212, -16117, 47272, 154171, 113551, 102959, 50348, -75152, -67466, 21585, -18437, 76399, 18402, -116656, -19940, 2714, -69502, -173316, -209354, -141273, -116259, -139474, -110211, -102785, -130741, -179972, -75069, -91724, -41257]
6607d1257J09297j03954o7680J35694m7510K4508P9298M4380q1208L5422l8449
6596D8541j53512J3334l1793Q1467J21424J3291m6130l4620K8512L0407n8768
6585A2153N325n3856R2431r9424J21783J06676r8458N8263q0423q0361P8917j47943
6573h4917M63l0653k1893K35646M2114j74829r0947l6534N482L7379J10769k2275
6561c0195O6466q8728K0885J43668n3294k1021k7862Q2610n7874K4817m1835j42719
6549a25082k08135K55930J16582R0156L4111k40632P4999P7483L4748j69261q9963
6538a49064K8827N1879J9645P7466l7747j3589Q4886j42326K7623Q771Q9222o974
6526C8619J37427j5605j67975j40750J11944J22770o9208M7302O7255K5926p260
$$ y = [-41257, 68040, -35914, -103594, 32100, -15410, 9098, 88396, 132776, 51568, 86990, 48541, -104971, -91637, -123430, -41963, 79461, 92752, 46622, 12002, 40514, 70921, 12153, 17478, -36378, 56053, -43371, 78412, 185088, 86630, 144893, 64470, -15891, 63026, -84917, -84454, -115107, -137000, 98646, 140760, -34069, -125016, -161550, -156068, -118689, -7920, -30195, 36271, -52457, -31572, 112096, 58802, 37781, 9919, 92529, 34655, 59472, 17637, -125082, -333217, -77287, 39295, 129451, 163562, -77070, -2071, 75412, 110160, -59101, -149064, -120237, -68358, -48713, 28753, -8994, -22583, 62303, -80023, -52400, -43629, 45593, 38619, 176046, 160441, -7534, -148284, -36340, 86430, 17222, 64524, 131779, 157705, 150445]
6515A50445P0835k13162j01866J30733L5351j08157N2137j6338j03822P7709j39741
6504a65876J29574J048q7904J81599j4195k97929P2675M8767j04503J69837M6572
6493b0335J2941n6479L2533L0771P62P4538J08320j03583k02526l7824J25212
6482c5670J58941j17014j52715q4117Q8845j13816R7622J51664J38529N4496k74228
6471h7463O5568J50532n8780O1778N3968o6984j62997N7767p4915o6220J0648
6460a17098N128J38269N7013l4073J09939p780j59945j19076J42944J34116n4815
6449I4622J4164j97234j01994J01048J19233r138o1157O3384n5065o7278J06518
6438G103J92039j143j40077j06863l8485J36146p2266p1750r0990K95336p8067
$$ y = [150445, 221280, 8118, -93748, 36985, 72336, -35821, 16316, -22, -103844, -26135, -165876, -36302, -35254, -123158, 58441, 44246, -253683, -181008, -132241, -236744, -66907, -20335, -7394, -63873, -31340, -569, 193, 74731, 183051, 79468, -123058, -160882, -35670, 123271, 6257, -146458, -230575, -141730, -255546, -157924, -6260, 132269, 186765, -87463, -21895, 128637, 69857, 131635, 185603, 118619, -44378, 13389, -61526, -127746, -117098, -111970, 26299, 83312, 49239, 159178, 151398, -8547, -127623, 15321, 149437, 94622, 108786, -88448, -190442, -89394, 29839, 20701, -40456, 22928, -32137, -99415, 7103, 199142, 197999, 57922, -48941, -87426, 48720, -23546, -95296, -186286, 109050, 30983]
6427C0983p7119R4308M22k1310Q2258n0899j6327O8431N0873m2196n2836j58746
6415i2158N4649M888k9319O3460p919N7583J41693j19080j42250j6269M4107l8753
6403g9368L0939O9722Q6676k0570m2539N6716L0046q8024j7236J30100q422J13610
6391B61650n0557p6296k13146l7172J05427L6875R2411L5135j66677j26262M1746
6380i6866K8328l9057J66748j61626Q0545q145J81655j38069o3048L072L8219
6369h244j2469j18406J15493m2167M3013r686R2092R2431j6569l1241Q8006r0424
6357A01829k7685m45K24837k50660K6672m039J04203P8599K2595j63670p0158
6346D2078J57150q7620J4211l451J42790j54345p3523J659K4736j3986j15267
$$ y = [30983, -46136, 48172, 48594, 27284, 109542, 58643, 42316, 110747, 161620, 119424, 66588, -92158, -37509, -32621, -61940, 1520, -6399, 51184, 192877, 73797, -68453, -84722, -40615, -79368, -48429, 21293, 107969, 87399, 44860, 101576, 131622, 43598, 26362, 156462, 148040, 261650, 211093, 134797, -78349, -115521, -10094, 26781, 119192, 154327, -12350, -138612, -96866, -68538, -107595, 59153, -102473, -21928, -30073, 151582, 13513, -49535, -46463, -8244, -20713, -139119, -23626, -65793, -22780, -32466, 59626, 152057, 135488, 104247, 192253, 101829, 74144, 73699, 298536, 47876, 74548, 70509, 174712, 253311, 275906, 112236, 42078, 199228, 111608, 125819, 122368, 265158, 110813, 37290, 38949, 63685, 49699, -65568]
6335f5568J13722Q3696n187j7522j32580K4801n6555R5929q339P1658j37845J66626
6323A32836J21203j93621J17005r0272l2143j31054m4760J37142J60892K161j03456
6312G5933K9058p7268R0063o3652p8257O8365O0279J0979q5323Q137O6004L3934
6300A38252p2579J39387l9508j16822J10515J3244j30330k1026J18615L7633k6968
6289A50413J622j42673K9803Q2610k3836N1456K4235J02295m5330o5624P7244
6278B42215j04833j00624P5752p5463L9985Q8723J0991n7553J6507r494J38873
6267B65079j00752j47924R9107K5966q3122r252J5048P6919l5825j13699j0751
6256a9206m6058k2423J96687J30351j93628k017j5130J12715J01201J20234j07989
$$ y = [-65568, 48154, 131850, 126663, 109141, -23439, 1362, -55193, 40736, 32397, 104055, -33790, 132836, 254039, 60418, 177423, 87151, 55008, -76046, -120806, 16336, 177228, 179389, 75933, 104991, 27723, 117786, 54134, -24123, 44242, 104521, 115500, 30177, 38314, 104318, 138252, 65673, 205060, 165552, 48730, 159245, 172489, 42159, 21133, 139748, 177381, 150413, 152035, 9362, 39165, 121775, 97939, 149395, 173630, 275925, 230595, 164971, 242215, 137382, 36758, 112510, 37047, 77032, 165755, 176746, 119193, 135700, 126206, 265079, 164327, 16403, 115510, 141476, 58354, 49102, 64150, 141069, 105244, -8455, -19206, -65264, -87687, 109000, 239351, 45723, 43706, 28576, 141291, 242492, 362726, 254737]
6245B54737j50890Q674N7639m440J22956m267j98270l0928R239J34140J49814
6234C48404j11450L804n9873R171K10484r8398J266k42984J9499O6720K0095P6694
6222B43432L0544N5248N3583J08473R0023j1994n2630j49357M7870R2328P7761
6211E85281p5254m8406M1066n600Q036n7972J16091Q4704j17077J9850L3533q8044
6199D96208J6384R1114q647o3071l1853k6703O3675p704o1600O2026J43419P0629
6187G43877k4041j20525J14713m8044M4719j99414L5942J32314p48L8807j4330
6176G03270R4093q7071N666Q2156J73062J38082m5777K5013O9699M4486j77080
6165A025599J87j31234J45452J98195P6036O4598j9638j18147N2792J9191P3419
$$ y = [254737, 103847, 112521, 170160, 165720, 288676, 284409, 86139, 55211, 64450, 198590, 348404, 236954, 240758, 180885, 190056, 400540, 302142, 303408, 60424, 79923, 146643, 166738, 243432, 273976, 329224, 382807, 491280, 581303, 569309, 516679, 367322, 415192, 507520, 585281, 510027, 461621, 502687, 497087, 505123, 447151, 563242, 647946, 530869, 550719, 584252, 496208, 512592, 603706, 595059, 531988, 500135, 473432, 537107, 529403, 467803, 529829, 673248, 743877, 719836, 599311, 714024, 665980, 710699, 511285, 547227, 679541, 678793, 717600, 703270, 797363, 710292, 715958, 798114, 971176, 1109258, 1063481, 1088494, 1158193, 1202679, 1025599, 1025786, 894552, 1040004, 1238199, 1314235, 1378833, 1359195, 1241048, 1293840, 1313031, 1386450]
6154A386450J39030J4535r0888p4255m3933j88393n1472j46917J16535P2388J11822
6143A244902M1357k7040k9482p8449J8846N1097J73290O9412K0976Q716Q1860
6132A575485J4566L3522J04054Q9162L83390K13005P466J68709J1954j30588l1634
6121B439091k4742J16358j06013k27185p775j33966j99794j48751k6709J67217
6111A847731o8507j2715K26609J53851J55396j7567M0097K3960n8052q8633R3767
6100B295937p8329J86444K49825N1607N3165J45510J05346M7775J48035j28477
6090C076838j82232k11112q0972J13510J26845K003N0973J32698K40626l9135
6080C230042K09563L83372K09955n4008j36536K4696j99188k58296l51782j15146
$$ y = [1386450, 1525480, 1540015, 1449127, 1374872, 1330939, 1142546, 1091074, 944157, 1060692, 1133080, 1244902, 1286259, 1259219, 1229737, 1151288, 1170134, 1221231, 1394521, 1463933, 1484909, 1493625, 1575485, 1590051, 1623573, 1727627, 1816789, 2200179, 2413184, 2420650, 2589359, 2601313, 2470725, 2439091, 2414349, 2530707, 2424694, 2197509, 2189734, 2055768, 1855974, 1707223, 1680514, 1847731, 1779224, 1766509, 1993118, 2146969, 2302365, 2284798, 2324895, 2348855, 2290803, 2202170, 2295937, 2217608, 2404052, 2653877, 2705484, 2758649, 2904159, 3009505, 3057280, 3205315, 3076838, 2894606, 2683494, 2602522, 2716032, 2842877, 2844880, 2895853, 3028551, 3269177, 3230042, 3439605, 3822977, 4032932, 3978924, 3842388, 3867084, 3667896, 3409600, 3057818, 2942672]
6070B942672R2771j54244J45062p3004N4764Q7876J52722J28037r6899O2038J48920
6059C490715O3376j57722J33780K25543R1085J15069L63876N07040K20750N19895
6049E573407M40133P59697Q96715Q97549N84031q2270q74159j083786q18169o55553
6039E637595m09745m79494m38479l14662k6274o3649j30477j46030j8001J42480
6029C753264N8344J24558M1076J45324K17561m7423K15053J13146J38420M79763
6019E239086K45208L28115P44347N94996O82468R73699N64661J43732m73121q98360
6009H144831r94962p73738p38530n30115l11984l24949l28737j98698r1897j96199
5999C655022j30562k702J32395r1554J9229l0496J65471J84023K2003N6550j43581
$$ y = [2942672, 3035443, 2881199, 3026261, 2953257, 3008021, 3095897, 3248619, 3376656, 3279757, 3341795, 3490715, 3554091, 3396369, 3530149, 3755692, 3846777, 3961846, 4325722, 4832762, 5053512, 5573407, 6013540, 6773237, 7669952, 8567501, 9151532, 9069262, 8195103, 7111317, 6293148, 5637595, 5227850, 4748356, 4309877, 3995215, 3968941, 3905292, 3774815, 3628785, 3610784, 3753264, 3811608, 3936166, 3977242, 4122566, 4340127, 4292704, 4507757, 4620903, 4759323, 5239086, 5484294, 5812409, 6556756, 7151752, 7834220, 8807919, 9372580, 9516312, 9043191, 8144831, 7149869, 6376131, 5637601, 5107486, 4795502, 4470553, 4141816, 3943118, 3851221, 3655022, 3524460, 3521758, 3654153, 3562599, 3581828, 3551332, 3716803, 3900826, 3922829, 3979379, 3835798]
5988C835798K23435K48555J30515O3173J64102L10460J95494K46019r0992j5171
5978E311388k53430l93344l49158j82028l9583M241k59282P732k4692k69377j06724
5967C445743J1531j47148J22446j2770j06137J89558o1336Q9241l4864J66171
5957C662435J34879n2294Q9705j09103K9841K20629M6651j10959K33338P3733
5947D218855K33592M0046J00555K10252J15629O8797j26458m5112R987n8887r2275
5936D674981j12219O2791N1835P4408K71586K5943K13606K57438Q5505J91740
5926E797614L29846J88473k0737L23811K31388K01859L23950K16479M09894M02409
5916H404986P02663O60048O38365R02131J038225J349029J338865J340903J656587
$$ y = [3835798, 4059233, 4307788, 4438303, 4501476, 4665578, 4976038, 5171532, 5417551, 5326559, 5311388, 5057958, 4664614, 4315456, 4133428, 4093845, 4098086, 3838804, 3846536, 3821844, 3552467, 3445743, 3457274, 3310126, 3432572, 3419802, 3313665, 3503223, 3441887, 3531128, 3496264, 3662435, 3797314, 3745020, 3834725, 3725622, 3755463, 3976092, 4022743, 3911784, 4145122, 4218855, 4452447, 4492493, 4593048, 4803300, 4918929, 4987726, 4861268, 4816156, 4826143, 4767256, 4674981, 4562762, 4625553, 4677388, 4751796, 5023382, 5049325, 5262931, 5520369, 5605874, 5797614, 6127460, 6315933, 6295196, 6619007, 6850395, 7052254, 7376204, 7592683, 8002577, 8404986, 9107649, 9767697, 10406062, 11308193, 12346418, 13695447, 15034312, 16375215, 18031802]
5907A8031802J319659L46148o91135j375057j338912j610061j096459q06477o39797
5898A2139711k62586l51863j19691m7897O1567R7397L10431K55109L51277L76437
5888A2809892O30985P92664P71415Q50392J244807J357164J665115J955432K664824
5879B4742690L385845M062942M681693M546456L593184J306248k495838n363529
5871C8459691n556556m519285l448406k639815k095649j566398j093646q79726
5863A6660210o86146m07130m44576k82338J11510K12801J46246K25849L56875
5854A5893301P07128Q34792J006191J218963J583344K003978K386149L309092
5846B8942938M058356M453229M521254L523566J196365k956403n806613o014999
$$ y = [18031802, 19351461, 19697609, 19006474, 17631417, 16292505, 14682444, 13585985, 12779508, 12139711, 11877125, 11525262, 11405571, 11357674, 11419241, 11516638, 11827069, 12082178, 12433455, 12809892, 13440877, 14233541, 15004956, 15855348, 17100155, 18457319, 20122434, 22077866, 24742690, 28128535, 32191477, 36873170, 41419626, 45012810, 46319058, 43823220, 38459691, 32903135, 28383850, 24935444, 22295629, 20199980, 18633582, 17539936, 16660210, 15974064, 15566934, 15122358, 14840020, 14951530, 15164331, 15310577, 15536426, 15893301, 16600429, 17435221, 18441412, 19660375, 21243719, 23247697, 25633846, 28942938, 33001294, 37454523, 41975777, 45499343, 46695708, 43739305, 37932692, 31917693]
5838C1917693m810823l727185k924869k065851j925508j377527j254510q32076
5830A2999344p73360o23266m76684l24426j76407k74174j46254J45585k3379Q5982
5820A0412961L18099K93158L04821O01519Q38742R35833J235388J210270J206663
5811A7357454Q83251N2788j201871j903692k058096j656491j531872j072902q09246
5802H059323o72572m32798n93699o45715k27009j94652j56879l15729l56088j44086
5792D320096j79866m9961k18928j11039j77819k20924q713J40946q6341k19854
5782C187597q740k770j47948j97334l8842j51436O372P2870q0614N652j98722
5771B446085j86172Q0352m1237k39299P6303j19423p1485j29041j97164L9657
$$ y = [31917693, 27106870, 23379685, 20454816, 18388965, 16463457, 15085930, 13831420, 12999344, 12225984, 11602718, 11126034, 10801608, 10625201, 10351027, 10204773, 10350358, 10326979, 10412961, 10731060, 11024218, 11329039, 11930558, 12769300, 13705133, 14940521, 16150791, 17357454, 18240705, 18293493, 17091622, 15187930, 13129834, 11473343, 9941471, 8868569, 8059323, 7386751, 6953953, 6360254, 5714539, 5487530, 5292878, 5135999, 4820270, 4464182, 4320096, 4140230, 4090269, 3871341, 3760302, 3582483, 3361559, 3352846, 3493792, 3407451, 3187597, 3178857, 3176087, 3028139, 2830805, 2791963, 2640527, 2646899, 2719769, 2639155, 2644807, 2446085, 2259913, 2340265, 2299028, 2059729, 2136032, 2016609, 1945124, 1816083, 1618919, 1658576]
5761A658576J5097J3074L4820j06900n9694N7862k53984J4001q1800p0433J91670
5750A412289n6660K060j00470K4578m4J23597J05909o0611J8630p04p147j33933
5738A327494j60733j05910j585k961j88976J16962Q3113j34980k6111K41470k11170
5727I36613p8153J3091m5185n962J43945k5782k22369P9124o3487l9479M5951
5716G38307R385J00840p4689j7879K4308j26547J40059Q4586o9014q2615l8580
5705F88161p9393L2462J04862p5141p0708L2497Q5580l9431q139M7936Q407j10161
5693F16932n421j1362q0298N7924j00511Q9383K7232K9974Q1456M8798n3359j4698
5681F86050o8327q1314P7565Q3222J2369j1277L7360m8326P2789O1146M9990P4906
$$ y = [1658576, 1673673, 1686747, 1721567, 1614667, 1554973, 1612835, 1358851, 1372852, 1291052, 1220619, 1412289, 1355629, 1357689, 1257219, 1281797, 1281753, 1405350, 1511259, 1450648, 1469278, 1468574, 1461427, 1327494, 1166761, 1060851, 1059266, 1056305, 867329, 984291, 1067404, 932424, 906313, 1147783, 936613, 858460, 871551, 826366, 820404, 964349, 938567, 716198, 795322, 731835, 692356, 738307, 747692, 848532, 773843, 755964, 780272, 653725, 793784, 878370, 809356, 726741, 688161, 608768, 641230, 746092, 670951, 600243, 632740, 718320, 678889, 670750, 718686, 727093, 616932, 611511, 600149, 519851, 577775, 477264, 566647, 593879, 623853, 705309, 754107, 700748, 686050, 617723, 536409, 613974, 697196, 709565, 698288, 735648, 687322, 760111, 821257, 871247, 946153]
5669I46153j15339N8547j64655j02910o6607K25O8310M7800j5946j66094J21225
5658F10709R0410j20127M7197J8248l0334K2922k42946P980j8074J38150K25249
5647G49384o4843n6220k1723m3533n9366m3046Q3211r4370p4717P2192J53119
5636F00088j78163j18732Q8521n7532R9280m4705n7508K0059J12603k3267j62635
5625B78009R2178J73022p3946R516M2466j13143j21664P9081m2408L8425R500
5614C71036j9748M1232J5344k666m557J39351M8662n8950j55100j88430J03428
5603B89602P0315m2977J4225K06325O3886j34142J6597N8422m4208M7468j54678
5592C90835q662J19293j66887j9958J04196j38443L11339l7043l1586L3356j89584
$$ y = [946153, 830814, 889361, 724706, 621796, 555189, 555414, 623724, 671524, 655578, 489484, 610709, 701119, 580992, 628189, 646437, 616103, 639025, 396079, 404059, 385985, 524135, 749384, 684541, 628321, 606598, 563065, 503699, 460653, 543864, 449494, 374777, 446969, 600088, 421925, 303193, 391714, 334182, 433462, 388757, 331249, 351308, 463911, 440644, 278009, 370187, 543209, 469263, 478779, 521245, 408102, 286438, 365519, 323111, 361536, 371036, 351288, 392520, 407864, 405198, 400641, 539992, 588654, 529704, 374604, 186174, 289602, 359917, 316940, 331165, 537490, 601376, 467234, 483831, 542253, 498045, 545513, 390835, 382173, 501466, 334579, 314621, 418817, 280374, 591713, 554670, 523084, 556440, 366856]
5581C66856j07830J66794K17233j3315j86324J79199M6061j47838N3721K5323
5571E99880j70796j24834J57178J14647r3017j26167J08185n0139O4915J22805
5561F02657L0355Q4299M3840j76812l870R5661j6196j67806p0369K3378J27797
5550E72934L1188L3657j00337J63276J10843J34482j33859J38704J45314j88676
5540I07526N9626J8304R4076M8570o4020j32235j94286K64932K04657o2786J4307
5529A158671J00903J27231K34314O1083K09951j2704O2417K03383J14614k03337
5519B056526P6344J11699j20521R1757k60158k31180j07419q6789j72206j34849
5509A223204J2993J04731l1430q3461R094j67680p4256J31903O6261j12950p1584
$$ y = [366856, 259026, 425820, 643053, 629738, 443414, 622613, 668674, 520836, 574557, 599880, 429084, 304250, 461428, 576075, 483058, 356891, 465076, 414937, 479852, 602657, 633012, 717311, 761151, 584339, 580469, 676130, 659934, 492128, 421759, 445137, 572934, 604122, 637779, 537442, 700718, 811561, 946043, 812184, 950888, 1096202, 907526, 967152, 985456, 1079532, 1128102, 1064082, 931847, 737561, 1002493, 1207150, 1144364, 1158671, 1259574, 1386805, 1621119, 1682202, 1892153, 1879449, 1941866, 2145249, 2259863, 2056526, 2132870, 2244569, 2124048, 2215805, 1955647, 1724467, 1617048, 1530259, 1358053, 1223204, 1236197, 1340928, 1309498, 1226037, 1235131, 1067451, 993195, 1125098, 1191359, 1078409, 1006825]
5498A006825p6372j79794j10524J70537J24704j18555N4817n1332l0095j54531
5488F35680J22569M3442o729Q9210m3857j09372j30900J36286J00306j14466j3626
5477G08543n7995j84781J59101O4454Q5227r835N1619l5659j44546P5022L8077
5466G49227r170R141O9333j53476k35076J31021K48100k8775j00906O575J65299
5455H51293J8398n4375L8832M1173o2271o0408Q064N8277M8746j22035K0952J12008
5443H98654N1866j06045j87766J36797Q3821L5027O2892m0101Q4138J61831r339
5432A171775p5965P3654K68854j63556j00607o5009k2968j006j46730J13132J57294
5421A208868p9401p1342n69K48816j9406J0650n8999n9368n1884J29954J24735
$$ y = [1006825, 930453, 750659, 640135, 810672, 935376, 816821, 871638, 820306, 790211, 635680, 758249, 801691, 794962, 884172, 840315, 730943, 600043, 736329, 836635, 722169, 708543, 650548, 465767, 624868, 689322, 774549, 764714, 816333, 780674, 636128, 711150, 749227, 740057, 749198, 818531, 665055, 429979, 561000, 809100, 780325, 679419, 685994, 851293, 869691, 815316, 854148, 895321, 833050, 772642, 780706, 838983, 887729, 765694, 786646, 898654, 950520, 844475, 656709, 793506, 877327, 912354, 975246, 935145, 1019283, 1181114, 1171775, 1095810, 1169464, 1438318, 1274762, 1174155, 1109146, 1086178, 1085172, 938442, 1051574, 1208868, 1129467, 1058125, 1057556, 1306372, 1286966, 1297616, 1238617, 1179249, 1127365, 1257319, 1382054]
5410A382054j42120j03865R3525j13196K3075K05728k296J194K280N0623Q6775
5399A483777M5858r9809q2876n5491R1289O8931M3263m9611P3803n8201N3970
5388A514903J5904j49922o3048O3214R1808J81907j82649l3854J45790j3665k8423
5377A541965p5401j6959p5056J7756J908m1557J24154o5086J37223J03699L8703
5366A691349j23708m1481J53849O2596J72831m9610J22032q7084j46316Q6472
5356A840930l1408K8366Q8240r3897p0038m047J7520K24567P9345p4112K14667
5345B220133J417N5127N9480q0116n9452J49098J06026N5589J56055o4470L455
5334B602342K7655n4744M603K34381J35361J16735q2200q6982J35918J54913R2931
$$ y = [1382054, 1239934, 1136069, 1229594, 1116398, 1139473, 1345201, 1342905, 1344099, 1346379, 1397002, 1483777, 1529635, 1429826, 1346950, 1291459, 1382748, 1451679, 1494942, 1445331, 1519134, 1460933, 1514903, 1530807, 1380885, 1317837, 1381051, 1472859, 1654766, 1472117, 1438263, 1584053, 1570388, 1541965, 1466564, 1449605, 1374549, 1392305, 1394213, 1352656, 1476810, 1411724, 1548947, 1652646, 1691349, 1567641, 1526160, 1680009, 1742605, 1915436, 1865826, 1987858, 1900774, 1754458, 1840930, 1809522, 1837888, 1926128, 1832231, 1762193, 1758146, 1775666, 2000233, 2079578, 2005466, 2220133, 2221550, 2276677, 2336157, 2256041, 2196589, 2345687, 2451713, 2507302, 2663357, 2598887, 2602342, 2629997, 2575253, 2579856, 2814237, 2949598, 3066333, 2984133, 2897151, 3033069, 3187982, 3280913]
5323C280913J64862M4128K4430J1207M3505K86851M6217j9675J29393N4808J08185
5312D174824L27271K5267R3947J69655K755J23182J59250N2937M5612K4714J81180
5301E380594K59891J73838J71229K85738K17906L24269K86791L04285J76113K56646
5291G837300J23119J70764k1319Q2498K16883J36220J09246k3353L00063J08770
5281I040191M20473L99247M21910K22205L63804L11311M37842M11648L45120N49238
5271A2922989M67429M07995N55325M56603M16018M36060M34710N67782N94758
5262A7259669N35368O30056N51503O96038P58549P03709Q59643J038592Q89609
5253B3922736R88655R60074J203043J197720J291918J363373J363163J509061
$$ y = [3280913, 3445775, 3489903, 3514333, 3525540, 3569045, 3855896, 3902113, 3882438, 4011831, 4066639, 4174824, 4502095, 4527362, 4621309, 4790964, 4793719, 4916901, 5076151, 5129088, 5174700, 5199414, 5380594, 5640485, 5814323, 5985552, 6271290, 6489196, 6813465, 7100256, 7404541, 7580654, 7837300, 7960419, 8131183, 8109864, 8192362, 8409245, 8545465, 8654711, 8631358, 8931421, 9040191, 9460664, 9859911, 10281821, 10504026, 10867830, 11179141, 11616983, 12028631, 12373751, 12922989, 13390418, 13798413, 14353738, 14810341, 15226359, 15662419, 16097129, 16664911, 17259669, 17795037, 18425093, 18976596, 19672634, 20431183, 21134892, 21994535, 23033127, 23922736, 24911391, 25871465, 27074508, 28272228, 29564146, 30927519, 32290682, 33799743]
5245C3799743J504192J737983J966359K255978K428349K648412K874151L665722
5237E2880889L968768M387591N023624N468703O359418P106858Q299574R816043
5229A03311468J1747923J4237600J7183611K0363546K3905208K6537314K6673522
5222B43960192K5145759K2076934J4547300K414228n921303j2317994k2028615
5215B67876501k8591471k9077866k7929548k5556347k1976671j7878357j4645175
5208A02221066j1714042r383380p821359o680327n633452m747168m078388l531620
5200D8631330l318681k580076k471112k253118j976359j709175j755094j749025
5192C0818690j513112j474977r54383j093761j219491j130350r11592r90924q94232
$$ y = [33799743, 35303935, 37041918, 39008277, 41264255, 43692604, 46341016, 49215167, 52880889, 56849657, 61237248, 66260872, 71729575, 78088993, 85195851, 93495425, 103311468, 115059391, 129296991, 146480602, 166844148, 190749356, 217286670, 243960192, 269105951, 291182885, 305730185, 308144413, 302223110, 289905116, 267876501, 239285030, 210207164, 182277616, 156721269, 134744598, 116866241, 102221066, 90507024, 81123644, 73302285, 66621958, 60988506, 56241338, 52162950, 48631330, 45312649, 42732573, 40261461, 38008343, 36031984, 34322809, 32567715, 30818690, 29305578, 27830601, 26876218, 25782457, 24562966, 23432616, 22521024, 21530100, 20635868]
5183B0635868q83946p21147o07994o58072p84821o78320n56637l90486o89269
5174A4665176m95046m17888m46729k56592m05798l34336m05867k41402k26839
5165A1434679j85428k92684k31820k61288r3665k44698j72671k65651k13267j52669
5155I320838l90822o6489k83932k96688q086k97760k88320l19454j91777j44350
5145G033160j88030k47148j89159k64025j83735k67092l02475k37567J7193j13265
5135E057857l2508q2222k07952q4576j38621j81530p3171N5482P4087q7224l40553
5124C959069o2649k22813j24385J07295M0948j08966J50579k84949j01791Q3675
5114C436013J1952N3033j99534j78637k3612K2842m1876j36060q8318p937o1096
$$ y = [20635868, 19751922, 19030775, 18422781, 17764709, 16979888, 16301568, 15744931, 15354445, 14665176, 14170130, 13752242, 13305513, 13048921, 12643123, 12308787, 11902920, 11661518, 11434679, 11249251, 10956567, 10724747, 10463459, 10369794, 10125096, 9952425, 9686774, 9473507, 9320838, 8930016, 8863527, 8579595, 8282907, 8274821, 7977061, 7688741, 7369287, 7177510, 7033160, 6845130, 6597982, 6408823, 6144798, 5961063, 5693971, 5391496, 5153929, 5171122, 5057857, 5025349, 4943127, 4735175, 4650599, 4511978, 4330448, 4257277, 4312759, 4386846, 4299622, 3959069, 3896420, 3673607, 3549222, 3656517, 3697465, 3588499, 3739078, 3454129, 3352338, 3436013, 3447965, 3500998, 3301464, 3122827, 3099215, 3122057, 3080181, 2944121, 2855803, 2847866, 2786770]
5103B786770n5544n5255o4501J5729j57137m6688K1240P3133r0652o2275j7470
5092B347350j66819J00682Q5042j9659k64703j40490J91518K8955l8187o8712
5082B054977n9683K3956j62114k9606q8691j72634K36353Q7483j0647P1462p7737
5071A873119p056j75811n8914m2681J00846O4892k11558r9366q0889J2380M5269
5060A420231O3466q0090O3806p1658o1233L2575k06270K4996p4306M6738o8561
5049A089694j8289m8605J3975m7078N6886q3487q9569l0968J37657J88364j21080
5038A047500j25147j15058J591L5114P2231R1859j31876n4022l4859J12535l0852
5027H69016J5924J71270p3288q7867N7189l560j07805j33253Q8555L6452j32966
$$ y = [2786770, 2731226, 2675971, 2611470, 2627199, 2470062, 2423374, 2444614, 2517747, 2427095, 2364820, 2347350, 2180531, 2281213, 2366255, 2346596, 2081893, 1941403, 2132921, 2161876, 2123689, 2054977, 1995294, 2019250, 1857136, 1827530, 1738839, 1566205, 1802558, 1890041, 1879394, 1950856, 1873119, 1866063, 1690252, 1631338, 1588657, 1689503, 1754395, 1542837, 1443471, 1362582, 1374962, 1420231, 1483697, 1403607, 1467413, 1395755, 1334522, 1367097, 1160827, 1185823, 1111517, 1158255, 1089694, 1071405, 1022800, 1036775, 989697, 1046583, 963096, 873527, 842559, 980216, 1168580, 1047500, 922353, 807295, 808886, 844000, 916231, 1008090, 876214, 822192, 787333, 899868, 869016, 884940, 1056210, 982922, 895055, 952244, 948684, 840879, 707626, 796181, 832633, 699667]
5016F99667J17370n1144n4599R0408o2953M7960k5644j17486m144J86422k1493
5005H04364J61077N3246j85711R3734L9127p5476j1042J45972m4846j85534J3789
4994H08700j71350j03045K92505M1510k09668q1889Q5928m1040p0254J95331K7058
4983G73786O8074L6392r5407j9653m7267P7262L1482j12647q6112M5953Q6162
4972G58025j1574k22677J52587Q2838J15344j97913j92311Q7398J08285k6668
4962F53334M4348Q0188L2677k80606P9645L866m4272p3437O5068Q6518J5235O3168
4950G25732j5012j33800Q1003L9489j2123J2545O6453J0545J20641j18424M957
4939G82006j0267j02003J99830m7247o0288k1561N2822L636J16386P3065k3467
$$ y = [699667, 817037, 765893, 711294, 801702, 738749, 786709, 761065, 643579, 639435, 825857, 804364, 965441, 1018687, 832976, 926710, 965837, 890361, 879319, 1025291, 980445, 794911, 808700, 637350, 534305, 826810, 868320, 658652, 576763, 662691, 621651, 551397, 746728, 773786, 841860, 878252, 782845, 763192, 715925, 793187, 824669, 712022, 625910, 671863, 758025, 746451, 523774, 676361, 759199, 874543, 676630, 484319, 571717, 680002, 653334, 697682, 777870, 810547, 529941, 609586, 613452, 569180, 495743, 560811, 647329, 662564, 725732, 710720, 576920, 657923, 697412, 685289, 697834, 764287, 774832, 895473, 777049, 782006, 771739, 669736, 869566, 822319, 762031, 740470, 793292, 796928, 913314, 986379, 962912]
4928I62912j66749J06484J79336l2383P9647K04364K02454J84272P796P8893R5033
4917A902059J99265J50341j7161m2375j3128L9847j85467k66805k46067j12158
4907A408351j54340k22299q9800R3489j3543j32991J8049j59195n1090J56169
4897H52800j597m9802p0674n0486q125J01678o6699J8085M0242k25247L8931J05984
4885F85090j03232p4485M3400j16823J85748q0503p6240j900J35833j05238O3875
4874E55525P4988m4879q9396o049n0382J22153Q9650Q4402K1551k0573j52995
4863E83995j00135J8919K2614J05732M793M4802l8838R0764j2580J05486m7782
4852G77770L1097K8554O3167P3052P0903Q2447O5200J03615K5946L5461L21746
$$ y = [962912, 796163, 902647, 1081983, 1049600, 1129247, 1333611, 1536065, 1720337, 1728133, 1807026, 1902059, 2101324, 2251665, 2234504, 2192129, 2179001, 2218848, 2033381, 1766576, 1520509, 1408351, 1254011, 1031712, 941912, 1035401, 1021858, 888867, 906916, 747721, 696631, 852800, 851203, 801401, 730727, 680241, 672116, 773794, 707095, 725180, 765422, 540175, 579106, 685090, 581858, 507373, 550773, 433950, 619698, 539195, 462955, 461055, 596888, 491650, 555525, 630513, 585634, 496238, 490189, 439807, 561960, 651610, 736012, 757563, 736990, 583995, 483860, 502779, 525393, 631125, 635918, 680720, 641882, 732646, 720066, 825552, 777770, 808867, 837421, 900588, 973640, 1044543, 1126990, 1192190, 1295805, 1321751, 1357212, 1678958]
4841A678958J75057m3592K41317J58837P3139J36386K38761j97023k69986k77094
4831A914760k61400j32619j01030k00256j71921k09088J3642j37139J95261k00584
4821G09626p3796J42413k82925n3539M8651M1767l6573R6824l2701M2445j14979
4810D87213r580K8387m9650J04007k5162j34427J48520j40752J85168K0901j4033
4799F00592L553k1637M6853J5468q7055k22575n603Q8491k9130J3984p4546Q4384
4787D12779J2998J22526j11900q5289N886j08347J73837L339j17782M7291K1310
4776C76648J17260p6836Q8430J22549o1263o7821j98895j517Q8627O8733K35175
4765F91090l7799k42989M9772M1989M4331J08110j15261j49090q256l0256L1085
$$ y = [1678958, 1854015, 1810423, 2051740, 2210577, 2283716, 2420102, 2658863, 2461840, 2191854, 1914760, 1653360, 1520741, 1419711, 1219455, 1047534, 838446, 852088, 714949, 910210, 709626, 635830, 778243, 495318, 441779, 490430, 532197, 495624, 592448, 559747, 602192, 487213, 477633, 506020, 456370, 560377, 535215, 400788, 549308, 408556, 593724, 614625, 600592, 604145, 582508, 629361, 644829, 557774, 335199, 329596, 418087, 388957, 402941, 328395, 412779, 425777, 548303, 436403, 351114, 357000, 248653, 422490, 425829, 308047, 355338, 376648, 493908, 417072, 505502, 628051, 566788, 498967, 300072, 298555, 387182, 455915, 691090, 653291, 410302, 460074, 502063, 546394, 654504, 539243, 390153, 381897, 351641, 382726]
4754C82726K4335R1981j0242j19042L7184Q2632n4089M0133o2932n293q3221r8725
4742B25447K22481J63382j99234j45795J69733J48845o6905n1844n9794J102L5745
4731D43163O3595L8438m6160n046P7322j82531j47869K09478R5465J4826j35172
4720D25509p8081M4191J03919o7126j576N049M6085L9625j04118P5608L5352l2384
4708D92053m424K7201R6873j03190j93375R1144J6179R3604j427q5708o8407J84966
4696E45489R5556j14030p8801J89188q0097J5433J06519R9608p0101j68607q249
4685E31908m9070o7099L6839K04201q0949j09307J25866M5391j4002K6549p4149
4674E76178R2372k3916q0547k1761J94267j19350k1335M30j18731J4979J935P3359
$$ y = [382726, 407061, 499042, 488800, 369758, 406942, 489574, 435485, 475618, 412686, 407393, 324172, 225447, 447928, 611310, 412076, 266281, 436014, 584859, 517954, 466110, 406316, 407418, 443163, 506758, 545196, 499036, 493990, 571312, 388781, 240912, 450390, 545855, 560681, 425509, 347428, 391619, 495538, 428412, 426836, 431885, 477970, 517595, 413477, 489085, 524437, 492053, 487629, 514830, 611703, 508513, 315138, 406282, 422461, 516065, 514638, 428930, 360523, 545489, 641045, 527015, 448214, 637402, 557305, 572738, 679257, 778865, 708764, 540157, 531908, 482838, 415739, 452578, 656779, 575830, 466523, 592389, 637780, 623778, 650327, 576178, 668550, 644634, 564087, 542326, 736593, 617243, 595908, 596338, 477607, 492586, 494521, 567880]
4662E67880K3425k33665j07623J79356J6186Q4229K9446J64629m8991j60079O3304
4651E78097l9568k3496N4627Q0109M1517m5769p7770p5638l5240q4460O6962J74353
4639F13724M9864q1886j44524k4189Q5483j13497O3482J78205Q594o8186r2113
4628D74957K3415J01390m8534j48749J37953o3980R2473r8575k521p3065J24600
4617E19364N0509j43435M9876p9242J21061m8417J49925j26529J0437K33708q3309
4606F53948M8237j40339r4197l3239M5588l427m3116n1902L5395P2682K8538P5156
4594E93324L8668J19790m6182j88484k6251J05967O4183L9333O3959J8173j04383
4583F78097J1508l4583j45413N5587K39282m9996N5723j51083j04889m0554k2162
$$ y = [567880, 591305, 357640, 250017, 429373, 445559, 529788, 559234, 723863, 674872, 514793, 578097, 538529, 515033, 569660, 649769, 691286, 645517, 567747, 492109, 456869, 372409, 439371, 613724, 663588, 581702, 437178, 412989, 498472, 384975, 448457, 626662, 635256, 567070, 474957, 498372, 599762, 551228, 402479, 540432, 476452, 568925, 470350, 467829, 394764, 519364, 569873, 426438, 476314, 397072, 518133, 469716, 619641, 493112, 503549, 737257, 653948, 702185, 561846, 467649, 434410, 479998, 476571, 433455, 381553, 416948, 489630, 518168, 593324, 631992, 751782, 705600, 517116, 490865, 596832, 661015, 700348, 764307, 782480, 678097, 689605, 655022, 509609, 565196, 804478, 754482, 810205, 659122, 554233, 513679, 491517]
4572D91517K47763Q4161j46367J13165j06557j39131j37909J16763J30716J92965
4562H47086P2942j31624p705j19969J33520n1789P8233j22227M4957P693j28839
4551F22278J92534P4209O7136p4917n6029K15475j73376n6335L576Q1249O6846
4540I62646L119J0777o7554j28449K0333Q7167M3453j58345J68530J16196j5910
4529A041963L319j32145j5136J12355k3740j21753J09768k240o2567n2065J87830
4518A045589J14008J8971K380R925Q3107q6513J4130J8954Q2169Q9374R7592q3131
4506A406555j91466j6824q8525J29897J00246O4735j13893q8076M4807J14674
4496A362130j05644N9127j9407O1390j44661O3364M1781N8222j37532q000J73229
$$ y = [491517, 739280, 823441, 677074, 790239, 683682, 544551, 406642, 523405, 654121, 847086, 920028, 788404, 780699, 660730, 794250, 742461, 820694, 698467, 743424, 751117, 622278, 814812, 889021, 956157, 881240, 825211, 1040686, 867310, 810975, 814551, 895800, 962646, 965765, 976542, 908988, 780539, 800872, 888039, 931492, 773147, 941677, 1057873, 1041963, 1045282, 913137, 898001, 1010356, 986616, 864863, 974631, 972391, 909824, 857759, 1045589, 1159597, 1178568, 1180948, 1190873, 1273980, 1187467, 1201597, 1220551, 1302720, 1392094, 1489686, 1406555, 1215089, 1198265, 1109740, 1239637, 1339883, 1404618, 1290725, 1202649, 1247456, 1362130, 1256486, 1315613, 1296206, 1357596, 1212935, 1276299, 1318080, 1376302, 1238770, 1230770, 1403999]
4485A403999Q2027J6571j55739m7481o6703K69059R0780r28J37648k5428J8452
4474A722257K54951K07908l6769J18431K74797J88163J05814O8517q9978O622
4464B820713j74585p6382j0720M1665O0366j65532j48623k32782J50147K1487
4454B285754J53448o0732N4001K4530n5631J58409J35510L017J48845Q7885K4462
4443B959498J08409K04371J06388K18669J63700J09782J58466J66747Q6630j84455
4433D098205j51698M7090K6622K7382J93622L6349j03270P0939R2633R9394L71155
4422D808423K56071Q1206J18892J20370K64240L7693J09483K37047K49606J85121
4412F468152K19973N66703O96295L91219N59381O19525Q51295O71108J054269
$$ y = [1403999, 1486026, 1502597, 1346858, 1299377, 1232674, 1501733, 1592513, 1591585, 1729233, 1703805, 1722257, 1977208, 2185116, 2148347, 2266778, 2541575, 2729738, 2835552, 2904069, 2814091, 2820713, 2646128, 2569746, 2559026, 2600691, 2661057, 2495525, 2346902, 2114120, 2264267, 2285754, 2439202, 2378470, 2432471, 2457001, 2401370, 2559779, 2695289, 2698306, 2847151, 2935036, 2959498, 3067907, 3272278, 3378666, 3597335, 3761035, 3870817, 4029283, 4196030, 4282660, 4098205, 3946507, 3993597, 4020219, 4047601, 4241223, 4277572, 4174302, 4245241, 4337874, 4437268, 4808423, 5064494, 5145700, 5264592, 5384962, 5649202, 5686895, 5796378, 6033425, 6283031, 6468152, 6688125, 7254828, 7951123, 8342342, 8901723, 9521248, 10372543, 11043651, 12097920]
4403A2097920J362984J563888K162221K911116L446859L746725L306603K123228
4395C2721544k42325l407235m314714l758990l040691k014199j556283j148686
4387A3238421q94253o05852m43845k81138L2354j07963J52491P8168J05013J23052
4377A1396448L28517l5084k44289j06789P9810K439L12173L41616O26422O50796
4367A3352059R42330J404944J841561K367811K915202L387309L477627K598012
4359C2286855N75613k547062m314180m383969l436429k574382j996073j654887
4351A1955486j191088r47677p88151q40470p11678j00791r2003m16874l13021
4342F553733k34498l03701k71820j76847j87376o7025N4137k97067r7568j33756
$$ y = [12097920, 13460904, 15024792, 17187013, 20098129, 23544988, 27291713, 30598316, 32721544, 32479219, 29071984, 24757270, 20998280, 17957589, 15943390, 14387107, 13238421, 12344168, 11738316, 11294471, 11013333, 11045687, 10937724, 11090215, 11168383, 11273396, 11396448, 11724965, 11689881, 11445592, 11338803, 11418613, 11421052, 11733225, 12074841, 12701263, 13352059, 14294389, 15699333, 17540894, 19908705, 22823907, 26211216, 29688843, 32286855, 32862468, 30315406, 26001226, 21617257, 18180828, 15606446, 13610373, 11955486, 10764398, 9816721, 9028570, 8188100, 7476422, 7375631, 7283628, 6866754, 6553733, 6319235, 6015534, 5743714, 5566867, 5379491, 5312466, 5366603, 5069536, 4971968, 4838212]
4332D838212j1115q4723k13676j54150n9402J12189j04704j32686m341K4757J79297
4321D389658o6476o3474J15796J12551q3912O7358K05986J40798J7916j23319
4311D712882j26492j49560R1465k07580j67381J5445q9525o2869j19429K3394
4301C920350R43K3195J48489R0488j93352k6241L04623J43762r995J24003m5636
4290D480629L6136J74238J03100K67073L03872K87259L37913o0085j68583j53720
4280E607832j25529l74318k53132m1669l758k6858O256j72361j53286J56506K39228
4269D858911r3890j83842M548N0816j10195M4303N8381K22387P8528j05575J41338
4258D965710M3196J3402j14526J96756J02316J26264J87397j821O6314J44100
$$ y = [4838212, 4827097, 4742374, 4528698, 4374548, 4315146, 4427335, 4322631, 4189945, 4185604, 4210361, 4389658, 4323182, 4259708, 4375504, 4488055, 4404143, 4471501, 4677487, 4818285, 4836201, 4712882, 4586390, 4436830, 4528295, 4320715, 4153334, 4168779, 4079254, 4016385, 3896956, 3920350, 3921293, 3944488, 4092977, 4183465, 3990113, 3963872, 4268495, 4412257, 4402262, 4526265, 4480629, 4516765, 4691003, 4794103, 5061176, 5365048, 5652307, 5990220, 5930135, 5761552, 5607832, 5482303, 5107985, 4854853, 4813184, 4809426, 4782568, 4788824, 4616463, 4463177, 4619683, 4858911, 4765021, 4581179, 4585727, 4636543, 4526348, 4570651, 4629032, 4851419, 4929947, 4824372, 4965710, 5008906, 5022308, 4907782, 5104538, 5206854, 5333118, 5520515, 5518694, 5585008, 5729108]
4248E729108J98611M52274J85766P0571J52770K82416J08529k20362p810K30420
4238G182293O5641j76357j54007j25370Q9165k12288p6053o5019k431K15994j3775
4227F727793q8692K5517J07340K22167J71483j6470P2587J51890K3619J62432
4217G559666Q3113J46556Q2131N7498J71560K83815O9860M3965K99035J42383
4207H939582K22252K88158J12577L27979L20447J85936M43874L24606K34649K80840
4197A1680900M31245K31381K44883M09188K93797K92439L18258L56824N92289
4188A4851204M58722N67175M04632N56609N74790O34489N59903O00772O20976
4179A9829272P04738O27106O61030Q17679P92986P43527J095399J201513J170285
$$ y = [5729108, 5927719, 6379993, 6565759, 6636330, 6789100, 7071516, 7180045, 6959683, 6951873, 7182293, 7247934, 7071577, 6917570, 6792200, 6881365, 6669077, 6593024, 6528005, 6525574, 6741568, 6727793, 6639101, 6664618, 6771958, 6994125, 7165608, 7149138, 7221725, 7373615, 7397234, 7559666, 7642779, 7789335, 7871466, 7928964, 8100524, 8384339, 8454199, 8498164, 8797199, 8939582, 9161834, 9449992, 9562569, 9890548, 10210995, 10396931, 10840805, 11165411, 11400060, 11680900, 12112145, 12343526, 12588409, 12997597, 13291394, 13583833, 13902091, 14258915, 14851204, 15309926, 15877101, 16281733, 16838342, 17413132, 18047621, 18607524, 19208296, 19829272, 20534010, 21161116, 21822146, 22639825, 23432811, 24176338, 25271737, 26473250, 27643535]
4170B7643535J462486J407261J488502J752313K185754K174648K550424K496463
4162D3161386K790595L094890L646756M037680N014151N734607O911223Q679226
4154H3070514J1192422J4241818J7474368J9614192J8708852J2694986O03802
4147A77600954j2223561k0876457k1859824j8256871j3802827j0011118p498848
4140G3071448n943240m661167l780311l052333k371727j821925j426632j034097
4132D8980016p46327n78432k86503k34841j53656K36102K85297N12040M53896
4123D8467592Q84087P12063O79030J094741J137562J031808J266041J329969J347014
4114E7949907J609997J750659K175778K477233K831018L299632L783265M271362
$$ y = [27643535, 29106021, 30513282, 32001784, 33754097, 35939851, 38114499, 40664923, 43161386, 45951981, 49046871, 52693627, 56731307, 61745458, 67480065, 74391288, 83070514, 94262936, 108504754, 125979122, 145593314, 164302166, 176997152, 177600954, 165377393, 144500936, 122641112, 104384241, 90581414, 80570296, 73071448, 67128208, 62467041, 58686730, 55634397, 53262670, 51440745, 50014113, 48980016, 48233689, 47655257, 47368754, 47133913, 46980257, 47216359, 47501656, 48013696, 48467592, 49351679, 50063742, 50742772, 51837513, 52975075, 54006883, 55272924, 56602893, 57949907, 59559904, 61310563, 63486341, 65963574, 68794592, 72094224, 75877489, 80148851]
4106H0148851M639610M988610N873286O434446P074418Q295993R420287J0993766
4098A37869267J2740501J5517452J8968984K3594779K9500865L6202565M2775842
4091C17170255M8454581N0403779M2888112K9984703J8930565l079582l2288431
4084D72463982m4609996m8299954n2224305m9997862m2243288l3771886k6421616
4077A74895075k0875683j7004824j3728140j0994693r131269p593876o273479
4070H9293111n164227m551438m046672l811024l508312l202681l237907l091003
4062E8679847k953705k791179k422159k490371k312553k082523j901934j737670
4054C9987753j653196j505693j326511j417535j495354j127619r25185j090010
$$ y = [80148851, 84788461, 89777071, 95650357, 102084803, 109159221, 117455214, 126875501, 137869267, 150609768, 166127220, 185096204, 208690983, 238191848, 274394413, 317170255, 365624836, 416028615, 458916727, 488901430, 507831995, 504752413, 472463982, 427853986, 379554032, 327329727, 277331865, 235088577, 201316691, 174895075, 154019392, 137014568, 123286428, 112291735, 103160466, 95566590, 89293111, 84128884, 79577446, 75530774, 71719750, 68211438, 65008757, 61770850, 58679847, 55726142, 52934963, 50512804, 48022433, 45709880, 43627357, 41725423, 39987753, 38334557, 36828864, 35502353, 34084818, 32589464, 31461845, 30536660, 29446650]
4046B9446650r44493q14256q36868q05778q90278p77045q00597o72629o44672
4037B2260034n86288o79301n69394l50281l22538k77593k88787k79894m93325
4028A8412633l01882j50348l34644m73726l46943k01753k68502l65757l41933
4019A5627145l17545l61037m94460k72397n03744l89523k09488k83125m41474
4010A2354352m16124j84664k67430l06312k42205j69605m37351j49823j68653
4001A0012185j64912o1975p2311o0260k72211j65638k23939j49991o4944k38400
3991H537604j21663q3553r0945r8479j28690J0701k43834j20097n7235R3576L6542
3980G733927j23759K09575K7309j42588m3200j63923j15633j70517j8910M1466
$$ y = [29446650, 28502157, 27687901, 26851033, 26045255, 25154977, 24377932, 23577335, 22904706, 22260034, 21673746, 20994445, 20425051, 20074770, 19752232, 19474639, 19185852, 18905958, 18412633, 18110751, 17960403, 17625759, 17152033, 16805090, 16603337, 16334835, 15969078, 15627145, 15309600, 14948563, 14454103, 14181706, 13677962, 13288439, 13078951, 12795826, 12354352, 11938228, 11753564, 11486134, 11179822, 10937617, 10768012, 10330661, 10180838, 10012185, 9847273, 9785298, 9712987, 9652727, 9380516, 9214878, 8990939, 8840948, 8776004, 8537604, 8415941, 8332388, 8241443, 8142964, 8014274, 8024975, 7781141, 7661044, 7603809, 7697385, 7733927, 7610168, 7819743, 7847052, 7704464, 7661264, 7497341, 7381708, 7211191, 7192281, 7233747]
3970G233747k57805j22492J43535Q7395Q7844J71207m1133J49563J58648J33387
3960G743896Q6126J60374J35248m7511k29098j17194k36762l00690j64631j73143
3950F856615J6689J53988j60053k6000j06328J3281Q2031p168J80162J53232J00979
3939G257428K00387J99488L11013K18175J75071J84613J90220Q3646n13434k27735
3929H078872k33140l66025l60884m50683l47801k90172l63702j20664r5865j16936
3919E333000k03473j06357q8239r3006O7928P795K6045m6195j73364j24323K15489
3908D815300J5721o3608J18568J96482n746J01762J10015P0461N3774L982k39925
3897E176786J02924q2218k41141j71103j20874k24967k18114k3900j56825o6534
$$ y = [7233747, 6975942, 6853450, 6996985, 7084380, 7172224, 7343431, 7302298, 7451861, 7610509, 7743896, 7830022, 7990396, 8125644, 8078133, 7849035, 7731841, 7495079, 7194389, 7029758, 6856615, 6873304, 7027292, 6867239, 6841239, 6734911, 6748192, 6830223, 6823055, 7003217, 7156449, 7257428, 7457815, 7657303, 7968316, 8186491, 8361562, 8546175, 8736395, 8820041, 8306607, 8078872, 7845732, 7479707, 7118823, 6668140, 6320339, 6030167, 5666465, 5545801, 5449936, 5333000, 5129527, 5023170, 4934931, 4841925, 4909853, 4917648, 4943693, 4897498, 4724134, 4599811, 4815300, 4831021, 4767413, 4885981, 5082463, 5076717, 5178479, 5288494, 5358955, 5412729, 5416711, 5176786, 5279710, 5197492, 4956351, 4785248, 4664374, 4439407, 4221293, 4197393, 4040568, 3974034]
3887C974034q8350j52970j00216J53724j15597j01936K8044J186J6265k8049j52676
3876C433459j4652K33739N1176q2109O6573P3281k6150l7378m8622m5907r5547
3865C507863n7150m754j3344J06961J13005P2545Q4728O721o7189k03213k25358
3854C320815j12257j81881R1245J7740l4785l7176L6125J8610j85545o9008J77159
3843C041042q747k05884q4415m076n6532m5849l10J27393M202j33872O5232j46274
3831B551910m1404K1032J6471k9255J1521j00644K7027K23342p0983m2207k1743
3820B545067j05763K3971o2104O3856P5755N726R4887m611k7000n7698J35423
3809B687509k5419N5567P4323K25746k17243R8583l1215J33609J68382Q1924J20873
$$ y = [3974034, 3885684, 3732714, 3632498, 3786222, 3670625, 3568689, 3596733, 3597919, 3614184, 3586135, 3433459, 3418807, 3652546, 3703722, 3621613, 3688186, 3761467, 3735317, 3697939, 3649317, 3603410, 3507863, 3450713, 3445959, 3432615, 3539576, 3652581, 3725126, 3809854, 3816575, 3749386, 3546173, 3320815, 3208558, 3026677, 3117922, 3135662, 3100877, 3063701, 3099826, 3118436, 2932891, 2863883, 3041042, 3032295, 2826411, 2741996, 2737920, 2681388, 2635539, 2635229, 2762622, 2766824, 2632952, 2698184, 2551910, 2510506, 2531538, 2548009, 2518754, 2530275, 2429631, 2456658, 2680000, 2609017, 2566810, 2545067, 2439304, 2463275, 2401171, 2465027, 2540782, 2546508, 2641395, 2636784, 2609784, 2552086, 2687509, 2662090, 2717657, 2791980, 3017726, 2800483, 2899066, 2867851, 3001460, 3169842, 3251766, 3372639]
3798C372639J05468J94423K81471L68319K37050R9490j11697r6821k49388l22121
3788C878833l09728j74700l01908j82012k76225o0806p247n7754j93391j56138
3778B158924O6516O0501J4255j69309n5642J43733o99r3594j43935O4917j10889
3767A934778p4826L2665L2014K2131o2824P0261p0283l2048j23173k2104J32642
3756A839233k5894N3269R3751k95878j23385J23673L2719j73334m946J01828L6056
3745A657092p6130J994J6903p8919J71774K2229j5412k0428m9167O4728J40060
3734A834724N0949O7383o9630j63151j78811m5047O1734o6544L5808J22248r751
3723A639912r9445k01215J76551k3771J2129R908j6510j48604O1190P3528l7375
$$ y = [3372639, 3478107, 3672530, 3954001, 4322320, 4559370, 4658860, 4547163, 4450342, 4200954, 3878833, 3569105, 3394405, 3092497, 2910485, 2634260, 2573454, 2566207, 2508453, 2315062, 2158924, 2225440, 2285941, 2300196, 2130887, 2075245, 2218978, 2218279, 2124685, 1980750, 2045667, 1934778, 1859952, 1892617, 1924631, 1946762, 1883938, 1954199, 1883916, 1851868, 1728695, 1706591, 1839233, 1813339, 1866608, 1960359, 1664481, 1541096, 1664769, 1697488, 1524154, 1519208, 1621036, 1657092, 1580962, 1582956, 1599859, 1520940, 1692714, 1714943, 1699531, 1679103, 1629936, 1694664, 1834724, 1885673, 1953056, 1883426, 1720275, 1541464, 1496417, 1558151, 1491607, 1527415, 1649663, 1639912, 1540467, 1339252, 1515803, 1492032, 1504161, 1514069, 1497559, 1348955, 1410145, 1483673, 1446298]
3712A446298J1839N9051J14774j94889J26372R062j15339J61402n9k428M2705
3701A658788J57747M6653P562j11062j19727k7008M7644M1572j31631j23654j65101
3690A281783K7527R3679k5389r1890N7357J83058j49701N1046j03682r6183P7556
3679A305161M456j52904R0903O4786j47225J55610L5214L6830o6594K85073K1634
3668A632944r8579J15306j0661j91546p7393N5825J2582n1495n8020r9313M5650
3657A275300j51948j1551J08911o65q0848r8154J01378L81479r1407l09651N4570
3646A177414J20050p0308O0299J80946J25915j21510r4709r25k8883n4971p8674
3635A214644N1380M5353J5981p7844R0073M7912n3263j47486j03292M410J97585
$$ y = [1446298, 1458137, 1517188, 1631962, 1437073, 1563445, 1572507, 1457168, 1618570, 1618511, 1616083, 1658788, 1816535, 1863188, 1870750, 1759688, 1639961, 1612953, 1660597, 1702169, 1570538, 1446884, 1281783, 1309310, 1402989, 1377600, 1285710, 1343067, 1526125, 1376424, 1427470, 1323788, 1227605, 1305161, 1309617, 1156713, 1247616, 1312402, 1165177, 1320787, 1356001, 1392831, 1326237, 1611310, 1632944, 1534365, 1649671, 1639010, 1447464, 1370071, 1425896, 1438478, 1386983, 1328963, 1229650, 1275300, 1123352, 1111801, 1220712, 1220047, 1139199, 1041045, 1142423, 1523902, 1432495, 1122844, 1177414, 1297464, 1227156, 1287455, 1468401, 1594316, 1472806, 1378097, 1377172, 1348289, 1293318, 1214644, 1266024, 1311377, 1327358, 1249514, 1339587, 1387499, 1334236, 1186750, 1083458, 1087868, 1285453]
3624A285453N6021k9484R405j95319M5642Q5856P3494K5396j67265K04357R6086
3613A489642O5350j97239R4290N4584j09203J68260l0258J6423j43740k13069
3603A195040M0028J87647N0022l6903J0859j385J281j9675Q328J10588L0785L2241
3591A608856J45879K0158J6546j22896q9914K5125j24294J03995J9895q5798M7511
3580A565063R3707j33260k8542Q2227q1443O2891l535r7553O3904j02640k5750
3569A395069J14074M9665j1837n5486J966L9839K8749M7307p8037j39434J3879
3558A405754M9720R7343P5645k9978M3233O9215m3210j29684O2304K78435j08950
3547A769827K3357J73031M63Q2902j59298N2743J96668J21445l737j33449j06839
$$ y = [1285453, 1341474, 1311990, 1321395, 1126076, 1171718, 1257574, 1331068, 1356464, 1189199, 1393556, 1489642, 1554992, 1357753, 1452043, 1506627, 1397424, 1565684, 1535426, 1551849, 1408109, 1195040, 1235068, 1422715, 1472737, 1435834, 1446693, 1445308, 1446589, 1426914, 1435242, 1545830, 1576615, 1608856, 1754735, 1774893, 1791439, 1668543, 1578629, 1603754, 1479460, 1583455, 1603350, 1517552, 1565063, 1658770, 1525510, 1496968, 1579195, 1497752, 1560643, 1557108, 1459555, 1523459, 1420819, 1395069, 1509143, 1558808, 1546971, 1491485, 1493451, 1533290, 1562039, 1609346, 1531309, 1391875, 1405754, 1455474, 1552817, 1628462, 1598484, 1641717, 1710932, 1667722, 1538038, 1600342, 1878777, 1769827, 1793184, 1966215, 1966678, 2049580, 1890282, 1943025, 2139693, 2261138, 2257401, 2123952, 2017113]
3536B017113L2238K8320M1528k1799q0771j17031R4074o3585K52010O0220k06564
3525B035753N3733N8347P4051K3781j37084J0077J14075j024J52331M8418j00011
3514B332447M2573J14653j29246O6505J04049J62778j46442J24061J93772k0962
3504B844188O656l6876J66627K24897j6361L7514J4459O3083J59464J30299M5852
3493C639802j7494o2859J98092O4083J91143J84261K05007j46198R5066K49519
3483D600422J44621K42170J25755K32001J08220J97141K14019J43830J79212K28187
3473F415578K21531L52377K40055L65565J33382K97251O83528M92716N75102M55467
3463A0232552N43641O98144O45502Q00406P31568O35963Q19498R44767J004613
$$ y = [2017113, 2049351, 2077671, 2119199, 2097400, 2016629, 1899598, 1993672, 1930087, 2182097, 2242317, 2035753, 2089486, 2147833, 2221884, 2245665, 2108581, 2118658, 2232733, 2231709, 2384040, 2432458, 2332447, 2375020, 2489673, 2360427, 2426932, 2530981, 2693759, 2547317, 2671378, 2865150, 2844188, 2850844, 2813968, 2980595, 3205492, 3189131, 3226645, 3241104, 3304187, 3463651, 3593950, 3639802, 3622308, 3559449, 3757541, 3821624, 4012767, 4197028, 4402035, 4255837, 4350903, 4600422, 4745043, 4987213, 5112968, 5344969, 5453189, 5650330, 5864349, 6008179, 6187391, 6415578, 6637109, 6989486, 7229541, 7595106, 7728488, 8025739, 8709267, 9201983, 9777085, 10232552, 10776193, 11474337, 12119839, 12920245, 13651813, 14287776, 15107274, 16052041, 17056654]
3454A7056654J200660J340267J598295K248881K726818L559293M500734N241580
3446C9473182N200063M070221J328723k935676n576856n244805m354065l473087
3438B8487700k390503j869088j165110q70523n76550l96825j47154Q9850L15268
3429B1477065M00350N29564R09971J215372J199787J473904J820145K411876K620054
3420C4058088L168283L919367N289800O861723Q741968J0311415J0068388Q106221
3412I0525253K138617p132959j1793491j1298680r402479p029186n152123l940213
3404C6914739l393124k666527j925601j691509j642717r84733n75007l91331r9783
3395B3544407j1896K24671N89061P59092R73423J556765J964926K071898K580522
$$ y = [17056654, 18257314, 19597581, 21195876, 23444757, 26171575, 29730868, 34231602, 39473182, 44673245, 48743466, 50072189, 47136513, 41559657, 36314852, 31960787, 28487700, 26097197, 24228109, 23062999, 22192476, 21615926, 21219101, 21071947, 21161797, 21477065, 21877415, 22406979, 23316950, 24532322, 25732109, 27206013, 29026158, 31438034, 34058088, 37226371, 41145738, 46435538, 53297261, 62039229, 72350644, 82419032, 90525253, 92663870, 85530911, 73737420, 62438740, 53036261, 46007075, 40854952, 36914739, 33521615, 30855088, 28929487, 27237978, 25595261, 24610528, 24035521, 23644190, 23544407, 23532511, 23757182, 24346243, 25105335, 26078758, 27635523, 29600449, 31672347, 34252869]
3386C4252869K924703L389869L475131L635220L739610K866986J96835l660591
3378E0820632n774364n726184m775469l593787k999931k378660j979059j706713
3370B1886465j526662j324418j087225q38650p92928m37237j51523j12191j01020
3361A5514611K29090L45297O23905Q71314J067835J649312J701557J455862Q91679
3352B4350462o98809k072708k326887j864822j266220j166694q57130m84842n41540
3343A3070810m26738k80992o54877o99350m18783m62574m68266l24879j90315
3334I144036j13235j02811j8282J75323j13388K64416L15200J93241N95697N90539
3324A0930736O99509Q57833Q46146M18797j49289q11200r97352j089951p95431
$$ y = [34252869, 37177572, 40567441, 44042572, 47677792, 51417402, 54284388, 54481223, 50820632, 45046268, 39320084, 34544615, 30950828, 27950897, 25572237, 23593178, 21886465, 20359803, 19035385, 17948160, 17109510, 16316582, 15879345, 15727822, 15615631, 15514611, 15743701, 16088998, 16712903, 17584217, 18652052, 20301364, 22002921, 23458783, 24350462, 23651653, 21578945, 19252058, 17387236, 16121016, 14954322, 14097192, 13612350, 13070810, 12644072, 12363080, 11708203, 11008853, 10590070, 10127496, 9659230, 9334351, 9144036, 9030801, 8927990, 8909708, 9085031, 8971643, 9236059, 9551259, 9744500, 10340197, 10930736, 11630245, 12488078, 13334224, 13753021, 13603732, 12792532, 11795180, 10705229, 9909798]
3315I909798o76863o77285k83667j73071j98843K5310l52307k71605k26741m38751
3305F635975j45618o587j27235J1199k05871m3619J0552j18471O0753R2345K0990
3294F184413J07445P3004J97528q3536K0093j64465k89560J54999j6295k7356
3284F156270P7192j45924M8604P5013R1735J68262J80415Q4565j54774j48640
3274F432718j77337j24727j00636o4711J3952N4230j56953J62293K32774k3193
3264F248410p8596J12575m3906l5684K5175m4276k18816k83855l2811P6547J05960
3253E830723r873K15704m859o9550R0612r0763J57650r0402J43666J96849p163
3242F362594j22839n5780r8303q3471j60191j95237n648m1036J61299o340n8471
$$ y = [9909798, 9232935, 8555650, 8271983, 8098912, 7900069, 7925379, 7573072, 7301467, 7074726, 6635975, 6490357, 6483770, 6356535, 6367734, 6161863, 6118244, 6128796, 6010325, 6071078, 6163423, 6184413, 6291858, 6364862, 6562390, 6478854, 6498947, 6334482, 6044922, 6199921, 6183626, 6156270, 6233462, 6087538, 6136142, 6211155, 6302890, 6471152, 6651567, 6736132, 6581358, 6432718, 6255381, 6130654, 6030018, 5965307, 5979259, 6033489, 5876536, 6038829, 6271603, 6248410, 6169814, 6282389, 6238483, 6202799, 6227974, 6183698, 5964882, 5681027, 5648216, 5724763, 5830723, 5820850, 6036554, 6031695, 5962145, 6052757, 5961994, 6119644, 6029242, 6172908, 6369757, 6362594, 6239755, 6183975, 6085672, 6002201, 5842010, 5646773, 5641125, 5600089, 5761388, 5755048, 5696577]
3231E696577J28828l14666l96129j85677j22057q3502L3607j6377j14009p3572
3221D553023K7289j88308q9982n8809M220q8649L3526j7598K55J57501K00167
3210D532635J90834l535n2726j72858k37448m14013j32490l5580q9655l3789k0168
3199C531207j39860j81766k06628k43231m9872o0451j49319k3120N6983k7438
3189B506505q5311l9938Q0110n745k7325o3720o3834Q4962K6718R8022r6502Q8134
3177B502076J94602k1708j08700j54208k89413n9949l0489j53374m6675M3306
3167A875468n3594k20231k5641K9585m6431O9227p5332o6433O725R4819P3097
3156A661259j58731l9450q5919p1021N8222K5902M1924j13443N6653O5500k65426
$$ y = [5696577, 5825405, 5510739, 5114610, 4928933, 4806876, 4723374, 4756981, 4740604, 4626595, 4553023, 4580312, 4392004, 4302022, 4243213, 4247433, 4158784, 4192310, 4174712, 4174967, 4332468, 4532635, 4723469, 4719934, 4667208, 4494350, 4256902, 3842889, 3710399, 3674819, 3585164, 3551375, 3531207, 3391347, 3209581, 3002953, 2759722, 2709850, 2649399, 2500080, 2476960, 2533943, 2506505, 2421194, 2381256, 2461366, 2455621, 2428296, 2364576, 2300742, 2385704, 2412422, 2510444, 2413942, 2502076, 2696678, 2674970, 2566270, 2412062, 2122649, 2062700, 2032211, 1878837, 1832162, 1875468, 1821874, 1601643, 1576002, 1605587, 1559156, 1628383, 1553051, 1486618, 1493343, 1588162, 1661259, 1502528, 1463078, 1377159, 1306138, 1364360, 1390262, 1432186, 1318743, 1375396, 1440896, 1175470]
3145A175470j78192J01712J03861m0683o6677J14166k422j56873P5081J7485m0757
3134A102171p420q3077l4819P3258j21482R4746R2471o2919J48589m6415m7742
3123A107361J20220Q3501j88048p0448J44274j45020r2093n4909O2310K9725N0156
3112A047029j00971j4032R4062j48417j67907j1547L5988P4574L2743k19729J44130
3101G65923n7417n7659R7105j02974m4841J30302q9204J11621J38516p1699j83136
3090F36537R8852Q0552r2974q0034r4746K6548q8040K2907O5313k447R9194j45091
3078E26571k5765K8456J4427J4636Q091l1528j17099R3686K3717j28407J7974
3067D24759K0089Q2842J08261o0145K1373j58190k1892l0767o7364J39409J18824
$$ y = [1175470, 997278, 1098990, 1202851, 1162168, 1095491, 1209657, 1207235, 1050362, 1125443, 1142928, 1102171, 1094751, 1011674, 976855, 1050113, 928631, 1023377, 1115848, 1052929, 1201518, 1155103, 1107361, 1227581, 1311082, 1123034, 1052586, 1196860, 1051840, 959747, 904838, 967148, 996873, 1047029, 946058, 932026, 1026088, 877671, 709764, 698217, 734205, 808779, 841522, 621793, 765923, 708506, 650847, 747952, 644978, 600137, 730439, 641235, 752856, 891372, 819673, 636537, 735389, 815941, 722967, 642933, 548187, 574735, 486695, 509602, 574915, 572468, 671662, 526571, 500806, 529262, 543689, 558325, 566416, 534888, 417789, 511475, 535192, 406785, 424759, 444848, 527690, 635951, 575806, 597179, 438989, 417097, 386330, 318966, 458375, 577199]
3056E77199O8105k9675o3894j78970j4401P9627l6368n1190n0839J11502j38556
3045B72540J13716n4680k5084J95700O7694K2874j21432m9821L4563l6455o3974
3034C55641Q3528l1827j6753J43551k30495j18110K45847o8862L715J9710Q1954
3023D67899r886j98093p4787P6208J2837r653m2155Q1924M5625l1363J3785M6262
3011C78603o5006j59001m2482n5060M7604R2261J06078q3194j14558m5971J18528
3000A77802L6476R2529l4893p7684j32303J67341J17240J18337j97897l3849j2164
2989B20935J13345p4405j04821J18168J51231m2530L3901J07958n0375j60492
2979C12915j2766j78106K4827P3616q4073R7706l6053K39873r229q3630m4161
$$ y = [577199, 645304, 615629, 551735, 372765, 358364, 437991, 401623, 350433, 299594, 411096, 272540, 386256, 331576, 306492, 502192, 569886, 592760, 471328, 421507, 456070, 419615, 355641, 439169, 407342, 390589, 534140, 303645, 185535, 431382, 362520, 366235, 385945, 467899, 458013, 259920, 185133, 261341, 274178, 264525, 222370, 304294, 349919, 318556, 332341, 378603, 313597, 154596, 112114, 57054, 104658, 196919, 302997, 219803, 105245, 59274, 177802, 214278, 306807, 271914, 194230, 61927, 229268, 346508, 464845, 266948, 233099, 220935, 334280, 259875, 155054, 273222, 424453, 381923, 415824, 523782, 473407, 312915, 300149, 122043, 146870, 220486, 136413, 234119, 198066, 437939, 428710, 345080, 300919]
2968C00919j93609o775Q2044j27599P6324J51855j7692m7161N385M2006M248j16467
2956A53478P2412m6182K18477k37751l436K1616q9872J06896J19084K7926K3774
2945C66422j40026k21740O2493N3951m0426P064O4710K23311p5996P808p3647
2934B33924q6339J3999J37373J41822j53326o6529P0128O7075J35L9987J6368
2923D14617j45119m4431J3575m5648o3474n9820J27267P423P8541K2593q6286
2912B19238O6492P3920j27302j04615P7503r743K27739M0090k48794l2834J01217
2901B82911j233j37335k5636R2617O239M7373J4896j29578Q1979l4840N4191O9012
2889C20596J3022J24048o0068j15715L4179r3935j86696J31813l7095K4632p6553
$$ y = [300919, 107310, 100535, 182579, 54980, 131304, 283159, 265467, 218306, 223691, 265697, 269945, 153478, 225890, 179708, 398185, 160434, 156998, 178614, 88742, 195638, 314722, 342648, 366422, 226396, 4656, 67149, 121100, 80674, 87738, 152448, 375759, 299763, 307571, 233924, 147585, 161584, 298957, 440779, 287453, 220924, 291052, 358127, 358262, 398249, 414617, 269498, 225067, 238642, 192994, 129520, 69700, 196967, 204390, 282931, 305524, 219238, 285730, 359650, 232348, 127733, 205236, 195493, 423232, 463322, 214528, 181694, 282911, 281678, 144343, 118707, 211324, 217563, 264936, 279832, 150254, 232233, 197393, 251584, 320596, 333618, 457666, 397598, 281883, 316062, 222127, 35431, 167244, 130149, 154781, 78228]
2878G8228O9489m2343M9681J62693r6591P3016K8592J40600j03752P7325j54970
2867B81968n6223j0588o1104K4411p121L2010p7477M1325K7723J33797m5872n2683
2855B30166Q5739r1230j10450j58290Q6075J88805J20294o9032q5349N0753o7968
2844A79513j21774K8484j07550J3996L9908P1127L9737j14590m3223J21328J07122
2833B14078Q8883j02762j30887L363N0416O662Q9106J7969q0374q2130j17493
2822d3169o2881K11921Q08k4933n1024k6060J13425j03048K0940n684J22773p1622
2810H1446l3238R456J36494j31499j200m120o8621J3448J87029n1650j44219J19443
2798A12769K115o7932J1095n4578K0585Q4508O470k8416r6237Q2916J82395p850
$$ y = [78228, 147717, 105374, 155055, 317748, 221157, 294173, 322765, 463365, 359613, 436938, 281968, 225745, 215157, 154053, 178464, 171343, 203353, 125876, 167201, 194924, 328721, 282849, 230166, 315905, 224675, 114225, -44065, 42010, 230815, 351109, 282077, 196728, 247481, 179513, 57739, 86223, -21327, -7331, 32577, 103704, 143441, 28851, -14372, 106956, 214078, 302961, 200199, 69312, 72675, 123091, 129753, 218859, 236828, 156454, 74324, -43169, -106050, 105871, 106679, 81746, 30722, 4662, 118087, 15039, 35979, 30295, 153068, 81446, 48208, 57664, 194158, 62659, 61459, 57339, -11282, 2166, 189195, 137545, -6674, 112769, 114884, 46952, 58047, 3469, 24054, 108562, 115032, 86616, -9621, 73295, 255690, 247840]
2786B47840o4546M8108j50473p0252M2738K4229K1914j4033r3076J02303j6858
2775G7894r1441Q5398N70R3609J24917j11066J95197p0661q3316M332M4614K4477
2763B94524o9685o5930n2414O9840p1639j12816J11074N6870n2501L878q5728
2752B5473J9961m548l1792k5377o8202j21541J17614J40549K4807q4152j09123
2741a16331k3894n2654p5820P1239K4755J24791J68154M2677o6474K3178l4017
2730H5604j93497J3091L488J64504R6652m3688j45591q523L9918L1411N8182P4014
2718A75565J0736j05442r9096J79670N3218k59002Q1223j0812j09252j7119k5616
2707a25927O5791L4515n9772j43674J00941Q1535m1121o1906q2379j9866J26117
$$ y = [247840, 183294, 231402, 80929, 10677, 53415, 77644, 99558, 85525, -7551, 94752, 77894, -13547, 71851, 72421, 166030, 290947, 179881, 375078, 304417, 221101, 225433, 270047, 294524, 224839, 158909, 106495, 176335, 104696, -8120, 102954, 159824, 107323, 111201, 25473, 45434, 40886, 9094, -16283, -84485, -206026, -88412, 52137, 76944, -7208, -116331, -140225, -192879, -268699, -197460, -172705, -47914, 120240, 162917, 96443, 119621, 85604, -107893, -94802, -91314, 73190, 169842, 126154, -19437, -27960, 11958, 43369, 101551, 175565, 186301, 80859, -18237, 161433, 214651, -44351, 36872, 26060, -83192, -100311, -125927, -60136, -25621, -85393, -229067, -128126, -46591, -87712, -149618, -231997, -251863, -125746]
2696a25746K42615n6141n4426O5364O7541k3475p8383l7838q0211P331J04484
2685C1115l8295R0947p1072M5688R274J10646k27438r5859O5728k3209J18384
2674A5909l9128o1655J14082k9002l7556O0416k5565J7480j3937k09626j61287
2663c69869M7173J52293K7141J37687J48086j19954k0621n1971n8382O0371r7462
2652a45508p6694j04929K08845J51122r2170k4424n1738K9396K0699J57591r9345
2641b7155p470k04275J55081p6063j58140K20389J31193n3503r0164o4145Q7244
2630h7008R5061N2607l2584j08409l7921p6063P8919n8314Q253P2410L51756o6806
2618A91901j87964J2866o7366O0714M8693Q8974J15656j4801j79385N322k10759
$$ y = [-125746, 116869, 60728, 6302, 71666, 139207, 115732, 37349, -489, -80700, -73369, 31115, -7180, 83767, 12695, 58383, 67657, 178303, -49135, -144994, -79266, -102475, 15909, -23219, -84874, 29208, 206, -37350, 23066, -2499, 14981, 1044, -208582, -369869, -322696, -170403, -143262, -5575, 142511, 22557, 1936, -50035, -108417, -48046, -145508, -222202, -327131, -118286, 32836, -59334, -83758, -135496, -106100, -85401, 72190, -27155, -34625, -238900, -83819, -159882, -318022, -97633, 33560, -19943, -110107, -174252, -87008, 8053, 60660, 28076, -80333, -118254, -194317, -115398, -173712, -165459, -93049, 258707, 191901, 3937, 16803, -50563, 10151, 58844, 147818, 263474, 248673, 69288, 74610, -136149]
2607a36149M0031P0984k1021J3505q0318l6167K31207M4351O4799J17867j14676
2596A94413m1329J3258j50816j48447P9169q0867o2189J22093R3140j7205j32807
2585a31587Q2803O4652r6509K0399m6521j11478N4336K3476J0113m3101L4754
2574a38663O0822l1736m0561n5725P9954J33035j13933N2622R7531O8722j56570
2563d4502M2868l1366j75526O6729R0077O0864J21407K03790j92813r9931o5077
2552b3480J40627l4629j0209j46946N2255j259M5310K1576j18712Q4887M9636
2541E9056Q1329r3866k3092J29367r7446m5997J7126j2987j31032O8279J17531
2530F8268P0994K7477r4006k334K021k6660p6368k01669O3586j3282j3348M4016
$$ y = [-136149, -96118, -25134, -46155, -32650, -112968, -149135, 82072, 126423, 191222, 309089, 194413, 153084, 166342, 15526, -132921, -53752, -134619, -196808, -74715, 18425, 1220, -131587, -48784, 15868, -80641, -60242, -106763, -218241, -163905, -140429, -130316, -173417, -138663, -77841, -109577, -150138, -205863, -125909, 7126, -106807, -54185, 43346, 112068, -44502, -1634, -33000, -208526, -141797, -51720, 9144, 130551, 334341, 141528, 41597, -23480, 117147, 82518, 72309, -74637, -22382, -23641, 21669, 43245, -75467, 9420, 59056, 140385, 46519, 23427, 152794, 55348, 9351, 26477, 13490, -117542, -49263, 68268, 139262, 166739, 72733, 70399, 72420, 45760, -30608, -232277, -168691, -181973, -195321, -151305]
2518a51305j1423K02666O9249q3613j53885n8848k3832Q579J60678J07154q8904
2507b3484l4749m2469m2200M7445J08118J10739q0492j45071J36049R564M4489
2496H7939r3337l403P9313J5084m1717P0342l1562j30770M9867Q5492o9301L5089
2484E3036R8953q9233J40678N4731j41546o9859q9370j01235J9557k632L1799
2473i5121q5218l3456J47692l5736p2162P1665O9944J13480P6862J7333q2107
2462I3176j60495m5871L8904L5784M7425N7303J49553q6025k48338q8566K6909
2451a80241k5671R5818Q7262P0101n8369j57445K6700J47379J76375j83388o9938
2440g1417L24J04723n0448P9658N3732q6565N1368M5748n2661r8296j54082O2845
$$ y = [-151305, -162728, 39938, 109187, 25574, -128311, -187159, -210991, -202412, -41734, 65420, -23484, -58233, -100702, -142902, -95457, 12661, 123400, 42908, -102163, 33886, 43450, 87939, -5398, -8801, 70512, 85596, 43879, 114221, 82659, -48111, 1756, 87248, 17947, 53036, 151989, 62756, 203434, 258165, 116619, 46760, -42610, -143845, -124288, -126920, -95121, -180339, -213795, -66103, -101839, -174001, -102336, -32392, 81088, 157950, 175283, 93176, -67319, -113190, -74286, -38502, 8923, 66226, 215779, 129754, -118584, -207150, -180241, -205912, -110094, -22832, 47269, -11100, -168545, -141845, 5534, 181909, -1479, -71417, -71093, 33630, -16818, 62840, 116572, 30007, 81375, 127123, 74462, -23834, -177916, -115071]
2428a15071J18834k0704J23520j6739Q3795j07341n9312m3072m5702J2875J13545
2417D4628l2581m7608J60851l2248O9716n7725m0635Q234j04444m0120n3763J8377
2405a07318O5788j0849j46436J09361J25275q970j67938o7734R9135m0580J51762
2394A496j4388p3802J67457K4842k1048L6014J04230l0751j22407j00428J29828
2383A01043j42933O6547K8123k4041r537M5337K1383j44927J32262L1245K1565
2372A26067M8678j28484J07530K22679k5463N7680o2726l4180o1132J2961r4506
2361A69104j23882n4082J01916o680Q0847l0538o3470m8047j12119O0421O2662
2350C6132j06743Q9367J62666j32873o0402M8160k05784R3793K63140M6208k7418
$$ y = [-115071, 3763, -16941, 106579, 89840, 173635, 66294, 6982, -36090, -81792, -68917, 44628, 12047, -35561, 125290, 93042, 162758, 105033, 64398, 72632, -31812, -71932, -125695, -107318, -41530, -52379, -198815, -89454, 35821, 26851, -141087, -208821, -109686, -150266, 1496, -12892, -86694, 80763, 105605, 84557, 120571, 224801, 194050, 71643, -28785, 101043, -41890, 24657, 52780, 28739, 19202, 64539, 85922, -59005, 73257, 104502, 126067, 174745, 46261, 153791, 376470, 351007, 408687, 345961, 311781, 250649, 263610, 169104, 45222, -8860, 93056, 86376, 167223, 136685, 73215, 25168, -86951, -26530, 36132, -70611, 18756, 181422, 48549, -11853, 36307, -169477, -75684, 187456, 233664, 206246]
2339B06246r9365L1308O6842l7440p8763J05488o6809j28567L7495m7439k0173
2328c1177J09213p6829o9205q1908K4712L20357J13276j34208P1826j22527n4864
2317F8666R3661j366p4017O5445J19594k38438k2967R8482J360K6944N9943j99300
2305a993n4276j78926J16911J99572p727o3653j13940K25928O0346k9387j39002
2294A3853l7395L4033j9463N0431O2970K85064j77358j33007k7969J68370K02512
2283D22041m42427n0473K41093j04790N1836M9021P6799O7349l3433k4178j47279
2272A05559k43634O6578K41203k8854J48145k56382J3568R3591j30565l575J51856
2261A57490m2215P0023Q3268j11727q3490J13556J56755r7413j69745Q8648m2054
$$ y = [206246, 106881, 138189, 205031, 167591, 88828, 194316, 127507, -1060, 36435, -11004, -31177, 78036, 1207, -67998, -149906, -125194, 195163, 308439, 174231, 246057, 123530, 68666, 162327, 160961, 86944, 152389, 271983, 33545, 10578, 109060, 110420, 137364, 197307, -1993, -56269, -235195, -118284, 81288, 73561, 9908, -104032, 121896, 182242, 152855, 13853, -23542, 10491, -8972, 41459, 104429, 389493, 212135, 79128, 51159, 219529, 422041, -20386, -70859, 170234, 65444, 117280, 166301, 243100, 310449, 277016, 252838, 105559, -138075, -71497, 169706, 140852, 288997, 32615, 46183, 139774, 9209, 5634, 157490, 115275, 185298, 268566, 156839, 73349, 186905, 343660, 246247, 76502, 165150, 123096]
2250A23096O3837Q4539j32155Q5109o6023p7833k7027P903J46126J60492j55177
2239B12887k9702m273k1107k4669J0778L31343r6163r8180J61539l2621n8333
2228C51499J0135n4076M3593m5387k30496Q6771J43461O6822l7907k0918Q0552
2217C94049j04599n4022P8035L874q0376P5169J5730M6410O4933m6773j31784
2206B60646m4018O9543J3006r3010J42592J42520m6828L6355j37799L2325J05317
2195D80649J6451n9570O5909n3885o9445K16727R2986J6878J03981r1749j28564
2184E90368o6273O3162M4422j6907P5079K57613l1331k52908J58654Q2953M3095
2173I47927K166j79230o5482j0111M2217J43692J57508J29632J26179p587j06735
$$ y = [123096, 186933, 271472, 139317, 224426, 158403, 80570, 53543, 61446, 207572, 368064, 212887, 183185, 178912, 157805, 133136, 143914, 475257, 379094, 280914, 442453, 409832, 351499, 361634, 307558, 351151, 305764, 75268, 162039, 305500, 372322, 334415, 313497, 394049, 289450, 235428, 313463, 317337, 236961, 312130, 327860, 374270, 439203, 392430, 260646, 216628, 286171, 299177, 206167, 348759, 491279, 444451, 480806, 343007, 375332, 480649, 497100, 437530, 503439, 449554, 380109, 596836, 689822, 706700, 810681, 718932, 590368, 524095, 587257, 631679, 614772, 689851, 947464, 916133, 663225, 821879, 904832, 947927, 950093, 770863, 705381, 695270, 737487, 881179, 1038687, 1168319, 1294498, 1286911, 1180176]
2162A180176J6199J27617J05192j72271m4611M0397M4124K52505J27706q0125
2152A596909J5701N8753J07294J37392J10822J26281o1509O2469O8069K24400
2142B446581R2779j9688J62753r1426K5371J44244P5743J27908K58176K05981
2132C428422K25120K50264Q9580K16373K17017N9823J78807K88006K64664L30220
2122E548296M67101L65526K56057N33589N44991O56712R03798P47070Q15317Q40323
2112A1678780M69636R42705R98567J143236J587063K006727K501912L306889M359842
2103B8995357N790014P696930Q385815P726581O014884l129399j1067248j0204401
2095D0208533q074276n785101m225912l257160k299738j943230j544149j104883
$$ y = [1180176, 1196375, 1323992, 1429184, 1256913, 1212302, 1252699, 1296823, 1549328, 1677034, 1596909, 1612610, 1671363, 1778657, 1916049, 2026871, 2153152, 2091643, 2154112, 2222181, 2446581, 2539360, 2519672, 2682425, 2590999, 2616370, 2760614, 2836357, 2964265, 3222441, 3428422, 3653542, 3903806, 3993386, 4209759, 4426776, 4486599, 4665406, 4953412, 5218076, 5548296, 6015397, 6380923, 6636980, 7170569, 7715560, 8372272, 9276070, 10023140, 10838457, 11678780, 12148416, 13091121, 14089688, 15232924, 16819987, 18826714, 21328626, 24635515, 28995357, 34785371, 42482301, 50868116, 58594697, 64609581, 61480182, 50412934, 40208533, 32134257, 26349156, 22123244, 18866084, 16566346, 14623116, 13078967, 11974084]
2087A1974084j056173n84329n96876m31261o66767o75177o53766m55923m06197
2078F447615m48771m60480l75987j56363k13283m98193k71714J24103k41931k97339
2068C607657k04236j56456k06709j3678j24968j56714j00856j13118l7787j13386
2058B379749J3455R591j75246j55511K6456r2311l3040j13847p2297N8774j48286
2047A697487L2049N623o7875j08554K5768J6088j13729J7859j20061q4414k6601
2036A273640j43435M3862L8k1163J15923l0596k11293J45099K1657j2360k28846
2025I52526l1717J18405j16467j16849r2554J84440j30431j53973m5522l0346
2015E37512J35602N0491q6957q4592J18282P5209j38314k0472r6678P3916j07408
$$ y = [11974084, 10917911, 10333582, 9736706, 9305445, 8638678, 7963501, 7309735, 6853812, 6447615, 5998844, 5538364, 5162377, 5006014, 4792731, 4294538, 4022824, 4146927, 3904996, 3607657, 3403421, 3246965, 3040256, 3026578, 2901610, 2744896, 2644040, 2530922, 2493135, 2379749, 2393204, 2402795, 2227549, 2072038, 2098494, 2006183, 1973143, 1859296, 1786999, 1845773, 1697487, 1729536, 1735159, 1667284, 1558730, 1584498, 1600586, 1486857, 1504716, 1384655, 1300241, 1273640, 1130205, 1174067, 1174105, 1152942, 1268865, 1238269, 1026976, 1172075, 1193732, 1181372, 952526, 920809, 1039214, 922747, 805898, 713344, 897784, 767353, 613380, 567858, 537512, 673114, 723605, 636648, 552056, 670338, 745547, 607233, 586761, 490083, 563999, 456591]
2004D56591K5444j21919P6958K0478L101R563L8431M0050l9260n4349n5321n3067
1992C46700J7756R4719J4853L676J29093j41517l9230j22104o8751J14350j89419
1981A60126J66484p5478M2261j324m5791M9994j7671R0332l4157j17657J06710
1970C23829m6185K7241j9366r2814R7623n1835m7357J06863J9810j27374M3720
1959B34155k4492j30592M0986N0501N6535k11698L1138J49662L9294p3562J7942
1948A79869P0541J10161N9149q4040j46739n2118q3665k1802j09458J10185K54146
1937B86229R2704j03242k26515o1451m2248J81150p360r009j37286O5470n2475
1926a4033P1347K94240j44502m3482j71899K0189K10405J15125k09176N348j2239
$$ y = [456591, 482035, 360116, 437074, 457552, 460653, 470216, 508647, 548697, 509437, 455088, 399767, 346700, 364456, 459175, 474028, 477704, 606797, 465280, 426050, 303946, 235195, 349545, 160126, 326610, 251132, 293393, 292069, 246278, 296272, 278601, 368933, 334776, 217119, 323829, 277644, 304885, 285519, 192705, 290328, 238493, 191136, 297999, 317809, 190435, 234155, 209663, 79071, 120057, 170558, 227093, 15395, 46533, 196195, 235489, 161927, 179869, 250410, 360571, 419720, 335680, 188941, 136823, 53158, 31356, -78102, 32083, 286229, 378933, 275691, 49176, -12275, -54523, 126627, 119267, 110258, -27028, 38442, -14033, 57314, 351554, 207052, 163570, -8329, 11860, 222265, 337390, 128214, 133562, 121323]
1915A21323K7934J37368K7387k83314O9491P7950L9449j2393j21366n8969o9706
1904d4846K0261l9780j7445O2086O7412l4200q445m6223J16706O66j11219K6421
1892h606K5956N3229N5668j59304N1309M4480R5767j28997O6168M38r2046J16034
1880A20096N6582j40195m3056J5277l2452J32328Q692j69518p8629J05702K446
1869b2727M720K01401k57129k4869L503J81984O2921k03295J31990l2393K0545
1858F6651M8695j64581N8252j83388J71639O9460m1315M082J38808r2254J44113
1847B20162Q302j51869J12708m9073m3884l09845J17703N4553J21233O6748P6533
1836B23271P108k8269R8691j7711p7228K42046q6435o062N5369m9068j53744N6849
$$ y = [121323, 149257, 286625, 314012, 30698, 100189, 178139, 217588, 205195, 83829, 24860, -44846, -24585, -64365, -81810, -19724, 47688, 13488, 5043, -41180, 75526, 76192, -35027, -8606, 17350, 70579, 126247, -33057, 18252, 62732, 158499, 29502, 95670, 96108, 4062, 120096, 176678, 36483, -6573, 8704, -23748, 108580, 117272, -52246, -130875, -25173, -22727, -18007, 183394, -73735, -98604, -95101, 86883, 149804, -53491, 78499, 46106, 66651, 115346, -49235, 9017, -174371, -2732, 66728, 25413, 29495, 168303, 76049, 220162, 228464, 76595, 189303, 140230, 96346, -213499, -95796, -41243, 79990, 146738, 223271, 230379, 202110, 300801, 283090, 205862, 447908, 361473, 355411, 410780, 361712, 207968, 264817]
1824B64817k2774J8401q988k5325o0445K2175p2967j9187j30496J61209q2142
1813D4278j93745o8546K10050J67089j52314J64072k1778j38391j64817J36938
1803a7164j03075o7675J36287j05616Q1630Q5638l6387R352p9139J59056j1914
1792E0993j5487p272K7101j49244j5843l703K08541q2200q3587J5286R2832o3443
1780b6026J09184j37593K1179J00712p0775p012k518l2369m303J29464j6974N2992
1768A15961J77145j40672j17362P3101j29660j4732l0134O9130j5836M0680K2000
1757D9621J45931j38926K8157l3965M0643o5961o7562l994j61689n5814J04799
1746a58760J75280O5485j3700j08475K7773o3040P111J9176k8284j9733P5916
$$ y = [264817, 242043, 260444, 251456, 226131, 165686, 187861, 114894, 95707, -34789, 126420, 44278, -149467, -218013, -7963, 159126, 6812, 170884, 149106, 10715, -154102, -17164, -120239, -187914, -51627, -157243, -75613, 10025, -26362, -17010, -96149, 62907, 50993, 35506, 28234, 55335, -93909, -109752, -113455, 95086, 12886, -70701, -55415, 37417, -26026, 83158, -54435, -33256, 67456, -3319, -10331, -12849, -45218, -49521, 79943, 62969, 115961, 293106, 152434, 35072, 108173, -21487, -36219, -66353, 2777, -13059, 27621, 49621, 195552, 56626, 84783, 50818, 91461, 25500, -42062, -46056, -207745, -263559, -158760, 16520, 82005, 68305, -40170, -12397, -75437, -68326, -49150, -77434, -97167, -21251]
1735b1251J28952L9654j16248j00032P5007n0039K514j5893Q825o248O8175J36017
1723A49433q1675m667L56m6203k8247j01325J19445j0082k793K5636k2760L3506
1711C0624L8917j23116J13407r0925k6937k8287q4889j9498K14887J7564n1965
1700a0218j46553l1107K03609O8863o7980P39N786r8497L0645p6428O9731K4853
1688b6557q4033J35474L5615M295J3846M572j99866j19674J03327o5479n7474
1677b55954J63758R3717n7691P6363k17318J67333l7239n1084O4773J67534p1464
1666D2728j55887Q5687k0525j0512j07157J9478P9368N5946J18590n9246J9285
1655F7755o2350q4443k44405J19129J48124N1654j14340q0368P1256J30045j12056
$$ y = [-21251, 107701, 147355, 31107, -68925, 6082, -43957, -41443, -57336, -48511, -54759, 13416, 149433, 67758, 63091, 63447, 17244, -11003, -112328, 7117, -2965, -5758, 19878, -2882, 30624, 69541, -53575, 59832, -31093, -58030, -86317, -171206, -190704, 24183, 41747, -10218, -156771, -187878, 15731, 84594, 16614, 17353, 23139, -75358, -44713, -121141, -51410, -26557, -110590, 24884, 60499, 64794, 78640, 83212, -116654, -236328, -133001, -198480, -255954, -92196, 1521, -56170, 20193, -197125, -29792, -67031, -118115, -53342, 114192, 42728, -113159, -27472, -47997, -58509, -165666, -146188, -66820, -10874, 107716, 48470, 67755, 5405, -79038, -323443, -204314, -56190, -4536, -118876, -199244, -127988, 2057, -109999]
1644a09999O2157j1682J9085Q9679k05208k10J40788j234j2785O1267p4076m5433
1632h7651j3664Q1826P7675Q35j15253O2357J25794j53317J4498J09813L391q0161
1620B6143j8862p9785J21812J62787j89497j49494m6153L0169l1493R498R9889
1609f4986K3342P9937j2547o9125L1314M7783P5185j37348j9080P9605n3569j7089
1597c6578K04100j05382o5331N7897k9287k27061K5753o3745O0162J74734k5813
1586c0551N2075o1365r2913m2251Q7259K9283k12243P9026J32209J04053K3827
1575F8409l7408P2384K8948M8340p7661R9712P9720o88M2037j12819j18481J1703
1563A04196L1939j88533R757O6311j35330J27647J39818j28137K4727K8401j35526
$$ y = [-109999, -47842, -59524, -40439, 49240, -155968, -156178, -15390, -16624, -29409, 31858, -42218, -87651, -101315, -19489, 58186, 59021, -56232, 6125, 131919, -21398, -6900, 102913, 106304, 26143, 7281, -72504, 49308, 212095, 22598, -126896, -173049, -142880, -174373, -164875, -64986, -41644, 38293, 25746, -43379, -12065, 35718, 110903, -26445, -45525, 34080, -19489, -36578, 167522, 62140, -3191, 54706, 25419, -201642, -175889, -239634, -179472, -4738, -30551, 21524, -39841, -132754, -175005, -87746, -58463, -270706, -191680, -59471, 44582, 68409, 31001, 103385, 132333, 180673, 103012, 202724, 282444, 281756, 323793, 210974, 92493, 104196, 136135, -52398, -42641, 23670, -111660, 15987, 155805, 27668, 52395, 80796, -54730]
1552e4730M4463Q4116M950j49679M2095q348R3877K7319j43224o2474N317J49866
1540C3548n0182j25607j15738J73931J56095j47067O1968m8327j79944K47359
1530F036R9516l2910j19743J18296r8041J1508M6581j34382K2675N0814l1082
1519f0732K1788m0362m0331j12951J05139N6100j6294J53257L6920M5008L1459
1508A79001j77418m1071Q9054o5561m513K9853j02598L6623P7887k33108K05034
1497f817J00767m9852M2596Q0223j20530j78783J34037K5641q7740k3692J9794
1486f4356J2931R5390o0183n4857j5714N9983L1805K7271N898j89092o0116j56413
1474c67453J82448Q5365J816j8364K46130l065p4022j54616R8479p9218P0509
$$ y = [-54730, -10267, 73849, 78799, -70880, -28785, -37133, 56744, 84063, -59161, -121635, -116318, 33548, -16634, -142241, -257979, -84048, 72047, -75020, -13052, -61379, -241323, 6036, 105552, 72642, -47101, 71195, -26846, -15338, 31243, -103139, -80464, -29650, -60732, -38944, -79306, -119637, -232588, -127449, -71349, -87643, 65614, 102534, 147542, 179001, 1583, -39488, 49566, -15995, -20508, 9345, -93253, -56630, 21257, -211851, -6817, 93950, 44098, 86694, 166917, 46387, -132396, 1641, 27282, -60458, -84150, -64356, -51425, 43965, -16218, -71075, -86789, -26806, 4999, 32270, 38168, -150924, -211040, -367453, -185005, -99640, -97824, -116188, 129942, 126877, 52855, -101761, -3282, -82500, -11991]
1463a1991j514k01550R7041K0960n6361j24933J42192N3346r6169N1074J4043
1452a13862j75668L6525O6450O2964J59702m3605J9713K1143L3538j64956m1602
1441a39658M6610k5295R7958n2724q1053M4385K2500M680j02872M3055K74342
1430A31928m2586j83410Q8377j01631J24630m3635o1935J22391l2178O9966M2517
1419A14434j28903o8060M8807q4106J37888k6885K06022l0117j09367o3410P711
1408D014r5717q7312L0047J38112P2852k6903j76391m452J42830K06558p473j21325
1396G4840P8290m1973j03271o5202j05113R3440J07241n6070k4301Q8607j7392
1385B9096J439M6070R2931j9500j47906q1320R0402J8914l3428o7845k9203j8077
$$ y = [-11991, -13505, -215055, -118014, -97054, -153415, -278348, -136156, -82810, -178979, -127905, -113862, -289530, -253005, -186555, -123591, 36111, -7494, 12219, 33362, 66900, -98056, -139658, -93048, -118343, -20385, -73109, -154162, -109777, -87277, -82597, -185469, -142414, 131928, 89342, -94068, -5691, -107322, 17308, -26327, -88262, 34129, 1951, 71917, 114434, -14469, -82529, -33722, -117828, 20060, -6825, 199197, 169080, 59713, -3697, 4014, -91703, -179015, -148968, -10856, 61996, 35093, -141298, -145750, -2920, 203638, 196165, 74840, 153130, 111157, 7886, -57316, -162429, -68989, 38252, -17818, -42119, 46488, 29096, 30535, 76605, 169536, 150036, 2130, -79190, 11212, 30126, -3302, -71147, -100350, -118427]
1373a18427n7705K0036J83269K8849q1161P0782m2218J73905j48511j82015J6933
1362a36263J78281p031p6951J0983J15809N8679k26074n0127L8596n3548M2994
1351a04652j1277j02482J324J21010O6883j14383o9812Q9783J02551j07483k7659
1340a56197P700k7716M0258j07739Q0282j51323l0226K85914M8391J3948j4603
1329a1311R699m7516L1277r7398o2743M8593Q0455L2420L2358j3941N7290P456
1317F6639o5388j85967J07259K9546J2940j54911M5542Q8746j1794p4092o8868
1306b10348J15837Q1426O5445j59003J10797N6171O814l8658J8708j44079R7669
1295G79L0277K1701K5867m1793K3286j0386j32832j67539l2794R4984k6854m8593
$$ y = [-118427, -176132, -156096, 27173, 56022, -25139, 45643, 3425, 177330, 28819, -153196, -136263, 42018, 34987, -41964, -30981, 84828, 143507, -82567, -132694, -94098, -147646, -104652, -115929, -218411, -217087, -96077, -29194, -143577, -213389, -123606, -21055, -128538, -156197, -148497, -176213, -135955, -243694, -163412, -314735, -344961, -59047, -10656, 3292, -11311, -1612, -49128, -17851, -115249, -177992, -129399, -48944, -16524, 15834, 1893, 59183, 66639, 1251, -184716, -77457, -47911, -34971, -189882, -144340, -55594, -67388, -141480, -210348, -94511, -13085, 52360, -106643, 4154, 60325, 67139, 28481, 47189, -96890, 779, 31056, 52757, 78624, 36831, 60117, 49731, -83101, -250640, -283434, -188450, -215304, -263897]
1283b63897J33319N9711Q97R8533k6521O0808j56657N3476J10148j67198O1762
1272c5619N1048J6343j61828L1319J5398O8267o9876j46941Q1566k4224J58613
1261a5934j36448n9828j02372Q4096R7498J4346n4226j50794J65221Q1578M5234
1250c1629L0134J2969J0847o2772K4256J3194l6021L4072R0751j84634k3308J72908
1238E0767j3653J8667M8694r8341J7976P5527m182J58389l8101J678k33149m2567
1226e8295J5998m1708n1896J7033K78166j38904n3761L5487j08663j05123m1268
1215b52934p1694J65928R0676O3476l3187L3831N9849n2457j9166k9021p228k3006
1203g4933J23619n7620j72424j7366L6639R6978M7207M5545q2334l9231o9836
$$ y = [-263897, -130578, -70867, -69970, 28563, 2042, 62850, -93807, -40331, 69817, -97381, -35619, 15429, 31772, -130056, -98737, -83339, -15072, -84948, -231889, -150323, -174547, -15934, -152382, -212210, -314582, -230486, -132988, -118642, -172868, -323662, -158441, -76863, -31629, -1495, 11474, 22321, -40451, -16195, -3001, -39022, -4950, 85801, -98833, -122141, 50767, 37114, 55781, 104475, 6134, 24110, 99637, 95455, 253844, 215743, 217421, -15728, -58295, -42297, -84005, -135901, -118868, 159298, 20394, -33367, 2120, -106543, -211666, -252934, -324628, -158700, -68024, -4548, -37735, -3904, 55945, 3488, -15678, -44699, -51927, -74933, 48686, -8934, -181358, -198724, -162085, -65107, -17900, 27645, -54689, -93920, -163756]
1192a63756r3696L65220j73261J15281J8611M9932k0285j54190O4916o0625j60325
1181b12178J68251P9750n0164p0913j5849K29927l4764q6973M557J0095m8448
1170b6709P591J06562j75298R807P171m4463J30508m3162L9945p3072q3585N4741
1158h9964O1641P7443o6726K4389l2471K3676n3908J6565L6712k2705K950j24224
1146a46622O3661J60684O648k12357P5900J2701j36365M304o5656J95836R285
1135c1981l0451J24887j02685R2629J0186j12149J43636J39359l08026J07518
1125C2923Q0058n9615K5904q2881J71417o8508j71434k3880J644q8594N6445K06229
1113G9708j23818r2482j1905L9825K5230M9587O9935k3058P1928l1698P5204R7640
$$ y = [-163756, -257452, 107768, -65493, 49788, 68399, 118331, 98046, -56144, 8772, -51853, -212178, -43927, 35823, -14341, -85254, -101103, 128824, 94060, 7087, 11644, 21739, -26709, -19118, 87444, -87854, -78047, -70876, -115339, 15169, -27993, 11952, -61120, -144705, -89964, -28323, 49120, -17606, 6783, -25688, -2012, -55920, -39355, -2643, -25348, -22398, -146622, -82961, 77723, 84371, -127986, -52086, -39385, -175750, -171446, -237102, -41266, -31981, -62432, 62455, -40230, 52399, 62585, -49564, 94072, 233431, -74595, 32923, 112981, 53366, 79270, -3611, 167806, 99298, -72136, -96016, -94372, -182966, -126521, 79708, -44110, -136592, -148497, -108672, -83442, -33855, 36080, 13022, 84950, 53252, 128456, 226096]
1101B26096r0996j7453k31894J23772J1276l6893m4591J7707j6163k4732O7851
1090a6020j423l7525j02579O5367R1957m9503l9695N3538r127J1395J7646n1204
1078f7173J8804j96862j26811K67380R0291n2693o1825r1719R5770K20279n4838
1067D0603j74281Q4587J32821j09974j4081J05618J03649l9374j33283M8745n5841
1056a0811J2084n9402K0294J01087K3061j23373R0154j5677q1153R1428j48744
1045a01052j1716Q224L5711J5534J2787r4644k5067Q2316Q6442k8184O5372j4870
1033C0853L0234k10074p694J38524J88167j80336J4422q1209o8302J64934J9391
1022C8910M642j80601j07070J34087L2648m9165n8500J57114J12541j46872O3377
$$ y = [226096, 135100, 117647, -114247, 9525, 20801, -16092, -60683, -42976, -59139, -83871, -16020, -17443, -54968, -157547, -92180, -223, -49726, -89421, -35883, -45010, -33615, -15969, -67173, -48369, -245231, -372042, -104662, -14371, -67064, -128889, -220608, -124838, 95441, 40603, -133678, -49091, 83730, -26244, -40325, 65293, 168942, 129568, -3715, 45030, -10811, 1273, -58129, -37835, 63252, 86313, -37060, 53094, 37417, -43736, 47692, -101052, -112768, -104544, -68833, -53299, -40512, -135156, -160223, -77907, 8535, -19649, 45723, 30853, 61087, -148987, -156681, -18157, 170010, -10326, 4096, -77113, -145415, 19519, 38910, 43552, -137049, -244119, -110032, -77384, -126549, -185049, -27935, 84606, -62266, 1111]
1011A111p4304R8911q9715r078M2633m9477P3129j0526j45155J44713Q3198J11233
999A76673n7120m2229j06503J7784O7098P1956J8712K5011j45159j21982k2464
988a18223j8769J30836O1261J1061O3696p504r2639p786q6750l4883p5180o2738
976b37618L5775K33052K8534n0488J06623j04801o5662n8947r5461M4692J19024
965d5277O7054P0098q4894q2595n2193l2401J40593n034P9085J09649n9170q6964
953A7951m2277J6355M8299k16768K59439M2522j11794J91327j64674j20134J9725
942f0029j6028J54615l840Q8293p6183m3264j71497J29856l6723n2582l0465n459
930a23306M2643N0056m449j58425J7357J02299K67140k09m2800j95559j71129
$$ y = [1111, -73193, 25718, -63997, -73075, -30442, -79919, -6790, -17316, -162471, -17758, 65440, 176673, 119553, 77324, -29179, -11395, 55703, 127659, 146371, 171382, 26223, -95759, -118223, -136992, -6156, 55105, 66166, 129862, 122358, 29719, 21933, -64817, -99700, -174880, -237618, -201843, 31209, 59743, 9255, 115878, 11077, -54585, -113532, -208993, -164301, -45277, 21777, 91875, 6981, -75614, -127807, -160208, -19615, -24649, 54436, 164085, 104915, 17951, -24326, -7971, 40328, -176440, 82999, 125521, 13727, 205054, 40380, -79754, -60029, -76057, 78558, 74718, 163011, 86828, 43564, -127933, 1923, -34800, -87382, -117847, -123306, -80663, -30607, -35056, -193481, -176124, -73825, 193315, 193106, 150306, -45253, -216382]
$$ [...]
##END NTUPLES=NMR SPECTRUM
##END=
