##TITLE=1H_CA-9065-1
 CDCl3
 8 sc, 
 22.09.2022
##JCAMPDX= 6.0         $$ Bruker NMR JCAMP-DX V2.0
##DATA TYPE= NMR SPECTRUM
##DATA CLASS= NTUPLES
##ORIGIN= UXNMR, Bruker Analytische Messtechnik GmbH
##OWNER= root
$$ XWIN-NMR		Version 3.5
$$ Thu Sep 22 13:34:21 2022 Russian Standard Time (UT+4h)  she@DPX200
##.OBSERVE FREQUENCY= 200.1313499994
##.OBSERVE NUCLEUS= ^1H
##.ACQUISITION MODE= SIMULTANEOUS
##.ACQUISITION SCHEME= undefined
##.AVERAGES= 8
##.DIGITISER RES= 18
##SPECTROMETER/DATA SYSTEM= spect
##.PULSE SEQUENCE= zg30
##.SOLVENT NAME= CDCl3
##.SHIFT REFERENCE= (INTERNAL, CDCl3, 0, 15.737)
##AUDIT TRAIL= $$ (NUMBER, WHEN, WHO, WHERE, WHAT)
$$ ##TITLE= Audit trail, XWIN-NMR		Version 3.5
$$ ##JCAMPDX= 5.01
$$ ##ORIGIN= Bruker BioSpin GmbH
$$ ##OWNER= she
$$ F:/spectra/data/she/nmr/H-F/1/pdata/1/auditp.txt
$$ ##AUDIT TRAIL=  $$ (NUMBER, WHEN, WHO, WHERE, WHAT)
(   1,<2022-09-22 13:33:18.29 +0400>,<she>,<DPX200>,
      <created by zg, POWCHK disabled, PULCHK disabled
       configuration hash MD5:
       00 E9 B6 7A A2 85 ED C7 34 08 36 98 17 FE 4E 26
       data hash MD5: 16K
       47 52 16 95 FF 5C 83 69 32 27 7B 1A 12 9C 6A 9F>)
(   2,<2022-09-22 13:33:20.56 +0400>,<she>,<DPX200>,
      <Start of raw data processing
       efp BC_mod = 2 LB = 0.24 FT_mod = 6 PKNL = 1 PHC0 = -18038.26 PHC1 = 16.00069 SI = 16K 
       data hash MD5: 16K
       CB 63 B2 FC 76 07 06 4F 5A D1 EB 67 71 4C 8D B1>)
(   3,<2022-09-22 13:33:36.68 +0400>,<she>,<DPX200>,
      <pk PHC0 = 1.929147 PHC1 = -4 
       data hash MD5: 16K
       5B 5D 03 A3 31 5D 51 03 0E 28 43 3B 3D D4 3D D5>)
(   4,<2022-09-22 13:33:39.84 +0400>,<she>,<DPX200>,
      <abs ABSG = 5 
       data hash MD5: 16K
       23 83 E5 D1 95 49 87 3F 45 60 D0 94 5C 06 EF CB>)
$$ ##END=
$$ 
$$ hash MD5
$$ 69 EE AF A9 5C CA C0 17 E9 61 1A 27 0D A4 60 61
##$RELAX= 
##$RELAX= 
##$RELAX= 
##$RELAX= 
##$RELAX= 
##$RELAX= 
$$ Bruker specific parameters
$$ --------------------------
##$DU= <F:/spectra>
##$EXPNO= 1
##$NAME= <H-F>
##$PROCNO= 1
##$TYPE= <nmr>
##$USER= <she>
##$AMP= (0..31)
100 100 100 100 100 100 100 100 100 100 100 100 100 100 100 100 100 100 
100 100 100 100 100 100 100 100 100 100 100 100 100 100 
##$AQSEQ= 0
##$AQ_mod= 1
##$AUNM= <au_zg>
##$AUTOPOS= <>
##$BF1= 200.13
##$BF2= 200.13
##$BF3= 200.13
##$BF4= 200.13
##$BF5= 200.13
##$BF6= 200.13
##$BF7= 200.13
##$BF8= 200.13
##$BYTORDA= 1
##$CFDGTYP= 0
##$CFRGTYP= 5
##$CHEMSTR= <none>
##$CNST= (0..31)
1 1 145 1 1 1 1 1 1 1 1 1 1 1 1 1 1 1 1 1 1 1 1 1 1 1 1 1 1 1 1 1 
##$CPDPRG= <>
##$CPDPRG1= <>
##$CPDPRG2= <>
##$CPDPRG3= <>
##$CPDPRG4= <mlev>
##$CPDPRG5= <mlev>
##$CPDPRG6= <mlev>
##$CPDPRG7= <mlev>
##$CPDPRG8= <mlev>
##$CPDPRGB= <>
##$CPDPRGT= <>
##$D= (0..31)
0 1.2 0 0 0 0 0 0 0 0.06 0 0.03 0 0 0 0 0.0002 0 0 0 0 0 0 0 0 0 0 0 0 
0 0 0 
##$DATE= 1663839197
##$DBL= (0..7)
120 120 120 120 120 120 120 120 
##$DBP= (0..7)
150 150 150 150 150 150 150 150 
##$DBP07= 0
##$DBPNAM0= <>
##$DBPNAM1= <>
##$DBPNAM2= <>
##$DBPNAM3= <>
##$DBPNAM4= <>
$$ [...]
##$SUBNAM3= <"">
##$SUBNAM4= <"">
##$SUBNAM5= <"">
##$SUBNAM6= <"">
##$SUBNAM7= <"">
##$SUBNAM8= <"">
##$SUBNAM9= <"">
##$SW= 18.0517283424941
##$SWIBOX= (0..15)
0 0 2 0 0 0 0 0 0 0 0 0 0 0 0 0 
##$SW_h= 3612.71676300578
##$TD= 16384
##$TD0= 1
##$TE= 0
##$TE2= 300
##$TE3= 300
##$TEG= 300
##$TL= (0..7)
0 120 120 120 120 120 120 120 
##$TP= (0..7)
150 150 150 150 150 150 150 150 
##$TP07= 0
##$TPNAME0= <>
##$TPNAME1= <>
##$TPNAME2= <>
##$TPNAME3= <>
##$TPNAME4= <>
##$TPNAME5= <>
##$TPNAME6= <>
##$TPNAME7= <>
##$TPOAL= (0..7)
0.5 0.5 0.5 0.5 0.5 0.5 0.5 0.5 
##$TPOFFS= (0..7)
0 0 0 0 0 0 0 0 
##$TUNHIN= 0
##$TUNHOUT= 0
##$TUNXOUT= 0
##$USERA1= <user>
##$USERA2= <user>
##$USERA3= <user>
##$USERA4= <user>
##$USERA5= <user>
##$V9= 5
##$VALIST= <valist>
##$VCLIST= <CCCCCCCCCCCCCCC>
##$VD= 0
##$VDLIST= <DDDDDDDDDDDDDDD>
##$VPLIST= <PPPPPPPPPPPPPPP>
##$VTLIST= <TTTTTTTTTTTTTTT>
##$WBST= 1024
##$WBSW= 4
##$XGAIN= (0..3)
0 0 0 0 
##$XL= 0
##$YL= 0
##$YMAX_a= 217575
##$YMIN_a= -299083
##$ZGOPTNS= <>
##$ZL1= 120
##$ZL2= 120
##$ZL3= 120
##$ZL4= 120
##$ABSF1= 15.76232
##$ABSF2= -2.28953
##$ABSG= 5
##$ABSL= 3
##$ALPHA= 0
##$AQORDER= 0
##$ASSFAC= 0
##$ASSFACI= 0
##$ASSFACX= 0
##$ASSWID= 0
##$AUNMP= <proc_1d>
##$AZFE= 0.1
##$AZFW= 0.1
##$BCFW= 0
##$BC_mod= 2
##$BYTORDP= 0
##$COROFFS= 0
##$CY= -3
##$DATMOD= 1
##$DC= 0
##$DFILT= <>
##$DTYPP= 0
##$F1P= 0
##$F2P= 0
##$FCOR= 1
##$FTSIZE= 16384
##$FT_mod= 6
##$GAMMA= 0
##$GB= 0
##$INTBC= 1
##$INTSCL= 3.70164e-10
##$ISEN= 128
##$LB= 0.24
##$LEV0= 0
##$LPBIN= 0
##$MAXI= 10000
##$MC2= 0
##$MEAN= 0
##$ME_mod= 0
##$MI= 1.114404
##$NCOEF= 0
##$NC_proc= -6
##$NLEV= 6
##$NOISF1= 3.799351
##$NOISF2= 2.8
##$NSP= 0
##$NTH_PI= 0
##$NZP= 0
##$OFFSET= 15.73697
##$PC= 1
##$PHC0= -18036.33
##$PHC1= 12.00069
##$PH_mod= 1
##$PKNL= yes
##$PPARMOD= 0
##$PSCAL= 0
##$PSIGN= 0
##$REVERSE= no
##$SF= 200.130006917748
##$SI= 16384
##$SIGF1= 3
##$SIGF2= 2
##$SINO= 5.538805
##$SIOLD= 16384
##$SREGLST= <1H.CDCl3>
##$SSB= 0
##$STSI= 16384
##$STSR= 0
##$SW_p= 3612.71676300578
##$SYMM= 0
##$S_DEV= 0
##$TDeff= 16384
##$TDoff= 0
##$TI= <>
##$TILT= no
##$TM1= 0
##$TM2= 0
##$TOPLEV= 0
##$USERP1= <user>
##$USERP2= <user>
##$USERP3= <user>
##$USERP4= <user>
##$USERP5= <user>
##$WDW= 1
##$XDIM= 16384
##$YMAX_p= 379143261
##$YMIN_p= -1320471
$$ End of Bruker specific parameters
$$ ---------------------------------
##NTUPLES= NMR SPECTRUM
##VAR_NAME=  FREQUENCY,     SPECTRUM/REAL,   SPECTRUM/IMAG
##SYMBOL=    X,             R,               I
##VAR_TYPE=  INDEPENDENT,   DEPENDENT,       DEPENDENT
##VAR_FORM=  AFFN,          ASDF,            ASDF
##VAR_DIM=   16384,         16384,           16384
##UNITS=     HZ,            ARBITRARY UNITS, ARBITRARY UNITS
##FACTOR=    0.220516191357247, 1,           1
##FIRST=     3149.4399045206, 0,             0
##LAST=      -463.276858485183, 0,           0
##MIN=       -463.276858485183, -1320471,    0
##MAX=       3149.4399045206, 379143261,     0
$$ Real data points
##PAGE= N=1
##DATA TABLE= (X++(R..R)), XYDATA
$$ [...]
9371 7754336 7766544 7911443 8044931 8287791 8592706 8743035 8823634 9174620 9378373 9496890
9361 9496890 9734104 10103385 10278084 10469353 10734610 10898494 11044443 11321476 11720860 12174667
9351 12174667 12492156 12752219 13312126 13866211 14081162 14430410 15038903 15523985 16068695
9342 16068695 16680520 17401814 17947349 18771138 19541142 20283426 21120001 22149041 23257994
9333 23257994 24386740 25372704 26446119 27967662 29615480 31305187 33225918 35278917
9325 35278917 37363933 39061148 40550884 42040196 43898340 46018897 48619459 51881779
9317 51881779 55950375 61164905 67751844 76038871 85848607 96776420 107810005 115877853
9309 115877853 118417630 115047075 107112185 97813701 89516927 83136231 78618240 75707964
9301 75707964 74109046 72525449 69947205 66457223 62356722 58235672 54758864 52269302
9293 52269302 50378124 48957799 47957882 47489433 47275987 47533296 48164840 49242643 50635139
9284 50635139 52665488 55561555 59110245 63162561 67526282 72122330 76126386 78577993
9276 78577993 80244268 82266849 85582967 90860941 98182583 107465158 117540309 125858551
9268 125858551 130155348 127168423 117436056 104414694 90803771 79334008 69931386 62527561
9260 62527561 56751873 52302835 48614980 45862960 43851929 42019842 40450060 38816345
9252 38816345 36894458 34614849 32304155 30001492 28065595 26461326 24951659 23740152
9244 23740152 22827191 21733408 20699814 19861937 19144780 18365032 17429601 16816293 16269075
9235 16269075 15885809 15447787 14928105 14266795 13758365 13332629 13002659 12634959 12268518
9226 12268518 12083267 11726564 11508836 11406056 11147946 10912152 10556374 10449452 10341109
9217 10341109 9978223 9939099 9850707 9641148 9618559 9437179 9346376 9360970 9177810 9050657
9207 9050657 8924806 8953988 8964005 8762736 8638081 8445957 8327539 8387352 8346342 8418187
9197 8418187 8477607 8502292 8386817 8422764 8362057 8447295 8450875 8396769 8350737 8578558 8735194
9186 8735194 8731397 8739786 8908654 9062279 9202691 9328856 9521825 9719586 9824172 10143847
9176 10143847 10462584 10612073 10966110 11296754 11643686 11922145 12597339 13354847 13782879
9167 13782879 14238406 14630260 15157702 15589232 16114112 16862523 17794046 18851589 20196814
9158 20196814 21811231 24096464 26648781 29441163 32622016 35480365 37060706 37111467
9150 37111467 35529246 33209472 30874859 28722839 27051088 26060103 25123402 24447501 24014349
9141 24014349 23118562 21969304 20907740 19983060 19043958 18197974 17746030 17425616 17353496
9132 17353496 17177698 17229776 17438803 17709367 18107766 18715446 19583051 20695546 21867071
9123 21867071 22975601 24367913 25369930 26318745 26954304 27590557 28584910 30157861 32277545
9114 32277545 34793107 37713670 40402268 41891696 41501957 39324788 35667063 31802822
9106 31802822 28172350 25122998 22643136 20508389 18976805 17987344 17103969 16355215 15779493
9097 15779493 15202358 14726406 14013753 13368762 12642386 11920955 11335453 10748439 10125232
9088 10125232 9611453 9284763 9056384 8766087 8343919 8096611 7813798 7579022 7346894
9079 7346894 7203654 7033932 6954923 6814905 6485718 6394613 6327732 6302177 6029078 5950956
9069 5950956 5756586 5673354 5623812 5524813 5535064 5470551 5399674 5303415 5208624 5170789 5145758
9058 5145758 4973840 4852887 4751002 4747761 4608731 4593070 4436191 4487063 4357316 4292827
9048 4292827 4253370 4229339 4087169 3930374 3923411 3779758 3821763 3736091 3578479 3508695 3593701
9037 3593701 3595766 3500604 3461017 3551397 3531655 3329729 3338153 3427047 3281348 3254912 3228082
9026 3228082 3160362 3298049 3232574 3255946 3071205 3060475 3105187 3045261 3082737 3104641 3094459
9015 3094459 2967807 2902840 2835281 2808651 2853322 2913607 2855017 2909427 2760724 2831709 2829087
9004 2829087 2877521 2780646 2726204 2631462 2570203 2514248 2553083 2418338 2282567 2304521 2274254
8993 2274254 2373672 2500805 2343570 2299745 2223180 2161574 2332727 2327364 2347904 2373955 2283711
8982 2283711 2270508 2345848 2431325 2429162 2462151 2429303 2410344 2479801 2375979 2469796 2391311
8971 2391311 2424512 2320062 2349641 2389194 2211473 2301612 2496106 2533962 2533731 2519729 2570340
8960 2570340 2493162 2616896 2594957 2461194 2345679 2342798 2398763 2597463 2762061 2758834 2787198
8949 2787198 2702222 2638215 2625512 2778238 2850747 2904209 2978784 2969916 2826623 2937532 3063988
8938 3063988 3075081 3160575 3150163 3065548 3092924 3112192 3100465 3158349 3176990 3060300 3232809
8927 3232809 3258140 3275592 3127324 3163446 3196833 3089553 3131076 3236022 3157550 3234301 3297303
8916 3297303 3351199 3423812 3435677 3549186 3516805 3771375 3810904 3738588 3609094 3739556 3800947
8905 3800947 3802644 3844892 3853941 3939694 3919278 4019205 4217276 4253240 4303852 4555427 4677395
8894 4677395 4809578 4814677 4736807 4878003 4964129 4974583 5057055 5200571 5373719 5669556 5845837
8883 5845837 6203234 6478190 6660975 6472272 6415550 6373655 6275554 6129679 5918509 5803825
8873 5803825 5695334 5648222 5665234 5529088 5613718 5703242 5500141 5469322 5561028 5725786 5619647
8862 5619647 5599342 5605250 5493182 5481833 5770232 5879953 5968685 6111216 6187369 6346565 6592610
8851 6592610 6956924 7029080 7166000 7356389 7412772 7630333 7803937 8212915 8770499 9188395
8841 9188395 9659536 9703862 9726867 9411537 8879099 8467644 8007473 7555070 7214851 7009346
8831 7009346 6976625 6790730 6659636 6583223 6390629 6399517 6350015 6305087 6273987 6189116 6106773
8820 6106773 6111951 6038748 6103883 6140837 6199019 6170528 6272371 6259312 6179172 6143052 6241288
8809 6241288 6476144 6635710 6544705 6661483 6783956 6808980 6848249 6924409 7143420 7235859
8799 7235859 7205794 7332275 7557067 7711152 7723674 8040604 8236602 8446615 8600968 8790444
8789 8790444 9088219 9270180 9584872 9872727 10224246 10486190 10948644 11481059 11910614 12260954
8779 12260954 12516023 12567799 12627844 12777686 12939553 12815834 12618337 12605244 12532918 12443647
8769 12443647 12177061 12077934 11950525 11901210 11980564 12003841 12052516 12178344 12321973 12398841
8759 12398841 12624638 12930341 12988773 13273612 13439379 13681533 14030791 14191026 14538295 14772995
8749 14772995 15098469 15360632 15784535 16030697 16385705 16871260 17281932 17689600 18112031
8740 18112031 18448309 18953968 19199235 19646056 20026499 20496742 20826402 21093587 21474697
8731 21474697 21790604 22290877 22716525 23223591 23577454 24236232 25007026 25594932 26291566
8722 26291566 27034465 27872745 28632664 29818454 31030269 32436511 33774388 35125949 36883491
8713 36883491 38895891 41048793 43164840 45619513 48305231 51287547 54576847 58205250
8705 58205250 62439829 67233342 72076099 77564902 82951485 87277243 90666933 93551299
8697 93551299 96914811 101738363 107475973 113791038 120153837 126617293 132716130 138175683
8689 138175683 142033593 143885018 144067600 143339838 141211765 137260132 132163892 126445897
8681 126445897 120735666 115004566 109372767 103798870 98385870 93731623 89612922 86006593
8673 86006593 82439696 79269009 76704452 74670838 73046179 71926305 71560452 71730591
8665 71730591 72438630 73588517 75521989 77867988 80462620 83511897 87022238 90686425
8657 90686425 94639662 98551407 102772435 107368775 111982968 116162550 119820176 122671661
8649 122671661 124955947 126469606 126502829 124423841 121109345 116990217 111678723 105427075
8641 105427075 98439340 91227334 84482863 78082173 72078048 66685812 62092100 58372561
8633 58372561 54996063 51828961 49232204 46848676 44722524 42789880 40964704 39275881
8625 39275881 37709040 36081367 34750542 33561504 32605864 31858056 31195666 30688558 30123824
8616 30123824 29876854 29929474 30115677 30334229 30888675 31405004 31599898 31616421 31425387 30682439
8606 30682439 29600565 28160555 26553617 24845988 23451028 22089063 20839029 19822682
8598 19822682 18848691 17980923 17281401 16520514 15937366 15541753 15039655 14749684 14358336
8589 14358336 13872733 13705430 13355308 12939078 12708525 12422919 12202290 12035518 11713925
8580 11713925 11553373 11275728 10925993 10736880 10586837 10500368 9992646 9715739 9555546 9438171
8570 9438171 9324891 8986207 8844788 8972039 8687742 8507415 8333623 8093453 7781266 7845409
8560 7845409 7932261 7817127 7593750 7377725 7334515 7323945 7192857 7116984 7022758 6834216
8550 6834216 7025001 7026305 6990228 6903556 6852789 6873440 6784496 6834188 7013098 6750306 6730682
8539 6730682 6625511 6516904 6422584 6344816 6392515 6236284 6259855 6182828 6026362 5930054 5730031
8528 5730031 5730453 5677241 5498402 5343811 5502756 5483483 5414958 5455812 5354908 5433748 5367083
8517 5367083 5329572 5363369 5327238 5261380 5258770 5286199 5062813 4792475 4813640 4850008 4790252
8506 4790252 4699316 4720393 4728915 4571479 4447222 4256008 4049547 4102604 4182229 4043706 3969177
8495 3969177 3817742 3737085 3691474 3598630 3479235 3668572 3604472 3449509 3416018 3398927 3501332
8484 3501332 3370923 3227098 3168443 3207319 3212922 3068700 2922226 3079418 3114732 3024907 3108795
8473 3108795 3021335 3033123 3119257 3097607 3006153 2836428 2912294 2882402 2782775 2771372 2685956
8462 2685956 2658417 2597820 2530026 2502415 2481377 2516141 2445915 2508152 2480672 2334543 2462537
8451 2462537 2437003 2449340 2497391 2398270 2406782 2331823 2264043 2310034 2288464 2118554 2160165
8440 2160165 2229717 2189388 2013528 2028101 1949432 1879530 1943479 2035617 2137515 1947229 1941090
8429 1941090 1827962 1651732 1828711 1774636 1671199 1714662 1729047 1696866 1651707 1711634 1593001
8418 1593001 1510281 1542582 1443006 1404493 1378806 1472452 1507294 1337224 1166074 1214171 1378748
8407 1378748 1353149 1196883 1323497 1270748 1310165 1358340 1271591 1214351 1225049 1129919 1139960
8396 1139960 1186071 1246253 1332589 1331510 1189240 1209923 1336623 1239773 1152341 1070603 1125997
8385 1125997 1076142 1011527 927112 874319 979912 1105629 1094802 997248 992847 947291 1023617
8374 1023617 1054858 1057923 1035828 888255 985243 967228 790946 850953 1019494 845224 874637
8363 874637 862206 846153 923540 839672 876988 871721 850839 808796 810329 811431 662626 727484
8351 727484 708498 810183 695521 732870 881123 965694 873394 794270 724029 875752 850161
8340 850161 776280 889153 694365 835342 968845 1024119 853981 736003 845502 809105
8330 809105 655328 908949 1049922 957020 920830 930850 1151603 1171175 1093606 1118094 1187219
8319 1187219 1182498 1125641 1159004 1237081 1272250 1349420 1367109 1446612 1341705 1380545 1334566
8308 1334566 1233079 1223818 1249322 1129825 1252499 1258418 1120994 1001462 1057932 1067124 900499
8297 900499 939074 837814 852894 788407 803409 859442 884679 954667 1126347 1133194 1225338
8286 1225338 1144918 990827 1070060 1196101 1153536 1310534 1399663 1424222 1150716 1328383
8276 1328383 1255425 1280959 1241343 1128577 1065158 1012940 1063181 1056467 1062818 1062560 1053593 1052360
8264 1052360 1062046 1010891 1066713 1038697 1112429 1009667 1066971 1015257 853783 938008 996212
8253 996212 814324 774918 782295 798667 755133 911945 930739 868100 772273 937389 869913
8242 869913 775860 661553 751492 908494 915162 708578 702823 728533 724774 823036 768330 882945
8230 882945 854849 667257 590120 552313 522103 466321 653742 714797 614138 619795 668986
8219 668986 623109 631221 384618 379514 407089 405254 400707 405163 508438 480320 696899 659211
8207 659211 468945 382761 298897 405788 358045 459334 817830 605635 711170 689230
8197 689230 673811 486290 495720 714074 1096831 -1083873 -1320471 -255193 -130558 175159
8187 175159 75160 194985 126802 232572 150180 194707 162593 13033 18347 115898 42777
8176 42777 102138 228430 303742 251332 181424 277017 361333 92609 106718 68916 96130
8165 96130 109302 206095 161106 367373 307305 336097 178175 76312 148549 148713 131365 179337
8153 179337 440573 369751 226889 309384 386671 284234 308296 317913 383310 358836 381382
8142 381382 238494 232680 251272 247265 271596 49921 -2367 117117 41343 38884 136495 167274
8130 167274 226973 185517 295826 195116 -86370 -54436 91351 29629 -104265 3168
8120 3168 -32800 40087 124244 -71463 -167555 -211593 31427 200692 197816 86188 125971
8109 125971 290418 211378 167051 174562 94691 184351 142282 144501 156493 110228 225068 194436
8097 194436 198284 330749 177706 -47978 136376 52981 86102 73224 190802 126743 140600
8086 140600 158554 81902 220135 205451 103002 -79502 -29444 -93892 -10530 95181 150675
8075 150675 53288 -104628 -84290 -131172 -143967 -100356 -113993 45446 -21822 -24830 101676
8064 101676 191309 290539 216959 107490 75534 91755 121251 52404 77356 111298 104128 -42960
8052 -42960 -39218 -388 99182 156603 -79174 -188189 -162398 -111182 -80888 -155262 -8353
8041 -8353 -34279 -3207 133062 -9731 40825 -119110 5006 83352 -66802 49299 55302
8030 55302 122470 203153 81113 96366 31784 -44644 -60176 38599 27487 -77472 -6488
8019 -6488 -117436 -91877 94 -62046 -95121 -22349 -37217 -26185 22633 39736 -57056 -77583
8007 -77583 -768 52813 11727 49395 26892 -3476 52312 40069 -28092 -109211 -7776 33274
7995 33274 33035 -29006 102793 123088 99525 176240 258000 76734 107559 119240 11927 32650
7983 32650 -29510 -59280 -122599 72215 32126 -148451 -45759 46997 198270 257506 102356
7972 102356 231381 416170 406510 479140 371349 444986 389393 461889 232432 498703 582767
7961 582767 374633 286910 230609 328294 407051 239601 193798 306727 407843 356325 149935
7950 149935 37030 86039 149532 271209 381589 151968 191734 127946 -2222 -21390 -106327
7939 -106327 -155376 4417 97296 182508 187507 192809 186558 88376 174951 291042 279988 256190
7927 256190 250383 248763 220393 295188 160119 168067 283078 228902 160716 190684 70692 194682
7915 194682 133033 214723 174100 80496 69873 2876 -95534 -130621 -113367 -124497 -120134 -142131
7903 -142131 -179946 16063 159546 88732 22812 -96256 -87109 40187 -26639 52913 -9032
7892 -9032 -28656 -125775 -125317 8201 -55486 -38430 -24853 -81699 -2186 10938 -63289 -24488
7880 -24488 20680 113251 -15995 5081 -85442 -217867 -109419 -89487 -89658 -52625 100471
7869 100471 179013 -41857 -186354 -320902 -272889 -184029 -145362 -205788 -197800 -196746 -258698
7858 -258698 -152585 -103005 -91027 -63301 -239510 -148687 -61143 -176107 -59438 -88237 -95486
7847 -95486 -166597 -141516 -181230 -215141 -301896 -376374 -388512 -298672 -176599 -29144 -183196
7836 -183196 -371597 -346165 -256594 -136985 -106793 -35619 -26917 -47912 -199564 -97923 -211245
7825 -211245 -157222 -180685 -69365 -221029 -79378 28000 -229037 -144962 -156478 -193192 -181415
7814 -181415 -88568 -107112 -139931 -204275 -537864 -202319 2985 -121674 -134676 -132139 -56857
7803 -56857 71382 -109212 -254235 -166731 -7893 -91299 -113061 -29149 -41013 21137 24220
7792 24220 85639 38944 -21623 -85699 -38776 -3778 -37286 -53083 -60887 -134626 -51360 -67918
7780 -67918 -86687 -276814 -109745 -42468 -1388 -24477 -44287 -164171 -78864 -106971 -169509
7769 -169509 -206341 -233025 -79376 -99411 -78617 -171359 -204330 -54933 -90906 -137458 -205960
7758 -205960 -158381 -162847 -270118 -81267 -14601 -142019 -104459 -148526 -267275 -281558 -321532
7747 -321532 -54821 -80526 -139719 -153546 -100986 -305964 -208497 -102424 -208635 -172033 2602
7736 2602 -160012 -269564 -133290 -1597 -123821 -212815 -247454 -155564 -111014 -72206 -169371
7725 -169371 -192604 -113591 -87404 -150278 -241420 -265353 -278146 -230654 -273750 -226478 -334144
7714 -334144 -238320 -291300 -232761 -250354 -222800 -147162 -53980 -105029 -239526 -189465 -57673
7703 -57673 24359 -136035 -247483 -195423 -190598 -199985 -276020 -173465 -200298 -235814 -192063 -174113
7691 -174113 -319151 -369387 -293397 -392590 -346798 -229663 -233325 -141549 -221580 -181728 -299694
7680 -299694 -182447 -76577 -39108 37629 -145165 -290384 -209721 -84734 -19743 52230 -43673
7669 -43673 -187674 -155592 -38452 -98526 -48120 -21470 -214833 -301329 -187174 -129258 -9633
7658 -9633 -88025 -99697 -166644 -193080 -15728 -48129 -232463 -246063 -130422 -201229 -215964
7647 -215964 -244839 -126286 -144024 -202816 -219683 -379203 -308245 -323535 -391935 -275939 -257443
7636 -257443 -143690 -223978 -329358 -222544 -302267 -231089 -140508 -49868 96146 -2465 -185788
7625 -185788 -161505 29968 59950 -165728 -253958 -137650 -138200 -258158 -281292 -252380 -115226
7614 -115226 111966 90512 -37716 -177330 -269913 -285624 -274599 -160726 -252983 -209037 -67104
7603 -67104 -35712 -109631 -115138 -135872 -7215 -29952 -5264 32626 185481 165776 -79092
7592 -79092 -177843 -176745 -38583 -82051 -171840 -54533 43825 -5804 -55862 27377 89655 5691
7580 5691 -67572 -24037 -34833 -131866 -210565 -131600 -135839 -184090 -191437 -158891 -243609 -191927
7568 -191927 -215391 -226495 -83279 -198689 -242552 -258374 -318753 -302748 -232414 -159524 -221119
7557 -221119 -220949 -122545 -175178 -178253 -130521 -41622 -55235 15729 17756 -134896 -157824 -64068
7545 -64068 -158681 67300 105044 19687 27885 -34269 51124 -83621 -76015 -114393 -50398 -151490
7533 -151490 -59084 -70920 -65670 -165917 -83999 -41311 -165251 -37541 -7594 -104215 -36618
7522 -36618 107510 10014 112560 157892 96770 47916 -57252 -119910 -43678 158545 150584
7511 150584 -53018 -40405 5125 197287 90123 110346 138508 293370 247412 314008 312509
7500 312509 453982 582070 601740 702429 730594 755240 791210 802759 794326 696654 623009
7489 623009 627978 559875 357839 361066 273128 286872 313314 224437 226152 134645 161830 150612
7477 150612 109731 183775 224010 124858 247447 263636 215800 150445 106171 308953 292379
7466 292379 235043 165602 209467 201479 -1830 1751 66199 -30147 -105221 -128643 -187134 50802
7454 50802 -28393 -72084 -82456 -118644 -6520 -24584 -22185 -75861 -79488 -97539 -13241 34145
7442 34145 -51469 -42409 11662 80196 40156 3413 -64181 -5150 26417 40132 122106 122058 -542
7429 -542 -63293 -151308 -107439 98450 33312 -175999 -151547 -50234 -9853 -43032 -47275 -45595
7417 -45595 -9608 -47064 52655 43456 30778 -116955 -20304 -109186 -140872 -174286 -89547 -127300
7405 -127300 -164836 -117126 -71539 18437 -184357 -343214 -328905 -57231 -12602 12821 -11917
7394 -11917 -49727 -84220 2549 -63036 -85675 -116797 -11704 22988 -99894 -190556 -177240
7383 -177240 -83386 -138521 -82333 -174777 -182091 -75171 -26875 -120843 -186547 23408 63852
7372 63852 -145417 -47888 92928 -125182 23030 -92729 -105859 -138702 -44526 58455 -38615
7361 -38615 -115553 -23335 -40895 -144038 -77913 -22594 -82179 -64889 7276 64634 26452 7087
7349 7087 51086 48058 -47419 -160004 -67519 -81725 -139035 -190501 -159622 -195304 -104642 -84410
7337 -84410 -120507 60382 87900 -20347 -20203 -126150 2924 -86901 -55075 16178 16941 -15446
7325 -15446 -69836 -64728 20822 5404 65069 128413 182259 -55848 -88384 89041 -30338
7314 -30338 -138096 -146224 -41657 105400 80116 -994 -6465 76986 -10174 -22993 -15434 -99059
7302 -99059 -27708 96459 -111539 -327586 -189547 -109048 -18955 -33158 124597 44550 59233
7291 59233 -15497 -150207 -132614 -131565 -113229 -71615 -100161 10930 58740 72077 138609 44222
7279 44222 43522 31643 -14813 150204 -48980 -125511 -50903 -61909 -29295 32671 -28037 124830
7267 124830 42484 29007 72219 158961 243684 119491 -27091 -31252 106212 247328 235283
7256 235283 208123 184976 93702 -61432 -169408 -172099 -144629 -113466 -67259 -101530 -3945
7245 -3945 179112 -59660 2632 103051 96981 78200 148937 163825 213199 292950 145353
7234 145353 121008 105065 50147 29642 146996 123187 154935 138093 92621 44490 13956
7223 13956 136270 119537 226210 268404 311625 222069 149241 132173 224492 150113 267453
7212 267453 251913 213837 144206 217500 202497 219270 173444 221987 389893 338867 401236
7201 401236 477056 394583 357437 418480 324528 356767 447665 367988 390784 468990 339452
7190 339452 226787 416239 355789 371198 430396 404904 402626 339481 231965 166751 267243
7179 267243 356207 460397 447540 453687 386459 350833 447544 478548 468854 469151 382676 357655
7167 357655 347871 481842 445200 480710 549040 544290 371245 576534 719591 713493 659467
7156 659467 677322 755282 644672 653462 528060 565924 616471 680953 727354 724118 811717 884423
7144 884423 896621 767775 697969 894146 1039038 1128006 1174571 1292057 1245007 1131072 1146033
7133 1146033 1176064 1233619 1236519 1322562 1598876 1566888 1600008 1725823 1703415 1689737 1558405
7122 1558405 1605935 1679988 1825485 1916027 1983613 2063622 2142143 2228917 2169063 2260904 2494103
7111 2494103 2622409 2783599 2757100 2705548 2911277 3015052 3065307 3100705 3262637 3546884
7101 3546884 3598414 3707199 3891074 4132871 4403386 4680252 5089438 5295018 5451701 5576564
7091 5576564 5853990 6328708 6720639 7254847 7695380 8255446 9126574 9976997 10918642 12021011
7081 12021011 13209945 14592922 16228495 18265128 20729879 23862959 27540528 31629464
7073 31629464 35611970 38640976 40106750 39470277 36714394 32725300 28547510 24425691
7065 24425691 20794613 18120454 15910760 14097293 12682800 11484791 10244026 9318536
7057 9318536 8568519 7797148 7086266 6668220 6461453 5887650 5436063 5161198 4812653 4563520
7047 4563520 4413790 4158017 3940806 3794882 3689542 3621249 3411590 3149643 2987337 2922444
7037 2922444 2765174 2609793 2582394 2527631 2362183 2285154 2253006 2102235 1780308 1702512
7027 1702512 1768745 1734428 1704628 1660111 1671219 1642590 1681511 1576730 1462796 1331320 1223699
7016 1223699 1096731 1109281 1113844 1221133 1260319 1232714 1003774 1057018 1060272 1087288 1088844
7005 1088844 1098700 1032298 961642 1034222 866173 834699 867398 804017 907334 864199 677348
6994 677348 596365 604973 811457 721783 754606 663807 829928 610378 640510 650552 504597
6983 504597 605624 593814 545112 510351 475904 504787 477464 493731 563832 486540 539714
6972 539714 541651 514838 427891 545755 526792 488615 378552 231324 317546 418569 434832
6961 434832 331281 409980 440833 212839 230802 403343 432260 400736 318289 375655 478519
6950 478519 373339 459954 419240 443734 388456 227691 233847 172531 22783 191517 241172
6939 241172 296915 274891 152582 266465 266878 335113 513436 307558 207050 181041 136882
6928 136882 171547 162398 226121 292277 273445 334127 271267 202170 256239 189203 199484 270578
6916 270578 178415 145431 376350 445182 382253 297432 455636 312654 164572 174985 201185
6905 201185 194923 242569 225358 129506 208508 386842 233626 152511 116783 94128 68333
6894 68333 177604 230757 202387 229247 165051 102506 159853 170349 244860 369457 377505 327980
6882 327980 255155 186729 236846 226444 216725 321587 477418 463286 376281 448808 403475
6871 403475 543509 724340 631985 504973 628838 608937 677365 686057 848048 565812 477849
6860 477849 514625 488166 429617 498121 688831 600436 453009 398044 416100 293360 327516
6849 327516 373685 288409 334652 313719 303231 391157 265490 317734 425816 358789 282307
6838 282307 236666 101939 27150 101546 246009 108157 161937 186079 211225 305107 307868
6827 307868 224333 46528 85168 162569 82443 200795 316281 251162 152879 180525 169908
6816 169908 272807 239204 165071 221619 171109 173797 256584 141664 1686 31850 -27920
6805 -27920 -78713 5973 37303 23209 -104057 -148756 -105136 -49490 70656 99774 67281
6794 67281 23988 44958 66737 -95388 -118383 -7744 -29776 41427 73434 105420 144236
6783 144236 4925 -41133 72718 65129 217742 193819 -8109 62492 47169 -45421 -43006
6772 -43006 -78700 -56725 -158431 -105567 -131284 -52472 -78145 36998 85785 161521 160377 -79306
6760 -79306 -147647 -105949 -44498 70026 15364 -22585 28594 -162966 -209618 -73943 -44129
6749 -44129 -233951 -253128 -165368 -108693 -137732 -156964 -10805 147521 114636 54911 -42664
6738 -42664 10380 120757 96721 -27786 -4426 37827 52173 203367 69908 -83593 -119022
6727 -119022 -124191 -11347 -107847 -43110 -27465 36081 -17024 40848 86316 -40947 80302
6716 80302 124721 70989 -48837 -27398 -20543 35572 -91246 -19916 53681 5844 57891 67511
6704 67511 63684 169490 54454 69590 -27444 -99594 -24955 55238 177760 169144 171135 238380
6692 238380 -54237 -131327 -51527 53911 -94495 -264686 -107472 9431 113797 62553
6682 62553 -14527 -118995 9935 -32244 83615 162104 71079 64585 236787 201208 116879
6671 116879 146302 325004 247351 265785 390695 333527 205521 113827 95409 191699 176594
6660 176594 128234 -1793 143161 149451 167872 136812 141925 128779 144179 166341 85982 177839
6648 177839 234973 77579 -26376 48735 41424 164283 200302 98175 123342 156627 154374
6637 154374 93880 -16072 -19937 -33185 -26150 -130045 -37278 -90429 -81764 -52914 -99755 -72582
6625 -72582 53814 -81288 -47635 68050 118640 144216 54568 37369 64933 53231 64510
6614 64510 3919 -22244 3919 107543 94208 191928 132613 39473 4819 -27984 60863 -78252
6602 -78252 -65355 67148 61792 49361 263838 309371 170330 70230 -23202 57302 38334
6591 38334 109810 231513 158924 46073 127618 65674 -14646 55728 3759 36443 -11179
6580 -11179 12889 103493 267023 137716 -40214 10011 13942 42462 99900 7890 -69515
6569 -69515 -130126 -140233 -167495 -247919 -165177 -56141 42392 156284 -15764 -186028 14495
6558 14495 222985 16060 52613 55496 -166826 -64156 72269 -28481 -31346 -101594 -54783
6547 -54783 157199 84713 100214 102136 5409 73595 55382 21229 216460 282580 138435
6536 138435 -65226 -47067 -58914 -79 37948 28364 24580 -95973 -25979 40984 -124143
6525 -124143 -116733 3689 81516 -18425 -103033 -2558 133464 67321 6580 54460 -114065
6514 -114065 82980 43664 -102469 -38175 15880 -55804 89498 84788 74209 -19803 77895
6503 77895 154096 46177 150999 176266 146970 97368 176873 -44932 -85937 -51821 -80488
6492 -80488 -127196 -8194 46189 59050 172022 174173 74554 30113 47533 100758 103091 158742
6480 158742 -118419 -2428 109160 77753 8706 -110510 -145070 35700 151598 51589
6470 51589 -4677 -14344 22275 43829 -99771 23687 160270 181029 252866 111615 162521
6459 162521 26783 122290 112034 2358 -30765 -96514 -72838 -10042 44458 16624 6431
6448 6431 126261 61807 -22466 62344 212870 -34666 -107465 -45639 -77239 -99786 101163
6437 101163 132739 103485 180161 7369 8916 133256 185429 184492 187072 133912 90493 99989
6425 99989 55621 -70543 119174 69751 926 -20780 96558 -24294 -148329 -39967 -67070
6414 -67070 -102094 92909 79652 -98554 -87044 -108444 -490 -31726 158140 132661 40371
6403 40371 4923 -110296 39655 -48727 -73240 56119 173405 256280 180249 183252 238799
6392 238799 224048 280914 358913 317539 329306 140680 198505 267193 45386 66953 218119
6381 218119 203974 205954 122914 15382 -155348 -35048 167428 82468 36476 122169 110675
6370 110675 18819 -26344 127915 235322 159412 238917 358535 296143 125548 -57778 111025
6359 111025 163812 198272 164514 212845 240005 379978 226253 90597 203133 84630 41813
6348 41813 29207 19641 -25798 177513 156655 60352 21563 158857 234601 236968 224610 189745
6336 189745 69652 39553 75028 154948 356435 362324 350319 147939 289218 307427 188011
6325 188011 333654 219770 157113 122983 88090 -53993 124501 200215 94567 163222 334655
6314 334655 151668 127691 146203 211715 231030 108172 86951 108152 13670 85705 223809
6303 223809 132225 156560 216826 95936 127988 223588 234298 148776 227820 307653 211764
6292 211764 77416 95201 159719 281782 451309 358770 19245 177276 353167 303953
6282 303953 211291 265642 332752 277207 152476 60012 289982 203284 159537 242170 253218
6271 253218 182372 326914 244802 95231 235714 266104 157784 181688 214754 218394 288970
6260 288970 204058 116314 214218 255851 246905 300262 456105 486581 361657 314088 203568
6249 203568 165072 226813 390719 477785 489878 397571 364803 393605 389753 476677 331890
6238 331890 307157 213840 391985 366934 221917 317340 432034 434119 492645 519576 464689
6227 464689 505081 682718 534350 496652 642518 653611 414362 443136 480304 449970 328334
6216 328334 425860 549411 533913 629030 618108 638300 777666 869864 790133 760808 723716
6205 723716 634884 760102 756994 665461 769856 809381 864300 898927 842622 702647 794761
6194 794761 770694 923832 886383 993823 993786 960988 1070756 1241030 1314471 1188797 1076235
6183 1076235 1018423 995552 1152497 1230267 1196586 1209096 1148025 1220794 1334218 1334067 1439150
6172 1439150 1453529 1617199 1563539 1556267 1505326 1397382 1504867 1718108 1853937 1914219 2213559
6161 2213559 2196354 2308824 2485240 2514822 2300051 2236795 2163614 2282525 2406920 2299262
6151 2299262 2245350 2097164 2027399 1905920 1912508 1911498 1926868 1997703 1903385 2021446 2101921
6140 2101921 2065496 2171190 2145837 2258189 2607398 2767746 2926731 3246809 3311400 3766643
6130 3766643 4101890 4458360 4558125 4627104 4586832 4105014 3910350 3706660 3699441 3489948
6120 3489948 3366719 3173668 2931688 2744614 2746223 2678584 2503087 2576559 2589158 2588259 2695695
6109 2695695 2804964 2754503 2940244 3080268 3157063 3305847 3423510 3624964 3683126 3873416
6099 3873416 4129806 4528371 4770483 5081602 5166361 5052259 4813624 4652405 4578778 4251228
6089 4251228 3994276 3768895 3625794 3659695 3574663 3655465 3615664 3628496 3754138 3702894 3727704
6078 3727704 3542455 3317902 3151498 3263491 3250349 3126785 3108524 3181454 3201914 3193651 3262447
6067 3262447 3416398 3592681 3713129 3862963 3945939 3996550 4125773 3974654 3903070 3900878
6057 3900878 3922299 3937353 4065669 4226625 4401545 4654138 4919525 5405209 5783473 6121112
6047 6121112 6289770 6087572 5662679 5262076 4968743 4658715 4372138 4238581 4031815 3967809
6037 3967809 4026550 3904399 3790498 3763335 3818458 3852153 3829110 3777650 3776072 3852708 3764101
6026 3764101 3836663 3953674 4121922 4266043 4447932 4814018 5006464 5226881 5699891 6060955
6016 6060955 6561662 6956089 6860546 6663829 6204597 5759073 5411384 5145529 4980634 4893179
6006 4893179 4500617 4453422 4183740 3944538 3817675 3768115 3674862 3551385 3572113 3633068
5996 3633068 3669450 3614646 3714739 3644592 3799791 3756607 3786923 3906616 4145584 4376784
5986 4376784 4448941 4538686 4592824 4778159 4790459 4895662 4909519 4864539 4671554 4771424 4587483
5975 4587483 4426362 4376484 4185970 4209802 4110046 4011933 4012308 3975939 3967723 3863044 3752913
5964 3752913 3728555 3614890 3733991 3772506 3933922 3840516 3966189 4113783 4152222 4200275
5954 4200275 4221031 4330386 4600015 4494440 4446596 4519789 4787201 5049983 5236252 5482783
5944 5482783 5493431 5471695 5374949 5327085 5303578 5320894 5410309 5438812 5550750 5498309 5543254
5933 5543254 5576986 5754873 5910733 6011658 6119857 6387893 6486106 6764752 7016900 7142029
5923 7142029 7319725 7607675 7969823 8285367 8732702 9231293 9869183 10482957 11162679 11987704
5913 11987704 13080179 14238805 15318259 16241945 16558197 16420164 15911640 14948944 14033438
5904 14033438 13330254 12820359 12166870 11898543 11603785 11461331 11414629 11451050 11547623 11694369
5894 11694369 11917599 12160416 12452837 12954302 13292256 13875556 14645242 15530226 16689213
5885 16689213 17812532 19160177 20926663 23215815 25962273 29054383 32195427 35037022
5877 35037022 36585635 35773279 33310769 29853351 26668843 23913076 21706484 19962971
5869 19962971 18374486 17277668 16469960 15673347 15151429 14719700 14523288 14523416 14447952 14436369
5859 14436369 14650742 14721585 15117996 15819880 16463168 17506488 18517047 19804909 21468093
5850 21468093 23656847 26331197 29450171 32561763 35277331 36525026 35525908 32814475
5842 32814475 29218020 25563285 22705190 20357082 18277908 16668024 15376830 14149452
5834 14149452 13254435 12519219 11698041 11241815 10859760 10425623 10164839 9973036 9912430 9807091
5824 9807091 9730363 9797204 9878705 9799761 10138701 10575601 11188984 11960515 12957357 13858086
5814 13858086 14493369 14679550 14216194 13270056 12040947 10903374 9854398 8954820 8181272
5805 8181272 7615422 7032348 6546614 6061177 5669119 5352867 5208019 5102148 4820699 4461921
5795 4461921 4242746 3968214 3839319 3824266 3791675 3450593 3145739 3050357 3179770 3168249
5785 3168249 3067816 3039540 2944909 2809484 2580876 2591821 2626560 2654387 2444906 2409869 2376269
5774 2376269 2185070 2170744 2124599 2147756 2270856 2150715 1965060 1898576 1842605 1803305 1771140
5763 1771140 1637028 1634546 1674223 1674436 1709991 1635703 1630554 1653495 1537526 1483569 1448101 1489898
5751 1489898 1487701 1478461 1645583 1573260 1413371 1284702 1189845 1236320 1350725 1241766 1356470
5740 1356470 1354677 1138540 1255150 1177847 1148527 1233023 1228635 1113955 1067081 964494 990943
5729 990943 1136244 1238939 1109263 1066168 989443 952413 964189 1237335 1246964 1001582 909640
5718 909640 919397 979684 857503 1025581 975517 935573 782530 840843 955425 908458 944556
5707 944556 993743 963069 1118358 1025014 883737 831552 869016 953886 881528 854988 858135
5696 858135 750802 770980 796876 677207 714090 872038 849141 909778 846899 865607 851355
5685 851355 739556 755545 712697 719270 805294 1017634 879590 922559 1091415 1154962 1161077
5674 1161077 1221008 1120617 1184631 1205288 903181 781120 711075 574713 734111 836774
5664 836774 754800 767145 715599 690501 748772 502048 473631 595273 803423 761276 710692
5653 710692 605723 426228 662969 608269 633926 732602 639887 615884 582101 558552 567092
5642 567092 519474 445252 414712 533279 542778 658892 793882 764873 596296 691889 746580
5631 746580 675511 569224 656424 595102 375698 459359 377698 492203 537649 465649 567930
5620 567930 670541 613357 591699 523630 741156 654067 498979 576030 650112 629962 567162
5609 567162 471151 418733 606880 382757 402329 315821 409268 582161 417362 529651 599958
5598 599958 661436 575634 539647 424599 497963 611009 633651 611349 523928 556166 598169
5587 598169 835498 727494 641912 564859 661147 750535 700294 552289 531815 640700 614922
5576 614922 654082 705612 659296 639996 647778 808711 807845 611259 767329 817311 732099 749778
5564 749778 675227 602315 565610 647544 539478 602954 704303 755232 747959 756298 824976 832715
5552 832715 838754 794787 756026 909394 1094771 940680 924587 992172 1024677 1061916 959433
5541 959433 1010077 1081736 965280 1045513 1149425 1248785 1404438 1330820 1228198 1480972 1508112
5530 1508112 1479162 1459573 1455231 1626622 1784792 1853168 1914038 2013866 2038760 1911287 1762927
5519 1762927 1805992 1787288 1746407 1736095 1699557 1584315 1431169 1422517 1387085 1274372 1337702
5508 1337702 1461468 1409074 1211466 1051082 1137475 1114367 1109512 1166459 1169976 1098817 1072400
5497 1072400 1145368 1005691 1249811 1159288 1010786 1054532 1068895 1171855 1066123 1216034
5487 1216034 1177519 1161310 961733 853244 963582 1057868 1094102 1139696 1143259 1164947 1131968
5476 1131968 1163236 1131304 1064233 1092317 1115253 861442 920179 1131029 897052 921419 1032305
5465 1032305 1148733 1158141 1149369 1221358 1137960 1081262 1314888 1494410 1394191 1258932 1136173
5454 1136173 1246723 1173109 1137757 1217927 1372432 1272310 1168603 1068752 1105293 1275621
5444 1275621 1227812 1337900 1315214 1182233 1366459 1515980 1421293 1422339 1596594 1598090 1621077
5433 1621077 1540194 1393623 1367319 1273427 1372876 1548315 1417444 1343584 1531704 1503372 1459250
5422 1459250 1217267 1263886 1295172 1502129 1588980 1576739 1607774 1605749 1647076 1689604 1517747
5411 1517747 1588533 1625108 1625680 1601662 1661516 1688495 1480005 1539581 1653676 1708848 1603528
5400 1603528 1554410 1672133 1544310 1478846 1508296 1630187 1581951 1702656 1801009 1953949
5390 1953949 1864931 1720330 1709048 1755373 1767539 1823100 1902484 2010899 1979659 1970664 2003337
5379 2003337 1948163 1964981 1949836 2061775 2142890 2154280 2145824 2339410 2278095 2251105 2111553
5368 2111553 2215509 2342813 2533040 2553890 2423778 2364922 2478022 2525169 2588803 2656328
5358 2656328 2750398 2708369 2810787 2831963 2913009 2798393 2750671 3019888 2929344 2916233 2859249
5347 2859249 2780919 2800634 2921887 3097662 3169582 3287618 3315585 3228408 3078287 3250867
5337 3250867 3242637 3257783 3411302 3474553 3613310 3606891 3713581 3591614 3646176 3716406 3695261
5326 3695261 3922480 4100361 3968456 3955188 4295092 4392984 4318214 4437541 4506219 4528665
5316 4528665 4532310 4750032 4726023 4935404 5062138 5094167 5159005 5350103 5373948 5353487 5484087
5305 5484087 5529236 5734566 5782495 6019765 6167290 6192765 6227219 6375336 6376423 6656911 6878414
5294 6878414 7048535 7457203 7731799 7831833 8133501 8462339 8707833 8967026 9104622 9484581
5284 9484581 9793258 10070181 10378509 10713402 11008589 11356959 11617974 11835171 12021802 12290744
5274 12290744 12732705 13061856 13530241 13855746 14225361 14550145 14962356 15514614 16002194
5265 16002194 16412755 16884948 17444354 17997134 18698817 19467492 19954564 20714993 21497414
5256 21497414 22163105 23137759 23902304 24878072 26012311 26957496 28147650 29552466 30969300
5247 30969300 32504216 34212733 36054447 38087155 40156555 42569156 45140204 48013205
5239 48013205 51516857 55225832 59509500 64334469 69876971 76031188 82901836 91009560
5231 91009560 100507872 111702660 124771782 140012083 157127920 175057087 192602650
5224 192602650 209249356 222075334 229219355 231095957 227041488 217254384 202694716 184943307
5216 184943307 165917534 147670542 130668067 115400513 102488758 91810779 82603361
5209 82603361 74879328 68218326 62764120 57940205 53621499 49849620 46105862 43064538
5201 43064538 40415635 37978930 35770683 33814004 32052793 30649759 29431382 28229401
5193 28229401 27032458 25831488 24675886 23687666 22874163 21993704 21093836 20255242 19581744
5184 19581744 18793364 17931029 17189005 16418245 16017052 15608256 14797098 14280398 13834514
5175 13834514 13363786 13052434 12691670 12364502 11833808 11423274 10913699 10652358 10583723 10359301
5165 10359301 10133075 9991424 9947516 9657794 9345340 9135174 8880604 8638280 8439965 8136849
5155 8136849 7946755 7698928 7605838 7461811 7232348 7058302 6911058 6742945 6813772 6783549
5145 6783549 6623200 6452103 6204138 6092049 5900674 5620069 5314655 5401141 5428475 5237472
5135 5237472 4964432 4757825 4852504 4633941 4375930 4372521 4403470 4375195 4118138 4112424 4130356
5124 4130356 3879238 3867949 3896657 3675549 3594831 3498836 3501068 3574088 3523281 3424674 3332329
5113 3332329 3391475 3368586 3163783 3078866 3062739 3072803 2980675 2808095 2721245 2819522 2657782
5102 2657782 2483333 2424727 2286279 2395963 2476625 2506805 2515600 2497244 2371043 2287745 2182869
5091 2182869 2198578 2127011 2130047 2350702 2186977 2087733 2099453 2046853 2088500 1962242 1813450
5080 1813450 1872207 1947675 1827937 1893998 1890770 1796720 1931549 1963029 1839048 1744139 1758245
5069 1758245 1774033 1892267 1854163 1918443 1791894 1572320 1621332 1535501 1546345 1448259 1484513
5058 1484513 1615103 1536167 1449479 1435933 1558751 1613548 1445402 1279336 1329053 1312895 1339380
5047 1339380 1316849 1305553 1392361 1297632 1293670 1215991 1204311 1361104 1227227 1068330 901557
5036 901557 759310 820786 743831 915035 901685 912762 1050504 1109547 1078838 887173 885550
5025 885550 735099 773916 963548 832691 690680 832339 734081 783487 856869 764275 804142
5014 804142 804841 735983 759947 749962 824908 687926 693385 802222 740060 814427 738880 785249
5002 785249 911543 725838 729517 537523 573337 734297 805203 830972 935850 1003305 897796
4991 897796 771319 707032 714211 659377 821057 739184 657201 734606 717603 525792 606646
4980 606646 562998 624121 674969 695252 646722 593549 659377 643554 671075 611774 766038
4969 766038 792939 765933 787356 672165 599135 656557 676887 639356 603859 585455 478959
4958 478959 424983 550589 318073 247560 532936 689956 516286 255749 357751 512588
4948 512588 442169 584788 644872 633719 722295 732819 641633 516309 616672 685475 625222
4937 625222 719547 616966 713644 678558 706078 725185 691651 558141 825861 906937 822000
4926 822000 1032574 931553 1060694 1235729 1337867 1534640 1594993 1571626 1591030 1568559
4916 1568559 1511477 1470998 1377863 1274836 1315322 1190293 990825 974944 859391 852156 873185
4905 873185 892465 759959 613128 686121 666122 690993 598693 767331 635696 528226 614522
4894 614522 591602 618695 625088 499773 567138 645396 762104 700158 377578 226384 325765
4883 325765 407632 442706 523978 486729 461065 537765 475984 334963 273167 327876 324880 291315
4871 291315 289856 494796 419056 267330 340769 370059 470444 432726 575546 583998 467683
4860 467683 343311 293955 507315 544319 500184 461946 431757 505766 560289 456902 481028
4849 481028 573081 470860 376963 242258 225004 291505 416905 422276 402330 312288 142481
4838 142481 287463 475924 461379 419365 415709 356907 230333 367632 337751 337539 500283
4827 500283 334303 228179 278085 332556 350572 244778 206680 241420 363364 419804 365470
4816 365470 269141 187073 292484 276981 494132 573974 615453 508017 401136 290357 267442
4805 267442 292936 261755 341762 309260 161812 229907 330492 254972 325458 220142 132251
4794 132251 335338 406148 375330 437762 451628 423813 370639 431248 517712 365135 345517
4783 345517 356881 276546 240081 410829 524530 629957 555199 341152 263425 359262 445586
4772 445586 496169 476865 426355 621757 618541 618678 468916 318898 349653 377310 439432 550498
4760 550498 370995 376466 513775 603035 412648 335215 446882 661883 538702 423982
4750 423982 429392 450258 590800 602436 295842 225625 229111 449734 574306 460014 391001
4739 391001 244795 339569 283371 438657 449511 449692 336287 317779 390590 496608 660413
4728 660413 580195 459514 456549 591429 507957 545424 435858 440168 542004 441610 371317
4717 371317 283813 435617 374112 325507 461643 572289 565806 575827 589494 471050 480774
4706 480774 505079 547241 506166 464977 644110 668758 506470 579921 396483 395560 486790
4695 486790 450804 515563 568162 546250 507008 543561 508103 625271 567021 688238 678776
4684 678776 570627 670193 590352 569905 606168 389213 540659 568284 478676 637102 635260
4673 635260 521798 558043 495315 683162 796285 584499 533693 494181 626977 598576 564206
4662 564206 438483 461576 487428 620559 735858 697369 735191 645596 595268 620380 621069
4651 621069 539938 565038 509979 526265 461053 356239 650868 763651 645628 699439 537016
4640 537016 533467 594747 658192 597865 465422 479459 561816 413788 432647 625254 630286
4629 630286 599992 513997 537166 729266 693290 630529 636547 536863 682574 645771 472245
4618 472245 532112 585679 671249 715720 640375 696634 601247 752596 835520 706087 657761
4607 657761 645825 739436 734622 710467 628586 676274 838632 708846 618051 591995 698455
4596 698455 840909 855079 630900 559770 510682 605647 733428 725610 654588 675876 936678
4585 936678 812216 682751 817498 916704 722284 599869 649145 810925 744207 762575
4575 762575 728214 690961 709016 654384 822544 887215 825143 860627 884850 887128 852117 853292
4563 853292 816090 711231 934214 834817 768431 921107 961889 934734 811785 831606 965513
4552 965513 1215385 1227224 1137103 1047089 1044479 1161868 1174899 1139882 1032127 868240 833549
4541 833549 926557 1029084 988976 1026883 1156639 998250 1088387 1106864 1055029 1109439 1115122
4530 1115122 1258403 1144835 1236979 1283755 1235244 1407180 1254073 1229447 1380250 1163303
4520 1163303 1166643 1385557 1319419 1184504 1260214 1556380 1588628 1452561 1290122 1404635
4510 1404635 1509283 1446404 1381127 1275840 1323431 1334830 1367639 1494016 1189946 1218370 1325114
4499 1325114 1204743 1393953 1287942 1326267 1453077 1536323 1488237 1331127 1364090 1521716
4489 1521716 1521772 1507644 1562770 1614879 1677704 1793344 1940193 1944387 1820841 1782096 1899292
4478 1899292 1931385 2015529 2004191 2316029 2461847 2572907 2521274 2559267 2791144 2817615 3009946
4467 3009946 2984390 2798958 2675722 2527261 2582004 2540488 2465888 2545020 2501162 2564127 2544304
4456 2544304 2559653 2571592 2554438 2527225 2598522 2787642 2779345 2802262 2831615 3046059 3067315
4445 3067315 2990762 2964573 3093884 3265315 3347460 3501944 3597682 3710794 3691958 3702671 3620602
4434 3620602 3646380 3803853 3846425 3866763 3721679 3735669 3967808 3974882 4202855 4223083 4227437
4423 4227437 4499484 4761528 4916060 5091314 5257739 5452473 5409145 5255486 5499280 5706069
4413 5706069 5817206 6136956 6402531 6668117 6999272 7446546 7832575 8607304 9346152 10181552
4403 10181552 11269941 12612989 14200129 16023417 17667212 18666827 18573825 17484834 15866178
4394 15866178 14016953 12750516 11693516 10813286 10269780 9704890 9183274 9122648 9069680
4385 9069680 8898230 8951495 9084597 9060432 9010426 8921147 8785921 8713833 8592940 8521023 8690477
4374 8690477 8614841 8706435 9062335 9310326 9683323 10176699 10877103 11734433 12792899 14127414
4364 14127414 15833886 17228573 18404998 18910118 18254801 16889948 14926328 13263155
4356 13263155 11795838 10574827 9663231 9039201 8432954 7678180 7210456 6846657 6636109
4347 6636109 6518150 6148445 5948682 5829021 5611100 5418386 5260769 5203543 5180404 5110781
4337 5110781 4981308 4947368 4879690 4753033 4846388 4973184 4951075 4720699 4781842 4773228 4703257
4326 4703257 4744018 4794330 4765386 4924673 4908400 4834990 4927450 4846341 4984875 5211232 5354253
4315 5354253 5412030 5291213 5420274 5279650 5140641 5056636 4920678 4863652 4879164 4929066
4305 4929066 4919298 4820551 4792171 4844661 4785419 4819264 4892366 4873238 4973001 5173727 5315653
4294 5315653 5369468 5426700 5682480 5831803 6004350 6320427 6566102 6714669 6881176 6711320
4284 6711320 6606271 6284230 5893979 5692442 5723825 5802510 5647084 5510504 5507833 5543337
4274 5543337 5455818 5410044 5299187 5170442 5189403 5161154 5268750 5308818 5285490 5409800 5374315
4263 5374315 5379501 5501633 5651131 5768324 5852070 6070774 6273712 6378240 6372413 6529945
4253 6529945 6616393 6880915 7088742 7252098 7366287 7570121 7727741 7888834 7910305 7940643
4243 7940643 8078144 8031103 7948755 7999076 7893736 7832989 7839432 7770229 7730086 7895056 7966260
4232 7966260 8011725 8023530 7983891 8042868 8281027 8329370 8407322 8548725 8738801 9006864 9204452
4221 9204452 9367232 9285311 9432949 9658842 9759955 9738797 9835474 10106777 10343012 10487700
4211 10487700 10708108 10956555 11166609 11399471 11543167 11827496 12184231 12365114 12719978
4202 12719978 12655681 12984315 13114014 13317750 13512055 14004555 14409092 14603144 14906713 15232528
4192 15232528 15623389 16025526 16509359 16719323 17261440 17787245 18221166 18627505 19194137
4183 19194137 19782764 20320013 21045306 21579619 22252584 23008147 23762248 24536206 25474310
4174 25474310 26266926 27229130 28323532 29482493 30895370 32363075 33932500 35798941
4166 35798941 37815887 40005845 42605065 45419153 48522885 52097082 56067414 60382718
4158 60382718 65480566 71579182 78903591 88002015 99021489 111397276 124464586 136044033
4150 136044033 142886517 142671731 134967761 122782803 109479857 97450987 87451540 79493455
4142 79493455 73209103 68146067 64137348 60739392 58146358 55971311 54329223 52962239
4134 52962239 51878932 51103449 50477855 50115881 49707016 49509342 49831639 50021485 50531451
4125 50531451 51222267 51909152 52867248 53820187 54603960 55567943 56681182 58040259 59574265
4116 59574265 61218071 62891196 64826314 67249744 69980859 72945749 76589181 80507502
4108 80507502 84833450 89775537 95305881 101626972 108912086 117226403 126988590 138441513
4100 138441513 151850046 168223338 188103993 211607383 239295349 271026779 303818599
4093 303818599 333581870 358690826 375803677 379143261 368638918 347047609 317473583
4086 317473583 284781684 251611013 220035082 192961213 170773185 152319128 136905347
4079 136905347 123965565 113045922 104018231 96334548 89585557 83721684 78751828 74095486
4071 74095486 69947037 66171413 62587178 59623277 56929880 54403991 51997000 49867263
4063 49867263 47998618 46199268 44385904 42475017 40840016 39567685 38354033 36944607
4055 36944607 35277502 33810562 32529919 31288840 30158595 28914189 27906958 27030914
4047 27030914 26230999 25526475 24786616 24114982 23341725 22818090 22329454 21722954 21186272
4038 21186272 20770596 20265342 19679578 19136331 18764428 18412728 18003932 17649669 17154746
4029 17154746 16868618 16508181 16105937 15965023 15648007 15265449 14964938 14602515 14441342
4020 14441342 14092255 13760245 13605352 13451812 13079398 12925202 12781282 12711080 12494538 12230416
4010 12230416 12103622 11865650 11549024 11367161 11137760 10751207 10494923 10359116 10072089
4001 10072089 9915243 9898791 9707720 9648590 9490119 9345221 9447085 9359917 9150473 9143290
3991 9143290 8905280 8809457 8765794 8576726 8615402 8585479 8383802 8255338 8388427 8604861
3981 8604861 8291124 8173436 8324095 8342292 8112418 7947707 7965397 7776544 7782358 7733940
3971 7733940 7551286 7563248 7561046 7619057 7679204 7549998 7516711 7577557 7773658 7766568 8030016
3960 8030016 8190267 8098263 8161265 8256215 8305968 8439072 8518654 8470402 8660627 8645159 8634086
3949 8634086 8763603 9112831 9557029 9802411 10059701 10358708 10875290 11212749 11619747 12459677
3939 12459677 13107369 13723806 14135138 14193352 13995301 13491294 12922192 12342524 11460607 10758622
3929 10758622 10173982 9655831 9175334 8754629 8373123 8146953 7789989 7600732 7458526
3920 7458526 7033311 6962980 6821925 6752984 6695245 6550535 6477566 6388043 6531088 6415526
3910 6415526 6462319 6422395 6341568 6461079 6470399 6500709 6489527 6574293 6620106 6652065 6720796
3899 6720796 6718805 6504793 6332851 6086647 5905026 5820654 5720318 5439757 5390625 5407054
3889 5407054 5186408 5020841 4954538 4808309 4770566 4758028 4630896 4484147 4600454 4712361
3879 4712361 4372552 4233220 4331879 4348634 4327305 4295587 4215607 4176490 4200192 4257847 4283239
3868 4283239 4433655 4572363 4461483 4346268 4312255 4439299 4628573 4487819 4551776 4602000
3858 4602000 4477421 4246432 4205357 4153542 4078258 3997900 3875407 3790230 3760910 3861848 3749845
3847 3749845 3860260 3880274 3792847 4012039 3842678 3796108 3676332 3788975 3844606 3745785
3837 3745785 3778068 3757588 3774496 3751119 3794677 3855623 3725855 3698748 3546591 3341751 3343323
3826 3343323 3382124 3452690 3388802 3510832 3466970 3476176 3500932 3521313 3522461 3372061 3407791
3815 3407791 3632206 3665130 3570273 3613764 3572608 3661442 3704704 3631386 3757453 3820840 3947160
3804 3947160 3878489 4024644 4221608 4291733 4332570 4694593 4764329 4783869 4868672 4777939 4607548
3793 4607548 4569728 4588199 4391642 4149482 3979529 3858065 3723043 3588893 3619781 3499833
3783 3499833 3311138 3181352 3213781 3149598 3203357 3203507 3350237 3376220 3231467 3091901 3087843
3772 3087843 3011478 2916797 2835291 2982752 3040489 2887872 2833284 2678067 2698885 2826481 2847755
3761 2847755 2831082 2708071 2497508 2531816 2589843 2652994 2572764 2604364 2523258 2454344 2510629
3750 2510629 2576416 2619655 2645104 2583537 2573429 2543732 2649623 2577336 2536234 2473554 2391540
3739 2391540 2455617 2395398 2428353 2570486 2475952 2500123 2530826 2430994 2430518 2371325 2193372
3728 2193372 2304928 2430447 2499017 2553562 2488336 2396769 2422558 2503797 2487851 2421698 2570512
3717 2570512 2576064 2436862 2285125 2185819 2188292 2204845 2288212 2280168 2207228 2267329 2327606 2356055
3705 2356055 2369733 2476618 2541566 2602925 2556634 2601683 2347407 2429731 2399690 2356185 2337473
3694 2337473 2335747 2303527 2230000 2280167 2182506 2203689 2164232 2085336 2129423 2304168 2201418
3683 2201418 2198586 2141874 2101843 2049766 2188001 2212389 2103946 2080048 2151703 2088014 2117816
3672 2117816 2158437 2287553 2326106 2137149 2208194 1974398 2058458 2325754 2111877 2023133
3662 2023133 2046702 2063874 2134109 1974631 1920263 2004163 1965916 1871308 1863735 1877195 1989262
3651 1989262 2163949 2152784 2160558 2131370 2211107 2121154 1984416 2056320 2032866 2021094 2252352
3640 2252352 2360098 2204536 2043567 2127436 2045095 2095464 1972425 1992976 1960206 2014892 1983654
3629 1983654 1821442 1746454 1955501 2035948 1966932 2202236 2153536 2032483 2007952 2042707 2108216
3618 2108216 2152369 2086221 2014910 1842570 1916234 2057418 2095237 2006306 1984529 1889010 2011440
3607 2011440 2079300 2036860 2250475 2232454 2111018 2055336 2069218 2051755 1889866 2012882 2067943
3596 2067943 1990856 2042237 2065934 2121021 2095498 2184255 2235746 2121530 2077937 2094296 2103936
3585 2103936 2153367 2228480 2143253 2154825 2075772 2052732 2316742 2205552 2146951 2257584 2050186
3574 2050186 1859983 2054168 2199649 2217312 2118434 2151237 2219640 2194669 2066922 2057607 2217788
3563 2217788 2514790 2484349 2241786 2113862 2094961 2189275 2090901 2031043 2031648 2174265 2115289
3552 2115289 2152966 2219401 2458218 2655423 2488995 2592907 2567060 2573148 2469782 2375484 2423607
3541 2423607 2506542 2587281 2543831 2544780 2425002 2536046 2534646 2478078 2616712 2599130 2582804
3530 2582804 2596324 2668104 2711076 2674205 2673638 2637164 2598007 2671031 2783416 2842560 2853030 2919645
3518 2919645 3011779 2986779 3091335 3176034 3259559 3237076 3274771 3268418 3196133 3310373 3484193
3507 3484193 3449428 3529645 3680208 3666128 3636148 3496502 3690406 3775953 3846367 4074925 4144906
3496 4144906 4248631 4234867 4235561 4162031 4377080 4565948 4613553 4720017 4818147 4954525 5112761
3485 5112761 5367835 5589520 5634597 5736103 5812461 5932546 6102947 6271481 6528794 6685343
3475 6685343 6958498 7200795 7506385 7754841 7759145 8052204 8470074 8838243 9233051 9668841
3465 9668841 10097071 10584679 10978512 11596878 12155948 12925203 13775182 14656360 15814080
3456 15814080 17030618 18424596 19985433 21903139 24607740 27699031 30968900 34513035
3448 34513035 37960584 40039140 39761283 37452687 34122468 31193281 28752235 26500636
3440 26500636 24690449 23422051 22343409 21728337 21348323 21064098 21020905 21222836 21532113
3431 21532113 22019862 22382371 23129676 23976793 25143627 26916586 28513736 30244957 32691542
3422 32691542 35649509 39247777 43805796 49542164 55962204 62996056 69582272 73117769
3414 73117769 72188209 67434195 60462272 53705261 48242018 43543710 39530334 36442494
3406 36442494 33605952 31307983 29415011 27738374 26634693 25627139 24755759 24194434
3398 24194434 23808576 23736145 23851966 24124959 24557344 25185578 26221673 27455852 28974428
3389 28974428 30759735 33337168 36155827 38918785 41673022 44354679 45830736 45236939
3381 45236939 42925838 39662526 36565914 34027777 31861270 29724205 27671866 25737269
3373 25737269 23801384 21894762 20404558 19278839 18217025 17446706 16820220 16230648 15958087
3364 15958087 15709623 15478648 15616143 15729478 16037685 16532207 17233782 17803127 18424034
3355 18424034 18677126 18181040 17330848 16346380 15537134 15079704 14708524 14451784 14267301
3346 14267301 14099907 13899457 13812128 13462847 12895213 12385033 11734081 11266466 10735744 10240285
3336 10240285 9874064 9834252 9633232 9508454 9517946 9510646 9481514 9595420 9829738 10005227
3326 10005227 10345831 10711509 11226884 11561268 11409681 11040709 10514555 9988145 9750786
3317 9750786 9597524 9428363 9120204 9022307 9117827 9062708 8993055 8763151 8469732 8110172
3307 8110172 7815488 7495372 7249583 7086615 6996471 6777362 6533791 6495476 6453043 6406372
3297 6406372 6445299 6507855 6440816 6418075 6409421 6400903 6256849 6390713 6386440 6207568 6403470
3286 6403470 6407673 6373848 6490083 6568107 6669442 6817295 6975454 7227056 7257204 7026741
3276 7026741 6832216 6608227 6410562 6331280 6347961 6440501 6291410 6161984 6300099 6281842
3266 6281842 6195004 6105572 6060658 6038693 5906947 5771788 5488425 5335491 5214907 5007707
3256 5007707 5103321 5141991 5084634 5115158 5138727 5183182 5195142 5170897 5130283 5232716 5333746
3245 5333746 5341834 5463206 5438311 5402742 5222601 4980506 5060018 5202007 5181745 5161802 5160104
3234 5160104 5160428 4941316 4732538 4598945 4644105 4317916 4120807 4143119 3983093 3697574
3224 3697574 3569945 3536959 3330249 3208009 3197573 3102564 3020493 3028562 3025208 2899314 2787907
3213 2787907 2742330 2780123 2712090 2664507 2842728 2664947 2629026 2609734 2768920 2801296 2755400
3202 2755400 2732033 2769757 2555537 2545325 2402886 2277257 2170932 1935775 2083475 2173613
3192 2173613 2009551 1950600 1850926 1839307 1755976 1738121 1703517 1700176 1674194 1730589 1723278 1592544
3180 1592544 1813438 1741378 1559587 1571856 1614992 1575687 1547433 1364148 1473344 1584274
3170 1584274 1476222 1406719 1450766 1427765 1359718 1234757 1254630 1353599 1420201 1405487 1416107
3159 1416107 1443922 1533211 1552525 1273358 1176555 1234005 1230279 1123506 1092506 1234311 1344250
3148 1344250 1348628 1268589 1345887 1262896 1277856 1180234 1090977 1180128 1059629 976831 1175172
3137 1175172 1222463 1076463 1034751 1087963 1066951 1235957 1159747 923396 1021719 1073929 1121960
3126 1121960 1116419 1130013 1224868 1204817 1050696 942204 985575 1099250 995106 887762 881378
3115 881378 861477 746336 669556 672965 930258 914019 813340 804525 800261 879884 930789 812002
3103 812002 673830 683714 726171 624437 612072 702618 623477 774271 853022 767614 798067
3092 798067 887812 680202 671544 762787 564888 429975 530672 570615 661590 740086 548854
3081 548854 613081 553379 748987 778745 672111 615741 587073 675247 675803 580632 523291 404284
3069 404284 535071 652507 611141 652985 526514 517149 398113 460260 482680 503544 511185
3058 511185 471807 609840 723780 578482 362182 421312 586373 538656 690831 624900
3048 624900 514430 623804 539623 246836 351128 494940 389829 384498 265130 352018
3038 352018 460806 359382 191039 284951 342935 277648 414288 420178 214677 205248 202056
3027 202056 250979 340286 289635 228956 478732 536998 440877 299153 200513 261988 377363
3016 377363 438957 222579 222571 259191 341655 335887 332973 250810 211749 270846 205579 309420
3004 309420 452855 320487 174947 204166 171695 184117 181066 58828 150297 131585 196861
2993 196861 455124 386964 269174 258822 383155 411754 333625 334563 288940 210086 169544
2982 169544 224493 256687 251351 246242 337077 307509 237196 169809 256528 432130 316842 151898
2970 151898 100718 126796 122989 84988 71678 177818 114328 191521 139570 115291 387345
2959 387345 308413 237527 276042 285383 449327 406808 371263 298742 308212 104517 121962 339556
2947 339556 257459 271160 112302 143948 122540 254389 206354 116803 281231 275241 245374
2936 245374 164331 201031 361806 366993 240915 172137 155000 182600 190611 242079 258752 316331
2924 316331 166209 212674 364375 341678 294621 344414 371074 301748 247081 157766 274332
2913 274332 224393 182903 285020 342795 258674 172440 299379 318374 145782 163722 267723
2902 267723 304837 217727 251527 254602 243775 124868 70950 176728 308060 325380 256305
2891 256305 99328 137745 246021 228114 404850 366516 251619 426977 361605 186988
2881 186988 138131 206694 256467 166142 209469 244716 278316 290090 279345 269165 265942 212834
2869 212834 137879 214044 298243 209723 210863 250141 108709 235671 214067 165395 346269
2858 346269 314016 172183 -103288 -28914 101438 380996 294313 321488 265428 341460 237318
2847 237318 251741 138249 -43981 34767 -61056 106718 202414 354168 89158 49627 218579
2836 218579 184505 164306 209221 226045 169707 60819 22707 12761 -44283 -131259 -163977 -101274
2824 -101274 117589 245812 211432 144445 200065 50652 -195161 -38944 -78334 -11412 194800
2813 194800 -7307 3659 7989 78219 -20876 -46863 103912 90474 48712 88527 150319
2802 150319 148837 100059 86700 55903 59118 58043 21056 -44114 -63871 -47839 -194643 -207730
2790 -207730 -112744 -59288 -212320 -133661 -49306 39695 92387 46018 204 -40984 -72887
2779 -72887 34183 63009 82401 38922 -28086 -128366 -102926 57796 40132 46156 5088
2768 5088 17206 32687 44022 105943 -99469 -145308 -120568 -131787 -124683 -171787 -39900 34150
2756 34150 -89465 -152082 -12203 6297 -144729 -211799 -131005 -241925 -247682 -240991 -76925
2745 -76925 3344 -79243 40582 -7259 -50389 -64344 26073 26798 -45503 83884 54285 -61921
2733 -61921 -147437 -43904 11677 10708 59775 2023 -148280 -109361 -82527 -133222 -222948 28145
2721 28145 49829 -1596 249953 264931 165792 117160 124232 84609 108093 160783 64907 -36765
2709 -36765 -25075 -190272 -254562 -120178 -208415 -195253 -154557 -154402 -44618 167660 168880 127002
2697 127002 -56611 -70131 -23808 -163525 -151969 -158905 -203097 -64179 -5241 15145 -33208
2686 -33208 -103073 28222 -59264 -9703 40523 -143219 -157152 -98188 -100339 -62853 -18062 -162931
2674 -162931 -201911 -74788 -193614 -251679 -66189 12959 -44253 -31742 -122474 -33934 54526
2663 54526 60173 153871 4002 -40633 -139643 -198856 -37411 -18442 -65790 -212663 53755
2652 53755 102881 -14194 -13879 21014 -39441 -66303 31372 93343 -32643 -230358 -224756 -57465
2640 -57465 86456 57175 -18687 2140 -114747 -64747 -55865 63782 28599 -44358 -112923
2629 -112923 -169935 -173246 -87994 -88347 -32483 -153535 -37994 -55057 -220115 12126 46961
2618 46961 -18220 -53904 -42295 28364 -60990 -166336 -260647 -140302 26397 29776 121940
2607 121940 -82594 -130816 -206926 -275867 -223585 -219594 -278230 -172306 -205217 -235752 -138123
2596 -138123 -85264 -136986 -93738 -95902 -73196 -56375 -40761 111524 68833 8474 -81744 -113231
2584 -113231 -105490 -106806 16510 -62679 -81466 -144810 -214338 -47249 -96351 -148134 -89405 -39423
2572 -39423 75516 211059 108956 -150660 -54249 96663 16514 5347 64449 33826 12196
2561 12196 -54714 -92884 -841 120554 65208 27519 19656 -46325 -247904 -176241 -231393 -195270
2549 -195270 12219 70243 -15801 -99926 -154638 -157072 -48285 -44617 119 -39247 7527 155950
2537 155950 -66615 -60665 -29545 -101501 82946 -29878 -44860 123396 154365 67267 11583
2526 11583 87139 -95030 -111692 -76719 113838 58781 -18760 -32468 219311 -15661 -177928
2515 -177928 -115886 -108198 14335 -123322 -86944 -64243 -107703 -96805 -109052 -161058 -58708
2504 -58708 -115431 -25174 -5119 -44382 -47091 -85206 -111212 -261255 -220331 -71041 -127029 -40808
2492 -40808 14871 -38734 -28457 -203456 -174357 47756 -54703 -122258 -143448 66727 101066
2481 101066 176271 -25392 -115052 -260295 -201635 -76938 -67500 -94416 -276074 -257499 -284525
2470 -284525 -269347 -116176 27826 74969 -7301 -152547 -101826 -78485 147687 46538 -62864
2459 -62864 36882 128775 -37764 30444 33323 -104153 61776 70484 71087 -112929 17694 30025
2447 30025 -39475 -61432 -36213 -125484 -41882 33323 -47586 -140606 2777 -24376 -18087 44868
2435 44868 -15405 2769 -44113 37202 143027 31056 -49428 -21991 27414 93226 48430
2424 48430 -121706 -205452 -159307 10019 -126499 -151382 -168843 -101860 16285 790 12686
2413 12686 146395 155480 99701 -128069 -277272 -159971 -125430 -47716 -81097 36510 -82622
2402 -82622 -173142 -57810 168010 189761 83026 90715 3044 -25888 -12770 -23180 99438
2391 99438 182792 273618 144730 64949 -1912 34162 -43748 19723 180973 264475 300953
2380 300953 392072 207738 229538 277224 130071 221009 160369 134885 87571 125783 179581
2369 179581 398916 444515 286233 305129 269899 166981 3000 -32971 38673 10158 17421
2358 17421 121246 58538 214376 168244 59626 -4416 104930 165594 -26514 9020 -46038
2347 -46038 -49104 -33212 89550 89931 -5091 86350 128132 153437 151863 321262 76528 83063
2335 83063 206660 56466 120233 122474 44642 97064 158510 138873 223673 276544 184575 255774
2323 255774 223040 124827 81336 142167 187576 143298 42951 10499 94354 182168 146727
2312 146727 305629 177187 189007 143141 348540 326439 149324 171263 56643 110742 24971
2301 24971 88809 -23847 10411 16945 -53611 52778 66248 103920 159727 149060 228165 151819
2289 151819 -5048 79417 143193 -16399 70620 -48428 -80539 3851 205750 184522 195533
2278 195533 276478 229758 139753 265591 167162 282135 243708 271343 296561 152873 187011
2267 187011 261074 112778 89752 147912 169192 -21050 -71361 155956 183649 322885 173089
2256 173089 159312 120763 118998 229505 108873 86176 93580 213575 293253 366538 162087
2245 162087 78874 152251 215141 413424 296830 209161 285189 386173 399146 367470 348115
2234 348115 264039 461043 423584 398040 383652 318236 466846 482750 426830 399398 396531
2223 396531 324628 465431 416271 486203 571142 438483 352478 366161 265201 349249 209308
2212 209308 281299 424023 377565 374602 377524 510967 667967 529781 644566 777184 665977
2201 665977 666686 546078 487721 425638 442392 655257 743657 829518 774631 742965 639492
2190 639492 673339 729439 632759 811565 658645 670720 789614 802348 797050 960468 955804
2179 955804 853121 844141 828880 758260 912423 1103325 1146456 1098539 1129509 1192320 1258213
2168 1258213 1307332 1334142 1310574 1323707 1335462 1499306 1481743 1608434 1617987 1586889 1690981
2157 1690981 1675806 1706701 1760939 1798714 1889008 1995156 2072913 2049007 2139964 2224031 2347107
2146 2347107 2541546 2647683 2705071 2714689 2874814 2839779 3071148 3080833 3141764 3274737 3364841
2135 3364841 3409915 3545528 3644377 3977265 4095326 4362945 4531831 4762225 5030185 5248686
2125 5248686 5485831 5901930 6138111 6707334 7209339 7749898 8221850 9042004 9866176 10457038
2115 10457038 11199602 11855504 12843345 13659938 14907812 16388454 18056598 20292631 23056136
2106 23056136 26903437 31851827 37225805 43023968 48825513 51014237 48740834 43170613
2098 43170613 36221798 30626375 26327354 22518026 19547123 17387434 15628093 14325943
2090 14325943 12934403 11913627 10976585 10399141 9693579 9050662 8326201 7687839 7132077
2081 7132077 6647823 6143563 5775029 5576562 5342044 5206687 5101039 4858531 4653581 4236696
2071 4236696 4082210 3881306 3568347 3639178 3601963 3552135 3285435 3139582 3065156 2964839
2061 2964839 2788363 2592102 2533208 2512021 2514178 2247929 2175471 2187235 2161292 1881713 1805907
2050 1805907 1857487 1840310 1893221 1842320 1718828 1596704 1530763 1454484 1347614 1333156 1310742
2039 1310742 1333536 1472008 1363823 1248930 1274420 1096016 1101252 1340343 1300251 1186554
2029 1186554 1056033 993723 939459 945286 891128 903183 1028934 930387 1002513 909751 843310
2018 843310 571437 573504 603048 632342 863649 888526 704842 714948 681676 603865 580771
2007 580771 602140 562824 463485 540211 568108 633351 597700 548161 596045 555494 700117
1996 700117 684898 655697 775151 747839 691591 497369 447127 409470 508678 399690 420062
1985 420062 315964 484411 530561 515287 373776 370861 284552 353417 411544 322154 184346
1974 184346 281174 186682 214949 140623 211638 244029 228707 209330 245063 266135 307966 449288
1962 449288 165392 155249 149362 173839 224037 450013 428321 375405 130138 136420 195594
1951 195594 243740 338155 359967 336668 258641 378092 382109 307845 282875 172867 253023
1940 253023 215537 342451 158785 113319 199720 231449 139146 155568 265839 148759 148662
1929 148662 49837 -30730 -46865 153348 162775 106846 227383 121788 72134 152346 170826
1918 170826 200729 231744 161948 154495 66139 37401 78867 104352 152537 70825 96782 209588
1906 209588 281388 60386 -64206 -3531 44933 32286 29534 -21571 137251 198463 88685
1895 88685 57400 243359 193259 150615 91974 127055 136234 165688 -18819 -23550 26627 13368
1883 13368 -38200 -106912 30855 32502 142111 164582 161580 80686 107043 17586 -83810 -38073
1871 -38073 5117 91238 204458 285386 470009 218345 190118 364150 205799 165265 56341
1860 56341 117045 192731 243304 306427 200544 -31330 -46037 131400 161669 58989 -84483
1849 -84483 -154728 -125660 64530 -15134 -133686 -25503 -43095 -92800 -97640 -81003 132046
1838 132046 222358 351526 168010 89192 73312 280106 177392 16951 220317 228905 85408
1827 85408 195714 225692 55724 78980 6947 13061 -35330 21693 -81303 -129230 -124852 -66145
1815 -66145 -557 -45295 -72657 -23498 -59246 3259 105565 92413 2551 168004 184206
1804 184206 75316 111747 142440 155468 173799 209022 119969 65856 170895 84669 2089
1793 2089 104423 26935 -150010 -108339 40419 -133630 -154572 -57807 41250 13766 18214
1782 18214 68183 177042 -6446 27507 158047 234901 12402 3659 -33466 -30604 74623
1771 74623 -4866 -18141 -181716 -166087 -80342 150852 29649 -163680 -53884 3256 116341
1760 116341 144022 59849 101654 27915 30252 35837 59062 181985 207938 -4092 153863
1749 153863 125562 -34402 -27180 60492 -1577 -108745 -38509 -29233 -128853 -50501 50849
1738 50849 -129070 -250722 -234678 -85086 -19753 -80575 -28152 5667 -70831 -120195 -152238
1727 -152238 -118280 -117850 -172185 -149739 -43319 132455 -13999 -42584 -66099 -50289 -254174
1716 -254174 -242504 -144926 -206983 -74146 -86004 -97907 8946 137589 30405 -114661 -114221
1705 -114221 28397 42919 -17730 -11695 108717 52376 8897 -126793 -188087 -163694 -104961
1694 -104961 -42235 -5722 -136073 -231789 -209059 -89458 29765 203187 115031 128818 25373
1683 25373 -65646 76704 113269 -40468 -194293 -98685 -157612 -103060 -54864 -18798 -102193
1672 -102193 151943 50262 -58309 -58 -89710 -47721 54189 27236 98170 -60178 -214658
1661 -214658 2279 -107924 -159068 -173763 -119016 -124113 131806 133618 80193 38431 103170
1650 103170 125745 59963 39698 -104032 20412 -1738 20617 73415 85469 59476 -28352
1639 -28352 21916 142043 153353 74442 56137 173711 -62 23688 -28222 -118129 -198922
1628 -198922 -144862 -49358 -19125 -27870 105850 18488 -159715 -137418 172377 186949 93184
1617 93184 194717 185998 53630 74708 135773 165654 18593 -65547 -46704 -84060 -111216
1606 -111216 -118959 -139264 -232833 -240528 -221120 -33102 -41099 -43421 17756 113664 55307 37584
1594 37584 36727 76779 26743 -16202 61789 158263 50520 -93913 -190661 -206028 -120481 -10343
1582 -10343 -196130 -24162 6664 -61692 31860 -14684 45703 7762 -128733 -102473 -23676
1571 -23676 6724 -109025 -151965 -201176 -132567 -14765 19950 -80099 -186453 -117251 48473
1560 48473 -80805 -8449 -9787 -57411 -92544 -114853 -134826 -113497 -129127 -30523 -88028 -112096
1548 -112096 -135568 -61141 -97598 -45834 -26222 -30812 -145293 -182077 -52122 25928 -56224
1537 -56224 -149542 2292 -6171 219046 133518 75915 164055 154498 39626 140426 179414
1526 179414 120871 58840 148399 -70301 27175 -155274 -201826 -179663 -178931 -82508 5006 -94650
1514 -94650 -220476 -123403 4094 -79187 -83690 36863 112969 194192 -39959 -16021 -24433
1503 -24433 -161686 -33087 -22370 -198343 -126206 74933 67704 -134302 -97667 -41894 -85193
1492 -85193 -74971 -212446 -82014 -114892 -221799 -188369 -190568 -240030 -29594 -111028 -50082
1481 -50082 -81583 -37672 -146814 -126261 13687 -29726 29012 -32846 28870 15255 -56037
1470 -56037 10790 64333 102594 168683 -61147 21323 91489 -63823 -194981 -101521 -131848
1459 -131848 -68271 49591 127142 96759 102538 -36895 8843 -58854 -103797 -29922 -90607
1448 -90607 94768 120392 148840 72711 -83074 -129823 -98600 -136340 -129641 -94254 -136354 15860
1436 15860 15960 -125495 -21691 -19889 18626 15547 157905 138653 208326 221837 38940 65816
1424 65816 12558 -56996 83469 98321 -100755 4531 4361 -23678 -11696 -13111 -105799 -102214
1412 -102214 -71967 21140 -55125 -3428 -36465 -85720 -182876 -196601 -8054 114118 -74763
1401 -74763 -132598 -49549 -139021 -298298 -190264 41558 129290 -40955 -19002 9719 -122522
1390 -122522 -138363 -37164 -9885 -241593 -103950 -30670 -94109 -199772 -111695 78663 -35112
1379 -35112 -58284 30652 -13986 -86085 -197053 -225592 -67259 -80659 -74273 -45016 -5212 48436
1367 48436 52495 -105300 -205868 -186526 -128135 19890 -98021 -109644 -136855 -107113 -42816
1356 -42816 -54152 -286179 -148510 8231 19613 98288 942 -261930 -339716 -195896 -74199
1345 -74199 -106016 2308 77349 79628 100631 63052 -122542 49826 230160 98940 5760
1334 5760 -55819 56955 -197609 -258183 -31192 19995 -126272 -120100 53092 -30047 -43085
1323 -43085 116207 72460 64826 55465 54626 151320 83536 14380 -97296 -22334 -42469 -164503
1311 -164503 -33735 -162102 -185895 -102531 -55643 -175930 -164035 -50799 66880 -82808
1301 -82808 -107587 -54234 -35913 -104787 -74951 -12439 -4869 -125929 -142285 -162592 -123539 -74609
1289 -74609 -37265 -15157 -132165 -100539 -53449 -64831 -116244 -29707 -25518 49058 -171123 30084
1277 30084 166161 -28583 -75248 -96979 -111396 -44396 57145 31973 -14412 11373 -14943
1266 -14943 -1828 62263 129320 81732 6973 -80195 -185572 -39113 -607 108673 -190
1255 -190 -185192 -71664 -23950 -161159 -191988 -205986 -134210 -51973 38591 69660 26025 -157679
1243 -157679 -87241 -125053 -199987 102546 -80425 -126411 -141360 -53097 -128645 -137767 -129794 4267
1231 4267 -15310 31833 11113 -165123 -28579 128399 -54949 -30539 4530 35312 -61923
1220 -61923 107374 21696 -161144 -235039 -106827 -19584 -124352 -99791 -110211 -50898 46808
1209 46808 124272 59409 57267 177816 96137 -124525 6382 1907 77738 127054 64283 39911
1197 39911 12399 -50128 -155654 -135719 -74820 -113245 -16961 14654 -70192 -94730 -40180 -37534
1185 -37534 -184397 -221860 46023 -821 54004 27172 -49912 87313 65287 -57783 -70117
1174 -70117 -74714 527 -171477 -168870 -278033 -223751 -110604 -29876 -121478 -69416 -84041 13804
1162 13804 -29397 -68828 -44510 -42244 41006 -45072 -478 -41261 -121177 -117585 42752 143246
1150 143246 268622 231632 120400 20612 -558 -152496 -45387 131134 96667 47017 -74681
1139 -74681 85563 -122018 -247984 -211204 -163632 -76026 99343 141061 156249 35380 -58641
1128 -58641 18715 49429 33269 16616 216613 83754 -26031 -103635 -129507 -83078 -257244
1117 -257244 -234829 -201056 -250075 -30352 100217 160330 29419 100190 127821 -59777 -77126
1106 -77126 -195634 -144907 -65337 58097 186864 186255 128993 48117 69403 -26512 82016
1095 82016 108742 97052 -206290 -132999 -32201 -86154 -37045 -23489 17144 -106313 -85489
1084 -85489 -86038 -47430 -61455 -103483 -133137 -197084 -86371 3142 -26883 -156564 -7892 103472
1072 103472 19270 -14185 -111187 -71419 75616 1211 106725 144469 133370 51213 79633
1061 79633 -196742 -179916 13894 -49596 -151909 -210422 -82169 -176925 -169205 -130965 -16761
1050 -16761 -81870 -176821 -98894 -19177 -134763 -80872 -13661 -104806 14499 318924 160564
1039 160564 65481 40255 -127236 -137561 -153283 1337 19299 -53760 -186143 -308643 -225584
1028 -225584 -138135 -238159 -168451 -97227 -159926 -145988 -51578 70371 143128 95701 59473
1017 59473 -34073 1137 29096 -53633 -97547 -67895 -20891 -152838 -172557 -33629 24869
1006 24869 875 -133828 -24445 -58581 -107612 -6495 -83622 -176209 -74026 -122830 -331382
995 -331382 -264685 -59998 135846 140078 146334 170242 134192 43509 -34357 -87175 104773 81153
983 81153 121091 120261 69979 36036 67637 -25350 102412 22929 -126406 43002 -12985 40832
971 40832 -49372 -56727 -90603 9837 -146404 -130011 -45259 -197760 25554 -37786 -103776
960 -103776 -44223 22766 -43837 -4737 27268 50923 80379 70901 1692 35438 -39345 -199812
948 -199812 -35670 126310 -52181 -63202 -20041 15803 -26638 -113786 -151568 -241850 -229265
937 -229265 -95762 -136139 -53692 -74200 -125178 -59732 -87280 -31152 127443 102553 82250
926 82250 56460 29640 -28625 84633 186994 94175 163032 30365 2791 -66677 -46342
915 -46342 -60792 -54410 -54021 -81592 -8744 90507 79652 -53163 -13907 127237 95567 66788
903 66788 -55433 -14812 -1753 6298 97556 62696 154476 180434 -26946 -46182 -7091 -18129
891 -18129 -156850 -159298 -51706 43961 73946 151166 -15910 282 -77960 -184498 7824
880 7824 -25837 -194545 -137306 138703 130263 38600 128542 79415 -11255 -41527 -162394 -67554
868 -67554 -109531 51117 107755 9705 164435 12844 -145696 -154696 -100010 -94667 -21980 -8489
856 -8489 -107295 114316 159116 -100342 -152120 -44302 -31147 -5523 126075 -43007 -123417
845 -123417 -55990 46631 149698 67252 45882 -1983 166193 87841 96809 197149 28964
834 28964 -79027 15200 175903 199615 49885 -140381 -21300 -125913 -232610 -155556 -64476
823 -64476 -64420 -21744 103474 50235 -42370 5439 61503 106617 210447 90594 -28438 51878
811 51878 156305 62508 37534 -66260 -27921 -44259 -112959 80163 136910 63150 60679 92776
799 92776 -18938 -133570 -75955 44074 94794 -93798 -40037 68885 107312 81091 32816
788 32816 -58086 -115589 -29048 -170897 -81986 -35149 -84392 9488 -211855 -247386 -167191 -138828
776 -138828 -64228 -80869 -155868 -163056 -70942 -59482 82284 61584 93119 79082 -26476 -31436
764 -31436 -143235 -202236 -50031 85223 110309 79519 83749 22537 -74686 -63387 -64603 -65958
752 -65958 91457 -5016 -41376 -69612 20580 44304 38365 159964 96135 -75172 -171609 -281260
740 -281260 -174457 -138522 -37253 87370 68942 63371 -20628 -128597 -239085 -30728 56385
729 56385 121706 171593 108012 110446 129816 185470 78364 -43655 -105373 -144415 -105842 -199404
717 -199404 -237585 -68877 60978 136738 280062 192061 -58376 -67190 87418 141971 26849
706 26849 5677 -48378 -95213 6169 182898 182849 -7923 44601 50005 170216 103662 87288
694 87288 -18300 -6065 -6027 53330 88675 92336 217795 151460 876 -26002 -126010 -88954
682 -88954 -61156 29549 -29027 19192 83114 19272 -75416 -96504 -146715 -19311 42836 55650
670 55650 29402 -81055 68823 61534 -21661 -108062 -87596 -98323 -43883 24959 -10340 -90575
658 -90575 -39812 175306 252916 132999 129108 127492 -6349 -53332 -44015 -141812 -35786 68089
646 68089 -119537 -147107 -64917 27661 -25388 32409 120197 36863 -26339 -166987 -133503 -132405
634 -132405 -51738 -7629 145486 230639 243624 148545 39758 35964 -32339 -19496 34201 10077
622 10077 -56162 -55453 71685 14290 -72046 10439 141607 102074 214183 247910 310508 275307
610 275307 217861 253059 215917 142629 287981 213783 19938 -17766 85585 134128 106633
599 106633 -120109 -103893 -88450 -38575 14603 70385 -78507 -176441 -88142 -98221 -90424 -176335
587 -176335 -185790 -202396 -115767 -42989 11792 -16202 -779 86064 119688 -33110 -49960 -19207
575 -19207 -49705 7084 19993 153091 207913 87503 -13134 24725 71804 15549 74828
564 74828 143742 106412 -64265 -35605 28653 94404 25983 46936 193216 55893 41502
553 41502 131986 260455 136627 -65336 327684 286431 67933 55898 31022 75748 167600
542 167600 162720 105866 92411 15307 47878 186183 110961 117497 71273 28871 37348 12334
530 12334 42876 189475 103915 74267 93694 21932 106696 116170 -14657 -170245 -143619 -132494
518 -132494 -39592 24613 -134148 -14279 -32663 -49636 46302 140941 44875 -84200 -71000
507 -71000 -102454 -139292 -82408 -46429 13325 -37361 -62203 -10671 -21869 73722 75072 -99363
495 -99363 11918 -41653 -98763 -140199 -140986 -43352 -46918 -40910 -37768 117488 102270 -66242
483 -66242 -20801 174631 151997 187248 88488 167047 142537 266390 175928 -41072 105726
472 105726 201668 107187 139044 61399 -8803 107482 -9757 -46411 -60532 -306239 -215793
461 -215793 -92163 -34762 22683 103556 71632 -57702 96623 165294 -77167 -169723 -27391
450 -27391 -159342 -78433 61247 74704 -55680 -73990 -116412 -91767 23569 -20479 -28056
439 -28056 -15551 9274 53168 122947 21323 -1464 45086 97202 -9261 -85999 -107781 -31048
427 -31048 -49876 -73810 232166 104097 32950 55902 52335 17893 15183 71614 -17693 18624
415 18624 64069 53419 38094 -72000 28646 -25713 -114883 -99905 -121038 -106823 -119852 -104968
403 -104968 -16657 -124241 -188621 -141142 -54805 -3608 -120361 202144 296287 146244 -33106
392 -33106 64395 111849 23868 102904 189935 104655 51637 -12694 105428 160234 46559 23897
380 23897 -87166 -78304 -94921 21788 4321 -33967 32811 -104103 -77731 -25604 50405 -24083
368 -24083 59487 102466 -81042 -90343 -137426 -97952 90029 71853 -54075 -47854 -17811 -35778
356 -35778 815 -38289 103908 84683 -1306 59662 109231 24021 80672 23822 -94900 -132435
344 -132435 6028 -21984 28293 20138 67635 -87152 17007 -831 -104640 -11348 -353032
333 -353032 -228117 -178277 -109358 -149163 -79670 8578 50777 60238 -172969 -182409 -54416 -54427
321 -54427 19032 64810 189738 80054 82516 4997 60761 48226 -98098 -223786 -175950
310 -175950 -154012 -76384 -7124 -43025 -87099 -81612 -68508 -62960 -59441 -54806 -32397 16094 86648
297 86648 25705 -157410 -155153 -98554 -57926 75739 -41502 -202899 50634 85503 -9660
286 -9660 100780 134954 -64508 48148 5770 -59852 -29028 50919 93791 78016 64471 95977
274 95977 -20086 -122658 -173112 -263765 -167638 -129357 -94761 -72069 -100881 -53178 132238
263 132238 175913 162911 66985 -33567 -103500 -117879 -156982 22991 -63055 64841 158750
252 158750 160742 162517 81102 -28080 -33437 164972 175309 145837 20687 -94238 -20828 -5498
240 -5498 112822 229000 193662 171067 11051 -41486 -102307 -51426 29133 -8334 -160880
229 -160880 -133790 -102488 -7549 207577 78277 120783 134348 156853 206820 94388 47927
218 47927 -29125 -84309 -56349 -80584 -96778 -95729 63066 80838 14041 -209487 9904 58235
206 58235 87650 35426 -51021 -73648 -171919 -202558 -172061 -59663 -191348 -28438 99531
195 99531 -33813 -79687 30498 19669 99033 12323 -96506 -41063 -182685 -229701 -192034
184 -192034 -99399 -26961 -22325 -3459 -39243 -5172 135914 177448 135968 105735 79477 -62656
172 -62656 -57122 70227 23483 -33170 -84443 -170054 -170897 -167553 -76215 -18118 -93040 88161
160 88161 56294 46505 73895 61933 -25616 47334 130049 -37637 -80282 -11903 -85346 -139836
148 -139836 -108024 -163283 -26186 -53547 -493 161199 215915 85253 141405 147748 90107
137 90107 19432 3893 -32469 -38595 108199 118443 53863 -64573 -28828 -9474 69388 83073
125 83073 -16257 25764 36728 105678 132223 99286 167428 -20856 -83022 -9101 -61785 -42255
113 -42255 -53663 -83562 -122871 -54089 -55963 -114663 -42178 -86597 -173649 -150213 23010 -10802
101 -10802 -120132 -83351 -92733 -24980 33050 30520 48427 3853 5379 -37475 -135700 -51600
89 -51600 70764 10622 24092 104728 206312 81730 -79888 3439 47133 -18574 -14376 -124387
77 -124387 -113563 -90185 60173 -24873 -62051 -21636 -13152 -13493 27529 14048 24498 76243
65 76243 -39857 57411 133274 -26327 -55711 26535 -32732 -86043 -81614 -32853 -21754 48884
53 48884 105298 15878 13398 7553 40431 134427 111222 103282 85852 125979 36741 39238 56356
40 56356 85439 -8743 -80155 -133660 -40866 23504 35957 -50326 -79881 81148 37274 14928
28 14928 -32120 60772 71083 108446 106567 -106894 -79073 -48288 -116721 -117096 -171879 -56726
16 -56726 -1868 27563 4930 85681 77086 132223 86671 72046 -63725 -128644 27741 21493
4 21493 -51987 -52893 -16201 32079
0 32079
$$ Imaginary data points
##PAGE= N=2
##DATA TABLE= (X++(I..I)), XYDATA
16383 -853578 -788434 -778461 -709907 -605311 -587389 -675339 -657450 -616711 -591101 -616936 -727311
16372 -727311 -643628 -614406 -543260 -513095 -438318 -455203 -495681 -356452 -317069 -354638 -392620
16361 -392620 -490967 -448298 -415209 -375542 -305836 -304666 -171674 -135927 -72122 -148148 -209333
16350 -209333 -183028 -142206 -161030 -118187 -52099 -97542 -106979 -70952 -103173 -21337 -19096 -25173
16338 -25173 82329 83280 105359 98933 162301 143441 165610 277468 286140 236151 276750 173173
16326 173173 97915 119531 149685 230224 355901 369284 388586 419930 432118 377620 520314
16315 520314 551946 432091 477433 594443 401951 380217 500173 510308 347714 478410
16305 478410 637093 627334 664584 854578 783657 735342 691990 660008 751172 786376 819384
16294 819384 856838 813435 757354 823353 905456 950122 801182 878141 873904 905265 826670
16283 826670 915548 950859 797552 885373 885574 911841 962813 970572 1053739 1154878 1165918 1086347
16271 1086347 1134243 1163356 1055698 1180922 1129559 996352 936533 974082 1008878 1014655 1208397
16260 1208397 1378494 1105533 1036306 1128930 1155201 1121171 1169545 1213371 1218588 1342147 1404864
16249 1404864 1326326 1361572 1344057 1237912 1268504 1265266 1368753 1317619 1405516 1442815 1480695
16238 1480695 1469949 1440312 1335520 1384289 1358569 1302851 1401588 1434037 1488341 1489231 1445230
16227 1445230 1358855 1412448 1359512 1376477 1608403 1624154 1535342 1549117 1625922 1571729 1694469
16216 1694469 1436455 1498933 1659586 1584232 1620171 1636699 1668600 1704033 1827408 1692333
16206 1692333 1641130 1760638 1653261 1612942 1584132 1622703 1591537 1462987 1533183 1632956 1646308
16195 1646308 1664072 1754754 1724817 1774945 1746907 1734486 1784494 1753823 1786953 1815759 1808884
16184 1808884 1918646 1946195 1990774 1932020 1751132 1825737 1848100 1770420 1791761 1905165 1840819
16173 1840819 1704053 1742051 1617725 1784643 1954876 1775844 1770048 1848053 1821058 1607872
16163 1607872 1838880 2095510 2102498 1978567 1898666 1934976 2014962 2041057 1966476 1859535 1758711
16152 1758711 1832601 1899906 1937165 1924360 1864037 1877531 1848519 1936482 1963259 1906538 1833867
16141 1833867 1798491 1904463 2079670 2269396 2054660 1950203 1807758 1803530 1959058 2076300
16131 2076300 2062518 2221284 2241578 1947118 1866268 1877702 2040545 2017973 1910628 1930402
16121 1930402 2005142 2005410 1971722 2001443 2180651 2095612 1967825 2024564 2013670 2027567 2062574
16110 2062574 2062510 2107164 2061080 2095761 2137736 2119726 1943106 1928853 2007411 1918483 2089675
16099 2089675 2147741 2090550 2042683 1971896 1919875 1971108 1938294 1942850 2134684 2134174 2147657 2243224
16087 2243224 2096155 2200279 2191124 2202362 2080976 2154418 2116610 2001104 2125120 2095678
16077 2095678 2109740 2146575 2086957 2010791 2148009 2194716 2153995 2086109 2042253 2053657 2031328
16066 2031328 2170873 2168168 2083905 2094665 2064389 1993670 2106973 2171083 2011065 1971677 1986954
16055 1986954 1966011 2075502 1987478 1923114 2096430 2140911 2157324 2179084 2179950 2173451 2172839 2218852
16043 2218852 2076376 2228844 2321915 2251638 2278549 2294166 2220992 2133209 2244977 2216849 2340857
16032 2340857 2224765 2010664 2118410 2314326 2150459 2082765 2222961 2096466 2068564 2184429
16022 2184429 2218091 2124316 1938472 1986729 2022396 2065609 2080123 2158612 2137584 2055664 2201744
16011 2201744 2147040 1990872 2091534 2043686 2113604 1992268 1995439 2037334 1935449 1930796 2061210
16000 2061210 2108334 1956056 2079053 2284606 2263645 2225633 2248947 2241598 2309449 2269333 2265282
15989 2265282 2233981 2166801 2071624 2060008 2112885 2208109 2053586 2022576 2027783 2091037 2039774
15978 2039774 2081144 2044696 1998211 2063277 2175529 2240879 2180947 2167164 2168700 2259037 2210097
15967 2210097 2308524 2305388 2218637 2285593 2233089 2096934 2167869 2185560 2235405 2294557 2221285
15956 2221285 2067968 2205834 2219247 2105068 2145729 2255846 2122281 2067253 2079676 2199802
15946 2199802 2246400 2260555 2140812 2074227 2103100 2200864 2173967 1959963 1919159 1981530 2045777
15935 2045777 2002873 2027188 2232243 2397070 2282191 2321826 2217412 2350564 2340572 2231245
15925 2231245 2106781 2057857 1977166 2072449 2231773 2030431 1969120 2096603 2149040 2269895
15915 2269895 2196186 2167883 2237438 2254435 2087880 2093628 2188638 2087189 2189307 2153497 2101726
15904 2101726 2146595 2205864 2230025 2357730 2277748 2265379 2198838 2183172 2182608 2158968 2056567
15893 2056567 2272563 2262531 2252194 2331692 2186962 2261465 2414189 2386201 2337383 2324758 2317464
15882 2317464 2436275 2309640 2330479 2254184 2192926 2120971 2156840 2100848 1995766 2055914 2205266
15871 2205266 2240546 2124996 2125301 2053600 1926937 1912565 2010459 2112084 2169013 2185391 2231190
15860 2231190 2033344 2106152 2175714 2241263 2333864 2400539 2420845 2247857 2191760 2166456 2219714
15849 2219714 2224848 2213425 2111340 2176418 2222348 2177884 2056453 2017823 1999480 2177393 2012419
15838 2012419 2104389 2165667 2112365 2103789 2196716 2217902 2219483 2061067 1927553 2053054 2176224
15827 2176224 2187034 2255264 2344016 2198032 2206043 2193724 2244993 2299922 2289900 2078317 2116806
15816 2116806 2146979 2179002 2131322 2153220 2143406 2198227 2364487 2329088 2246062 2108586 2073812
15805 2073812 2195570 2161394 2120276 2143168 2088015 2156828 2362907 2328731 2375318 2192419 2095460
15794 2095460 2146676 2193042 2145942 2185566 2241015 2147124 2141005 2179231 2218605 2173752 2186644
15783 2186644 2189853 2158494 2260832 2360357 2357769 2240621 2036783 2112743 2254995 2309545 2189473
15772 2189473 2063996 2108935 2158968 2262646 2306082 2160490 2179219 2159610 2146560 2282735
15762 2282735 2304863 2213099 2271988 2316346 2326545 2274910 2321340 2314374 2320598 2321819 2193734 2269711
15750 2269711 2418039 2202050 2240899 2304029 2081575 2158636 2303319 2384870 2361311 2340564
15740 2340564 2343427 2325278 2124106 2163837 2163928 2152071 2083309 2112921 2046673 2142869 2158751 2196152
15728 2196152 2363884 2247303 2199336 2102721 2312633 2287750 2097126 2177750 2011333 2074679
15718 2074679 2245528 2230456 2225021 2309455 2248838 2359745 2378841 2263946 2342989 2300097 2307829
15707 2307829 2269075 2219725 2246348 2124651 2080495 2239972 2280936 2268254 2344298 2327620 2243522
15696 2243522 2315918 2203777 2166087 2224565 2353971 2168911 2155037 2199115 2063290 2184621
15686 2184621 2273903 2137110 2191010 2413550 2375893 2271086 2339330 2214378 2228138 2275849
15676 2275849 2438874 2344334 2225967 2203799 2339117 2269972 2120140 2267295 2230055 2289468
15666 2289468 2341738 2326536 2202854 2205895 2220423 2302559 2280476 2406829 2376151 2139932 2076930
15655 2076930 2053669 2098743 2232451 2202760 2221052 2269811 2256571 2370743 2489757 2412635 2233243
15644 2233243 2168244 2062719 2059022 2275220 2221622 2291208 2290674 2201905 2019455 2127508 2263142
15633 2263142 2351156 2381972 2373266 2316595 2290840 2212437 2228979 2263990 2371416 2361976 2291838
15622 2291838 2280968 2249634 2386425 2369518 2271560 2179729 2179076 2167045 2204718 2181251 2278118
15611 2278118 2221521 2160134 2205428 2320980 2196374 2086727 2061985 2261735 2275433 2231402
15601 2231402 2326796 2307497 2185772 2075625 2117447 2166019 2222801 2309109 2269504 2285229 2181773
15590 2181773 2294420 2238524 2265360 2106271 2147738 2179958 2235151 2362880 2262745 2098515
15580 2098515 2085306 2293270 2248291 2326574 2169432 2226484 2306152 2172295 2147348 2208291 2220039
15569 2220039 2283569 2263004 2271358 2229635 2186082 2223485 2285936 2358799 2325040 2136486 2150323
15558 2150323 2270519 2252802 2380790 2412059 2160914 2215595 2216199 2297969 2359169 2421162 2418877
15547 2418877 2229442 2253478 2208262 2112869 2090355 2238250 2092018 2147297 2087698 2163087 2376064
15536 2376064 2389667 2256701 2071331 2139994 2187833 2202767 2149784 2140502 2249429 2250139 2296617
15525 2296617 2340294 2430508 2343355 2200360 2168925 2164817 2203772 2067140 2267447 2291874 2265686
15514 2265686 2281797 2346557 2354736 2173445 2229478 2331031 2216296 2308749 2342555 2138960 2184240
15503 2184240 2290276 2188285 2374949 2439365 2287842 2140503 2038277 2166660 2109235 2119743
15493 2119743 2342541 2364897 2337365 2261066 2291560 2318931 2289165 2124578 2081957 2059248 2241583
15482 2241583 2156960 2200712 2335020 2276523 2282310 2272201 2247738 2339701 2390258 2293231 2327475
15471 2327475 2336048 2226366 2225075 2408338 2296428 2303460 2334173 2356676 2395744 2408869 2326152
15460 2326152 2182039 2200261 2047250 2110491 2459789 2515432 2438737 2325261 2288196 2260034
15450 2260034 2299053 2268683 2181324 2323290 2307776 2269762 2119164 2024081 2098721 2223350 2334652
15439 2334652 2299129 2179385 2178253 2248309 2196493 2169654 1980752 2282556 2455923 2336632
15429 2336632 2321823 2177526 2233311 2299904 2221720 2275482 2414380 2299564 2025661 2135084
15419 2135084 2339958 2238830 2129624 2158211 2306776 2371695 2242416 2155265 2038570 2143230
15409 2143230 2092671 2142051 2216738 2202060 2131772 2212053 2284702 2212313 2153385 2419324 2345861
15398 2345861 2296338 2329196 2331746 2328339 2365772 2352503 2357107 2259753 2167924 2191461 2158647 2326092
15386 2326092 2216335 2299125 2395851 2358161 2271819 2262489 2245595 2120397 2195358 2326006 2316118
15375 2316118 2295292 2211002 2322902 2508063 2309129 2222368 2301827 2280250 2340329 2315270 2259265
15364 2259265 2393537 2372915 2273882 2354126 2408804 2273026 2324985 2413052 2280330 2199025 2206585
15353 2206585 2414174 2470289 2372660 2258423 2324268 2410301 2404090 2383697 2185077 2181247 2332760
15342 2332760 2240444 2321523 2233543 2245240 2409881 2366513 2286492 2397490 2482244 2339820 2366877
15331 2366877 2479622 2475194 2352908 2296387 2274882 2015847 2138081 2288011 2285009 2254862 2379169
15320 2379169 2337489 2295600 2447671 2409386 2368890 2352148 2433819 2444459 2328737 2340186 2346902
15309 2346902 2307069 2203729 2132308 2213208 2389890 2325326 2438704 2383034 2318974 2151781
15299 2151781 2085773 2258004 2287321 2295916 2366381 2394236 2363840 2303099 2284347 2314970 2323810
15288 2323810 2322336 2317121 2346139 2331431 2341912 2168750 2185397 2191724 2349334 2382051 2261479
15277 2261479 2365924 2364262 2441577 2413322 2375525 2396193 2316013 2396812 2277984 2218566 2106045
15266 2106045 2242454 2325041 2228927 2266017 2238511 2208972 2194072 2222561 2242566 2229755 2270927
15255 2270927 2194854 2240346 2248955 2232607 2286233 2353555 2360037 2115923 2265338 2496298 2472135
15244 2472135 2428929 2318973 2279047 2260602 2428797 2401826 2243010 2306444 2304026 2409371 2422798
15233 2422798 2257161 2287149 2342306 2230905 2196903 2318066 2284158 2277785 2313025 2358074 2347818
15222 2347818 2380111 2543147 2483566 2428259 2379542 2399121 2426408 2451387 2483868 2344186 2344034
15211 2344034 2375242 2264981 2330877 2367119 2224702 2267476 2152374 2221585 2249127 2342362 2391254
15200 2391254 2366459 2277596 2307146 2504179 2399301 2304785 2319636 2334194 2367013 2451966 2453518
15189 2453518 2342618 2313255 2297145 2267168 2244372 2252944 2308335 2267711 2260586 2181749 2333324
15178 2333324 2454360 2338533 2256446 2246178 2405638 2540586 2481856 2457006 2483977 2357947
15168 2357947 2406123 2380131 2302557 2432446 2348975 2401689 2308049 2271413 2441986 2699873 2533629
15157 2533629 2472470 2567330 2395685 2361935 2284646 2368094 2410803 2364593 2430794 2418873 2466998
15146 2466998 2419204 2411294 2417802 2419821 2424425 2303004 2192009 2401603 2426462 2390839 2370451
15135 2370451 2335014 2277798 2167945 2316611 2517958 2591355 2419611 2334579 2293582 2389101
15125 2389101 2357303 2397756 2388655 2346958 2356321 2346180 2387419 2460321 2379502 2512037 2441647
15114 2441647 2276493 2439842 2509385 2451292 2374375 2252110 2257780 2304589 2277514 2298604 2288993
15103 2288993 2265566 2429565 2443516 2283418 2367832 2361274 2285949 2404228 2577142 2596501 2432323
15092 2432323 2420002 2458905 2437584 2515173 2439149 2260624 2277512 2488885 2486013 2523639 2386452
15081 2386452 2368210 2254500 2254427 2258670 2229426 2338068 2416582 2445496 2367956 2351527 2428173 2450347
15069 2450347 2508587 2429810 2533615 2440745 2305964 2283326 2295031 2371260 2439176 2219393 2188301
15058 2188301 2340503 2371398 2409477 2446759 2634747 2518446 2443914 2298184 2407943 2585811
15048 2585811 2594359 2434862 2402948 2294233 2278202 2310034 2384854 2134699 2188750 2301348 2193044
15037 2193044 2265730 2416176 2555681 2492264 2547408 2435574 2309399 2376199 2376654 2550402 2513078
15026 2513078 2526533 2537020 2400323 2359633 2294009 2409998 2500204 2492379 2275658 2347692 2344786
15015 2344786 2493335 2535392 2329251 2347414 2416916 2504636 2446106 2422250 2518194 2348549 2280793
15004 2280793 2389443 2476149 2401818 2419199 2532006 2496440 2380009 2397663 2500998 2468248
14994 2468248 2442631 2400696 2436726 2354747 2269839 2124956 2321110 2546136 2507867 2590213 2400036
$$ [...]
##END NTUPLES=NMR SPECTRUM
##END=
