##TITLE=1H_CA-9064-3
 CDCl3
 8 sc, 
 20.09.2022
##JCAMPDX= 6.0         $$ Bruker NMR JCAMP-DX V2.0
##DATA TYPE= NMR SPECTRUM
##DATA CLASS= NTUPLES
##ORIGIN= UXNMR, Bruker Analytische Messtechnik GmbH
##OWNER= root
$$ XWIN-NMR		Version 3.5
$$ Tue Sep 20 13:12:47 2022 Russian Standard Time (UT+4h)  she@DPX200
##.OBSERVE FREQUENCY= 200.1313499994
##.OBSERVE NUCLEUS= ^1H
##.ACQUISITION MODE= SIMULTANEOUS
##.ACQUISITION SCHEME= undefined
##.AVERAGES= 8
##.DIGITISER RES= 18
##SPECTROMETER/DATA SYSTEM= spect
##.PULSE SEQUENCE= zg30
##.SOLVENT NAME= CDCl3
##.SHIFT REFERENCE= (INTERNAL, CDCl3, 0, 15.7447)
##AUDIT TRAIL= $$ (NUMBER, WHEN, WHO, WHERE, WHAT)
$$ ##TITLE= Audit trail, XWIN-NMR		Version 3.5
$$ ##JCAMPDX= 5.01
$$ ##ORIGIN= Bruker BioSpin GmbH
$$ ##OWNER= she
$$ F:/spectra/data/she/nmr/H-F/1/pdata/1/auditp.txt
$$ ##AUDIT TRAIL=  $$ (NUMBER, WHEN, WHO, WHERE, WHAT)
(   1,<2022-09-20 13:11:24.06 +0400>,<she>,<DPX200>,
      <created by zg, POWCHK disabled, PULCHK disabled
       configuration hash MD5:
       00 E9 B6 7A A2 85 ED C7 34 08 36 98 17 FE 4E 26
       data hash MD5: 16K
       BD D3 56 6B 22 B6 F2 03 A4 59 8F 89 CF 8B F1 3D>)
(   2,<2022-09-20 13:11:29.15 +0400>,<she>,<DPX200>,
      <Start of raw data processing
       efp BC_mod = 2 LB = 0.24 FT_mod = 6 PKNL = 1 PHC0 = -18039.35 PHC1 = 20.40069 SI = 16K 
       data hash MD5: 16K
       60 A6 3D A8 80 E7 2E C4 E4 1F C4 8D CE B5 28 0D>)
(   3,<2022-09-20 13:11:50.35 +0400>,<she>,<DPX200>,
      <pk PHC0 = -2.906242 PHC1 = 0 
       data hash MD5: 16K
       B6 68 27 40 6C 76 4D FE 06 D8 62 02 F8 FC C6 99>)
(   4,<2022-09-20 13:11:53.81 +0400>,<she>,<DPX200>,
      <abs ABSG = 5 
       data hash MD5: 16K
       EF 2C 66 C3 99 FA 4C B4 96 55 F7 89 58 7E 26 73>)
$$ ##END=
$$ 
$$ hash MD5
$$ 85 A6 5B 6E F9 42 B4 F3 0B 3C EC 60 36 83 27 93
##$RELAX= 
##$RELAX= 
##$RELAX= 
##$RELAX= 
##$RELAX= 
##$RELAX= 
$$ Bruker specific parameters
$$ --------------------------
##$DU= <F:/spectra>
##$EXPNO= 1
##$NAME= <H-F>
##$PROCNO= 1
##$TYPE= <nmr>
##$USER= <she>
##$AMP= (0..31)
100 100 100 100 100 100 100 100 100 100 100 100 100 100 100 100 100 100 
100 100 100 100 100 100 100 100 100 100 100 100 100 100 
##$AQSEQ= 0
##$AQ_mod= 1
##$AUNM= <au_zg>
##$AUTOPOS= <>
##$BF1= 200.13
##$BF2= 200.13
##$BF3= 200.13
##$BF4= 200.13
##$BF5= 200.13
##$BF6= 200.13
##$BF7= 200.13
##$BF8= 200.13
##$BYTORDA= 1
##$CFDGTYP= 0
##$CFRGTYP= 5
##$CHEMSTR= <none>
##$CNST= (0..31)
1 1 145 1 1 1 1 1 1 1 1 1 1 1 1 1 1 1 1 1 1 1 1 1 1 1 1 1 1 1 1 1 
##$CPDPRG= <>
##$CPDPRG1= <>
##$CPDPRG2= <>
##$CPDPRG3= <>
##$CPDPRG4= <mlev>
##$CPDPRG5= <mlev>
##$CPDPRG6= <mlev>
##$CPDPRG7= <mlev>
##$CPDPRG8= <mlev>
##$CPDPRGB= <>
##$CPDPRGT= <>
##$D= (0..31)
0 1.2 0 0 0 0 0 0 0 0.06 0 0.03 0 0 0 0 0.0002 0 0 0 0 0 0 0 0 0 0 0 0 
0 0 0 
##$DATE= 1663665083
##$DBL= (0..7)
120 120 120 120 120 120 120 120 
##$DBP= (0..7)
150 150 150 150 150 150 150 150 
##$DBP07= 0
##$DBPNAM0= <>
##$DBPNAM1= <>
##$DBPNAM2= <>
##$DBPNAM3= <>
##$DBPNAM4= <>
$$ [...]
##$SUBNAM3= <"">
##$SUBNAM4= <"">
##$SUBNAM5= <"">
##$SUBNAM6= <"">
##$SUBNAM7= <"">
##$SUBNAM8= <"">
##$SUBNAM9= <"">
##$SW= 18.0517283424941
##$SWIBOX= (0..15)
0 0 2 0 0 0 0 0 0 0 0 0 0 0 0 0 
##$SW_h= 3612.71676300578
##$TD= 16384
##$TD0= 1
##$TE= 0
##$TE2= 300
##$TE3= 300
##$TEG= 300
##$TL= (0..7)
0 120 120 120 120 120 120 120 
##$TP= (0..7)
150 150 150 150 150 150 150 150 
##$TP07= 0
##$TPNAME0= <>
##$TPNAME1= <>
##$TPNAME2= <>
##$TPNAME3= <>
##$TPNAME4= <>
##$TPNAME5= <>
##$TPNAME6= <>
##$TPNAME7= <>
##$TPOAL= (0..7)
0.5 0.5 0.5 0.5 0.5 0.5 0.5 0.5 
##$TPOFFS= (0..7)
0 0 0 0 0 0 0 0 
##$TUNHIN= 0
##$TUNHOUT= 0
##$TUNXOUT= 0
##$USERA1= <user>
##$USERA2= <user>
##$USERA3= <user>
##$USERA4= <user>
##$USERA5= <user>
##$V9= 5
##$VALIST= <valist>
##$VCLIST= <CCCCCCCCCCCCCCC>
##$VD= 0
##$VDLIST= <DDDDDDDDDDDDDDD>
##$VPLIST= <PPPPPPPPPPPPPPP>
##$VTLIST= <TTTTTTTTTTTTTTT>
##$WBST= 1024
##$WBSW= 4
##$XGAIN= (0..3)
0 0 0 0 
##$XL= 0
##$YL= 0
##$YMAX_a= 311381
##$YMIN_a= -255767
##$ZGOPTNS= <>
##$ZL1= 120
##$ZL2= 120
##$ZL3= 120
##$ZL4= 120
##$ABSF1= 15.70502
##$ABSF2= -2.346829
##$ABSG= 5
##$ABSL= 3
##$ALPHA= 0
##$AQORDER= 0
##$ASSFAC= 0
##$ASSFACI= 0
##$ASSFACX= 0
##$ASSWID= 0
##$AUNMP= <proc_1d>
##$AZFE= 0.1
##$AZFW= 0.1
##$BCFW= 0
##$BC_mod= 2
##$BYTORDP= 0
##$COROFFS= 0
##$CY= -3
##$DATMOD= 1
##$DC= 0
##$DFILT= <>
##$DTYPP= 0
##$F1P= 0
##$F2P= 0
##$FCOR= 1
##$FTSIZE= 16384
##$FT_mod= 6
##$GAMMA= 0
##$GB= 0
##$INTBC= 1
##$INTSCL= 3.70164e-10
##$ISEN= 128
##$LB= 0.24
##$LEV0= 0
##$LPBIN= 0
##$MAXI= 10000
##$MC2= 0
##$MEAN= 0
##$ME_mod= 0
##$MI= 1.114404
##$NCOEF= 0
##$NC_proc= -6
##$NLEV= 6
##$NOISF1= 3.799351
##$NOISF2= 2.8
##$NSP= 0
##$NTH_PI= 0
##$NZP= 0
##$OFFSET= 15.74469
##$PC= 1
##$PHC0= -18042.26
##$PHC1= 20.40069
##$PH_mod= 1
##$PKNL= yes
##$PPARMOD= 0
##$PSCAL= 0
##$PSIGN= 0
##$REVERSE= no
##$SF= 200.130005372863
##$SI= 16384
##$SIGF1= 3
##$SIGF2= 2
##$SINO= 5.538805
##$SIOLD= 16384
##$SREGLST= <1H.CDCl3>
##$SSB= 0
##$STSI= 16384
##$STSR= 0
##$SW_p= 3612.71676300578
##$SYMM= 0
##$S_DEV= 0
##$TDeff= 16384
##$TDoff= 0
##$TI= <>
##$TILT= no
##$TM1= 0
##$TM2= 0
##$TOPLEV= 0
##$USERP1= <user>
##$USERP2= <user>
##$USERP3= <user>
##$USERP4= <user>
##$USERP5= <user>
##$WDW= 1
##$XDIM= 16384
##$YMAX_p= 267628004
##$YMIN_p= -414830
$$ End of Bruker specific parameters
$$ ---------------------------------
##NTUPLES= NMR SPECTRUM
##VAR_NAME=  FREQUENCY,     SPECTRUM/REAL,   SPECTRUM/IMAG
##SYMBOL=    X,             R,               I
##VAR_TYPE=  INDEPENDENT,   DEPENDENT,       DEPENDENT
##VAR_FORM=  AFFN,          ASDF,            ASDF
##VAR_DIM=   16384,         16384,           16384
##UNITS=     HZ,            ARBITRARY UNITS, ARBITRARY UNITS
##FACTOR=    0.220516191357247, 1,           1
##FIRST=     3150.98488256769, 0,            0
##LAST=      -461.731880438085, 0,           0
##MIN=       -461.731880438085, -414830,     0
##MAX=       3150.98488256769, 267628004,    0
$$ Real data points
##PAGE= N=1
##DATA TABLE= (X++(R..R)), XYDATA
$$ [...]
5963a92777k3752j9033J10047J28367j01314q8043M224r390O1529O39O6224L1967
5951c1312M0655Q0443j23553j7495n3282K7256L7003l9052P7014L5385m9090K0775
5939D747K4982k0464j31177q9158J19375J87308j9739o0546J7417L563J7794O0808
5927A14910p7409j28664l5971P1020J3913Q3304N0773J443o3906p2468J43874
5916A00819J60958l0792o4409m1889P7602Q4153J6478k3495m9834n1009m0953
5905A37629N2257J06464K1310L0639O0969m7757L7818L1872p6535O8797o5422
5894C58041k889j33389J01346K7946M855j06869o6693J28873l85j06898J0369
5883B14307J08817M6096l3660r540L8648J9610J23351j12659M6478j41556Q4640
$$ plain form
5963 -192777 -216529 -235562 -125515 2852 -98462 -186505 -182281 -191671 -130142 -129503 -63279 -31312
5951 -31312 9343 89786 -33767 -51262 -104544 -77288 -40285 -79337 -2323 33062 -16028 4747
5939 4747 29729 9265 -121912 -211070 -91695 95613 75874 15328 32745 36308 54102 114910
5927 114910 37501 -91163 -127134 -56114 -42201 41103 91876 93319 29413 -43055 100819
5916 100819 261777 230985 166576 124687 202289 286442 302920 279425 229591 178582 137629
5905 137629 189886 296350 317660 348299 409268 361511 399329 431201 354666 423463 358041
5894 358041 355152 221763 323109 351055 355910 249041 182348 311221 310836 203938 214307
5883 214307 323124 369220 335560 326020 364668 384278 507629 394970 441448 299892 384532
5872C84532N5875K6391L6954j4942O508R3324j25267M6278J23790J8673N7960
5861G10076N6680j03150l2342O9086n0499p3822p0740J42418l8000q7068l7599
5850D85040N2439j91512j28567L4403Q5706P5203R164k2161M00P6940j00812j668
5838C74575j9023J9171M3210O1468q3618j43843R8781m7232m9756Q0341L8747
5827C72821J2107o1947j51Q6674N0965j24040j6886n2330O9109J3989o2834j0794
5815B76683j22657j74198m4786P7592L8093J29030O5543N5427j58985j39301j42245
5804a39804P9952N0840O4613J51531j24684l8045l3445J8357j06820o3298N3211
5793h7592q0261o3779R8896N8011K6592O2918j5391K7954o1125j32972J75280
$$ plain form
5872 384532 440407 466798 503752 488810 495318 588642 463375 509653 633443 652116 710076
5861 710076 766756 663606 631264 700350 649851 576029 505289 647707 609707 522639 485040
5850 485040 537479 345967 217400 251803 337509 412712 421876 399715 400115 477055 376243 374575
5838 374575 355552 374723 417933 479401 395783 251940 350721 303489 253733 334074 372821
5827 372821 384928 322981 322830 409504 460469 336429 319543 267213 336322 350311 287477 276683
5815 276683 154026 -20172 -64958 12634 50727 179757 245300 300727 141742 2441 -139804
5804 -139804 -59852 -9012 55601 207132 82448 44403 10958 29315 -77505 -140803 -87592
5793 -87592 -167853 -231632 -132736 -74725 -48133 14785 -606 27348 -33777 -166749 8531
5782H531J38691j71537o1199J14187N6737n8480n6044m072K6128Q564O6192r1794
5770b4096j74076j4037O7970P8683j31649J01181J37195m3533N6317l5244j11763
5759i3052L9807J00259j33583o1620K4095J29498k5210j63401N8201k1744L1750
5748a15000N2233O2499K8272k8316M471R616n5867p9163m2082o6942K5527J33077
5736g1675J02170j1048m5462M2715J00955r722k5707k45381j01935K761J31796
5725a30533P855L9030k6381K4590Q9374Q4192R6019j51926l5634P4561l3925l3184
5713D038P9569N21j24495j1475k6164r4111J4647K1488P5418q6289J45810J09372
5701A08329j40129m8386R982Q477O3386P125j49709P0430m5715K7558J28990K2980
$$ plain form
5782 8531 147222 -24315 -85514 28673 85410 26930 -29114 -33186 -7058 1506 67698 -24096
5770 -24096 -198172 -212209 -144239 -65556 -197205 -96024 41171 -2362 53955 18711 -93052
5759 -93052 -53245 47014 -86569 -148189 -124094 5404 -19806 -183207 -125006 -146750 -115000
5748 -115000 -62767 -268 28004 -312 4159 13775 -42092 -121255 -163337 -230279 -204752 -71675
5736 -71675 30495 19447 -26015 16700 117655 107933 82226 -163155 -265090 -262329 -130533
5725 -130533 -122678 -83648 -110029 -85439 3935 88127 184146 32220 -3414 71147 37222 4038
5713 4038 83607 84128 -40367 -51842 -78006 -172117 -157470 -135982 -60564 -146853 -1043 108329
5701 108329 -31800 -80186 -70204 -61727 1659 8784 -140925 -70495 -116210 -88652 40338 63318
5689F3318l9480j0017o6516M6144O9003q1810l4124J69135j71658p1259J61448
5678C4184p1613Q0203M6416o6354q9478n0249O7570J89438r1849j26087Q2075
5667D256n078j9346K50006M6386O427j89757n9791k2961R4885J58614m8512j37837
5655G7292J14532M2109m673n6417J09301P0938J80751j11516k59035J63998O465
5644C33745j1169o382L9006N3383K3127k1706j2973J22474N1428J2054M2219m9284
5632E75922N845n3916p303L8102J0748j45492P0017M1469K5349j2657m0482L7545
5620E45147O0947q2168L1622O8255J2469M9476p2680q9741P1961Q3799j7406k0483
5608F41198N8590l4986o1192l0608j14779N06j4822l3870P3555k5050j6577m6232
$$ plain form
5689 63318 23838 13821 -52695 -6551 62452 -19358 -53482 115653 -56005 -127264 34184
5678 34184 -37429 42774 89190 22836 -66642 -116891 -49321 140117 48268 -77819 4256
5667 4256 -822 -20168 229838 276224 282651 92894 33103 10142 105027 263641 215129 77292
5655 77292 191824 233933 229260 172843 282144 353082 533833 422317 163282 327280 333745
5644 333745 322576 316194 355200 408583 431710 410004 397031 519505 570933 582987 625206 575922
5632 575922 581767 527851 520548 558650 569398 423906 493923 535392 560741 548084 507602 545147
5620 545147 606094 523926 555548 623803 636272 685748 613068 523327 595288 679087 661681 641198
5608 641198 699788 664802 603610 573002 458223 458729 443907 410037 483592 458542 441965 395733
5596C95733J5429J14824j448j1380o9845O2709m4385j02984J10J51851q7397r9633
5584C23584O7830P6130j65567l3136J06894n1767O5665q1212K7876L1645n9922
5573C08020L322O5467K2259q4947k8067Q1420j47166j4405O4375O1734R1574P6808
5561E00394J5298j10429l7366M0697j92064M0757p8189j4136N0005K1932j12906
5550A23993N2323M752m0988o7428l8887j5825o8775J08135o395Q025q4075O5058
5538C9913r3469m6328M1229N3160m0032J43035k8434L503l8100m6462j4062k0302
5526d6349Q1797J5821m6158o5306K2551k0637q4613L398Q300R5854J60901j8875
5514A06684o7671l5683P7225J3701p9265m1633R2839p6955j01668l2371J47055
$$ plain form
5596 395733 411162 525986 524538 513158 443313 506022 461637 358653 358763 510614 423217 323584
5584 323584 391414 467544 301977 268841 375735 323968 389633 308421 336297 367942 308020
5573 308020 311342 376809 399068 314121 286054 367474 220308 205903 270278 332012 423586 500394
5561 500394 515692 405263 367897 408594 216530 257287 179098 164962 214967 236899 123993
5550 123993 176316 181068 140080 72652 33765 17940 -50835 57300 50905 58930 -25145 39913
5538 39913 -53556 -99884 -58655 -5495 -45527 97508 69074 72577 34477 -11985 -26047 -46349
5526 -46349 35448 51269 5111 -60195 -37644 -58281 -142894 -139496 -131196 -35342 125559 106684
5514 106684 39013 3330 80555 94256 14991 -26642 66197 -10758 -112426 -144797 2258
5503B258p4452n1379J95966j41272J1054M7198k4310l721Q5582N2502o025l7881
5491E5520j10792n4033l5899O4359P3417M7047L0014Q5948R275j34772P246R1379
5479A28709q7473q4047J2591K1851o4395r390P2100r6823j052j05183N4422J05867
5467e2823O8146J15551K8177j22898m9307l2797k3345J37564O4635j18529Q832
5456B3206O8778m5378P8862K3422j60712R3072l0625m7193N5893p5720j08893
5445a25288m1272L8146J5344P2781J27469q2816m7740o4767p3724j4400P7523
5434a18744N8792N6295J7062n1100O0386k2514L6589N1686k0009r1711M720o6711
5422h5259O0427O538O9454o8135K0722J21982R7253m6294j36530m3125J11820
$$ plain form
5503 2258 -72194 -123573 72393 -68879 -57825 -10627 -34937 -38658 46924 99426 93401 55520
5491 55520 -55272 -109305 -145204 -80845 -7428 39619 69633 155581 164856 30084 37330 128709
5479 128709 41236 -42811 -30220 -8369 -72764 -82154 -10054 -106877 -107929 -213112 -158690 -52823
5467 -52823 15323 130874 159051 36153 -13154 -45951 -69296 68268 132903 14374 23206
5456 23206 91984 46606 125468 148890 -11822 81250 50625 3432 59325 -16395 -125288
5445 -125288 -166560 -128414 -113070 -40289 87180 4364 -43376 -108143 -181867 -196267 -118744
5434 -118744 -59952 -3657 13405 -37695 22691 177 36766 88452 68443 -23268 -18548 -85259
5422 -85259 -24832 -18294 51160 -16975 3747 125729 222982 176688 40158 -2967 108853
5411A08853L0728j29864L187P6559k0607P474M6556q5473l4709l1194k3961k7311
5399g9762J13802m712j08729N0859R519O8075Q2564o7475k73J2531n990M2625
5387A13034q2876K7169J23250p4608j06774P3677J08180l4053j02367j0462m5384
5376a1214l5675J7761J5335p1906l5262m6251J37641j10874J05466M7832l7755
5365b4902N3469k8634k2256J9791p5192k5249J0579J40100Q3027L67j8088j66008
5353e2996K6052Q3003J06829j39739q7516N3886j3669l7296R4337J5838j13110
5342f4381n3895R7204N4909L1810n1879k6285M1891N8544n6570r9353R1453J41682
5330A65130n2368r2547m6477q261J47796K7484m18J35726j18265l1239r9485o9832
$$ plain form
5411 108853 139581 9717 12904 89463 68856 76330 122886 37413 2704 -28490 -52451 -79762
5399 -79762 34040 29328 -79401 -28542 -19023 49052 131616 64141 63868 76399 70409 113034
5387 113034 30158 57327 180577 105969 -805 72872 181052 146999 44632 34170 -11214
5376 -11214 -46889 -29128 -13793 -85699 -120961 -167212 -29571 -140445 -34979 12853 -24902
5365 -24902 28567 -67 -22323 -2532 -77724 -102973 -92394 47706 130733 131100 113012 -52996
5353 -52996 -26944 56059 162888 23149 -64367 -10481 -24150 -61446 32891 48729 -64381
5342 -64381 -118276 -21072 33837 65647 13768 -12517 29374 87918 31348 -68005 23448 165130
5330 165130 112762 20215 -26262 -34523 113273 140757 140339 276065 157800 126561 27076 -42756
5318d2756r3333Q4368N4105j25310p312J21828J5410N1153N2809p1301j17831
5307g8170O8603J7789J3800l083K1607P1466m7964P3682j9220j63883L8977n3588
5295e9984L8249J18953j12164K6318R2508r3704o5287J01211M4050q4138l0422
5284b4410r7174J32515O6289o9141J11554k0937P9773m2263j55456m0685m2442
5273a02377N8987l0432K1157J0960j8480O8359L0139k8782J0924O4842Q2312m2776
5261A24833o9593M1418j30338m9783n451J01511R7791J06078j59866l9572r0620
5250g3592J06210N5266Q22q3207K9598K6714J07975n8291l9664N408O886J77124
5238B61249o8790p6105j10274q4885J47498Q77J6871J32470M6302j04113j19268
$$ plain form
5318 -42756 -136089 -51721 2384 -122926 -130238 -8410 7000 58153 110962 39661 -78170
5307 -78170 -9567 8222 22022 18939 40546 112012 64048 137730 118510 -45373 -6396 -59984
5295 -59984 -21735 97218 -14946 11372 103880 10176 -55111 46100 90150 6012 -24410
5284 -24410 -121584 10931 77220 8079 119633 98696 178469 136206 -19250 -59935 -102377
5273 -102377 -43390 -73822 -52665 -41705 -60185 8174 38313 9531 20455 85297 167609 124833
5261 124833 55240 96658 -33680 -83463 -88914 12597 110388 216466 56600 17028 -73592
5250 -73592 32618 87884 88706 5499 35097 61811 169786 111495 71831 77239 84125 261249
5238 261249 192459 116354 6080 -78805 68693 69570 86441 218911 265213 161100 41832
5227D1832L38n2861O468R9564N8146M4516o856j68457J8110j0309k2249l9106
5215c0864L8019O4757l2535L5609p5692j10390Q3975m456M6878l0832m2944P0694
5203A2219N4967j00161n2540O7370o8803l6140K22495l0623j53549J8468M8313
5192a7984J38962K7361j61895M1287K9197L8881o10J9458N0244r9042r6677J46699
5180A15881M0446N291l2998l9175O1402N3961m5231r0385L4082Q5948O8923q4329
5168A73816N570j1968j05251m5588N3503O6325j14672J02432j7289N2050m7440
5157A11488m4608O5301j06876K8664Q3818Q1321j37630l8690k7068j2167m0978
5146c7425k0947J17100l7960o5608R8872N443k7075q4654O2562M0812l4667O4233
$$ plain form
5227 41832 42170 -10691 -4223 95341 153487 198003 191147 22690 40800 30491 8242 -30864
5215 -30864 7155 71912 39377 74986 -706 -111096 -27121 -31577 15301 -15531 -58475 12219
5203 12219 67186 -32975 -85515 -18145 -86948 -123088 99407 68784 -84765 -66297 -17984
5192 -17984 120978 148339 -13556 27731 56928 95809 95199 114657 164901 65859 -30818 115881
5180 115881 156327 161618 128620 89445 150847 204808 159577 69192 103274 189222 258145 173816
5168 173816 179386 167418 62167 16579 70082 136407 21735 124167 106878 158928 111488
5157 111488 66880 132181 25305 53969 137787 219108 81478 42788 15720 3553 -37425
5146 -37425 -58372 58728 20768 -44840 54032 59475 32400 -52254 10308 51120 16453 80686
5134H0686m2870M1886J26817j77745o8261Q377J01669N1296Q0573J6717M927j2219
5122B11853j3829P017n043q6586N9435j0341j18896K8479k3649o2018J07955p3438
5110B0939j4462J61835j3357j0261O98r8518m5948P5384N9348P5487n2716p8088
5098H0341L59J57394r5128p581M6046k2619p4529l7141q9225J583j5787K966J42267
5085H8946j16425N8893J24114l8881P284m1279J7545q4074j13871K5294M5592
5074b6862o3930N4291O4157N6407O2983j22613L2987p4539K1754Q6005j23703
5063c3063l6109K2343J4743k1606p6071m7324Q0342J10761k6581j23945K0791
5052a15719J58078k3748J20447Q943j46896j02654k4887R233Q3367Q7521j62183
$$ plain form
5134 80686 37816 79702 206519 28774 -39487 -31110 70559 121855 202428 219145 224072 211853
5122 211853 198024 205041 199998 113412 172847 162506 43610 72089 48440 -13578 94377 20939
5110 20939 6477 168312 154955 144694 145392 46874 926 76310 135658 211145 158429 80341
5098 80341 80700 238094 142966 135385 181431 158812 84283 47142 -42083 -40500 -56287 -53321 88946
5085 88946 -27479 31414 155528 116647 123931 82652 100197 16123 -97748 -72454 -26862
5074 -26862 -90792 -36501 27656 84063 147046 24433 57420 -17119 4635 90640 -33063
5063 -33063 -69172 -46829 -32086 -53692 -129763 -177087 -96745 14016 -12565 -136510 -115719
5052 -115719 42359 18611 139058 148001 1105 -101549 -126436 -117203 -33836 53685 -108498
5041a08498L0857P8882o2014m3819j8198j371P992N1629M6531o5144Q7162L5173
5029C9182J2380n6047j0540n90j4537N4509l0949l5374P2589m0304j0231j0948
5017c0860R8512K5475q1740K5749M4700j49380P7758Q549j9945p2856k2971P7592
5005a9417K6580K7201j40950k6411J40196j4287m0613K527r332J18524j1121o955
4993D5942j11970P8371L776N733O1250j53434J7793r1764n4761O5912O2191N6720
4981a4241q7344O1571q9676R079q7490K04721J18832j18093j53931M3570J47410
4970C4408p4552l844j01859J09233K0601q5499J444M7510J32642L089n3571j17264
4958h7662L783K9996k7344J29513L5073P257k9354k17858L5181J41873J05053
$$ plain form
5041 -108498 -77641 1241 -60773 -104592 -122790 -124161 -116169 -64540 -18009 -83153 4009 39182
5029 39182 51562 -4485 -15025 -15615 -30152 24357 -6592 -41966 30623 -9681 -19912 -30860
5017 -30860 67652 93127 11387 37136 81836 -67544 10214 18763 -1182 -74038 -97009 -19417
5005 -19417 7163 34364 -106586 -132997 7199 -7088 -47701 -45174 -54506 64018 52897 45942
4993 45942 -66028 12343 16119 21852 83102 -70332 -52539 -144303 -199064 -133152 -70961 -14241
4981 -14241 -101585 -40014 -129690 -120611 -208101 -3380 115452 -2641 -156572 -113002 34408
4970 34408 -40144 -43988 -145847 -36614 -16013 -101512 -100068 -52558 80084 83173 29602 -87662
4958 -87662 -83879 -53883 -81227 48286 83359 90616 61262 -156596 -121415 20458 125511
4947A25511n9114j59863R106J0049m1690o4913N6196K9455k658J0406O4900m1513
4935f4128k2813O8011p9365N7352l1724J06546J59425j32361m3964P7552j12105
4924a7574j1874J10653n6401N7344j0867l1393j04374m3110P3727p1279N2615
4913e2533j18107J9508O9786K8928m4160j2130k6750J19031J54548l0725J00515
4902B07911O7041o8553m4827O492l1975N1615K6467r2522N563j6275j0244k5653
4890G5040m9930J43994K4639j74026K3047O1417o5544Q3617M2360l3591N9771
4879A90794O1875j6549r6299r5103p2097N1166L1392L6367R4656q3013j2480J20526
4867B11235L2020r9821l5360m3974K9107j7498L6678j31689L2339L8346J3153
$$ plain form
4947 125511 66397 -93466 -84360 -74311 -116001 -180914 -124718 -95263 -97921 -87515 -22615 -64128
4935 -64128 -86941 -18930 -98295 -40943 -72667 33879 193304 60943 16979 94531 -17574
4924 -17574 -29448 81205 24804 82148 71281 39888 -64486 -107596 -33869 -105148 -52533
4913 -52533 -170640 -151132 -81346 -52418 -96578 -108708 -135458 -16427 138121 107396 207911
4902 207911 274952 206399 161572 168064 136089 187704 214171 121649 127212 110937 100693 75040
4890 75040 25110 169104 193743 19717 42764 104181 38637 122254 164614 131023 190794
4879 190794 252669 236120 139821 44718 -27379 23787 55179 91546 186202 103189 90709 211235
4867 211235 243255 143434 108074 64100 93207 75709 112387 -19302 13037 51383 64536
4856F4536R089J14505o0051Q604J18265l3443q6757L9905J6014k6994P106M2723
4844B13502N7283j61296J35121j15231o2463J67981j8576r1505n867Q6926L7301
4833B43176r0185m768j8093j08315J5377m4136J16792L0407j23815M9188J89917
4822B55545m3540o1425L794j0078o549M5489N5102r654j43692L2824n9286j014
4810E7516J22792L6327o8283j670o7796J8440o1920m7243J43956j06995j7435
4799G689k6914N7222M0637L7167j5073p2600j3519J4548K9169L485j0221j5859
4787C5731j2439K0492k3650K9342J80364O0286q1639m279j7429N0576j8157p6099
4775A43099q4349j8807J6340Q2802l4947l2306m8100K5114J34735n1792L6728
$$ plain form
4856 64536 73625 188130 128079 136683 254948 221505 134748 174653 190667 163673 170779 213502
4844 213502 270785 109489 244610 129379 66916 234897 216321 124816 118949 205875 243176
4833 243176 152991 148223 130130 21815 37192 -6944 109848 140255 16440 65628 255545
4822 255545 212005 150580 154374 144296 137747 183236 238338 228684 84992 117816 58530 57516
4810 57516 180308 216635 148352 146682 78886 97326 35406 -11837 132119 25124 7689
4799 7689 -19225 37997 78634 115801 100728 28128 14609 29157 58326 61811 51590 35731
4787 35731 23292 43784 20134 49476 229840 290126 208487 204208 186779 237355 219198 143099
4775 143099 58750 39943 56283 139085 104138 71832 23732 48846 183581 131789 168517
4764A68517J8362o2831J0401j37864L1322j4661Q5481M0525k6756P726n1081P7939
4752A47080R7516m2941M16N3552j07656j29935j3404O6078J68184j17105k7463
4741I4322J02185N6377p4852p4686l0056K5184L4992P6103o2065j13433M7978
4730H2049J19937P9398n3730J572N4694L7874j16013q7580Q5695L6707m9432q034
4718A83137N253m0636N4632p8982P0160j2177r3848K9021N3750j9455k2598K4817
4706A53074J4291L8188l0675m1625l6947k5652K9246k3234p2135R3310P2405N188
4694A75434j01191O9537o4365N5223j30290R4069l6980l5583n964p0439rO8263
4682A7705J02106N3402j0662K6457o0965n7740j6046l6744N7034n540l3944k2090
$$ plain form
4764 168517 186879 124048 134449 -3415 27907 13246 98727 139252 112496 120222 69141 147080
4752 147080 244596 201655 202071 255623 147967 18032 4628 70706 238890 121785 94322
4741 94322 196507 252884 178032 103346 73290 98474 133466 209569 147504 34071 82049
4730 82049 201986 281384 227654 229226 283920 321794 205781 118201 203896 240603 191171 183137
4718 183137 188390 147754 202386 123404 193564 181387 87539 116560 170310 150855 128257 153074
4706 153074 167365 205553 174878 133253 96306 70654 99900 76666 4531 97841 170246 175434
4694 175434 74243 143780 79415 134638 4348 98417 61437 25854 19890 -50549 -50558 17705
4682 17705 119811 173213 162551 189008 128043 70303 54257 17513 74547 69007 35063 12973
4670A2973M8902J03587n631J02744q4497k07802M733R5995L5520Q6233r5717m1059
4658E5981Q4330k7056m0935j2960N8018m5399m8915N246j9336o7062J3367N1877
4646G156N1103K7318o9482M601K5895m3274K0364K2121m7942r6802J18030m8831
4634b9743k4461m8034P8482K6948J08560J25006m315j19670L3950m7246j06442
4623f965Q6270q0478J09520j11796N5455L9044q4268N1302K0972N5371q0914n6018
4611b505O6681O8154q2978p4927J9076N4135L453o9633k8751Q5629N5802O4373
4599A58509K8836j17165m1762O1558l146N3685K9073J8218r1905p8031L4259O7546
4587A19675o4772O5153q7431r6987P6687j3381J3545J5268r4184O2426M7826O89
$$ plain form
4670 12973 61875 165462 159831 262575 178078 -29724 -24991 71004 106524 192757 97040 55981
4658 55981 140311 113255 72320 59360 117378 71979 23064 28310 8974 -58088 -44721 7156
4646 7156 58259 85577 16095 20696 46591 3317 23681 45802 -2140 -98942 19088 -29743
4634 -29743 -54204 -102238 -23756 3192 111752 236758 232443 112773 146723 99477 -6965
4623 -6965 79305 -1173 108347 -3449 52006 91050 6782 58084 79056 134427 53513 -2505
4611 -2505 64176 132330 49352 -25575 -6499 47636 51089 -18544 -47295 38334 94136 158509
4599 158509 187345 70180 28418 89976 86830 140515 169588 187806 95901 17870 52129 119675
4587 119675 54903 120056 32625 -64362 12325 -1056 12489 27757 -66427 -4001 43825 44514
4575D4514Q6442L0523k9873m3587K0769M9224o4535O877N0863N2177M6059j52372
4563I7081r0033Q67n6368q4029J01320L7291O1633J01502l5137j02907M7786q5564
4551f558L2352M3067N9608r3467K4937M0785p1350K9868m0709j7950j7939M145
4539a3211n596O9906O7777O0173n4296j3974l6575N3547Q5176r4036j30067j36528
4527a47704P7847O3366J02036M191J7082M8917p8733P6422J00843q2718L2171
4516B13720k8834j31634J11766j2347M5682j0293j03664Q3152L5485k7767o3734
4505A11532J40257L3409p6694l3311k5358j8596N6978N9137j45309N8636m8517
4494A12164m5721J27044R2032j15657J8840n3743n5579M5038J53118n1996j33308
$$ plain form
4575 44514 130956 161479 131606 88019 108788 158012 93477 100354 151217 203394 249453 97081
4563 97081 7048 7915 -48453 -132482 -31162 6129 67762 169264 134127 31220 79006 -6558
4551 -6558 25794 68861 128469 35002 59939 100724 29374 59242 18533 583 -17356 -13211
4539 -13211 -18807 51099 118876 179049 124753 110779 74204 127751 212927 118891 -11176 -147704
4527 -147704 -69857 -6491 95545 99736 116818 165735 87002 163424 264267 181549 213720
4516 213720 184886 53252 165018 152671 198353 188060 84396 167548 203033 175266 111532
4505 111532 251789 285198 208504 175193 149835 131239 188217 247354 102045 160681 112164
4494 112164 66443 193487 285519 169862 188702 134959 79380 124418 277536 225540 92232
4483I2232L0599M5297K9302J9691M6772n2203P9331n4024q7233M5734N3010j2231
4471B36277j27419L3421J70209n4957N503m6949N7355M4660j96664M8252O2580
4460B32268J3222j5626O0806K0029p4394O992m8921L7577L6498J18589O1226j59516
4448B88750P3419j3290J05819m0278N7166J8844l2872Q0995n0123P3365j66241
4437C95554P1319j1398j10294m0787l9761l0109J15737k2304J0392l0728k3390
4426B84231J25668j131O9262j15310o3244J26121k3653j6717r7673l1344M8950
4415C05160L8863k1713M1304Q9306q7714l5599L6372j19720k1957J21947j68318
4404A77931J8762R0510r3539Q7405J87948L3274m6515j39223K6024l0456J8555
$$ plain form
4483 92232 122831 168128 197430 217121 263893 211690 291021 236997 149764 195498 248508 236277
4471 236277 108858 142279 312488 257531 263034 216085 273440 318100 121436 169688 232268
4460 232268 245490 229864 290670 310699 236305 243297 194376 231953 268451 387040 448266 288750
4448 288750 362169 348879 454698 414420 471586 490430 457558 538553 488430 561795 395554
4437 395554 466873 455475 345181 304394 264633 234524 350261 327957 338349 307621 284231
4426 284231 409899 408768 478030 362720 299476 425597 401944 385227 287554 256210 305160
4415 305160 344023 322310 363614 452920 365206 329607 365979 246259 224302 346249 177931
4404 177931 196693 287203 193664 281069 469017 502291 455776 316553 342577 312121 330676
4393C30676K481o2006j8201K1440N8304P449R9954P1083r0929k9797k2891L2203
4381C99766l2838j7485q5623J16783J02360j45692q850M9764k1889k9552O0441
4370C87185k4934K8666o9854N928N3226j6628K0663O6258q2980N3788p9096L2838
4358C75060K4542q2137r3384M4121L9525j7550N6110M0519m5187R772J5171M282
4346C70844N9554j50723L0836O1702R518Q305m7503L9498r1271O296J23719j5741
4334D05034J17213r8408o8402J1713j30019J36337J02000M5223j42287P1468J0808
4323D60680M0199j03986r1735m8172Q8095Q0881o6267N8070N797n2988l7591R7778
4311D30761l7604K3864J56421J15017j88307Q6976j7144M88j7534r7872L1863
$$ plain form
4393 330676 333157 271151 252950 274390 332694 340143 440097 511180 420251 390454 367563 399766
4381 399766 366928 349443 263820 380603 482963 337271 328421 378185 356296 326744 387185
4370 387185 362251 390917 321063 326991 380217 363589 384252 450510 367530 421318 342222 375060
4358 375060 399602 317465 224081 268202 307727 290177 346287 386806 341619 351391 366562 370844
4346 370844 430398 279675 310511 372213 381731 390036 342533 382031 290760 297056 420775 405034
4334 405034 522247 423839 355437 367150 237131 373468 475468 520691 378404 449872 460680
4323 460680 500879 396893 305158 256986 345081 425962 359695 417765 423562 370574 332983 430761
4311 430761 393157 417021 573442 688459 500152 587128 569984 570472 552938 455066 486929
4300D86929Q589n7338Q1610J8165N8814L2736N138l7580m5825J4796P1379L0843
4288F68256N2691N448Q3303R3796j38667L622N1642j95611K3587j5074K1034O0875
4276G14902k4111n0767J4311O0699R2774P143r327Q088q4969J67829p1694N545
4264H30423J07556K0693m3498p6958q459n8317L8336P327j18894k2044J50141
4253H26306p017j13479O7008K00891J45798j47453k0073n6468L7848J46962p1274
4242A009049j32170O7285J45751j25099l0883K1100L8842O875K7783L4581M8239
4231A111353P273j11397k5334J99657k4110M0665M0478P1901P5173j1462Q8620
4220A462817k1530r9973l8442J0159N3796J23537j8923k1512l6181M3671P5298
$$ plain form
4300 486929 495518 438180 519790 537955 596769 629505 634643 597063 551238 566034 637413 668256
4288 668256 720947 726395 809698 903494 764827 768449 820091 624480 648067 632993 654027 714902
4276 714902 690791 640024 654335 715034 807808 814951 805624 813712 728743 896572 824878 830423
4264 830423 937979 958672 915174 838216 829757 771440 809776 817103 698209 676165 826306
4253 826306 819289 705810 772818 973709 1119507 972054 951981 895513 933361 1080323 1009049
4242 1009049 876879 944164 1089915 964816 933933 955033 993875 1000750 1028533 1063114 1111353
4231 1111353 1118626 1007229 981895 1181552 1157442 1198107 1238585 1310486 1385659 1374197 1462817
4220 1462817 1441287 1341314 1302872 1313031 1366827 1490364 1471441 1449929 1413748 1457419 1532717
4209A532717J91800p6651O9236M325Q0560M9570M3619n4103l1296K30138R8184
4198B138099K1857N061j2393P1010K4932M9993O196J18082P1844N9613O7587k1416
4186B600465J35036P1069K3715J8500L3453J0148J24123J52948J21727M6951O1849
4175C399984M3371Q2706P620m3107K3422J65337J76644J18747J32555l4329J66638
4164D239588J17493M5045J63956J46132J00047K36691Q8607J19664n5282L8357
4154E240298J67255K24475J35247J05159L24433J86693J34078K61826J59821J2774
4144F952059L46209K08872K9943J37378L38647K25365J49114K57343L08410M80970
4134I434310L00892K83592K17432J79980M04415L54304L55416L54537L49966L60837
$$ plain form
4209 1532717 1724517 1647866 1717102 1721427 1801987 1851557 1895176 1841073 1809777 2039915 2138099
4198 2138099 2159956 2165017 2152624 2223634 2248566 2298559 2304755 2422837 2494681 2554294 2621881 2600465
4186 2600465 2735501 2806570 2830285 2848785 2882238 2892386 3016509 3169457 3291184 3338135 3399984
4175 3399984 3443355 3526061 3533681 3490574 3513996 3679333 3855977 3974724 4107279 4072950 4239588
4164 4239588 4357081 4402126 4566082 4712214 4812261 5048952 5137559 5257223 5201941 5240298
4154 5240298 5407553 5632028 5767275 5872434 6196867 6383560 6517638 6779464 6939285 6952059
4144 6952059 7298268 7507140 7537083 7674461 8013108 8238473 8387587 8644930 8953340 9434310
4134 9434310 9735202 10018794 10236226 10416206 10820621 11174925 11530341 11884878 12234844 12595681
4124A2595681L44541M34640M62177M35613O15539N14769M93481N18206N84614
4115A6999261M14480M76009L92021N06315N66240N52048O09114O23692M59487
4106B1598667M94457M43910K90005K92474L71673K68912L17635K76505M54669
4097B4808907K69591J88609J72896J40681J58521M0955q3680j18536k24345j85550
4087B5168049k93819m64425k54743l73682l69218l98587l51266m70353n36032
4078B1655924m08482o09181n88935n46677p41450p08656o61584n92763n88751
4069A6209445n98909n89670o26685n53168l75536n30992o90021m99004m26472
4060A1318988n75385o05525n62200l89944k13079l88630m26529l19277l44060
$$ plain form
4124 12595681 12940222 13374862 13837039 14272652 14888191 15402960 15896441 16414647 16999261
4115 16999261 17413741 17889750 18281771 18788086 19354326 19906374 20515488 21139180 21598667
4106 21598667 22093124 22537034 22827039 23119513 23491186 23760098 24077733 24354238 24808907
4097 24808907 25078498 25267107 25440003 25580684 25739205 25780160 25696480 25577944 25353599 25168049
4087 25168049 24874230 24409805 24155062 23781380 23412162 23013575 22662309 22191956 21655924
4078 21655924 21247442 20638261 20049326 19502649 18761199 18052543 17390959 16798196 16209445
4069 16209445 15610536 15020866 14394181 13841013 13465477 12934485 12244464 11745460 11318988
4060 11318988 10743603 10138078 9575878 9185934 8972855 8584225 8157696 7838419 7494359
4051G494359k75561l62061k46321k22725l23979l26626l1377k22988j40310k79477
4041E062934j72651r7219j97660j22221j30008k44287m0108j13829j64175n2034
4031C728742r7652o3673o349m1735J68p0018j45463r814J6966n4565K8677k88327
4019B996957o5813J62239q1899l3661M8565j55045P8809J3685j4162q2363k19060
4008B648252L9830K18091J234m9811J9328k2819P8812j83943K4043k0580p2421
3997B680016k6624j4383q5565M3954l8697M3867K2954J4763j6947K4625o7102
3986B580861N849Q3340Q7097J2214j9892k74573o0275Q3461N4149k1883J3946
3975B544294J3306j30511j22747J05286J1313n2402O4798j5167N0849K5326M5743
$$ plain form
4051 7494359 7218798 6856737 6610416 6387691 6063712 5737086 5705709 5482721 5342411 5062934
4041 5062934 4890283 4793064 4595404 4473183 4343175 4098888 4058780 3944951 3780776 3728742
4031 3728742 3631090 3567417 3561068 3519333 3519501 3449483 3304020 3294206 3311172 3256607 3285284 2996957
4019 2996957 2931144 3093383 3011484 2977823 3026388 2871343 2950152 2963837 2949675 2867312 2648252
4008 2648252 2688082 2906173 2907407 2857596 2876924 2854105 2932917 2748974 2773017 2752437 2680016
3997 2680016 2653392 2639009 2553444 2597398 2558701 2602568 2625522 2640285 2623338 2647963 2580861
3986 2580861 2586710 2670050 2757147 2769361 2749469 2474896 2414621 2498082 2552231 2530348 2544294
3975 2544294 2557600 2427089 2304342 2409628 2420941 2368539 2433337 2418170 2469019 2494345 2540088
3964B540088m9267n860J385l9558N7029K7262J01661m3855Q3605N1886M7297J01735
3952B873408m9792j70638j3019J18314r729J18340m5867m6932l1493J12415P4635
3941B929642n644P5281J97765n274K151P4869j62851l914O9194J09161L9890k1654
3929C298616J4574J88395o9543l0031J21813J41711N2491p4848j7027l0453J92106
3918C787804J08005Q541R868R8954m5261M063k5565K47401j6590j1734M2813J17082
3906D325381L7959j02270q095l3366J15036K5080m4437J9278Q4111J11173P8447
3895D608297J17813L3188N3529J94956J5658N8515J07854j0207l5578J43046M1970
3884E329041J50299J03152Q4839J93869P3799K03238J36509N8378J4866J81030
$$ plain form
3964 2540088 2490821 2484961 2486346 2446788 2503817 2531079 2632740 2588885 2672490 2724376 2771673 2873408
3952 2873408 2823616 2652978 2639959 2758273 2748544 2866884 2821017 2774085 2742592 2855007 2929642
3941 2929642 2923998 2999279 3197044 3191770 3193921 3268790 3105939 3102025 3171219 3280380 3320270 3298616
3929 3298616 3313190 3501585 3432042 3402011 3523824 3665535 3718026 3643178 3626151 3595698 3787804
3918 3787804 3895809 3904350 3914218 4013172 3967911 3971974 3946409 4193810 4177220 4165486 4208299 4325381
3906 4325381 4363340 4261070 4252975 4219609 4334645 4359725 4315288 4334566 4418677 4529850 4608297
3895 4608297 4726110 4759298 4812827 5007783 5023441 5081956 5189810 5179603 5144025 5287071 5329041
3884 5329041 5479340 5582492 5667331 5861200 5934999 6138237 6274746 6333124 6347990 6529020
3874F529020J26021k4037N2384K71522K70958J99700J37107P9874N9209K24385
3864G926143J24892J55749K70566K46275J20637J57541J77195J66410L13267K36604
3854I895279J85953J55022J63337K43063L79107K65764K15348K83950L75518L08395
3844A2470736M55067L35734L44930L88044M79382L89730N53570N41868N90497
3835A6549558O10947N16276O55925O42259P78583P83580Q13676J045822R85777
3826B3382403R72659J091718J262785J318120J317224J483350J776160J899465
3818C4503884J794163J960594K153849K132999K164362K380104K257099K136766
3810E1483820J722266J594643J608905J209067R87370O18618L58761K24810R1022
$$ plain form
3874 6529020 6655041 6631004 6683388 6954910 7225868 7425568 7562675 7642549 7701758 7926143
3864 7926143 8051035 8206784 8477350 8723625 8844262 9001803 9178998 9345408 9658675 9895279
3854 9895279 10081232 10236254 10399591 10642654 11021761 11287525 11502873 11786823 12162341 12470736
3844 12470736 12925803 13261537 13606467 13994511 14473893 14863623 15417193 15959061 16549558
3835 16549558 17160505 17676781 18332706 18974965 19753548 20537128 21350804 22396626 23382403
3826 23382403 24355062 25446780 26709565 28027685 29344909 30828259 32604419 34503884
3818 34503884 36298047 38258641 40412490 42545489 44709851 47089955 49347054 51483820
3810 51483820 53206086 54800729 56409634 57618701 58606071 59224689 59583450 59808260 59899282
3801E9899282j76304j74245l10834m36042o07595p17675p59579q72518j027855
3792E4816635j512655j577174j948100k010726j991025k154981k292511k254842
3784C9074621k017393k072834j866935j861648j828285j497117j510394j376404
3776B5043611j186427j002441q97781r20651q67404q32284p97547o65198m84918
3767A7388960o50053n93859m27284k87136l68414k63374k43500k55259k85304
3758A4014777k09463k17643l50305k96301o3166j01812j38639n2779j55311o5550
3748A2363808k11276r4585j00437m9481j08287p1414M0035j08393j3380n6082
3738A1590508r167J9117Q4122q066q718K9220m3792O5261m4205J16770J18416
$$ plain form
3801 59899282 59722978 59548733 59237899 58801857 58194262 57476587 56717008 55844490 54816635
3792 54816635 53303980 51726806 49778706 47767980 45776955 43621974 41329463 39074621
3784 39074621 37057228 34984394 33117459 31255811 29427526 27930409 26420015 25043611
3776 25043611 23857184 22854743 21956962 21036311 20168907 19336623 18539076 17873878 17388960
3767 17388960 16738907 16145048 15717764 15430628 15062214 14798840 14555340 14300081 14014777
3758 14014777 13805314 13587671 13237366 12941065 12877899 12776087 12637448 12584669 12429358 12363808
3748 12363808 12152532 12057947 11957510 11908029 11799742 11728328 11768363 11659970 11646590 11590508
3738 11590508 11581341 11600458 11684580 11676514 11667796 11697016 11653224 11718485 11674280 11791050 11909466
3727A1909466J80916L6481J39955L2907J45760K50410J86894J21700K65871K31766
3717A3502126K54606J41618L37409M36431M08293K82389J43545L37580M18377
3708A6262374N35822M06163N73688M44911P93153P42781O12518P30788P52522
3699B1854720Q28877O40214M68880N30156M31433L75135L57816K48212J4874m9483
3689B5700834j22519j98700j77554j43020j76971j42667O5157O3532m5478J30530
3679B4953144K27672K36788L86835L59923L24196M81121O07988M94642O58326
3670B8730635Q15194Q45363R42823Q96847R87761J044147J287880J402804J437209
3661C8390663J655279J705354J792326J967105K145023K361101K482848K771446
$$ plain form
3727 11909466 12090382 12126863 12266818 12299725 12445485 12695895 12882789 13004489 13270360 13502126
3717 13502126 13756732 13898350 14235759 14672190 15080483 15362872 15506417 15843997 16262374
3708 16262374 16798196 17204359 17778047 18222958 19016111 19758892 20371410 21102198 21854720
3699 21854720 22683597 23323811 23792691 24322847 24754280 25129415 25487231 25735443 25750317 25700834
3689 25700834 25578315 25379615 25202061 25059041 24882070 24739403 24804560 24868092 24822614 24953144
3679 24953144 25180816 25417604 25804439 26164362 26488558 26969679 27577667 28072309 28730635
3670 28730635 29545829 30391192 31334015 32230862 33218623 34262770 35550650 36953454 38390663
3661 38390663 40045942 41751296 43543622 45510727 47655750 50016851 52499699 55271145
3653E5271145L041660L334710L597410L639330L822491L862981L907923L738305
3645H4215955L700491L423292K854582K585787J917247J435218J105700O88724
3637A01926996J93120j37844k86096m27918n60737n14630n59626p27592q91023
3628I8014650q86403j027119j250706j442473j615505j793670k286002k368817
3620H5343955k565545k814244l105599l136559l280538l280578l181309l217666
3612F0761917l106746l135559l016142k648144k516357k346785k186873k115453
3604C9689858k025026j827105j659264j495110j441010j314657j266818j060598
3596B7600270p85650r15368r24139q55560n50208n73787m99635n52640m11172
$$ plain form
3653 55271145 58312805 61647515 65244925 68884255 72706746 76569727 80477650 84215955
3645 84215955 87916446 91339738 94194320 96780107 98697354 100132572 101238272 101926996
3637 101926996 102120116 101982272 101696176 101268258 100707521 100192891 99633265 98905673 98014650
3628 98014650 97128247 96101128 94850422 93407949 91792444 89998774 87712772 85343955
3620 85343955 82778410 79964166 76858567 73722008 70441470 67160892 63979583 60761917
3612 60761917 57655171 54519612 51503470 48855326 46338969 43992184 41805311 39689858
3604 39689858 37664832 35837727 34178463 32683353 31242343 29927686 28660868 27600270
3596 27600270 26814620 25899252 24975113 24119553 23569345 22995558 22495923 21943283 21532111
3587B1532111l21346k56390l20605j42471m8484k89967j12248Q9336O5783L5303
3577B0231022J42956R1652J13564J11960J80126J7852p5018j79948k02073m05714
3567B0026379k84671l75339n27455o18132m64932o25989o86563m00600o79868
3558A5362830n79234n48353m24162n60006n50071m24342l75786l84458l74754
3549A1141664m11162j40410k95653l41786j39058k47883k57082j28280j72224
3540I008126j73551p0246k09272j44193o4427r8806n0775j42091l1299j87620
3530G835846o3349m7120q0151k7866p4864k6578j38431Q8382r9326L3746P6345
3519G476634p8006q871J87678p3730O3835o7780o507J27056l3066L4115j0801
$$ plain form
3587 21532111 21210765 20954375 20633770 20491299 20442815 20152848 20040600 20129936 20195719 20231022
3577 20231022 20373978 20465630 20579194 20691154 20871280 20889132 20814114 20634166 20432093 20026379
3567 20026379 19741708 19366369 18838914 18220782 17755850 17129861 16443298 16042698 15362830
3558 15362830 14783596 14235243 13811081 13251075 12701004 12276662 11900876 11516418 11141664
3549 11141664 10730502 10590092 10294439 9952653 9813595 9565712 9308630 9180350 9008126
3540 9008126 8834575 8764329 8555057 8410864 8346437 8247631 8196856 8054765 8023466 7835846
3530 7835846 7772497 7725377 7645226 7617360 7542496 7515918 7377487 7465869 7366543 7400289 7476634
3519 7476634 7398628 7389757 7577435 7503705 7567540 7499760 7493253 7620309 7587243 7621358 7610557
3508G610557p2321m8308N4292r8709j67752n3367j2776K7136O0032j0096j06365
3497G182323N483N1762j32351K2889M859J17978r748K6248N2106M6688Q4610J24056
3485G576903J17431p9217J09345J38022J3136J21709Q9717J14001K09585J71792
3475H582424K37255K46478K38522J45819J50808K89206M31855M81450L12601M21947
3465A1538365N45171O07875N45820O24293N21329N92433M75869M01998N13375
3456A6366528L00678M58905L29726K46884K59187R6106p9554j15262q9959j30017
3446A7643222n5808J19877j34404j98983j31051k35428k96639k32901l90601m18480
3436A5668804k17930k04097k40339l21247j95116j10703r9175J36361J4063J26820
$$ plain form
3508 7610557 7538236 7489928 7544220 7445511 7277759 7224392 7211616 7238752 7298784 7288688 7182323
3497 7182323 7187806 7239568 7107217 7130106 7134965 7252943 7243195 7269443 7321549 7368237 7452847 7576903
3485 7576903 7694334 7615117 7724462 7862484 7875620 7997329 8087046 8201047 8410632 8582424
3475 8582424 8819679 9066157 9304679 9450498 9601306 9890512 10322367 10803817 11116418 11538365
3465 11538365 12083536 12691411 13237231 13861524 14382853 14975286 15451155 15853153 16366528
3456 16366528 16667206 17126111 17455837 17702721 17961908 18058014 17978460 17863198 17773239 17643222
3446 17643222 17587414 17707291 17572887 17373904 17242853 17007425 16710786 16477885 16087284 15668804
3436 15668804 15450874 15246777 15006438 14685191 14490075 14379372 14280197 14416558 14430621 14557441
3426A4557441l1011J51885K05947J67302K62749L44093L30482L40499L96451L65630
3416A7091468L31943M82466N74215M35749N97066O55492N97204N03283N82100
3407B1850986M80407N50202M49376M18418L50071M20246L05683L77109K60290
3398B5462788k6742M2422K47526J28945J47528J89064K4969J17502j03266k2657
3388B6208079j82758k68155j00334j66776k86638l12860k55023k60689j89600
3379B4185246k18187J4060n9744J96904J66705K19569K27780J72344M76351M91550
3369B5872578M05765N70236P10975P67773Q60061R30724R73957R79625J288257
3360C3359951J374412J435078J535499J704882J766053J920411J990067J995937
$$ plain form
3426 14557441 14526430 14678315 14884262 15051564 15314313 15658406 15988888 16329387 16725838 17091468
3416 17091468 17423411 17905877 18480092 18915841 19512907 20168399 20765603 21268886 21850986
3407 21850986 22331393 22881595 23330971 23749389 24099460 24519706 24825389 25202498 25462788
3398 25462788 25436046 25478468 25725994 25854939 26002467 26191531 26216500 26334002 26230736 26208079
3388 26208079 26025321 25757166 25656832 25490056 25203418 24890558 24635535 24374846 24185246
3379 24185246 23967059 23981119 23921375 24118279 24284984 24504553 24732333 24904677 25381028 25872578
3369 25872578 26278343 26848579 27559554 28327327 29187388 30118112 31092069 32071694 33359951
3360 33359951 34734363 36169441 37704940 39409822 41175875 43096286 45086353 47082290
3352D7082290K062546J935407K141119K135523K026448J835727J565376J627975
3344F2412411J472484J225997J118638J250448J007971R29392Q04383Q14272P59251
3335G1795247N64036M35161p4017j45783l98903o62747p37846q59983j008950
3326F8906215j130078j328738r82013q27623r06148o82113m90056l09403p1112
3317F2178931j68709j79855r6143j8081M8478p3338K2597J49417K66087K10904
3307F2340288J76617J01920J96228O504l817j11707j69697k18754m27142m73578
3297F1416862n49515o60276q59692j000278q63994j095871j242162j354737j525628
3288E2264709j589388j813297j899218j848449j790158j858887j820582j763324
$$ plain form
3352 47082290 49144836 51080243 53221362 55356885 57383333 59219060 60784436 62412411
3344 62412411 63884895 65110892 66229530 67479978 68487949 69417341 70221724 71035996 71795247
3335 71795247 72359283 72794444 72720427 72574644 72175741 71512994 70775148 69915165 68906215
3326 68906215 67776137 66447399 65465386 64637763 63731615 63049502 62559446 62250043 62178931
3317 62178931 62010222 61830367 61734224 61716143 61764621 61691283 61713880 61863297 62129384 62340288
3307 62340288 62516905 62618825 62815053 62821557 62817740 62706033 62536336 62317582 61890440 61416862
3297 61416862 60867347 60207071 59347379 58347101 57483107 56387236 55145074 53790337 52264709
3288 52264709 50675321 48862024 46962806 45114357 43324199 41465312 39644730 37881406
3280C7881406j625828j577746j335307j280712j271234q47818j078471j011960
3272B7852330p45712n19546n14027p06523n72741l91454k25093k51818j51412
3263B3774004k27702k466N1245Q2929K11911J25087K16777L15818L63927K69171
3253B5180701M40935M45013M67593L85106M67658L95846K69815J38352K87965
3244B8478984L39623J14691K21761N7424M5737R2325J33962Q722m9440l642L6299
3233B9476446j29729l55110m78555m82392n36812n75674o36539p67268p44417
3224B4769950o68793p87863p08042n81027o55444n38371l31028m61922l94226
3215A9643234k70274j24866j21788k05572k00079j04800N9246M4694Q9532J16748
$$ plain form
3280 37881406 36255578 34677832 33342525 32061813 30790579 29942761 28864290 27852330
3272 27852330 27106618 26587072 26073045 25366522 24793781 24402327 24177234 23925416 23774004
3263 23774004 23546302 23543836 23595081 23678010 23889921 24015008 24231785 24547603 24911530 25180701
3253 25180701 25621636 26066649 26534242 26919348 27387006 27782852 28052667 28191019 28478984
3244 28478984 28818607 28933298 29155059 29212483 29258220 29350545 29484507 29493229 29443789 29440147 29476446
3233 29476446 29346717 28991607 28513052 28030660 27493848 26918174 26281635 25514367 24769950
3224 24769950 24101157 23313294 22605252 22024225 21368781 20830410 20499382 20037460 19643234
3215 19643234 19372960 19248094 19126306 18920734 18720655 18615855 18675101 18719795 18809327 18926075
3205A8926075J57413K37084J45653K76894L47404K59744M19873N04548N61158
3196B1835846O39411N47957N63144Q55187Q82594Q43250R42717J289975J151428
3187B9551509J256570J390284J439104J699188J679941J719962J888072J842099
3179D2466729J901074K035956J732013J591087J627972J536961J605060J267500
3171E5764352J080186R01921O42983N65552L59488K68962J39802J0874j72956
3162E9561164k39972k33353l72082m68988o26443p42853q63784j058264j226010
3153E3729415j539322j674679j932552j967008k084736k277010k262752k171605
3145C7819751k284068j993333j991885j745787j779244j537451j283969j419023
$$ plain form
3205 18926075 19083488 19320572 19466225 19743119 20090523 20350267 20770140 21274688 21835846
3196 21835846 22475257 23023214 23586358 24441545 25324139 26167389 27110106 28400081 29551509
3187 29551509 30808079 32198363 33637467 35336655 37016596 38736558 40624630 42466729
3179 42466729 44367803 46403759 48135772 49726859 51354831 52891792 54496852 55764352
3171 55764352 56844538 57746459 58389442 58954994 59314482 59583444 59723246 59734120 59561164
3162 59561164 59321192 59087839 58715757 58246769 57620326 56877473 56013689 54955425 53729415
3153 53729415 52190093 50515414 48582862 46615854 44531118 42254108 39991356 37819751
3145 37819751 35535683 33542350 31550465 29804678 28025434 26487983 25204014 23784991
3137B3784991j181536j109567r57698r33499p22247q53283o91456p40282o17609
3128A5977814n12509n16068l37404m36678m27023l61743j58218j78529l23894
3119A2725748l91680j11340k08912k44600k06863r5716r7803p4368o6971k55735
3109A0971760J51895J72217o3918M101O5633K9773K00546J11440k6373N5856J15044
3098A1787974j59647l1090j34973k48066j78897k69194k13150l01706l87020k63369
3088I600862j90952k85457l22321j96382k44567l00118k30636j35290r0514k26607
3078G378018j35701j10410j81255j30858n5954j27477n0202q1174j06232r1975
3068F306780o0584p1346l6946j44144l7851m4990k5262q7293P8370o537J5949
$$ plain form
3137 23784991 22603455 21493888 20536190 19602691 18880444 18027161 17335705 16595423 15977814
3128 15977814 15465305 14949237 14611833 14175155 13748132 13386389 13228171 13049642 12725748
3119 12725748 12334068 12222728 12013816 11769216 11562353 11466637 11368834 11294466 11227495 10971760
3109 10971760 11123655 11295872 11231954 11236055 11301688 11331461 11532007 11643447 11617074 11672930 11787974
3098 11787974 11628327 11597237 11462264 11214198 11035301 10766107 10552957 10251251 9864231 9600862
3088 9600862 9409910 9124453 8802132 8605750 8361183 8061065 7830429 7695139 7604625 7378018
3078 7378018 7242317 7131907 6950652 6819794 6763840 6636363 6586161 6504987 6398755 6306780
3068 6306780 6246196 6174850 6137904 5993760 5955909 5910919 5885657 5798364 5876734 5870197 5886146
3057E886146j979n3355n7560k9547P367K7734m2654o4665n5046r199J64040j27072
3045E644210J7242L6039r4491n5166R2593O2483Q3312o318k6719J8010m7308l9497
3033E684390J5759j08579L5679M9497M048j28788r2714N682P2666P9895O3451
3022E680986L1537L1702k4442J64734N373J40763N0881n2203J42156L8419p3912
3011F135994R0104L3745N6917R9446O3249m9130K13734J13502j4994J16349K5223
3000F884139L6652J97852L0720J39285K4273K2756Q3920j0977K74235O6344Q669
2989G757868L3224R0382J99034J33652J07596J51544J41058J02410K18280P0228
2979I005276R0678K67856J86568J80390J84659J73294J58615K48390J69335K70039
$$ plain form
3057 5886146 5884167 5830812 5773252 5743705 5751072 5778806 5736152 5671487 5616441 5607242 5771282 5644210
3045 5644210 5661452 5697491 5603000 5547834 5640427 5702910 5786222 5779904 5753185 5771195 5723887 5684390
3033 5684390 5700149 5591570 5627249 5676746 5680794 5552006 5459292 5464974 5537640 5617535 5680986
3022 5680986 5712523 5744225 5719783 5884517 5889890 6030653 6081534 6029331 6171487 6209906 6135994
3011 6135994 6226098 6259843 6316760 6416206 6479455 6430325 6644059 6757561 6742567 6858916 6884139
3000 6884139 6920791 7118643 7149363 7288648 7312921 7335677 7419597 7408620 7682855 7749199 7757868
2989 7757868 7791092 7881474 8080508 8214160 8321756 8473300 8614358 8716768 8935048 9005276
2979 9005276 9095954 9363810 9550378 9730768 9915427 10088721 10247336 10495726 10665061 10935100
2969A0935100P8677K48166K69704J65068J80551K85324K80798K41412J51585J88600
2959A3024985K37106L75920K84616N55357L33346M35817L28573L19124L92431
2950A6287275M77410K88240M21894N09105M71132M67328N49117N65078N71885
2941B0608464O13453O91704P33187P06108P38325J045586J024859R05049R82449
2932B8049184J057861J065020J075927R94445Q69823M74083M92066N65194N75950
2923C5219553O94233O79534Q96143J001842J382737J432019J803145K154988K288388
2914D7552582K723710L089347L481073M094465M140564L804786K881739J616867
2906G3385133K25942r24140j429993j237909q47204j95867L41581O88358J126309
$$ plain form
2969 10935100 11013777 11261943 11531647 11696715 11877266 12162590 12443388 12684800 12836385 13024985
2959 13024985 13262091 13638011 13922627 14477984 14811330 15247147 15575720 15894844 16287275
2950 16287275 16764685 17052925 17474819 17983924 18455056 18922384 19471501 20036579 20608464
2941 20608464 21221917 21913621 22646808 23352916 24091241 25136827 26161686 27066735 28049184
2932 28049184 29107045 30172065 31247992 32242437 33112260 33586343 34078409 34643603 35219553
2923 35219553 35913786 36593320 37489463 38491305 39874042 41306061 43109206 45264194 47552582
2914 47552582 50276292 53365639 56846712 60941177 65081741 68886527 71768266 73385133
2906 73385133 73611075 72686935 71256942 70019033 69171829 68975962 69317543 70005901 71132210
2897G1132210J381582J670709K003201K146033K596301K928577L265477L708780
2889I0832870M184740M772425N314752N983619O718528P531352Q653176R525799
2881A43517261J0895375J2037720J3318614J4524271J5411552J5560012J4984102
2874B40248907J2984164R681980M712953j024099o615362j1610500j5163634j6848730
2866B16365679j7197464j6769036j5484896j4037794j2552781j1276870j0079760
2859A18967078q914432q077460p144962o590759o016924n329757m739135m424504
2851F7729145l838906l500172l391463l041587k761734k574016k340939k214509
2843D4065819k071454j998069j651458j603815j495926j168362j385101j324916
$$ plain form
2897 71132210 72513792 74184501 76187702 78333735 80930036 83858613 87124090 90832870
2889 90832870 95017610 99790035 105104787 111088406 117806934 125338286 133991462 143517261
2881 143517261 154412636 166450356 179768970 194293241 209704793 225264805 240248907
2874 240248907 253233071 262915051 267628004 266603905 259988543 248378043 233214409 216365679
2866 216365679 199168215 182399179 166914283 152876489 140323708 129046838 118967078
2859 118967078 110052646 101975186 94830224 88239465 82222541 76892784 72153649 67729145
2851 67729145 63890239 60390067 56998604 53957017 51195283 48621267 46280328 44065819
2843 44065819 41994365 39996296 38344838 36741023 35245097 34076735 32691634 31366718
2835C1366718j156549j171171j042733r17184j030793p90820p71969p42870q73789
2826B2868840p50658q03093n52925m70127o72637o03558m58351l26543n35603
2817A7695345m98799n96648n68937k53376l70591m51420m31481k48490k62643
2808A4012960l76546k14914j94193l65010l47433k44024k38745l48009k92207
2799A1391879k59445k93740l12255j60332l06701j38664k81932k07622j38430
2790I292758k61780j54857k97426j65109j73443k29375j79869j33886j55940j80829
2780G360244Q671l01786j77815j10250n2869o845j55286j76019k38390r6475r0087
2769E963093j63381q6610r8131k0371j67182j84656n9850K5034p2756r3234m7081
$$ plain form
2835 31366718 30210169 29038998 27996265 27079081 26048288 25257468 24485499 23742629 22868840
2826 22868840 22118182 21315089 20762164 20292037 19619400 19015842 18557491 18230948 17695345
2817 17695345 17196546 16599898 16030961 15777585 15406994 14955574 14524093 14275603 14012960
2808 14012960 13636414 13421500 13227307 12862297 12514864 12270840 12032095 11684086 11391879
2799 11391879 11132434 10838694 10526439 10366107 10059406 9920742 9638810 9431188 9292758
2790 9292758 9030978 8876121 8578695 8413586 8240143 8010768 7830899 7697013 7541073 7360244
2780 7360244 7368915 7067129 6889314 6779064 6726195 6719350 6564064 6388045 6149655 6053180 5963093
2769 5963093 5799712 5713102 5614971 5594600 5427418 5242762 5182912 5207946 5135190 5041956 4994875
2758D994875j80121o914k5692l0971j3561j11425q7752j35295P0972r1856j66825
2747D215435n2403o6032j98341n5028R1996o5821j77908J360j39317m2758Q3235
2736C594418j39221M320n8925o5540j40544k8715R3195Q25m6789m6481j29943
2725C036600n8734j3862j34976q1611J9324l0041q963N7136n1835l4019o9401
2714B629618k1643K0574q5683k9016j14298P1247k7493k22575r1590j17334n5396
2703A956411L3154M5586P7637J2823P1410n1319k32719M480o9458p3047J88704
2692A963662m3776J7546r30j38962q409p5268l2776P7909j16692m2037k0784J33092
2680A712575j29380O2831q2626R0783j7670j78373L5690l3199K3339J505j1496
$$ plain form
2758 4994875 4814754 4807840 4782148 4751177 4737616 4626191 4538439 4403144 4474116 4382260 4215435
2747 4215435 4163032 4097000 3898659 3843631 3935627 3869806 3691898 3693258 3553941 3511183 3594418
2736 3594418 3455197 3459517 3400592 3335052 3194508 3165793 3258988 3259813 3213024 3166543 3036600
2725 3036600 2977866 2964004 2829028 2747417 2766741 2736700 2727737 2784873 2733038 2699019 2629618
2714 2629618 2607975 2628549 2542866 2513850 2399552 2470799 2443306 2220731 2129141 2011807 1956411
2703 1956411 1989565 2035151 2112788 2125611 2197021 2145702 1912983 1917463 1848005 1774958 1963662
2692 1963662 1919886 1937432 1936502 1797540 1789131 1713863 1681087 1758996 1642304 1600267 1579483 1712575
2680 1712575 1583195 1646026 1563400 1654183 1636513 1458140 1493830 1460631 1483970 1485475 1473979
2669A473979J08401j81965r7858n4410Q9412R3105Q799q048o266M3368p2700J2496
2657A408313j3395n001m7803m6049J28343p2317P7819q2008j01116M5658M3275
2646A335719o3212O2341J7723k9387l8805l0619P5911k9291j56297j27795K07164
2635A223452J06542J80931j77086n9325L3146L1964j7114m0427J7641q065l1740
2624A259919J34161r0053o337j257j5477J5930n5868N5022J26802j51305l1836
2613A239701q7204N149m665J216m8453M0458M3864K0299O02l2834n8405P2627
2601A192355K8744P691L1571M8062K027J38200M2970L7302R5698O0510l1365m0418
2589A613347J69561R0265Q1605j51900N6738K7736r1238j03148O3544K3912k08854
$$ plain form
2669 1473979 1582380 1400415 1302557 1248147 1337559 1430664 1439463 1431415 1425149 1468517 1395817 1408313
2657 1408313 1394918 1389917 1342114 1296065 1424408 1352091 1429910 1347902 1246786 1292444 1335719
2646 1335719 1272507 1334848 1352571 1323184 1284379 1253760 1329671 1300380 1144083 1016288 1223452
2635 1223452 1329994 1510925 1333839 1274514 1307660 1339624 1322510 1282083 1299724 1291659 1259919
2624 1259919 1394080 1304027 1297690 1296433 1280956 1296886 1241018 1296040 1422842 1271537 1239701
2613 1239701 1152497 1157646 1152981 1154197 1105744 1146202 1190066 1210365 1210967 1178133 1119728 1192355
2601 1192355 1221099 1228790 1260361 1308423 1310450 1448650 1491620 1528922 1624620 1685130 1653765 1613347
2589 1613347 1782908 1873173 1954778 1802878 1859616 1887352 1796114 1692966 1756510 1780422 1571568
2578A571568k05331j37700L4155k5657M5827M8561p2765J02722j9064j84733k09014
2567I48569Q2018K5777j39527j08869Q4555l0888j9414n5880p0818l5695l7769
2556F42059P1152k0747Q9621K6956O41k2715k5801L6064j3755o7934o0772q0986
2544E73783k405K4741J06256j18043Q8303N5025K8923j46156j56752l6965j1961
2533D04749m794K05772R1895k59549N3328p3110M591J4761O2758k8500k3609j1206
2521D37086j38603J0436J27205O0552K3208r7011p4039m9306n1674K3525N9705
2510C31084j03074J0381M3893j2379Q6087L2890J05548n4410q8810N10m8522P8295
2498C81493o9776M3617J7940k7218K1701K3625k9397n6742k0271K4716N1946q4112
$$ plain form
2578 1571568 1366237 1228537 1262692 1237035 1282862 1331423 1258658 1361380 1342316 1157583 948569
2567 948569 1030587 1056364 916837 807968 892523 861635 842221 786341 715523 679828 642059
2556 642059 713211 692464 782085 809041 809682 786967 761166 797230 783475 715541 654769 573783
2544 573783 571378 596119 702375 584332 672635 727660 756583 610427 453675 416710 404749
2533 404749 399955 605727 697622 438073 491401 418291 422882 437643 500401 471901 448292 437086
2521 437086 298483 308919 436124 496676 519884 422873 348834 299528 247854 271379 331084
2510 331084 228010 238391 282284 269905 355992 388882 494430 440020 351210 351720 303198 381493
2498 381493 311717 355334 373274 346056 367757 391382 361985 305243 284972 309688 361634 277522
2486B77522r6132k1619J8556P7879O2276N4633J06483J5998n0759j69409r8262
2475A77166N8460j02492J84315r563M0442J7645J04056r5348m4082J06608r7861
2464C39346q1717J13116N87j8553J9993k6858J0109M774R107j9839p6941m7284
2452B25840j2064j1433J35028k0958O0702j13380M1144n5340M0074Q4347R7579
2441D71539j14779n8866P0304j17317L9480N9884j2806j6138m4852p5692J10456
2430C11213L5286J0096m7116m2325K2527j11790K9677J27884L9618j36931R3663
2419C31802q918j19886M2940R002L4969q0832p8679J65349k117O710j22420p4874
2407A03046J17370K6870l110K1001O3056q0387L8651J1894Q2483J7839r6752q4504
$$ plain form
2486 277522 181390 159771 178327 256206 318482 373115 479598 495596 444837 275428 177166
2475 177166 235626 133134 317449 307886 348328 365973 470029 374681 330599 437207 339346
2464 339346 257629 370745 371332 352779 372772 345914 356023 360797 369904 350065 273124 225840
2452 225840 213776 202343 337371 316413 377115 263735 304879 249539 289613 373960 471539
2441 471539 356760 297894 368198 250881 290361 350245 337439 321301 276449 200757 311213
2430 311213 346499 356595 309479 267154 289681 177891 207568 335452 375070 238139 331802
2419 331802 322884 202998 245938 254940 289909 209077 130398 295747 293630 300340 177920 103046
2407 103046 220416 247286 244176 265177 328233 247846 286497 298391 380874 398713 301961 217457
2395B17457j08872J18172r5399m2083l1309P9936N2014q1427K597J30671M1698
2384B83455m2276N5996o5890j5108N864q4744J0265k6261K8570J55802o809l3728
2372B65136J9398Q6539j6292j26374R483P3454r3846o4237Q7178N4970k3182K1366
2360B93593O2662p6993J5093o7483R680K7991k3692q1854J18090o4917M0914p8834
2348A74250q1945M1282J0038N1451k4115J5978j0643J28882J0931J0244j00220
2337B26133q1341O4552J04334J5136m2031j46962M5383j8982m1307q264J46831
2326B63482J4165r2490N1813P465p5645r5030N9225m2363o5677J37686L4514L5330
2314B32475r1715k0492N749m2328K7141K34426l2174m7341j77372M8063J2127
$$ plain form
2395 217457 108585 226757 131358 89275 57966 137902 189916 108489 111086 241757 283455
2384 283455 241179 297175 231285 216177 222041 137297 147562 121301 149871 305673 298864 265136
2372 265136 284534 371073 354781 228407 237890 311344 217498 153261 240439 295409 272227 293593
2360 293593 356255 279262 294355 226872 236552 264543 240851 158997 277087 212170 253084 174250
2348 174250 92305 133587 143625 195076 170961 186939 176296 305178 316109 326353 226133
2337 226133 144792 209344 313678 328814 286783 139821 185204 166222 124915 116651 263482
2326 263482 277647 185157 236970 244435 168790 73760 132985 90622 24945 162631 197145 232475
2314 232475 140760 120268 126017 83689 110830 345256 313082 265741 88369 136432 148559
2303A48559j06469m666Q427k8018J31821P3156N0240q8927j4996J53304m9368
2292B73063M732j5357l9509q8201P547J0130J11079m231q2706M9554Q4881q5185
2280B25797q2715O000l859L2075j0961l2487J24811O0723j28409Q6912m5643R834
2268B42078J10509O793R6238j55553K5106J6426p463n5723L8059J2665M9676l7199
2256C41612R3014j55843j05643N615K4137Q5406O4708q9440J0649l870K8991O3275
2244C62611N7779j2004o8818n9728j34099L4330J23059O2382m864l2895L187N3562
2232C84502j29055J0140J3899J53854o0004K1888J47978q6923q2668l8922L4112
2221C68801m4222k0326N4938L26K9178p6969p048J18612K7225R1252K5008j29989
$$ plain form
2303 148559 42090 37424 45851 17833 149654 222810 273050 184123 169127 322431 273063
2292 273063 277795 262438 222929 134728 142275 152405 263484 259253 176547 226101 310982 225797
2280 225797 143082 149082 145223 177298 166337 133850 258661 319384 190975 277887 232244 242078
2268 242078 352587 359380 455618 300065 325171 341597 334134 278411 316470 329135 378811 341612
2256 341612 434626 278783 173140 178755 202892 288298 353006 263566 274215 270345 299336 362611
2244 362611 420390 408386 339568 279840 145741 180071 303130 365512 360648 327753 330940 384502
2232 384502 255447 265587 279486 433340 373336 395224 543202 456279 373611 334689 368801
2221 368801 324579 304253 359191 359517 388695 311726 304678 423290 450515 541767 566775 436786
2209D36786K6989j7829M0151O6049j18875P8807N7747l4275Q910n7435J19421
2198F06446L0594J013O4615k4245j01105j2928L9410N1335K6365l0295r0014P5216
2186F36407O8058N6024J41127q8715l7206L7534N3463O6220j07679O6614P800
2175H99647l3023J14855o4817P9728q9067j04278J41007J03505J7929m0311N4272
2164A079447P3382M8482J22417j3473q436o340l6082J10286n4712j1631J68104
2153A471444j9768k7368J72771r7626m2580K16515L1889J6965J0875q374R4773
2142A819516K3146J90585R3656k0832K7833M4605J07641J47619J32327J63686
2132B729782P6257p6993J68536J73149K18794K26592J58050J03735J72907J739
$$ plain form
2209 436786 463775 445946 486097 552146 433271 512078 569825 535550 544460 487025 606446
2198 606446 637040 638053 702668 678423 577318 564390 603800 655135 681500 651205 561191 636407
2186 636407 704465 760489 901616 812901 775695 813229 866692 932912 825233 891847 899647
2175 899647 866624 981479 916662 996390 907323 803045 944052 1047557 1065486 1025175 1079447
2164 1079447 1152829 1201311 1323728 1310255 1301819 1295479 1259397 1369683 1314971 1303340 1471444
2153 1471444 1451676 1424308 1597079 1499453 1456873 1673388 1705277 1722242 1733117 1724743 1819516
2142 1819516 1842662 2033247 2126903 2106071 2133904 2178509 2286150 2433769 2566096 2729782
2132 2729782 2806039 2729046 2897582 3070731 3289525 3516117 3674167 3777902 3950809 3952548
2122C952548J63785L61788K05498J64424K78025K40738K26834L68222L07236L24508
2112F593606M79855N03829N36148M64556N29130M46188M55279O28041Q44975R56029
2102A2437636J243586J707726K328814K612913L057316L918460M744563N193111
2094C7244125L020612P21991j865389m690533n636605n176287l836211k879010
2086A6902693k114529j847715j365110j034722r23982p75140n44703m18403o43511
2077G234878m13222n83632m23390m55739m13098l59060k57586j73960j99123j93532
2067C762536j90073k47684k76992p9249j59745j00735K1096p4966k79345j67573
2057B207270J00848q2723n7411L1159j61332l6922j04245k3526p3430j46655o4840
$$ plain form
2122 3952548 4116333 4478121 4683619 4848043 5126068 5366806 5593640 5961862 6269098 6593606
2112 6593606 7073461 7577290 8113438 8577994 9107124 9553312 10008591 10636632 11481607 12437636
2102 12437636 13681222 15388948 17717762 20330675 23387991 27306451 32051014 37244125
2094 37244125 40264737 40986728 39121339 34430806 28794201 23617914 19781703 16902693
2086 16902693 14788164 12940449 11575339 10540617 9616635 8841495 8296792 7878389 7234878
2077 7234878 6821656 6238024 5814634 5358895 4945797 4586737 4329151 4155191 3956068 3762536
2067 3762536 3572463 3324779 3047787 2968538 2808793 2708058 2729154 2654188 2374843 2207270
2057 2207270 2308118 2225395 2167984 2199143 2037811 2000889 1896644 1873118 1799688 1653033 1588193
2046A588193j68552J20524o961k11148M328N368j26248o339o8070m8908K703J8925
2034A103815p9338M2090K7604p6185k1780j7049k3893m3065M8956l7524l0948
2023H92683m6459O6804m7430m2106j60376r62Q4077o676q1456K5572L4889m647
2011G13913J5664n2219j69928j10957p126M0746l0389j6482P6326k2991o6189
2000C70368L0543J17280J2751p843M6456K506j0898r4335m0818J4260m2916Q7541
1988D84895j05315n261J7739o4614m2216J40917l1656n1176m7995R6432K9640
1977D21390m0187J4349K116p8041m4989j1474k2999r6023O7483N7792m6796k7102
1965A95519o8567N9320K4366r3779P3679Q9353j4082J6365j99994m0510J62129
$$ plain form
2046 1588193 1419641 1540165 1533204 1322056 1326384 1331752 1205504 1199165 1131095 1082187 1084890 1103815
2034 1103815 1024477 1066567 1094171 1017986 996206 979157 955264 912199 961155 923631 892683
2023 892683 846224 913028 865598 823492 663116 662154 746231 739555 658099 683671 718560 713913
2011 713913 729577 677358 507430 396473 389347 430093 399704 383222 459548 436557 370368
2000 370368 400911 518191 530942 523099 569555 572061 561163 466828 426010 440270 397354 484895
1988 484895 379580 374319 392058 327444 285228 426145 394489 343313 295318 391750 421390
1977 421390 381203 395552 397668 319627 274638 263164 240165 144142 211625 269417 222621 195519
1965 195519 126952 186272 210638 116859 190538 279891 265809 282174 82180 41670 203799
1954B03799L1159L5664j3544j16573K3178M4968K22176j06894p7659J0259n9700
1943A96833K1248R6325o3738K972m4708N1598m528m2756k1801o8076K7539K8633
1931A79541m9189n4973J17977K8683q3832r657m8080n346R144L2207P636k9671
1919I4440m0648q5235L843k0251J66117M4698L0100p8266n8141P6494p6139n5727
1907A285J42746Q5661j66271L0486J7766r0814M0961O5099J1268K659M0026j52719
1895B8153M7449M4425K1063n6647p8463J1972j40759P1927R7005O5612l3048L0826
1883A09515o919k7969M4651o22L4282l5992j86007Q0877R3729j124r2822P3467
1871H5066l601j7999j02373L1665J44051l8241K9004J3709n898o0711o3836n2611
$$ plain form
1954 203799 234958 270622 257078 140505 163683 208651 430827 323933 246274 256533 196833
1943 196833 218081 314406 250668 253640 208932 260530 256002 213246 191445 123369 150908 179541
1931 179541 130352 75379 193356 222039 138207 128550 80470 75124 84268 116475 124111 94440
1919 94440 53792 -31443 -27600 -47851 118266 162964 193064 114798 56657 133151 57012 1285
1907 1285 144031 229692 63421 93907 111673 20859 61820 126919 138187 140846 180872 28153
1895 28153 75602 120027 141090 84443 5980 17952 -122807 -50880 46125 111737 78689 109515
1883 109515 102596 74627 119278 118656 152938 116946 -69061 11816 105545 104421 11599 85066
1871 85066 81465 63466 -38907 -7242 136809 98568 127572 141281 135383 74672 10836 -41775
1859d1775K17769K2400o0304R383J7809m7136N6296k7921o9982r6665O192k232
1847a6166n2253Q7517R9958R0364m2303n0953L43j10530P5647l6315O7637k5374
1835H7572q3453m3415M0484R5286k2973J13602J9477p7181n8814M1469K22661
1824C34715o0597O7273l4610p2008j495j40662o9701O896K5499q8516L2797j7654
1812a8063p805j03623q513J25855K1690o916k2923P4815j2467q625J17423l911
1800A46937n5398M7287j02948J4581k5571j28630J06868p4084L7086N6512K2013
1789D4653L0466K9572n7872o4060K6199r436O0479j3062L0886P3225j56367J21840
1777A16523q5573l0656r2949R0979L9041p8281N066j8485k3813o1495P1792K37830
$$ plain form
1859 -41775 175994 198394 138090 147473 165282 118146 174442 146521 76539 -20126 -13934 -16166
1847 -16166 -68419 19098 119056 209420 167117 116164 116507 5977 81624 45309 112946 87572
1835 87572 4119 -39296 1188 96474 73501 187103 206580 129399 70585 112054 334715
1824 334715 274118 341391 306781 234773 233278 92616 22915 29811 55310 -33206 -409 -18063
1812 -18063 -25868 -129491 -138004 -12149 9541 2625 -20298 54517 42050 33425 150848 146937
1800 146937 91539 138826 35878 50459 24888 -103742 3126 -70958 -33872 22640 44653
1789 44653 75119 104691 46819 -17241 8958 -478 60001 46939 77825 151050 -5317 116523
1777 116523 30950 294 -92655 -1676 37365 -40916 -35850 -54335 -78148 -139643 -67851 169979
1765A69979l0821j44564M5848J9221p3352k8423J0143L5819j5529o6875Q9664
1754A1110l153m1529J48633N9079q7019n7337r0257N9018J16099K1988j02437
1743C4195O186k2904l0028j8189p4654P2954P3865n6985k2459L1658L5897o4628
1731c5092L8614L5262q9373j02962J5532K8518J13923N0572j36935q4271k5293
1720a91505R4763Q8514r3724M1984M4067R8275q1743n3026j0829P5077p4581j9309
1708h2037N6602O7579N2718m9448o501j1045j9852J9195J0518j07731N6623M2808
1696B9429r8860L662Q1476r5715p8060j32015J74714M3830j46675J36287J9432
1685f2495q9403Q8237j1387j3407J6479N5791J20355l8925m965l0290j5805M7058
$$ plain form
1765 169979 139158 -5406 40442 59663 -13689 -42112 -31969 3850 -11679 -78554 11110
1754 11110 7957 -33572 115061 174140 87121 29784 -60473 -1455 114644 136632 34195
1743 34195 40381 17477 -12551 -30740 -105394 -32440 41425 -15560 -38019 -6361 29536 -35092
1731 -35092 3522 38784 -50589 -153551 -138019 -109501 4422 54994 -81941 -166212 -191505
1720 -191505 -96742 -8228 -101952 -59968 -15901 82374 631 -52395 -63224 11853 -62728 -82037
1708 -82037 -25435 42144 94862 45414 38913 27868 8016 27211 37729 -70002 -13379 29429
1696 29429 -69431 -65769 15707 -80008 -158068 -290083 -115369 -71539 -218214 -81927 -62495
1685 -62495 -151898 -63661 -75048 -88455 -71976 -16185 104170 65245 60280 29990 14185 61243
1673F1243l9847K6423R695o4435j00449k456J28738j3441j23546r76P4779J6508
1661b7764O820l7827O2414k431M6198M4035o5106j8344O01O6193P6932n6967P255
1648A02009j63920j04983M3521j4925L0242M2695O1625J0798N2582O1565M720
1637A25929j09715q11o2972K7869K8129q0490M5713j9902K8926n5414o541j8599
1625i7878J20598l0571j15246R1732Q453L766l3364L8547J3773J08954N5603o5310
1613I9057j01671N9333q8995m9197P1598P0576j79980K5942M7245J947J3686q286
1601c8745n3109O2686O5170l510L7270j47006k1719K9010q540k8435R6219n5448
1589f6157q0154L2916O4074L9685J07217L3121q2441r5482j52614P2313m8762
$$ plain form
1673 61243 21396 47819 57514 -6921 -107370 -109826 18912 5471 -118075 -119051 -44272 -27764
1661 -27764 -20944 -58771 3643 1212 47410 91445 26339 7995 8596 74789 151721 94754 102009
1648 102009 -61911 -166894 -123373 -138298 -108056 -65361 -3736 7062 59644 121209 125929
1637 125929 16214 15403 -47569 -19700 8429 -72061 -26348 -46250 -17324 -72738 -79279 -97878
1625 -97878 22720 -7851 -123097 -31365 -22912 -19146 -52510 -13963 -190 108764 164367 99057
1613 99057 -2614 56719 -32276 -81473 -9875 60701 -119279 -93337 -46092 -44145 -30459 -38745
1601 -38745 -91854 -29168 36002 32492 69762 -77244 -98963 -69953 -78493 -106928 -10709 -66157
1589 -66157 -146311 -113395 -49321 -9636 97581 130702 48261 -47221 -199835 -127522 -176284
1578a76284J85736L1782n636L4961q7139N5205K30l4911k9540N3640n0871M2235
1566A9408m7077o469O2618O818j00835K2989R1168j2342k8865Q710R0992j7219
1554H9896j01159j08260j6211K7621l7843k9978N5984J26829q767J3098p1445
1543f0235Q5116q7894o0519R686o5041O7526M6995k0596R2454k8345j9637k2483
1531f2973m412J4930K9385n726N0438Q91p3087N3393j6175j14083P2188J5835
1519c9396M3365L0191m9272k8762o0140n1630M0885j1737n7165N7291L3337J32202
1507C9169j26571P1230k998L1379K1319o6616o3599J71243J03795j29375o1972
1496a2996j47400J22608J9277N6170j7169l2328N7189n8996j6708N7332n0656
$$ plain form
1578 -176284 9452 41234 35598 70559 -16580 38625 38855 3944 -25596 28044 -22827 19408
1566 19408 -27669 -34138 28480 35298 -65537 -42548 48620 36278 7413 16123 107115 89896
1554 89896 -11263 -119523 -135734 -108113 -145956 -175934 -119950 6879 -1888 11210 -60235
1543 -60235 24881 -63013 -123532 -113846 -178887 -111361 -64366 -84962 7492 -20853 -40490 -62973
1531 -62973 -67385 -52455 -23070 -28796 21642 22533 -50554 2839 -13336 -127419 -55231 -39396
1519 -39396 3969 34160 -15112 -43874 -104014 -155644 -114759 -126496 -183661 -126370 -93033 39169
1507 39169 -87402 -16172 -19170 12209 33528 -33088 -96687 74556 178351 48976 -12996
1496 -12996 -160396 -37788 -18511 37659 20490 -11838 45351 -13645 -30353 26979 -23677
1485b3677P7189m011j1280r3969J4322j2702P0812Q1805j02601J3319K4577O7392
1473A01176r3383j09470j244J57301N033L4793r184o4741L026k9161l252Q5223
1461G6117K6099j01336l0856Q4356n7834J41846j4465L718l3499j72389K7674
1450e0569R7224r3325k5394R7293N7858k20716j6740j3735j20158K00783L9654
1439d7825M4804o8370J3702J4800k1879J7163j25958N4268K8069J03427n0689
1428c8488J8805r2404Q8679r7252N7884J31787j5820K4107j99712j19057M1808
1417a99663J47258q9636j4457P9574N0565M7982N3276n5456o216m8195p7992J26111
1405A3151N1405j46580k7183q1003N8393K03072l0223q5984L9823N1083l8610
$$ plain form
1485 -23677 53512 49501 38221 -55748 -41426 -54128 16684 98489 -4112 9207 33784 101176
1473 101176 7793 -101677 -102921 54380 59413 94206 85022 20281 23307 -5854 -9106 76117
1461 76117 102216 880 -29976 54380 -3454 138392 123927 127645 94146 -78243 -50569
1450 -50569 46655 -46670 -72064 25229 83087 -137629 -154369 -168104 -288262 -87479 -47825
1439 -47825 -3021 -71391 -57689 -42889 -64768 -47605 -173563 -119295 -91226 12201 -38488
1428 -38488 -19683 -112087 -23408 -120660 -62776 69011 53191 77298 -122414 -241471 -199663
1417 -199663 -52405 -142041 -156498 -76924 -26359 21623 74899 19443 13227 -34968 -112960 13151
1405 13151 64556 -82024 -109207 -190210 -131817 71255 41032 -44952 -5129 45954 7344
1394G344l0436q1051R7340j1357r9658J08559M8852m5357p1608O7198R579M3308
1382D2713J1433o6045n0201J06634j5959j3763l6614K8417m3741j01194O8553
1371f9767O5586m2093k5722O1331P2303j28167p5877Q2623M5918l9498m142o1365
1359a18870m5160O4377o2614N1411J9822k6982O9777N169P1288L4357M0147Q956
1347A11678n765j77582M2245k6708K0443p5804o1543J49769K3221j32968L2147
1336a00867J80678m2819o2975Q5036J30865m6016k11350R515J16389j2134l9378
1325F944j0566J21500o2385j07047K3351K6642n6089O5635O9112o6360J3687M2940
1313F7364K2874r4094k5674L8685j09260J6120M0635p1955N4304J6811q4429K5678
$$ plain form
1394 7344 -23092 -104143 -6803 -18160 -117818 -9259 39593 -5764 -77372 -10174 -595 42713
1382 42713 54146 -11899 -62100 44534 28575 14812 -21802 6615 -37126 -138320 -69767
1371 -69767 -4181 -46274 -71996 -10665 61638 -66529 -142406 -59783 -13865 -53363 -57505 -118870
1359 -118870 -164030 -99653 -162267 -110856 -91034 -118016 -48239 -43070 28218 62575 102722 111678
1347 111678 105913 -71669 -29424 -56132 -35689 -111493 -173036 -23267 -46 -133014 -100867
1336 -100867 79811 36992 -25983 59053 189918 143902 -67448 -57933 58456 46322 6944
1325 6944 -3622 117878 55493 -51554 -28203 -1561 -57650 7985 77097 10737 24424 67364
1313 67364 90238 -3856 -29530 9155 -100105 -83985 -43350 -115305 -61001 -44190 -128619 -102941
1301a02941P5991O5623M4044K576K4558K1376r0261j4903p9709o0106M9432J02819
1289C8499L1237j11025l3574P5281P804L5358o2896j8955O3943q7968K5073M7380
1277A0157l4601J23170R1521N582q1206k1235j7969j7160r2556K0950l1467K4159
1265b0655k5163J8713j6382M1339l0484j9902J6783k0116L3444Q5832q6745L9115
1253A5779O8809R052r143j6443n7602m7714J06288m7713j6130l8823o2802q260
1241a04702L2272J4942o1418J36350R5750j38539O3895Q232j21337O2477J52589
1230A40511m0957q7709r2711k278j2986l6007O5330P5490q7764K1781P988o2110
1218a11422M3748P6071K5344L2939M0373j27144n7251M0719m9431Q454o4772l1720
$$ plain form
1301 -102941 -26950 38673 82717 85293 109851 131227 40966 26063 -53646 -113752 -64320 38499
1289 38499 69736 -41289 -74863 418 8222 43580 -19316 -38271 25672 -62296 -37223 10157
1277 10157 -24444 98726 190247 195829 114623 93388 75419 58259 -34297 -13347 -44814 -20655
1265 -20655 -45818 -27105 -43487 -2148 -32632 -52534 -35751 -55867 -22423 63409 -23336 15779
1253 15779 84588 93640 84497 68054 10452 -37262 69026 21313 5183 -33640 -96442 -104702
1241 -104702 -72430 -57488 -118906 17444 113194 -25345 38550 46782 -74555 -12078 140511
1230 140511 99554 11845 -80866 -83144 -96130 -132137 -66807 8683 -79081 -57300 -49312 -111422
1218 -111422 -67674 8397 33741 66680 107053 -20091 -77342 -36623 -86054 -77600 -142372 -174092
1206a74092m9751J03303Q035k7625J08916M2750K5732n0j09254m711M0099p959
1194d4607P996J15585n8056M7862J56286q4903j57886o1409j9289K0505J22421
1183D4505l5849r5337j077l2781O772q8715Q250J80036K7140P1806q0063M1747
1171D6434m1483q8903j9480P8009l975L4814j9856l3758M5679K1018j4388k0676
1159a6565l8729l1723K9541P9682p1213J006Q6150N4654o913j3945j3830p4275
1147a6160l9087J8650N8274j19368Q3846J2351m9931K2126L5167j72435J09055
1136e7512o038l2169J26726O1862q0499n8779L5240K7469R330j18252O0203L276
1124b9143p190O3766O7353l1610j17627J5317m849R580l7586k7297O9248L7425
$$ plain form
1206 -174092 -223843 -120540 -112505 -140130 -31214 11536 37268 37218 -72036 -76747 -36648 -44607
1194 -44607 -36611 78974 20918 68780 225066 140163 -17723 -79132 -98421 -77916 44505
1183 44505 8656 -86681 -87758 -120539 -113767 -202482 -194232 -14196 12944 84750 4687 46434
1171 46434 4951 -83952 -103432 -25423 -29398 5416 -14440 -48198 -2519 18499 4111 -16565
1159 -16565 -55294 -87017 -57476 22206 -49007 -48001 38149 92803 85890 71945 58115 -16160
1147 -16160 -55247 -36597 21677 -97691 -13845 -1494 -51425 -29299 5868 -166567 -57512
1136 -57512 -63550 -95719 31007 92869 12370 -46409 -11169 16300 25630 -92622 -32419 -29143
1124 -29143 -36333 27433 94786 63176 -54451 -39134 -43983 -34403 -71989 -99286 -30038 7387
1112G387p8505l7181K7994O2161q0728J28900R0361j63025J3917J19922k8223
1101F2980j44206r5428L802J01774o978o2300j5379J1883J63114K7222n6298R2574
1089H2760o6111k7354O6706j43621K4230O5464k5048J8213L9256m2533n3088N6443
1077d683Q1100j45090r0200J03830J5825l1586k4552j1326N7962j3049l6405l8266
1065a36440m3984J29729L1350k0406n1823O7001m5429Q010p06J6139O6991O5144
1053H5576j18895K3952j17400J37373J00692j21650q6200n2675O6217n106M9847
1042c8269l5537L3189R5623o1685j24826M3585J19197n5141K7485m2684K6229
1031a2834r3501O0786j6237O86L2714n3579J20930P7284j47857P0873L6720N7883
$$ plain form
1112 7387 -71118 -108299 -80305 -18144 -98872 30028 120389 -42636 -28719 91203 62980
1101 62980 -81226 -176654 -172852 -71078 -78056 -140356 -155735 -143852 19262 46484 -9814 82760
1089 82760 16649 -10705 56001 -87620 -63390 2074 -22974 -4761 34495 -8038 -61126 -4683
1077 -4683 76417 -68673 -158873 -55043 -39218 -70804 -95356 -106682 -48720 -61769 -98174 -136440
1065 -136440 -180424 -50695 -19345 -39751 -91574 -24573 -70002 -61992 -62698 -46559 20432 85576
1053 85576 -33319 -9367 -126767 10606 111298 -10352 -96552 -149227 -83010 -88116 -38269
1042 -38269 -73806 -40617 55006 -6679 -131505 -87920 31277 -23864 3621 -39063 -12834
1031 -12834 -106335 -45549 -61786 -61100 -28386 -81965 38965 116249 -31608 39265 75985 133868
1019A33868p062q7531k2346j5642l6376l8177N5435l252j8129q7145l5149n1275
1007b12781K05756O2483P6122j01022m1406M4665k3365k7521p1128M7714J94354
996A53871l1199r8739K5858K038j9529L7877l2129p446l0919o417M585p2269Q5200
983A0782J22356r0629j6980j40029j09678P3857L7021K1772l0880R5290n1988
972g9106J7352j1986j9748J28281M9543p2625m4206P3989P3238r8872q0893M8051
960a6982Q2222j8706M005J877j2297k9308l8674m7553j06637J92755q7829O5833
948a1294J058J3206l2203k0117j377j1564p5953j9199J09869N847j92J43472o6492
935C5061M7955M3520j37465J9614O9861o1798N3380q786m2948o3412K1795K2365
$$ plain form
1019 133868 126806 39275 16929 1287 -35089 -73266 -17831 -21083 -39212 -126357 -161506 -212781
1007 -212781 -7025 55458 131580 30558 -10848 33817 10452 -17069 -88197 -40483 153871
996 153871 122672 23933 49791 51829 32300 70177 38048 30602 -317 -6734 -2149 -74418 10782
983 10782 133138 42509 25529 -114500 -224178 -150321 -113300 -91528 -122408 -27118 -79106
972 -79106 -61754 -73740 -93488 34793 84336 11711 -32495 41494 114732 15860 -65033 -16982
960 -16982 65240 46534 50539 52416 40119 10811 -27863 -75416 -182053 10702 -77127 -11294
948 -11294 -10236 2970 -29233 -49350 -50727 -62291 -138244 -157443 -47574 -41727 -41919 101553 35061
935 35061 83016 126536 -10929 8685 78546 16748 70128 61342 18394 -45018 -23223 -858
923h58o5628P4809j9080o2565j6107p9819n3280L6503Q6322K4173r6015J13327
911e8218q7793n9808Q6832Q1144m2392J09389n9779l2715M8231K128J9298R8128
899A04445K4129n0430P894j24425M2544Q0767Q3159l1483m6240K7574k9633m2964
887D5337j77740J58111R7560q2066n3294K2172L3611k6845n8271j4948k815P4095
875A4907n4056M1014J652k0378J0445m8436J5126O0687q6756q8965O0870P2852
863b1038R4352L3549m0574q5365L3918k0453Q9190O5652n2532n1091L4617m7092
851C3133J5766r920j5834N9324k7304j08036p2113M3789p122K173l7372k3317
839a46833j46379J82399J35690P066n1064m9769J0358J4070J1548O8374L1114
$$ plain form
923 -858 -66486 8323 -10757 -73322 -89429 -169248 -222528 -186025 -99703 -75530 -171545 -58218
911 -58218 -146011 -205819 -118987 -37843 -80235 29154 -30625 -63340 -15109 -12981 6317 104445
899 104445 128574 78144 86038 -38387 4157 84924 168083 136600 90360 117934 88301 45337
887 45337 -132403 25708 123268 41202 -12092 10080 43691 16846 -41425 -56373 -59188 14907
875 14907 -39149 1865 3517 -16861 -6416 -54852 -39726 20961 -65795 -154760 -93890 -21038
863 -21038 73314 106863 66289 -19076 14842 -5611 83579 149231 96699 45608 80225 33133
851 33133 48899 38979 23145 82469 55165 -52871 -124984 -81195 -88317 -86144 -123516 -146833
839 -146833 -293212 -110813 24877 31943 -19121 -68890 -58532 -44462 -32914 35460 66574
828F6574k6844q420l3083L0320o4035r6319O1625J36490l4588j82872j2540M1439
816a22253J21451n8471j52309P387L4494P0350O6311N2508N9685M2832j71126
805d9141N6166P620o3195J6896j01293p3033R1937M0961p6175R8122K704l4341
793h2772j1788O5957k9316m1322O0381R0684k4520p0024O5728k5298L8413j6069
781B0054P2868P2887m4389n9947J2931r3847Q6727p1650j47250J28716o7222m2317
769a32439R3000l8003K5634p552k4532l356O3656J02293l7185j11453L943o9245
757a35239M1750j3124n1598Q0491o579m7207J55673k8049Q7498k450r0639l6319
745d5792R525k8621J9897O6823N1169O6022r7576l0925j1546K4138M4888l3648
$$ plain form
828 66574 39730 31310 -1773 28547 -35488 -131807 -70182 66308 31720 -151152 -163692 -122253
816 -122253 -802 -59273 -211582 -204195 -169701 -99351 -33040 19468 79153 121985 -49141
805 -49141 7025 14645 -48550 -31654 -132947 -205980 -114043 -73082 -149257 -51135 -48431 -82772
793 -82772 -94560 -28603 -57919 -99241 -38860 51824 27304 -42720 23008 -2290 36123 20054
781 20054 92922 165809 121420 61473 74404 -19443 67284 -4366 -151616 -22900 -90122 -132439
769 -132439 -39439 -77442 -51808 -59360 -83892 -87248 -23592 78701 41516 -69937 -65994 -135239
757 -135239 -93489 -106613 -158211 -77720 -84299 -131506 24167 -3882 83616 81166 -9473 -45792
745 -45792 -36267 -64888 -44991 21832 73001 139023 41447 10522 -1024 23114 68002 34354
733C4354j0638k7935P7140q0710J02135K3115j88980k6766L6074J9631q8343J03560
721b7363O5590q1749K8581p4170m7887m3774J5160P8512O2592K2980q1024K3771
709e8781K059l3579J29560R1569k00942O743O9457Q2835q5419r6203Q6962j4064
697a9803r8252J06026M5365J0896j9133N3552n2163k483j33573M1610j6612K2464
685f2106l9248j31507N3246N0552J904J09250O5482j22909Q5081l4662j8738P2213
673B8558j30068R7096J3683K9665J9079q4130l0899L3918k4174r7338n2298J56093
661d0815j04423r4067J80447L0497j3670J8557k4943k5204m8554M4999J622l5265
649a10819M3684P3469J3292R062P8983J4432p1882j82991J36315J9210k0392k3689
$$ plain form
733 34354 23716 -4219 72921 -7789 94346 117461 -71519 -98285 -62211 -42580 -130923 -27363
721 -27363 38227 -43522 -14941 -89111 -136998 -180772 -165612 -87100 -24508 -1528 -82552 -58781
709 -58781 -56722 -90301 39259 130828 -70114 -63371 6086 88921 3502 -92701 -5739 -19803
697 -19803 -118055 -12029 33336 44232 25099 78651 26488 24005 -109568 -67958 -84570 -62106
685 -62106 -101354 -232861 -179615 -129063 -127159 -17909 47573 -75336 9745 -24917 -43655 28558
673 28558 -101510 -4414 9269 38934 58013 -26117 -57016 -23098 -47272 -144610 -196908 -40815
661 -40815 -145238 -239305 -58858 -28361 -42031 -23474 -48417 -73621 -122175 -77176 -75554 -110819
649 -110819 -67135 6334 19626 28688 107671 122103 50221 -132770 3545 22755 2363 -21326
637b1326l1806l3973P4435Q4942j20027O945l4953p928J03144k8613j8627K7378
625d09j6687J402K04960p8255j61635O4791q9662n4480L0332Q9855L2446M5145
613F7803k8005r3287Q976n0515R0119j5407O1511O7074k5293R6384p9908j54209
601e4757j2011M3011P1763N584J6718o7766L5050r609j7347L5954m6085l1157
589c0652N4622j63467l3228J36236r15K7583j8939p0009N6941m5075P0772K1341
577E210M061N1853n4215n0976P5584O5941r91m4461J5165K2732j02280r3510M2411
564f3476O0420Q1255j59576k8641Q5101p3233J12324M1442J45507j49890q3715
553c2482K3821m2837N5555O7251K4674N0509j23863R1956N8431q8828r7905J00648
$$ plain form
637 -21326 -53132 -87105 -12670 72272 -47755 -40810 -75763 -83691 19453 -9160 -27787 -409
625 -409 -17096 -15694 189266 111011 -50624 14167 -75495 -129975 -99643 -9788 22658 67803
613 67803 39798 -53489 -44513 -95028 -4909 -20316 41195 108269 82976 179360 99452 -54757
601 -54757 -66768 -23757 48006 53590 70308 2542 37592 27983 10636 46590 505 -30652
589 -30652 23970 -139497 -172725 -36489 -37404 -9821 -28760 -98769 -41828 -86903 -16131 5210
577 5210 9271 61124 6909 -44067 31517 97458 96467 52006 67171 89903 -12377 -105887 -63476
564 -63476 -3056 78199 -81377 -110018 -24917 -98150 14174 55616 201123 51233 -32482
553 -32482 -8661 -51498 4057 71308 95982 146491 22628 114584 173015 84187 -13718 86930
541H6930O4568j49305J25603J1838j03928k5779R5648O7775j33055k8263J7544
530B9576n9228J77719n7937J2840j8044P342j03283N6619o2428L1695p653m7381
518d0163j6493q9133K17200p5169O5654l752n357q5047n8854l2754L9213q1305
506a65960J60243O4016q9640k3387P0668m2613L1053L5156q9911K6028m1787Q9441
494B3307M0139j19304r9523Q1062N3737l3695J19236P7619l9145n9176o9506J15345
482I0096n8471n646l2399k5716O202O9325o332k582N189q3626O4952m1413n1515
469g1936J7315O4989J4933L929k4189l639n0499L7534n3294J9612j8632J52949
457H9072r2656j34987k4882K14417J01320p9458k532p947p580m208K4785r95q0686
$$ plain form
541 86930 151498 2193 127796 139634 35706 9927 105575 173350 40295 12032 29576
530 29576 -29652 148067 90130 102970 84926 92268 -11015 45604 -16824 14871 7218 -40163
518 -40163 -56656 -145789 71411 -3758 61896 58144 52787 -32260 -91114 -123868 -84655 -165960
506 -165960 -5717 58299 -31341 -54728 15940 -26673 4380 39536 -50375 -24347 -66134 23307
494 23307 63446 -55858 -155381 -74319 -20582 -54277 64959 142578 103433 44257 -25249 90096
482 90096 31625 25979 -6420 -32136 -25934 43391 37059 34477 39666 -43960 20992 -20421 -71936
469 -71936 -54621 10368 25301 29230 5041 1402 -49097 -11563 -64857 -45245 -63877 89072
457 89072 -3584 -138571 -163453 50964 152284 72826 70294 62347 54767 50559 75344 74349 -6337
444f337K3237N9891o6871k5565M747J6372J00432k1135o9307J35001o5764R5622
432A80323m3770p6916l7729q261N7478M089O1419n2253j08563K2032N1208R039
420E8096R258j1114q916O9933k6067p3989p2954O4084N7986r2190O8911N4903
408I7941j53862K1196k8561J35745J0033m0109j19157P4056k8243m3852M7162
397b7651m4419o9403J9485J27746o5270m6800p1502P4301J59726j75102k7088
386a45977M6103K3275O9689M9341j59640R6360N151n2253o7933o8758R9102M9934
374e5606m1614P2663L8162q5135p099k540P0714r8068k1341O1995Q8354j16646
362i6161l9643J6037l2584J03554J01726k1478p8101Q4401M8318j26606j00570
$$ plain form
444 -6337 16900 76791 9920 -15645 -10898 5474 105906 84771 15464 150465 84701 180323
432 180323 136553 59637 21908 13647 71125 75214 136633 84380 -24183 -2151 49057 58096
420 58096 67354 56240 47324 117257 91190 17201 -55753 8331 66317 -25873 43038 97941
408 97941 -55921 -34725 -63286 72459 82492 42383 -76774 -2718 -30961 -74813 -27651
397 -27651 -72070 -141473 -121988 5758 -59512 -106312 -177814 -103513 56213 -118889 -145977
386 -145977 -99874 -76599 -6910 42431 -117209 -20849 -15698 -67951 -135884 -204642 -105540 -55606
374 -55606 -97220 -24557 13605 -71530 -78629 -81169 -10455 -108523 -129864 -67869 20485 -96161
362 -96161 -135804 -119767 -152351 -48797 52929 31451 -46650 37751 86069 -40537 -141107
351a41107R3995J8588O2570k9655o7558N672m6756J40042j034K7941j02615P4873
339C4956O5658K2274j61889q0009k4486Q2590J8427M4874m1747K208p243P1214
327B6827J10467m6402k3796P1372n7971j02574k4848J9851Q1919K7773N1212j55509
315b1679m9019m6083R0831n34k5785K3312j5710R3215p5153K7072o1189Q8451
303B7729q5572p9368J08191k3890L7898Q0654j34518j06475K50735K1509j02841
292e948K0744n4727o9987N8695J47166p070j551n2403n8582r1050m474N6328j4051
279g6910K40K7405l8274N1556J13456j25069j40876J29133Q3481n8214J11868
268G7796l3931j12781r4596J05352j43487J53243O6124k22633J9533O4521K5182
$$ plain form
351 -141107 -47112 -28524 34046 4391 -63167 -57495 -104251 35791 34757 62698 -39917 34956
339 34956 100614 122888 -39001 -119010 -143496 -60906 -42479 2395 -39352 -37144 -44387 26827
327 26827 137294 90892 67096 138468 80497 -22077 -46925 -27074 54845 82618 133830 -21679
315 -21679 -70698 -116781 -25950 -26484 -52269 -28957 -44667 48548 -26605 467 -60722 27729
303 27729 -57843 -137211 -29020 -52910 -15012 65642 -68876 -175351 75384 96893 -5948
292 -5948 14796 -39931 -109918 -51223 95943 88873 87322 34919 -23663 -114713 -119187 -62859 -76910
279 -76910 -76670 -49265 -87539 -35983 77473 -47596 -188472 -59339 24142 -34072 77796
268 77796 43865 -68916 -163512 -58160 -201647 -48404 17720 -204913 -185380 -120859 -95677
257i5677R1385o397p5833o3503J16675Q3001r349k4568N0976R372q3528J9076
245A1630r9004j39052J30565j128K9503J11030n5140o2174N8155O0730n3888k5226
233c3999l3493M0194J390M8594j6970J3418n9505L576R0785K4308N1575j93207
221f3334k5505k9746R789N3367M6063O9862j8621O2424k2059j09151J31p094J1272
208b2602l0234o159P163L6568Q4216k2453o3572P9802J02958j44650r116M9724
196F1645m55k1861M757n3814K7846k4500p9038J1089M2972O2630K9566P8400n5297
183H3940K3977R4667q4102o1745j25728K6448K0008P6586j14106J42006O9396
172A51347j20804J3366m6296k3942L2475N876K2438p483j07750l31j1085R5464
$$ plain form
257 -95677 -4292 -10689 -86522 -150025 -33350 49651 40302 15734 66710 76082 -7446 11630
245 11630 -87374 -226426 -95861 -96989 -67486 43544 -11596 -73770 -15615 45115 -8773 -33999
233 -33999 -67492 -27298 -25908 22686 5716 19134 -40371 -36795 53990 78298 129873 -63334
221 -63334 -88839 -118585 -108796 -55429 -9366 60496 41875 104299 82240 -26911 -26780 -33874 -22602
208 -22602 -52836 -58995 -51832 -15264 68952 46499 -17073 62729 165687 21037 11921 61645
196 61645 61190 39329 44086 -9728 18118 -6382 -85420 -74331 -31359 31271 60837 139237 83940
183 83940 107917 202584 118482 56737 -68991 -42543 -22535 54051 -60055 81951 151347
172 151347 30543 43909 -2387 -26329 6146 12022 34460 26977 -80773 -81104 -92189 3275
160C275P6862m5278j3813P0080m8027n9681j6716K3306n21k922m9392n6857J6123
147a03561Q5761Q1770l1300n5810K9447k0464m5943l413N2651o6232N7547R2739
135G3192O6656p8354o0620o657j75507L1821M7744K3149J12950O518p2398k4836
123e6342m5635L9957N7015K3354J37825K4593j82997R510l9445J1989j0156p6455
111a06787J54504M1898r4784m4027L2273J56723n1835p5053P0226p499K7729K864
99A06232J7769l1368j01345Q8069M8389l6444o0342j33544J1736O8080p0807J12853
87A9278j0005Q3774K1898k7210j068p7674P4369k9946P7418n9372k8445k2281
75B0736J3093L8729p71m5371p1863l86M2445J8855K9773l0478L6948k3117p2646
$$ plain form
160 3275 80137 34859 21046 91126 43099 -16582 -33298 -9992 -10513 -13435 -62827 -119684 -103561
147 -103561 -17800 63970 32670 -23140 6307 -14157 -60100 -63513 -10862 -77094 -19547 73192
135 73192 139848 61494 874 -5783 -181290 -149469 -101725 -78576 34374 40892 -31506 -56342
123 -56342 -101977 -62020 -5005 18349 156174 180767 -2230 7280 -32165 -20176 -30332 -106787
111 -106787 47717 89615 -5169 -49196 -16923 139800 87965 12912 83138 75639 103368 106232
99 106232 124001 92633 -8712 79357 127746 91302 30960 -102584 -90848 -22768 -93575 19278
87 19278 9273 93047 114945 87735 86667 8993 83362 53416 130834 71462 43017 20736
75 20736 33829 72558 71787 26416 -45447 -45833 -3388 15467 45240 14762 51710 28593 -44053
62d4053j6001O9328k6200l5009Q2665k7784n6842L7486M100K6839O879n4861J63
49c3290P3280J7687q3324o0314J69474J25782j03964m7153l2132O8409o7824k311
37B4320J1317M3634J141m9396k6071J2219J4051N015k149J3378k728m0974N4299
24E8056j13357K8027J05002l0609k1641L632k8392n1002j2288P9388J2964P3298
12A03078L0325m8003k8575l6357O1166K1234o9903N901L808j1140l4447O0883
0E7970
$$ plain form
62 -44053 -60054 9274 -16926 -51935 30730 2946 -53896 -16410 -12310 14529 21408 -33453 -33290
49 -33290 39990 57677 -25647 -85961 83513 209295 105331 58178 26046 94455 26631 24320
37 24320 35637 79271 80412 31016 4945 17164 31215 36230 34081 47459 44731 3757 58056
24 58056 -55301 -27274 77728 47119 25478 29110 718 -50284 -62572 16816 29780 103078
12 103078 133403 85400 56825 20468 81634 102868 32965 38866 42674 31534 -2913 57970
0 57970
$$ Imaginary data points
##PAGE= N=2
##DATA TABLE= (X++(I..I)), XYDATA
16383a334042J60625q41p5012J8532P1694j984K5746M4264n4817l7829O0359k453
16371a125758m9379N8587j5063N1977P6710P8326m7304r0884M3652o662P6081
16360i49717m833L0021J9311l0213J15806O8313l5982q9218J6461O7527J01973
16349f90551m5767l2392Q6074l0138n975J09567j5808n3020N5860K2845k0405
16338f19710P4937M7106j7000p022k3631J03396N1881k3890Q4606q8767j9527
16327d37621Q509k1432J1290P2526k8139Q295K0531j2427k1820M0957J30546J14969
16315a13816m3264K4268j4636P688K6538K7940J2629l8801j9741j5918K5169M7548
16303g4396R0500L1124N4974j0269j8921K260l9048P2570r242O0154m8018q407
$$ plain form
16383 -1334042 -1173417 -1174258 -1249270 -1230738 -1159044 -1161028 -1135282 -1091018 -1145835 -1183664 -1123305 -1125758
16371 -1125758 -1175137 -1116550 -1131613 -1079636 -1002926 -924600 -971904 -1062788 -1019136 -1025798 -949717
16360 -949717 -954550 -924529 -905218 -935431 -819625 -751312 -787294 -876512 -860051 -792524 -690551
16349 -690551 -736318 -768710 -682636 -712774 -718749 -609182 -624990 -678010 -622150 -599305 -619710
16338 -619710 -544773 -497667 -514667 -521689 -545320 -441924 -390043 -413933 -329327 -418094 -437621
16327 -437621 -429112 -450544 -439254 -366728 -394867 -386572 -366041 -378468 -400288 -359331 -228785 -113816
16315 -113816 -157080 -132812 -147448 -139760 -113222 -85282 -72653 -111454 -131195 -147113 -121944 -74396
16303 -74396 16104 47228 102202 91933 73012 75272 36224 108794 99552 159706 111688 103281
16291A03281J26561n3379j4898m2434j596q1641R5648O3872k108O8166L0832K0178
16279C12482J0629p606R9969r58q0637l7433j3456O3899M4454l3881P3606j0613
16267D20455m1768N0590l0631N2026m5918K3418J09210J5245Q276J6670J0812
16256E88385K5514n5534n2008P2753m8003L9449N3056L2810O6656J8835r5403
16245F46510m3941M5065N4360J5904l2120j43884K9716K705J11295o4576K8401
16234F49435R2748m2129M8867q813L8473k8720P8575l4502J45381j07525M2456
16223H74246J12322p9377l1997j50755o80P3925O5384L0704J9612m2585j248N7949
16211I27500m5049j0307O4820j48787J00844N7950o0251L1249M7742L1458M591
$$ plain form
16291 103281 229842 176463 161565 119131 117535 35894 131542 195414 193306 261472 292304 312482
16279 312482 323111 315505 415474 414516 333879 296446 282990 346889 391343 357462 431068 420455
16267 420455 378687 429277 398646 450672 404754 428172 537382 552627 560903 577573 588385
16256 588385 613899 558365 506357 579110 531107 570556 623612 656422 723078 741913 646510
16245 646510 602569 647634 701994 717898 685778 541894 571610 574315 685610 621034 649435
16234 649435 742183 700054 748921 740108 778581 749861 828436 793934 939315 831790 874246
16223 874246 986568 907191 875194 724439 723759 797684 863068 893772 913384 870799 869551 927500
16211 927500 882451 872144 936964 788177 889021 946971 886720 917969 965711 997169 1001760
16200A001760o655r7239J1696J3627P2213J33301K0770k1770l9636o4376l8305
16189I85386K9142L3186L77l0635l0492k8061O2213j9051L3601L1936J3843r5050
16177I86395J5291P1740Q8297p6313o645J65134j02123r8143L2028Q4391o0297
16166A099755P1106j513j7723J26718m9290o6396R7556J0226J332l1294m9424
16155A191053p990p0033M2196L7318P4991k936p5104J3598r8370P3519P5084R0053
16143A343379o8231n0047k5720L4276m3768J2922p2645K3378P1489j5577n7817
16132A151639M2328o0948R3893M9661M0025O5308l1711n8634j3963m4728K3960
16121A256830K7895l952L2085m5998q7745P2575J4339K937N95n7125j03903J65679
$$ plain form
16200 1001760 995105 897866 909562 923189 995402 1128703 1149473 1127703 1088067 1023691 985386
16189 985386 1014528 1047714 1048091 1017456 986964 958903 1021116 1002065 1035666 1067602 1081445 986395
16177 986395 1001686 1073426 1161723 1085410 1078765 1243899 1141776 1043633 1075661 1160052 1099755
16166 1099755 1170861 1169348 1151625 1278343 1229053 1162657 1260213 1270439 1271771 1240477 1191053
16155 1191053 1183063 1113030 1155226 1192544 1267535 1264599 1189495 1203093 1104723 1178242 1253326 1343379
16143 1343379 1275148 1225101 1199381 1233657 1189889 1202811 1130166 1153544 1225033 1209456 1151639
16132 1151639 1193967 1133019 1226912 1276573 1316598 1381906 1350195 1291561 1277598 1232870 1256830
16121 1256830 1284725 1280773 1312858 1266860 1179115 1251690 1266029 1268966 1269561 1212436 1108533 1274212
16109A274212K5337l6343Q558J24560Q9633j77652k1470L1587j07632P9511O4713
16098A355014j12151Q8159r5671L0103j3870J72509j23400K0260l3968p6303Q9321
16087A300003R6729M7539l5805k27730P3163M3567J6057J6302N4546r218k0026
16076A355127L7434K3687j42338n8821N6595K7514J54201p3047p0810N0643n36
16065A359649O840Q8413j25519j02695J20896Q6450J0300n4948o4356L7283J16533
16054A478846j57567J401N7793M2505K5170m2099n91J2659m8579K3138N1692o9136
16042A375232P710o1763j24144J13705R8361n8735P9741q661n3263R6147k0166
16031A444164j13418n67O6097q3669O478N0912J1140o1194k0810m0491l9290J53247
$$ plain form
16109 1274212 1299549 1263206 1271764 1396324 1485957 1308305 1286835 1318422 1210790 1290301 1355014
16098 1355014 1242863 1331022 1235351 1265454 1251584 1424093 1300693 1320953 1286985 1210682 1300003
16087 1300003 1396732 1444271 1408466 1180736 1253899 1297466 1313523 1329825 1384371 1375153 1355127
16076 1355127 1392561 1416248 1273910 1215089 1271684 1299198 1453399 1380352 1309542 1360185 1359649
16065 1359649 1366489 1454902 1329383 1226688 1347584 1434034 1444334 1389386 1325030 1362313 1478846
16054 1478846 1321279 1322680 1380473 1422978 1448148 1406049 1405458 1418117 1369538 1392676 1444368 1375232
16042 1375232 1382942 1321179 1197035 1310740 1409101 1350366 1430107 1421446 1368183 1464330 1444164
16031 1444164 1330746 1330179 1396276 1312607 1319085 1369997 1381137 1319943 1299133 1258642 1219352 1372599
16019A372599m12j1228K9603j47267M8484P3569k9536n9869j6196Q5812J17164
16008A462723j20624J636J31844J8613N0281o6681j6337m3032O6382m349N9358
15997A539814j12701m7557j2054p693k3910J5166j06889N3091j1227k7816n7441
15986A200783J56402J57174j4922j51582L2170Q6194m6301K9943j45975J7910
15976A321796J3448M7998p9085j31025K4051P7321L6611P2522N0088j58395J67000
15965A442330N6024j80209m3273N5879m5038l7964L9547R2458P2419Q2823r1700
15954A443296K333k7610r7419J00887J08536J1835p4910n406j84519r1223J59426
$$ plain form
16019 1372599 1372187 1360959 1390562 1243295 1291779 1365348 1335812 1275943 1259747 1345559 1462723
16008 1462723 1342099 1343735 1475579 1494192 1544473 1477792 1461455 1418423 1484805 1480456 1539814
15997 1539814 1427113 1379556 1367502 1359809 1335899 1351065 1244176 1297267 1286040 1258224 1200783
15986 1200783 1357185 1514359 1499437 1347855 1380025 1466219 1419918 1449861 1303886 1321796
15976 1321796 1335244 1383242 1304157 1173132 1197183 1274504 1311115 1383637 1433725 1275330 1442330
15965 1442330 1498354 1318145 1274872 1330751 1285713 1247749 1287296 1379754 1452173 1534996 1443296
15954 1443296 1445629 1418019 1320600 1421487 1530023 1541858 1466948 1461542 1277023 1185800 1345226
$$ [...]
##END NTUPLES=NMR SPECTRUM
##END=
