##TITLE=1H_CA-9060-3
 CDCl3
 8 sc, 
 26.09.2022
##JCAMPDX= 6.0         $$ Bruker NMR JCAMP-DX V2.0
##DATA TYPE= NMR SPECTRUM
##DATA CLASS= NTUPLES
##ORIGIN= UXNMR, Bruker Analytische Messtechnik GmbH
##OWNER= root
$$ XWIN-NMR		Version 3.5
$$ Mon Sep 26 14:29:10 2022 Russian Standard Time (UT+4h)  she@DPX200
##.OBSERVE FREQUENCY= 200.1313499994
##.OBSERVE NUCLEUS= ^1H
##.ACQUISITION MODE= SIMULTANEOUS
##.ACQUISITION SCHEME= undefined
##.AVERAGES= 8
##.DIGITISER RES= 18
##SPECTROMETER/DATA SYSTEM= spect
##.PULSE SEQUENCE= zg30
##.SOLVENT NAME= CDCl3
##.SHIFT REFERENCE= (INTERNAL, CDCl3, 0, 15.7469)
##AUDIT TRAIL= $$ (NUMBER, WHEN, WHO, WHERE, WHAT)
$$ ##TITLE= Audit trail, XWIN-NMR		Version 3.5
$$ ##JCAMPDX= 5.01
$$ ##ORIGIN= Bruker BioSpin GmbH
$$ ##OWNER= she
$$ F:/spectra/data/she/nmr/H-F/1/pdata/1/auditp.txt
$$ ##AUDIT TRAIL=  $$ (NUMBER, WHEN, WHO, WHERE, WHAT)
(   1,<2022-09-26 14:26:41.20 +0400>,<she>,<DPX200>,
      <created by zg, POWCHK disabled, PULCHK disabled
       configuration hash MD5:
       00 E9 B6 7A A2 85 ED C7 34 08 36 98 17 FE 4E 26
       data hash MD5: 16K
       42 9F 69 EE 42 68 F9 F8 84 91 85 50 12 D3 F8 12>)
(   2,<2022-09-26 14:26:44.81 +0400>,<she>,<DPX200>,
      <Start of raw data processing
       efp BC_mod = 2 LB = 0.24 FT_mod = 6 PKNL = 1 PHC0 = -18033.29 PHC1 = 16.60069 SI = 16K 
       data hash MD5: 16K
       01 48 52 AC 74 8E 70 2C 10 95 E7 94 D5 D4 2D DF>)
(   3,<2022-09-26 14:27:07.71 +0400>,<she>,<DPX200>,
      <pk PHC0 = 1.340284 PHC1 = -3.4 
       data hash MD5: 16K
       F8 64 E5 03 1E B7 5F DB C6 CD 68 FD 11 63 83 6C>)
(   4,<2022-09-26 14:27:10.92 +0400>,<she>,<DPX200>,
      <abs ABSG = 5 
       data hash MD5: 16K
       7A 97 0D 46 65 16 22 C2 B3 A1 C7 3C 5B 73 72 37>)
$$ ##END=
$$ 
$$ hash MD5
$$ CC 99 A0 3F 1E 61 FF BC 28 E6 27 0E 20 6B 20 0E
##$RELAX= 
##$RELAX= 
##$RELAX= 
##$RELAX= 
##$RELAX= 
##$RELAX= 
$$ Bruker specific parameters
$$ --------------------------
##$DU= <F:/spectra>
##$EXPNO= 1
##$NAME= <H-F>
##$PROCNO= 1
##$TYPE= <nmr>
##$USER= <she>
##$AMP= (0..31)
100 100 100 100 100 100 100 100 100 100 100 100 100 100 100 100 100 100 
100 100 100 100 100 100 100 100 100 100 100 100 100 100 
##$AQSEQ= 0
##$AQ_mod= 1
##$AUNM= <au_zg>
##$AUTOPOS= <>
##$BF1= 200.13
##$BF2= 200.13
##$BF3= 200.13
##$BF4= 200.13
##$BF5= 200.13
##$BF6= 200.13
##$BF7= 200.13
##$BF8= 200.13
##$BYTORDA= 1
##$CFDGTYP= 0
##$CFRGTYP= 5
##$CHEMSTR= <none>
##$CNST= (0..31)
1 1 145 1 1 1 1 1 1 1 1 1 1 1 1 1 1 1 1 1 1 1 1 1 1 1 1 1 1 1 1 1 
##$CPDPRG= <>
##$CPDPRG1= <>
##$CPDPRG2= <>
##$CPDPRG3= <>
##$CPDPRG4= <mlev>
##$CPDPRG5= <mlev>
##$CPDPRG6= <mlev>
##$CPDPRG7= <mlev>
##$CPDPRG8= <mlev>
##$CPDPRGB= <>
##$CPDPRGT= <>
##$D= (0..31)
0 1.2 0 0 0 0 0 0 0 0.06 0 0.03 0 0 0 0 0.0002 0 0 0 0 0 0 0 0 0 0 0 0 
0 0 0 
##$DATE= 1664188000
##$DBL= (0..7)
120 120 120 120 120 120 120 120 
##$DBP= (0..7)
150 150 150 150 150 150 150 150 
##$DBP07= 0
##$DBPNAM0= <>
##$DBPNAM1= <>
##$DBPNAM2= <>
##$DBPNAM3= <>
##$DBPNAM4= <>
$$ [...]
##$SUBNAM3= <"">
##$SUBNAM4= <"">
##$SUBNAM5= <"">
##$SUBNAM6= <"">
##$SUBNAM7= <"">
##$SUBNAM8= <"">
##$SUBNAM9= <"">
##$SW= 18.0517283424941
##$SWIBOX= (0..15)
0 0 2 0 0 0 0 0 0 0 0 0 0 0 0 0 
##$SW_h= 3612.71676300578
##$TD= 16384
##$TD0= 1
##$TE= 0
##$TE2= 300
##$TE3= 300
##$TEG= 300
##$TL= (0..7)
0 120 120 120 120 120 120 120 
##$TP= (0..7)
150 150 150 150 150 150 150 150 
##$TP07= 0
##$TPNAME0= <>
##$TPNAME1= <>
##$TPNAME2= <>
##$TPNAME3= <>
##$TPNAME4= <>
##$TPNAME5= <>
##$TPNAME6= <>
##$TPNAME7= <>
##$TPOAL= (0..7)
0.5 0.5 0.5 0.5 0.5 0.5 0.5 0.5 
##$TPOFFS= (0..7)
0 0 0 0 0 0 0 0 
##$TUNHIN= 0
##$TUNHOUT= 0
##$TUNXOUT= 0
##$USERA1= <user>
##$USERA2= <user>
##$USERA3= <user>
##$USERA4= <user>
##$USERA5= <user>
##$V9= 5
##$VALIST= <valist>
##$VCLIST= <CCCCCCCCCCCCCCC>
##$VD= 0
##$VDLIST= <DDDDDDDDDDDDDDD>
##$VPLIST= <PPPPPPPPPPPPPPP>
##$VTLIST= <TTTTTTTTTTTTTTT>
##$WBST= 1024
##$WBSW= 4
##$XGAIN= (0..3)
0 0 0 0 
##$XL= 0
##$YL= 0
##$YMAX_a= 362623
##$YMIN_a= -649231
##$ZGOPTNS= <>
##$ZL1= 120
##$ZL2= 120
##$ZL3= 120
##$ZL4= 120
##$ABSF1= 15.76341
##$ABSF2= -2.28844
##$ABSG= 5
##$ABSL= 3
##$ALPHA= 0
##$AQORDER= 0
##$ASSFAC= 0
##$ASSFACI= 0
##$ASSFACX= 0
##$ASSWID= 0
##$AUNMP= <proc_1d>
##$AZFE= 0.1
##$AZFW= 0.1
##$BCFW= 0
##$BC_mod= 2
##$BYTORDP= 0
##$COROFFS= 0
##$CY= -3
##$DATMOD= 1
##$DC= 0
##$DFILT= <>
##$DTYPP= 0
##$F1P= 0
##$F2P= 0
##$FCOR= 1
##$FTSIZE= 16384
##$FT_mod= 6
##$GAMMA= 0
##$GB= 0
##$INTBC= 1
##$INTSCL= 3.70164e-10
##$ISEN= 128
##$LB= 0.24
##$LEV0= 0
##$LPBIN= 0
##$MAXI= 10000
##$MC2= 0
##$MEAN= 0
##$ME_mod= 0
##$MI= 1.114404
##$NCOEF= 0
##$NC_proc= -7
##$NLEV= 6
##$NOISF1= 3.799351
##$NOISF2= 2.8
##$NSP= 0
##$NTH_PI= 0
##$NZP= 0
##$OFFSET= 15.74689
##$PC= 1
##$PHC0= -18031.95
##$PHC1= 13.20069
##$PH_mod= 1
##$PKNL= yes
##$PPARMOD= 0
##$PSCAL= 0
##$PSIGN= 0
##$REVERSE= no
##$SF= 200.130004932091
##$SI= 16384
##$SIGF1= 3
##$SIGF2= 2
##$SINO= 5.538805
##$SIOLD= 16384
##$SREGLST= <1H.CDCl3>
##$SSB= 0
##$STSI= 16384
##$STSR= 0
##$SW_p= 3612.71676300578
##$SYMM= 0
##$S_DEV= 0
##$TDeff= 16384
##$TDoff= 0
##$TI= <>
##$TILT= no
##$TM1= 0
##$TM2= 0
##$TOPLEV= 0
##$USERP1= <user>
##$USERP2= <user>
##$USERP3= <user>
##$USERP4= <user>
##$USERP5= <user>
##$WDW= 1
##$XDIM= 16384
##$YMAX_p= 340976310
##$YMIN_p= -881739
$$ End of Bruker specific parameters
$$ ---------------------------------
##NTUPLES= NMR SPECTRUM
##VAR_NAME=  FREQUENCY,     SPECTRUM/REAL,   SPECTRUM/IMAG
##SYMBOL=    X,             R,               I
##VAR_TYPE=  INDEPENDENT,   DEPENDENT,       DEPENDENT
##VAR_FORM=  AFFN,          ASDF,            ASDF
##VAR_DIM=   16384,         16384,           16384
##UNITS=     HZ,            ARBITRARY UNITS, ARBITRARY UNITS
##FACTOR=    0.220516191357247, 1,           1
##FIRST=     3151.42518698478, 0,            0
##LAST=      -461.291576020998, 0,           0
##MIN=       -461.291576020998, -881739,     0
##MAX=       3151.42518698478, 340976310,    0
$$ Real data points
##PAGE= N=1
##DATA TABLE= (X++(R..R)), XYDATA
$$ [...]
8363 27824330 27782847 27714131 27855014 28556065 28571194 28489937 28413921 28577272 29416674 30061472
8353 30061472 31195003 32262780 33036967 34040156 35137209 35730962 35976232 36115923 35991957
8344 35991957 36025052 36360866 36831072 37652000 38332452 39159550 39845429 39881928 39288432 38466288
8334 38466288 37526069 36438819 35469676 34901358 34253098 33481126 32604968 31979635 31597114
8325 31597114 31112217 30903799 30760451 30438883 30555941 30089860 29765867 29764391 29676704 29978583
8315 29978583 29931033 30063543 30390281 30298337 30526939 30953899 31244096 31870179 32495517 32993553
8305 32993553 33821727 35035384 37089381 38455014 39515658 40648918 40710738 40526260 40235429
8296 40235429 39842542 39048582 38967517 39433336 39533921 39899058 40161263 40706454 40821636 40619754
8286 40619754 40020426 39605707 39275352 38825929 38455146 38088274 37797257 37604810 37003736
8277 37003736 36826544 36409074 36149168 36316668 36529274 36564535 36743380 37433283 37925486 38406682
8267 38406682 38579391 38563841 39055118 40040821 40882554 42079379 42951494 44092026 44827588
8258 44827588 44801682 43871843 42802676 41757605 40827477 40519770 40598875 40983637 41827755
8249 41827755 41630496 41924810 42216749 41776557 41151202 40986490 40878896 40440452 40310593
8240 40310593 40393019 39683342 38850107 38534198 37765963 37002179 36615074 36030755 35546046 35370416
8230 35370416 35426221 35204308 35110463 34857418 34447245 33664498 32828074 32512479 31504979 31337497
8220 31337497 30974201 30579098 30103169 29150395 28300135 27778722 26738703 26357092 25771201
8211 25771201 25750808 25772342 25953258 26202207 25930668 25968293 25545111 24850254 24345768 24080832
8201 24080832 24325830 24699553 24722378 24630579 24601680 23842062 23361678 22875310 23535697 23714073
8191 23714073 21461788 21665537 21467635 21136112 21422599 20935201 20285075 19740394 18896108
8182 18896108 18265198 17434925 16900967 16488736 15725051 15176622 14694226 14160920 14084175 13899835
8172 13899835 13497923 12969219 12549741 12550940 12500498 12429478 12251257 11637388 11974905 11986768
8162 11986768 11678196 11415044 11088842 11215683 11223808 11419609 11436088 11583888 11355563 11518701
8152 11518701 11421882 11257033 11237341 11000160 10762519 10840687 10845965 11212665 11082105 10948917
8142 10948917 10802281 10736556 10687829 10705237 10565125 10321332 10339554 10110724 10192008 9997672
8132 9997672 9824466 9745950 9363029 9302822 9238133 8976516 9046068 8669462 8881623 8926417
8122 8926417 8375890 8303932 8316994 8223475 8010509 7898969 8216036 8159800 7955537 7935387
8112 7935387 8012132 7832488 7560882 7652399 7762371 7476675 7577959 7830559 7665612 7892950
8102 7892950 7884793 7991965 7951262 7743917 8000866 7801133 7339428 7336283 7448858 7652504
8092 7652504 7805571 8016839 7649177 7525288 7631622 7348449 7174098 7448030 7320049 7096087
8082 7096087 6972257 6503186 6562795 6612692 6637495 6697124 6617676 6758266 6663562 6362346 6795334
8071 6795334 6791749 6720808 6591351 6250921 6138117 6116675 6140785 5989286 6197375 6381638
8061 6381638 6231447 5934135 6082558 6094696 5965442 6098882 6051848 6103602 6058200 5997380
8051 5997380 6369376 6345572 6194313 6110580 6188649 5915701 6022521 5781006 5762022 5761997 5513671
8040 5513671 5752028 5750708 5684473 5920520 5987046 5866543 5728266 5751621 5493536 5357553
8030 5357553 5609235 5356778 5396664 5469778 5663846 5684612 5603559 5401906 5439552 5210591
8020 5210591 4971028 4862714 5145456 5174018 5335670 5417569 5382426 5339069 5332495 5115292 5275376
8009 5275376 5234080 5225783 5101373 5181323 5326372 5255952 5379281 5630677 5102621 4780546
7999 4780546 4868900 4697291 5041615 5170247 5324333 5091288 4649246 4661847 5194476 5113851
7989 5113851 5125663 5143357 4866864 4780452 4709063 4837115 5063414 5246773 5232037 5455283
7979 5455283 5400331 5005851 5063258 5154563 5130476 4861697 5157099 5187592 5225461 4973875 4864273
7968 4864273 4798392 4948793 5244322 5047447 5103542 4992488 4804308 4877420 5044863 4939917
7958 4939917 4976672 4983858 4628378 4668354 4682262 4818044 4921949 4788241 4883847 4774670 4739098
7947 4739098 4514932 4650335 4781149 4516546 4791450 4448024 4672136 5001600 4953236 5034608
7937 5034608 5095421 4947229 4961920 4944387 4737323 4923670 4676561 4796412 4802795 4450631
7927 4450631 4564677 4678386 4504847 4631284 4614304 4451512 4420554 4568978 4734559 4803163
7917 4803163 4711940 4445075 4568875 4687793 4573170 4434264 4396599 4310635 4338183 4317820
7907 4317820 4345264 4688595 4518657 4490279 4464175 4350297 4367834 4568480 4879376 4609320
7897 4609320 4385862 4460502 4540201 4812306 4624337 4155257 4282895 4665502 4908672 4699543
7887 4699543 4535324 4498308 4509031 4278849 4289273 4394537 4354242 4399776 4366433 4527312 4813215
7876 4813215 4324948 4038005 4210032 4328573 4113910 4196827 4409377 4192241 4064451 4228575
7866 4228575 4551070 4223227 4362132 4300710 4271960 4062918 4161486 4196312 4199633 4344207 4384079
7855 4384079 4393030 4044738 3993950 4279617 4308073 4147556 4267564 4223032 4222793 4641194 4636511
7844 4636511 4550532 4205960 3994698 3810724 4019993 4234119 4415171 4331411 3996214 3750943
7834 3750943 4175022 4217482 4205985 4113988 3897896 4194773 4180481 4230328 4008153 4112551
7824 4112551 4118599 4435066 4327322 4259512 4316736 4643183 4506631 4316091 3941898 4153830
7814 4153830 4584316 4569310 4105449 3933356 3936417 4079636 4023754 4204852 4488124 4275994
7804 4275994 4095669 4132788 4248705 4220848 3857906 4164603 4210808 3889847 4475158 4226388
7794 4226388 3892808 3992140 4005124 4054495 4247050 3954980 3851785 3963134 3946491 4039981
7784 4039981 4009660 3973522 4013307 4049412 4055079 3807871 4002894 3947789 4078856 3907912 3753370
7773 3753370 3929351 3884363 4078467 4128847 3815183 3873461 3581069 3591782 3474243 3180246
7763 3180246 3307444 3804798 4103344 3936891 3736053 3767943 3587886 3491600 3731488 3831207
7753 3831207 3941549 4093809 3674810 3441631 3253859 3142642 3462778 3560705 3648943 3684859
7743 3684859 3549838 3480718 3570796 3504843 3497997 3561570 3541351 3569409 3451444 3027263 3478609
7732 3478609 3199273 2902451 3056725 3153734 3457520 3434802 3338777 3236421 3187953 3187242 3465489
7721 3465489 3345799 3009142 3108251 3118120 3135735 3028045 3320710 3270543 3089025 3213926
7711 3213926 3368806 3255343 3397897 3495519 3449218 3253983 3186335 3057214 2944563 2915306
7701 2915306 3418050 3338704 3140844 3110642 3447937 3414779 3070148 2979528 3130084 3109651
7691 3109651 2987004 3111803 2855741 2723047 2488461 2870793 2640833 2752647 2709253 2895399
7681 2895399 3090562 2852088 2711565 2702265 2507588 2607651 2930753 3014995 3019286 2933212 3094028
7670 3094028 2882448 3079685 3165083 2924356 2878307 3049431 3082489 3033502 3074125 2966771
7660 2966771 2961964 2810052 2712074 2849911 2829186 2887814 3347849 3178149 2831857 2788317 2951702
7649 2951702 2666873 2710546 2907726 2911406 2962568 2748959 2826105 2859143 2793723 2669445 2776130
7638 2776130 2611432 2696476 2839778 2998895 2993879 2952310 2453517 2519035 3027746 3311387
7628 3311387 3244776 2909072 3060493 2826954 3042911 3313075 3280973 3052765 3049017 3095914
7618 3095914 3259337 3041044 3062535 2981320 2657658 3008764 3133299 2876741 2701863 2599427
7608 2599427 2745965 2742775 2938452 2890125 2529653 2316633 2678527 2806623 2941401 3037712
7598 3037712 2898201 2908677 2965524 2693890 2673838 2693419 2915604 2710213 2476909 2382755
7588 2382755 2498025 2664957 2450008 2626528 2439595 2404026 2599050 2711969 2907201 2955953
7578 2955953 2922173 3007395 2695069 2292292 2550395 2676285 2461331 2557146 2621428 2653203
7568 2653203 2782408 2899161 2467584 2533747 2369913 2563622 2570799 2508903 2687434 2591758
7558 2591758 2635989 3000795 2850164 2672803 2694990 2423424 2097774 2322640 2479370 2615590
7548 2615590 2603531 2444606 2741526 2951989 2713541 2811768 2717420 2584195 2731579 2422614
7538 2422614 2442237 2472527 2559923 2341459 2065614 2204209 2048263 2319929 2543467 2504520
7528 2504520 2449344 2657182 2653685 2515893 2663688 2496665 2304578 2453854 2438638 2250956
7518 2250956 2371921 2463989 2468998 2326880 2258442 1908046 2187629 2544989 2420637 2290672
7508 2290672 2311139 2117996 2492645 2728447 2545931 2741002 2355963 2089715 2337201 2307888
7498 2307888 2288176 2386041 2420186 2304864 2283246 2656510 2552674 2187287 2305538 2398461
7488 2398461 2020543 2246093 2712313 2695011 2019347 2048520 2391221 2639918 2573800 2407203
7478 2407203 2292132 2419961 2596216 2399307 2476451 2580942 2565789 2123600 2236678 2474784
7468 2474784 2483852 2306082 2383848 2325088 2271451 2045537 1919142 2200842 2312173 2557627
7458 2557627 2584756 2638521 2656555 2414023 2493756 2371679 2521466 2183003 2167341 2115761 2312513
7447 2312513 2612954 2529362 2627429 2696851 2415593 2474771 2500609 2326664 2546622 2652746
7437 2652746 2361611 2411589 2651944 2780772 2708122 2508375 2726068 2211619 2285258 2492944
7427 2492944 2378894 2214033 2356098 2419151 2518616 2641290 2463951 2533547 2750990 2623312
7417 2623312 2641322 2396004 2767930 2763260 2904758 2936080 2599710 2619007 2555133 2279286 2204491
7406 2204491 2660445 2505736 2377919 2552836 2566236 2441148 2510260 2690915 2557152 2464654
7396 2464654 2292141 2154282 1923395 2314410 2562865 2310109 2307634 2261191 2479011 2394720
7386 2394720 2639885 2602486 2280849 2412823 2858454 2706054 2125239 2171875 2330077 2234084
7376 2234084 2406519 2637088 2505317 2373127 2464645 2598142 2332091 2392630 2619134 2396046
7366 2396046 2252123 2100697 2481049 2312717 2461732 2726970 2957244 2528002 2370386 2508026
7356 2508026 2284138 2209767 2274318 2518652 2682883 2598625 2451266 2599900 2819011 2531563
7346 2531563 2730343 2840822 3154713 2977945 2963480 3349723 3246178 3364951 3261271 3153196
7336 3153196 3386189 3471686 3530826 3534329 3321990 3471701 3535713 3075994 3228712 3488482
7326 3488482 3102890 3247052 2929099 2822929 2856735 3006782 2905134 2904202 2949396 2857649 2460941
7315 2460941 2591922 2441124 2479014 2619626 2784985 2995473 2573576 2372548 2714722 2822752
7305 2822752 2720127 2967513 3297204 2920851 2945512 3180367 3076521 2828133 2667901 2612690
7295 2612690 2413541 2460806 2094513 2100616 2818373 2612092 2223256 2220448 1993066 2464160
7285 2464160 2472826 2071786 2198297 2349513 2325508 2206122 2203862 2253016 2157608 2207668 2301213
7274 2301213 2359886 2484226 2408867 2480041 2554663 2527989 2930572 2990714 2854331 2803097 2718352
7263 2718352 2903750 2770013 2479970 2414494 2889515 2878101 2735348 2655234 2669869 2884873
7253 2884873 3132389 2907412 2889395 3059315 3091845 3105488 2954052 2871413 2662735 2748534
7243 2748534 2679464 2916732 2688531 2351414 2706793 2494962 2430124 2356901 2120070 2001339
7233 2001339 2362927 2433664 2184549 2352024 2232508 2132552 2259287 2347451 2445510 2237028
7223 2237028 2136894 2143827 2045452 2196120 1970910 1874046 2103956 2028004 2076358 2260514 2122443
7212 2122443 2220802 2274106 2032562 1983653 1997896 1910322 2064411 2321739 2442230 2177512
7202 2177512 2161744 2043032 2355797 2244994 2388366 2507016 2361637 2140870 2201013 1991420
7192 1991420 2162191 2417422 2231211 2149497 1918890 1924525 2277574 2250219 2277355 2235034 2319354
7181 2319354 2239009 2692751 2812031 2624378 2646874 2260993 2360976 2448139 2465369 2354664
7171 2354664 2389018 2422114 2703785 2930915 3055529 2747232 2891171 3242013 3133421 3224042
7161 3224042 3615680 3651005 3227662 3458471 3699065 3515775 3546360 3528087 3717349 3986445
7151 3986445 3710083 3586937 3445391 3483882 3404875 2814006 2693668 2835481 2692816 2556429
7141 2556429 2782658 2962958 2861970 2593356 3116942 3105681 2704961 2888677 2787585 2807912
7131 2807912 2965818 2760410 3094437 2946192 2577417 2914696 3009302 3033045 3211745 3200725
7121 3200725 3028441 3018024 3029445 3283710 3305010 2930789 3278148 3321838 3551275 3794649
7111 3794649 3540543 3490907 3682671 3634860 3875879 4023022 4201228 3830049 3602344 4037920
7101 4037920 3871140 3651605 3634175 3656572 3729307 3767721 3342186 3179106 3164687 3204290 3254788
7090 3254788 3378013 3503836 3391462 3576059 3676500 3618310 3550171 3810445 3587984 3456106
7080 3456106 3225874 3375287 3702540 3736785 3405585 3011562 3033710 3105462 3438509 3165883
7070 3165883 2825389 2850229 2835809 3033812 2832610 2931608 2810363 2954206 3220765 3396852
7060 3396852 3641120 3451841 3356923 3255767 3169353 2910738 3068755 3069941 3346698 3105855
7050 3105855 2894929 2959060 2790143 2839528 2860938 3092501 3192278 3146762 3274832 3010324
7040 3010324 2973533 3359271 3517874 3263266 3465303 3545523 3577059 3618753 3696915 3756479 3547741
7029 3547741 3803182 4031641 3846896 3852178 3824938 3673134 3809341 3683732 3575579 3818123
7019 3818123 3848968 3771141 3673997 3697251 3668911 3756796 3912185 3919630 4158097 4378214 4270813
7008 4270813 4216503 4235931 4293612 4561435 4647016 4597611 4428242 4537737 5160617 5176604 5074409
6997 5074409 5166068 5297812 5084872 5541018 5896682 5855868 5939105 6041323 6126788 6161971
6987 6161971 6384493 6473183 6782118 6847151 6901157 7145518 7273329 7491588 7579971 8045514
6977 8045514 8406818 8334965 8595866 8733535 8655502 9059929 9133214 9243746 9211719 9537742
6967 9537742 9819236 10319650 11123996 11361504 11510147 11710838 11966791 12321040 12587513 12882816
6957 12882816 13442999 13474402 13774437 13704471 13590549 13702151 13692159 13397957 13595327 13748091
6947 13748091 13565872 13532648 13747259 13484207 13512242 13822263 14082206 14121392 14579855 14926004
6937 14926004 15023203 15329329 15627818 15871734 16376667 16955049 17518203 17973571 18530993 19034046
6927 19034046 19622983 20587083 21130468 21630958 22514566 23013282 23743888 25080189 26135343
6918 26135343 27355828 28850833 30533919 32300510 34756404 37497075 40641481 44285957
6910 44285957 48931685 54902190 62233180 71349839 83572896 99986439 123412162 150283610
6902 150283610 170937980 173117929 158330298 137857726 116185826 95437280 77886399
6895 77886399 65712285 56733996 49746016 44279233 40604182 37346596 34247895 31927168
6887 31927168 29639203 27624708 25771649 24507721 23183842 22004326 20936849 20174625
6879 20174625 18970953 17956934 17287772 16169536 15565682 14848404 14602979 13994916 13401740
6870 13401740 13009206 12756761 12476484 12152113 11631592 11088454 11045543 11072375 11025539 11007971
6860 11007971 10769441 10787561 10690127 10587017 10529760 10729778 10868705 10784538 10960966 10878680
6850 10878680 11162029 11437549 11673235 11915497 12117386 12398989 12727060 12863177 13495971
6841 13495971 13963742 13557653 13051214 12517056 12180328 12050542 11342840 10691249 10153615
6832 10153615 9533474 9135519 8571166 8336278 8026960 7593851 7129337 6951156 6377474
6823 6377474 6106118 6053191 5872672 5525852 5387417 5174418 4985850 4893427 4872427 4918154
6813 4918154 4657252 4544209 4253900 4191971 4044057 3888408 3825800 3738807 3599699 3522906
6803 3522906 3537685 3917953 3922224 3611867 3484316 3576446 3702858 3370594 3701891 3966265
6793 3966265 3687510 3341588 3074394 3311916 3266422 3124372 3127591 2851833 2691105 2922422
6783 2922422 2904186 2924871 2587168 2388339 2520019 2560375 2203494 2326801 2325294 2265368 2401318
6772 2401318 2327234 2194532 2352698 2446577 2319524 1936874 2106488 2121990 2174266 2192165
6762 2192165 2194980 2109687 1997930 2015577 1914101 2147667 2177258 1901502 1840421 1921595 1843328
6751 1843328 1766842 2006599 2270552 2365118 1998640 1985987 2274924 1937789 1591653 1631495
6741 1631495 1831680 1914145 1841210 1830277 1978809 2124455 2281742 1980515 2234703 2264781
6731 2264781 1900555 1835769 1400842 1601066 1943704 1641440 1586169 1561299 1812582 2047934
6721 2047934 1961246 1683627 1361892 1349146 1828360 1697233 1619478 1558211 1630959 1660536 1803443
6710 1803443 1682371 1891469 2124989 1928566 1615021 1313226 1191015 1576140 1701567 1588356
6700 1588356 1621817 1496415 1360494 1470473 1385552 1718860 2095289 1918078 1888952 1860590
6690 1860590 1575041 1557808 1464887 1583235 1590050 1542482 1653378 1575173 1459795 1145922 1507915
6679 1507915 1728241 1538716 1588467 1696724 1690202 1578504 1633308 1390182 1445734 1499645 1421014
6668 1421014 1583846 1677991 1701294 1915468 1851240 1256495 1524304 1590250 1511865 1519194 1624044
6657 1624044 1523336 1554966 1797251 2112647 1885988 1735801 1684124 1955997 1866418 1617715
6647 1617715 1755912 1878414 1939850 1631074 1405233 1319433 1348087 1621025 1570960 1062980
6637 1062980 1114352 1339444 1702557 1393704 1431078 1712798 1762623 1870294 1634883 1581450
6627 1581450 1634659 1867833 1585625 1779226 1532551 1586991 1872797 1630021 1420640 1298193
6617 1298193 1417748 1492060 1401944 1521354 1461261 1299750 1251033 1274596 1314431 1441397 1766143
6606 1766143 1638192 1772354 1958369 2088436 1988160 1770344 1852624 1966685 2054669 1820627
6596 1820627 1679592 1695111 1644953 1559432 1757027 1653619 1509934 1788270 1990433 1925841
6586 1925841 1853981 1775700 1782732 2154161 1987077 1819860 1967402 2143456 1970777 2132134
6576 2132134 1854301 1681221 1886220 1918558 2258650 1861338 1918298 1630051 1575516 1800101
6566 1800101 1669377 1270940 1334009 1389993 1475695 1837572 1864302 1604172 1274684 1700929
6556 1700929 1749760 1670118 1505679 1693277 1388172 1278273 1658861 1833330 1633158 1473681
6546 1473681 1564537 1804402 2060883 2170812 1987628 1727791 1590711 1483877 1744646 1910697
6536 1910697 1726475 1441689 1459992 1630943 1669775 1662324 1738879 1686456 1769873 1900229 1894923
6525 1894923 1948202 2031584 1711660 1815859 1810381 1577140 1775719 1771040 1878222 1761716 1900975
6514 1900975 1735140 1606691 1334916 1584359 1936316 1868120 1618460 1855250 1898802 1804783
6504 1804783 1657075 2031980 2194984 2316926 2516069 2394269 2603646 2757425 2744527 2920312
6494 2920312 2549098 2449333 2475072 2300609 2042054 2099114 2175302 2228937 2584299 2434230
6484 2434230 2401481 2238546 2131727 2133150 2271955 2418133 2507800 2219462 2195734 2143983 2475517
6473 2475517 2611990 2491060 2467354 2573127 2665599 2516624 2438657 2679564 2283736 2531440
6463 2531440 2574094 2596013 2453761 2466650 2180869 2345417 2457029 2128194 2541421 2582017
6453 2582017 2510398 2813963 2763728 2523600 2314788 2231530 2386723 2706644 2761579 2727917
6443 2727917 2712707 3072302 3340063 3204761 3138557 3374289 3335445 3021023 3187471 3355027
6433 3355027 3419712 3590086 3863135 3906814 3683656 3484283 3807382 3701904 3945216 3767539
6423 3767539 3772846 4342887 4245258 4184424 4210294 4247348 4289119 4465414 4534334 4573963 4790058
6412 4790058 4824082 4523860 4553645 4637082 4817790 4890486 4643736 4771630 5103565 5105350 5124884
6401 5124884 5269617 5277507 5411460 5498461 5608108 5584413 5395078 5503470 5892462 6015319
6391 6015319 6209637 6275423 6548585 6773253 6923339 6804026 7003740 7375256 7453305 8099818
6381 8099818 7964869 7801798 8012551 8287280 8596893 8941383 9384304 9495329 9733042 10056798
6371 10056798 10446351 10376951 10598284 10908634 11245351 11878425 12363690 12745644 12966635 13593343
6361 13593343 14130474 14869588 15278075 15828828 16894415 17742023 18745648 19690692 20828790
6352 20828790 22004557 23031386 24776168 26360241 27538764 28765817 29505481 30722965
6344 30722965 31431596 31071516 30225517 29531064 28772435 28494182 27943079 27468891 26998353
6335 26998353 26846197 26795970 26797433 27111954 27531315 27809288 28790728 30051182 30993462 32652701
6325 32652701 34478862 36146510 38269316 40941719 43885237 47251378 51280066 55921405
6317 55921405 60707658 65242965 69229538 72332914 73571424 73046881 71259729 67802000
6309 67802000 63254679 58715621 54535721 49977377 46323394 42474089 38918216 36273634
6301 36273634 33651815 31067838 29025074 27528245 25605127 24090280 22942446 21561568
6293 21561568 20195086 19116563 18162552 17309253 16356033 15794363 15015521 14397223 13975090
6284 13975090 13450756 12596089 12172147 11746410 11593095 11448811 11282434 11294804 10919432 10672136
6274 10672136 10391230 9943167 10096632 9860143 9247726 9557262 9698996 9434648 9391891 9334481
6264 9334481 8980115 8774112 8466323 8140731 8165856 7820743 7858077 7994379 7664462 7179704
6254 7179704 7037858 6834406 6928049 6757158 6703937 6469288 6446733 6455562 6627697 6756623
6244 6756623 6586664 6375845 6204026 5888771 5679160 5695008 5593731 5637103 5818131 5705040
6234 5705040 5567045 5672068 5744749 5895764 6022537 5752949 5712233 5477017 5164437 5208622
6224 5208622 5528478 5902328 5689265 5567175 5576558 5308226 5601317 5231523 5237025 5578360
6214 5578360 5164488 5165426 5234566 5517679 5493077 5464782 5511408 5585884 5435016 5429911 5404580
6203 5404580 5035548 5245217 5379669 5031190 4877986 4989210 4848632 4918406 5239622 5219079
6193 5219079 4946147 4760468 5213874 4838235 5065754 4972155 4662796 4683246 4603992 4507650
6183 4507650 4554927 4597142 4526444 4845650 4969085 4907629 4931410 4710170 4692181 4878391 5105443
6172 5105443 5044298 4852035 4780044 4882596 4615945 4837934 4913144 4995521 4933640 4862126 4978321
6161 4978321 4767935 4851881 4845751 5119020 4882765 4951350 5022264 5105053 5102711 4994682 4938662
6150 4938662 4846006 4746273 4692165 4618103 4521916 4613610 4607040 4605070 4297543 4465429 4393738
6139 4393738 4492299 4337156 4438306 4724347 4147766 4008627 4218293 4491601 4359937 4403173
6129 4403173 4273223 4296043 4148674 4015154 3787216 3790080 3964053 3816265 3862738 3837054
6119 3837054 3930858 3741231 3670814 3552568 3848285 3769646 3727800 3832609 4114383 3877618
6109 3877618 3349742 3527195 3746324 3702195 3557844 3474827 3296659 3587846 3886774 3793530
6099 3793530 3604900 3498906 3856257 3523286 3483156 3732801 3607747 3686176 3881467 3828048
6089 3828048 3664133 3758460 3868583 3780053 3725538 4014743 4005872 3986294 4031034 4085782 4027561
6078 4027561 3927035 3806476 3744815 4152623 4041606 3856121 3832701 3932311 4057909 3964435
6068 3964435 3945025 3839646 4259893 4310958 3994090 3902433 4032138 3777409 3614810 3755354
6058 3755354 3633482 3751561 3999000 3865717 3981344 3957817 3957191 4180700 4296191 4296634 4296088
6047 4296088 4250911 4306560 4486998 4612849 4473382 4332956 4287149 4563732 4530879 4969926
6037 4969926 4803839 4495481 4354972 4130185 4494773 4776243 4709396 4480135 4170261 4587533
6027 4587533 4813512 4398829 4346067 4476310 4565645 4550923 4845970 4863175 4633551 4698894
6017 4698894 4642531 4511584 4552956 4457725 4375444 4595746 4643893 4679702 4827998 4737385 4674199
6006 4674199 4829875 5121232 4981285 5033955 4907885 4736220 4771231 4576872 4722927 4842279
5996 4842279 4914097 4852027 4941607 4787507 4808813 4826465 4979490 4943370 4921959 4772239 5008034
5985 5008034 5363187 5059532 4837419 4843991 5051886 5117807 5221144 5468339 5365004 5349709
5975 5349709 5303543 5223519 5291740 5365399 5529248 5718722 5638170 5461037 5641662 5834089
5965 5834089 5802204 5678452 5619772 5747608 5532346 5612419 5969468 5951350 5915165 5937338 6079382
5954 6079382 6158558 6220577 5944052 5971843 6094212 6293840 6413333 6528497 6549010 6513924
5944 6513924 6396862 6660377 6607811 7048945 7083915 7112114 6861776 7064241 7278528 7223919
5934 7223919 7383324 7574737 7551506 7429569 7683482 7709450 7697229 7550165 7542587 7568080 7888495
5923 7888495 8016371 7725065 7818105 7797854 8163214 7867647 7903601 8058295 8073730 7961803
5913 7961803 8316332 8184492 8404151 8595766 8524207 8627952 8449780 8566883 8578762 8826045
5903 8826045 8621011 8473695 8522920 8669200 8851223 9049906 9252352 8908207 8868855 8852186
5893 8852186 8519299 8355556 8669788 8615278 8385951 8544778 8575875 8436841 8449914 8554958
5883 8554958 8699964 8712576 8601182 8391095 8064492 8375434 8458255 8433016 8261578 8017351
5873 8017351 7939821 8028390 8059811 8135083 7969310 7820719 7830180 7817224 7450976 7466920 7373099
5862 7373099 7647305 7573354 7514405 7261210 7470886 7559223 7434137 7599863 7508885 7525605
5852 7525605 7684018 7603973 7707971 7634840 7799994 7496046 7034813 7185484 7562338 7447700
5842 7447700 7465656 7458305 7412307 7347670 7460985 7699137 7591832 7551932 7319603 7332198 7433795
5831 7433795 7417258 7358510 7226777 7334424 7380043 7334965 7643522 7695635 7594629 7516681 7721126
5820 7721126 7868008 7915060 8272385 8284394 8284192 8251495 8448652 8519192 8747207 9126399 9400939
5809 9400939 9617502 10240865 10676593 10953120 11569084 11887193 11626067 11092166 10937641 10954177
5799 10954177 10556510 9832157 9733237 9881642 9858368 9604813 9631426 9843806 9665240 9784289
5789 9784289 10157304 10077021 10137998 10024017 9892749 10137243 10312592 10313703 10421718 10315781
5779 10315781 10362064 10629020 10729235 10815633 10972725 11125696 11338426 11305258 11368378 11496320
5769 11496320 11823519 12013975 12269216 12370349 12242942 12420785 12240881 12094787 12574989
5760 12574989 12912348 13077237 13252127 13500387 13603823 13944873 14089788 14321035 14743421
5751 14743421 15036799 15454521 15523078 15648173 16056538 16532825 16866418 16980644 17509834 17914916
5741 17914916 18421289 18531848 18890305 19660066 20009667 20134499 20568885 21099955 21907203
5732 21907203 22462664 23044423 23779697 24476825 25140195 25629113 26627687 27810359 28911269
5723 28911269 29770456 30608243 31935702 33591518 34606554 35974374 37317489 38548005
5715 38548005 40087383 41829275 43802275 46234986 48697466 50993340 53538480 56686856
5707 56686856 60152452 63412278 66808753 69906653 71791048 72567676 72464642 71074144
5699 71074144 68307145 64543335 60434530 56692828 52750928 48758141 45479969 42358225
5691 42358225 39508827 37032727 34855729 32732231 31086026 29281341 28135007 26815641
5683 26815641 25525480 24367792 23627359 22750378 21713624 21067587 20423249 19799795 19254873
5674 19254873 18593113 18083091 17806400 17165953 16944301 16856487 16921276 16226357 15888441 15707169
5664 15707169 15434589 14969617 14631697 14862461 14542447 14261727 14400851 14282422 13937206
5655 13937206 13869068 13609690 13794279 14049269 13636103 13365072 13583598 13953222 14024318 13737662
5645 13737662 13490455 13728566 14092488 13897243 13830365 13717636 13587515 13416780 13834087 13923701
5635 13923701 14035525 13646288 13286740 13620599 13738733 13881751 13698624 13823080 14100659
5626 14100659 14072405 13975131 14178040 14151427 14319283 14142079 14080315 14139326 14339130 14118656
5616 14118656 14494060 14343722 14421758 14562461 14520614 14373962 14389277 14793826 15229571 15244355
5606 15244355 15050032 15111936 15496685 15325083 15721091 15900581 16085943 16244697 16247521 16413251
5596 16413251 16557872 16780238 17071894 17009453 17008814 17309473 17388147 17284969 17538032 17888683
5586 17888683 17803055 17655111 17997685 18005270 17968730 18202087 18085315 18271088 18337002 18348200
5576 18348200 18635680 18662610 18771452 19309121 19106581 19365021 19453673 19354640 19531568 19805527
5566 19805527 19908089 20303930 20415804 20758400 20786832 20634401 20945805 21241019 21437614 21392460
5556 21392460 21558384 21732844 22170119 22325341 22430975 22808022 22702369 22985423 23242971
5547 23242971 23627265 23597919 23755517 24234846 24645198 24799940 25269477 25346053 25587899 25980440
5537 25980440 26221849 26606480 27115482 27419889 27654073 27867479 28302131 28577901 29150766
5528 29150766 29595696 29726671 30254223 30556365 30813834 31265397 31937046 32551339 33254718
5519 33254718 34009970 34635254 34978286 35657854 36295509 36788542 37934018 39400447 40263793
5510 40263793 40982567 41871771 42479504 43572561 44634298 45761275 46853156 47859526 49036604
5501 49036604 49844456 51262104 52333570 53256985 54189026 54685238 55009595 54673042 54217256
5492 54217256 53926147 53445302 52645729 52089179 51255365 50581934 50055805 49922861 49647776
5483 49647776 49137968 49148219 49477691 49860931 50093100 49991468 50187092 50474084 50748532 50929964
5473 50929964 50904451 51179326 50903806 50619660 50436816 50368017 49931168 49480684 49055971 48934625
5463 48934625 48664885 48090419 47434632 46870593 46175386 45492979 44834254 44169883 43554683
5454 43554683 43161443 42867547 42363789 41783795 41438139 41093036 40654354 40826318 40593156
5445 40593156 40795435 41122007 41347203 41584291 42014810 42474199 42787201 43253212 43436206
5436 43436206 44102033 44469275 44771591 44919662 45072532 45199424 45106218 44898290 44759212 43967050
5426 43967050 43067451 42332253 41970499 41229711 40648407 40058865 39056178 38172699 37257003
5417 37257003 36261728 35502604 35060581 34255239 33572257 32859823 31971827 31336002 31055436
5408 31055436 30690487 30062044 29800203 29423295 28977193 28503571 28213740 28184129 27936947 27789664
5398 27789664 27704013 27517933 27405854 27031590 26592239 26234260 26084819 26032890 25963979 25774878
5388 25774878 25735448 25821823 25631402 25631077 25598278 25590618 25649282 25651448 25240824 25011836 25214108
5377 25214108 25330010 25080033 25241517 25257511 25402108 25577505 25732742 25761440 25724939 25749514
5367 25749514 26119529 26200484 26363913 26404320 26714405 26878599 27289911 27648353 27556255 27330116
5357 27330116 27528291 27605998 27939323 28142328 28024867 28207649 28442126 28935264 29313634 29524330
5347 29524330 29938365 30201375 30168994 30491623 30590554 31034616 31132340 31697196 32379344 33127755
5337 33127755 33694101 34286640 34714370 34998948 35158695 35290695 35588288 36097685 36445177
5328 36445177 36293323 36526284 36365946 36107727 36479517 36680397 36744429 36589906 37141607 37558468
5318 37558468 37357336 37530695 37798473 38148066 38333726 38715599 39155482 39448026 39852875
5309 39852875 39956764 40248115 40569531 41047835 41530099 41782513 42148099 42400462 42449763 42966902
5299 42966902 43226683 42797263 42616972 42438745 42446316 42553311 42176157 41872016 41493258 41649993
5289 41649993 41416675 40950297 40833213 40744561 40440396 40204942 40129929 40152338 40468468 40538386
5279 40538386 40739261 41169319 41917551 42523638 43137265 43693193 44111167 44429589 44701034
5270 44701034 44922720 44620487 44655139 44906471 44526520 44422584 44615324 44849810 45005694 44902491
5260 44902491 44798656 44617816 44333644 44050277 44222125 44084427 43638376 43768036 43363375
5251 43363375 43303447 43456784 43276093 42906537 43175274 43085074 43094986 43495477 43574235 43649779
5241 43649779 43767483 44154154 44246154 44521314 45214909 46139460 47182572 48078470 49136614
5232 49136614 49595000 49690287 49152561 48547956 47794421 47207813 46787609 46341593 45568924 44917341
5222 44917341 44324509 43885589 43534871 43141879 42521222 41679239 41145073 40764171 40102381
5213 40102381 39386657 38649447 38066019 37692719 37219993 36713158 36229175 36146970 36123096 35663395
5203 35663395 35088625 34956728 34507134 34677550 34914717 34579639 34622161 34858204 34800681 34800363
5193 34800363 34699275 34793572 34916543 34571629 34416896 34340803 34343797 34384836 33761845 33476654
5183 33476654 33304444 32778869 32404860 31899312 31174408 30703811 30232452 29300496 28953735
5174 28953735 28576032 27744529 27427899 26969473 26462375 25961353 25676383 25314708 24965510
5165 24965510 24756616 24574141 23966855 23344628 23101781 23260182 22968741 22567850 22196383
5156 22196383 21813772 21510208 21430666 21412744 21233111 21024504 20942779 20821322 20749152 20760548
5146 20760548 20460925 20642480 20605918 20818571 20901013 20701548 20706025 20459205 20644180 20344187
5136 20344187 20543631 20638384 20188005 20127013 20238271 20181877 20138388 19824254 19762217 19573873
5126 19573873 19303410 19631745 19668748 19783935 19845386 19815332 19244092 19299097 19443182 19412175
5116 19412175 19545535 19457177 19659014 19497212 19852435 19606990 19520503 19876525 19992963 20058117
5106 20058117 20207642 20002755 19992105 19984048 20033537 20305882 20339941 20517784 20767830 20652101
5096 20652101 20597229 20875313 21044106 21071627 21237906 21532176 21544848 21657912 21671037 21939192
5086 21939192 22197767 22416883 22763765 23204058 23644375 23825132 23965983 24362818 24776869
5077 24776869 25106296 24970449 24862247 24812402 24860094 24894456 25103311 24729912 24851791 25140751
5067 25140751 24862623 24834529 24640067 24197388 24563822 24506171 24366182 24176922 24359737 24614867
5057 24614867 24553566 24717488 25353080 25748976 25811661 26146823 26383124 26738223 27209999 27623435
5047 27623435 27641523 27713670 27595015 27495161 27676666 27852886 27533667 27312945 26894636 26424285
5037 26424285 26188843 25736752 25473606 25299272 25192659 25073585 25043982 24542514 24597109 24364730
5027 24364730 24210816 24194714 24062120 24128328 24110910 24198209 23836634 23663927 23923111 24127129
5017 24127129 23904530 23700008 23656731 23446656 23020637 22505571 22272011 22575823 22351882 21852556
5007 21852556 21746153 21734510 21332514 21040801 20977518 21017102 20795600 20973950 21294322 21368486
4997 21368486 21481069 21574122 21939894 22098508 22311478 22845766 23529133 23694816 23636229 23521128
4987 23521128 23207731 22451972 22262887 22321001 22055878 21985169 21646001 21869355 21848410 21812637
4977 21812637 21985376 21960459 22023521 21786319 21570438 21361766 21313087 21306255 21203229 20943692
4967 20943692 21219915 21573876 21482110 21398677 21519093 21449683 21091997 20919125 20959039 20931926
4957 20931926 20918925 20664390 20567656 20513396 20292408 20280289 20310812 20348678 20084619 19767250
4947 19767250 19699825 19665483 19534282 19411241 19183171 19505973 19589975 19755688 19746016 19670242
4937 19670242 19521135 19574196 19612574 19661307 19537353 19699427 19684014 19332979 19471454 19581201
4927 19581201 19773212 19719200 19599025 19497702 19282374 19206651 19152062 19638472 19627011 19667502
4917 19667502 19759592 19891743 19790029 19812140 19802420 19937522 20206334 19894072 19873913 19973894
4907 19973894 20042577 20178953 20340846 20111594 20199474 20018660 20378236 20408424 20328125 20366852
4897 20366852 20289776 20368359 20395095 20344172 20326189 20773493 20367638 20412402 20495154 20773008 20982154
4886 20982154 21212104 21159015 20978028 21095415 21136161 21049772 21487846 21459439 21168961 21334063
4876 21334063 21377970 21201547 21207030 21360197 21518929 21554970 21872983 22232440 21993754 22144272
4866 22144272 22167536 22682700 22798131 22617847 22723418 23129170 23532656 23850303 24076210 24295926
4856 24295926 24419826 24431373 24639986 25063337 24987880 25564597 25794299 25538115 25760143 26053276
4846 26053276 26333511 26796452 26990009 27297196 27294091 27688080 27848756 28293070 28671027 29206480
4836 29206480 30010541 29777925 29963644 30396147 30904214 31339881 31943230 32458951 32637075
4827 32637075 32533709 33108609 34124453 34658954 35021305 35232720 36162023 37302638 38313238
4818 38313238 39203357 40230506 41281722 42728955 43567232 44757030 45960356 47379885
4810 47379885 49177168 50571202 52061341 53901920 55735131 57319304 58964453 60014563
4802 60014563 60914090 61665463 61614483 61442647 60719797 59776343 58453306 56948962 55848171
4793 55848171 54242641 52946642 51976930 50621405 49247566 48439144 47461323 47095543 46562658
4784 46562658 45926636 45737970 45870370 45770212 45713782 45685321 45811028 46235254 46328665 46319207
4774 46319207 46647497 47001273 47701885 48182490 48567917 48871080 49315565 49949775 50333972
4765 50333972 50438373 51338589 52241259 52521022 53357779 54737946 55506801 56313894 58147999
4756 58147999 59813018 61673088 63231687 64969527 67538701 69878341 72422470 75076196
4748 75076196 78323016 82199813 85641881 90260368 95307154 100500256 106143813 112230671
4740 112230671 117870104 123082828 128183369 132029187 135114641 136580514 136252751 134188893
4732 134188893 130866804 126290013 121015254 115274753 109566529 103834870 98034672 92644377
4724 92644377 87935904 83337860 79040267 75676342 72789757 69533820 66909771 64430050
4716 64430050 62213904 60300798 58757076 57390431 56179698 54992888 54027945 53297699
4708 53297699 52535951 51736626 51129376 50403693 49637395 49121930 48253806 47631547 46831715
4699 46831715 46305676 45960319 45460082 44981016 44902462 44445727 44423895 44624536 44995370 44544330
4689 44544330 44355901 44491781 44394762 44272167 44379667 44648756 44846493 45079004 44616936 44718900
4679 44718900 45020980 44610840 44833448 45160097 45610030 45399094 45415168 45151107 45281690 45970693
4669 45970693 45841115 45870022 45953645 46100191 46088467 46310186 45904078 45865676 45829118 45759460
4659 45759460 45494010 45092364 44992126 45133555 45257207 45123468 45376072 45721557 45997739
4650 45997739 45841253 45936411 46289937 46840162 47418492 47979125 48250797 48615341 49428938 49929734
4640 49929734 50621434 51143927 51878290 52683455 53386885 54149977 54519251 55049597 55525095
4631 55525095 55792745 55958465 56297837 56605288 56332732 56319015 56280237 56039136 55849752 55746293
4621 55746293 55778961 55959647 55993877 56281130 56706223 57167738 57492756 58223987 58793367 59259570
4611 59259570 60104994 61196021 61924544 62517552 63285352 63977800 64698516 64669581 64481345
4602 64481345 64591917 64277188 63623220 62479283 61597531 60538519 59342468 58156637 57170875
4593 57170875 56209321 55026352 54387280 53263118 52394492 51815918 51305423 51050507 50557565
4584 50557565 50037543 49863078 49864229 49802717 49417837 49288046 49232564 48770856 48219623 48090986
4574 48090986 47764824 46938344 45860695 45268943 44547742 43662677 42839787 42072898 41122994
4565 41122994 40554143 39734690 39093218 38548585 38119631 37742854 37198123 36965464 36589541
4556 36589541 36477779 36344667 35982067 35347572 35025246 35292801 35205081 35073649 34917495 35013568
4546 35013568 35158946 35069261 35087002 34966536 35149809 35071040 35033551 35118558 35242902 35391574
4536 35391574 35364165 35435172 35359210 35520030 35788133 36120902 35961380 35912986 35979938 35954852
4526 35954852 35548969 35592862 36330690 36408355 36343924 36288950 36496511 36547482 36764903 37455293
4516 37455293 37776211 38019192 38452745 39183544 39417527 40246306 41019353 41532034 42450488
4507 42450488 43504886 44533065 45782711 47489739 49562703 51930768 54312196 57679517
4499 57679517 60920507 63961641 65768243 66169916 65155892 62828544 59896858 56241055
4491 56241055 52981698 50110188 47800403 45979480 44214514 42933321 41675378 40662166
4483 40662166 39657655 39193772 38664647 38357837 38052010 37744879 37507183 37568323 37654759 37338366
4473 37338366 37362532 37427340 37336091 37246660 37583233 37999521 37977189 38442349 38624735 38798640
4463 38798640 38839687 39018395 39248179 39297803 39246894 39634349 40021984 40197167 40797772 41409384
4453 41409384 41848436 42418089 42743568 43571823 44649348 45803275 46616563 47269210 47680589
4444 47680589 48254613 48985633 49151193 49381314 49587321 49979243 50453084 50971478 51290928
4435 51290928 51818946 52115212 52776535 53779624 54680092 55343253 56184370 57141295 58386498
4426 58386498 59953200 61496232 63346647 65357338 67333011 69861855 72875605 75997846
4418 75997846 79989195 84805338 89701095 95275538 101912664 109717674 118852781 128866311
4410 128866311 138776233 147975442 154358103 156618672 154741813 149206997 141244489 132742845
4402 132742845 124095370 115626062 107598791 99933307 93070156 86627698 80816988 75917314
4394 75917314 71522788 67596331 64286208 61539331 58623834 56478859 54762551 53009652
4386 53009652 51380459 49933419 48596989 47213634 45580215 44367921 43261902 41880499
4378 41880499 40825408 40366573 40091568 39051812 38300879 37594105 37090698 37088652 36731747
4369 36731747 36153797 35485492 35173573 34641685 34173348 33709459 32708751 32157117 31522836
4360 31522836 30991607 30478172 30206494 30051017 29833290 28946413 28526876 28528027 28223410 27686270
4350 27686270 27019639 26903569 26711723 26580446 26077451 25675819 25328311 25010239 24688204
4341 24688204 24578411 24507990 24163642 23901725 23827916 24075752 23941244 23635557 23756844 23552399
4331 23552399 23346637 23327744 23599227 23852867 23809607 23713985 23732732 23876889 24462370 24423070
4321 24423070 24694815 24782567 24811098 24883408 25347395 25586362 25438657 25798783 25992396 25820657
4311 25820657 25980745 26162715 26181168 26555164 26656035 26797277 26836648 27419762 28132696 28625922
4301 28625922 29235651 29768001 30513511 31188811 31598091 32447965 33083656 33617827 34291966
4292 34291966 34728813 35108871 35841636 36331794 36571577 36520829 36726956 36867302 36897726 36525370
4282 36525370 36163387 36067513 36038477 36144542 36194393 35927112 36068861 36297295 36174803 36617837
4272 36617837 37116650 37887066 38614120 39030604 39979681 40490076 41158602 41859417 42349249
4263 42349249 43147044 43505785 43488003 43608364 43808423 43249886 42460999 41818393 40786348
4254 40786348 40133504 39546740 38978682 38237277 37584474 36882338 35986106 35442535 35066629
4245 35066629 34801345 34334949 33808116 33379036 33141723 33130945 32968569 32523875 32279442 32208591
4235 32208591 31908755 31893926 31795986 31579454 31661522 31394011 30862254 30684498 30325297 29670009
4225 29670009 28844756 28256432 27600120 27025487 26448743 26017999 25612614 25032440 24563093
4216 24563093 24544733 24319695 24107851 23654812 23464214 22979135 22837086 22991754 22494089 22267730
4206 22267730 22219164 22024475 21614751 21587632 21415590 21692898 21806819 21218584 21015216 21065075
4196 21065075 21036313 21250989 20844550 20736301 20877999 20768575 20924281 20880291 20970644 20886264
4186 20886264 20682434 20717804 21127808 21559325 21404486 21024542 21032814 21091769 21125357 21529471
4176 21529471 21897558 22163619 22307370 22127281 22221871 22903578 22774179 22886254 23010344 22808398
4166 22808398 23256646 23867087 24299323 24872388 25154456 25495765 25662269 26191361 26744466
4157 26744466 27581637 28497845 29419782 30367694 31638441 33089146 34264322 36113365 38417393
4148 38417393 40929386 44505938 48770192 53330229 56245341 56162564 53550574 50370419
4140 50370419 46804091 43746383 41290060 39201990 37603225 36397464 35708963 34989076
4132 34989076 34611813 34070261 33881068 33867823 33323908 33379850 33367540 33241818 33309771 33113729
4122 33113729 33120510 33245754 33182701 32920436 33048491 33266691 33192430 33053851 33546210 33849784
4112 33849784 33751368 34016161 34323966 34603039 35101726 35404858 35978461 36397996 36485037 37076401
4102 37076401 37838187 38660460 38917620 39496159 40272952 41020769 41408156 41912463 42734791
4093 42734791 43730574 44900603 45532773 46544506 47980424 49351616 50204945 50773383 51884051
4084 51884051 53226199 54527455 55685249 56422361 57402134 58594426 60208534 61840164
4076 61840164 63341433 64879855 66295533 67964951 70108508 71841493 73876080 75897062
4068 75897062 78491696 80985192 83670218 86678426 89755311 92089971 93589734 94937384
4060 94937384 95875405 96817361 97700243 98997712 100685410 102306196 104494853 106379744 108621542
4051 108621542 111302713 113912325 116050950 117709039 119069284 119363156 119014403 118143248
4043 118143248 116844758 115789470 114252632 112410032 110741339 109842587 108823108 107767783
4035 107767783 106696224 105889398 104848315 104409249 103684188 102813952 102433278 101875683 101276953
4026 101276953 100465504 100381230 100185847 100057597 99625885 99348617 99372786 99443436 99476081 99433660
4016 99433660 99183569 99234853 100044884 100795548 100977472 101244784 101981177 103094453 103521649
4007 103521649 104257446 105237644 106362790 107439872 108386872 109448264 110555885 111737155
3999 111737155 112677971 113780925 115286694 116884888 118311319 119559121 120969993 122219989
3991 122219989 123854818 125486179 126995256 128587982 130025892 131808276 133403535 135222584
3983 135222584 136773041 138283409 140168364 142376958 145015382 146943861 148941331 151159056
3975 151159056 153277472 155335089 157667663 159917832 161955163 164248008 166796522 169121813
3967 169121813 171928593 174541831 177068243 180152008 183269464 186394512 190044725 193458442
3959 193458442 197544527 202429049 207324506 213060300 219152669 225921691 232717424 240358403
3951 240358403 248193208 255406120 261996422 266360254 268020888 266826530 263276596 257459690
3943 257459690 250386059 243037417 235788029 228957886 222383318 216174191 210396452 205510990
3935 205510990 200914301 196548998 192129466 188080807 183816395 179462178 175153962 170898079
3927 170898079 166840463 162503843 158102134 153764611 149651196 145230219 141424159 137855364
3919 137855364 134128455 130414705 127057754 123879789 120564803 117383326 114591244 111964460
3911 111964460 109609549 107080530 104690301 102535652 100266393 98353083 96465554 94468548
3903 94468548 92697410 91178580 89629044 88173363 86729751 85558029 84520996 83061536
3895 83061536 81998650 81311993 80256531 78974418 78221291 77456845 76486402 75919918 74788981
3886 74788981 73713921 72624972 71913059 71249288 70230761 68968395 67844259 66844891 65201870
3877 65201870 63517263 61825796 60310921 59205624 57903260 56302804 55182956 54212363
3869 54212363 53234448 52200531 51354731 50360818 49342605 48177137 47333723 46626333 45881189
3860 45881189 45546994 44688651 43931515 43322191 42813484 42645083 42088872 41521128 40961234
3851 40961234 40467718 39720301 39405486 39002735 38596548 38885867 38647170 38447651 38284667
3842 38284667 38153767 37962527 38186903 38178469 38113711 38347041 38226291 38269080 38339129 38666949
3832 38666949 39360224 39663224 40253826 40722981 41401620 41974798 42290971 42750359 42725356 42232919
3822 42232919 41437267 40635399 39649174 38738608 37733571 36787798 35858243 35062899 34483116
3813 34483116 33804626 33069980 32396631 32286638 31825233 31416663 31367051 31441668 31552604 31469314
3803 31469314 31115266 31233233 31314782 30987393 30806628 30973715 30984458 31295191 31547577 31877468
3793 31877468 31731363 31673809 31751110 32042119 32132775 32058276 32108497 32096588 31943336 31803495
3783 31803495 31983373 32154250 32327531 32449623 32930956 33259663 33568821 33645329 33733151 34247212
3773 34247212 34552093 34877549 35120997 34939935 35162518 35500024 35837691 36080459 36528162
3764 36528162 36882694 37467883 37922457 38423768 39368795 40263084 40856039 41466380 41863315
3755 41863315 42496631 43241320 43798599 44080738 44670495 45117223 45685615 46010219 46275815
3746 46275815 46756037 46916984 47042936 47678382 47556592 47611641 47813046 47941123 47855224 47338143
3736 47338143 47094887 47128986 46881159 46587401 46557808 46191016 46111535 45434835 45118581 45125865
3726 45125865 45335888 45153812 45350288 45254399 44417417 44264793 44476232 44443901 44487428 44498662
3716 44498662 44431198 44918065 45216491 44953071 45280707 45671639 46080873 46496465 46605670 47051659
3706 47051659 47571256 48230691 48790508 49337337 49627788 50282987 50910301 51596822 52199845
3697 52199845 53108993 53884985 54881052 55428406 56058166 57000945 57853202 59192096 60101045
3688 60101045 60758945 61629234 62869318 63924021 65210978 66326932 67332334 68486514
3680 68486514 69639135 70916465 72361334 73725555 74704818 75527584 76962586 78367037
3672 78367037 79662122 81067236 82725683 83833198 85089141 86459242 87919049 89213846
3664 89213846 90382187 91999209 93556455 95178414 97038193 98682692 100068022 101488449
3656 101488449 103097739 104564630 106073787 107958904 109346299 110597375 112417929 114217485
3648 114217485 116404130 118274784 120397057 122666861 124774980 127011976 129041342 131373936
3640 131373936 133542176 136098850 138763250 141493110 144395243 147430718 150722952 154000357
3632 154000357 157298803 160799307 164477995 168373545 172275509 176487527 180678365 184771789
3624 184771789 188908905 193109564 197501339 202045573 206422365 210682768 214695106 218461075
3616 218461075 222441323 226706474 230373238 233995329 237060698 240152716 242949653 245805529
3608 245805529 248239952 250630945 252794906 254585450 256414395 257650626 258997388 260311821
3600 260311821 260943584 261517551 262339682 263033172 263970613 264591945 265174961 265714986 265903354
3591 265903354 266270592 266726622 267324711 267841334 267723262 268022204 268527670 268832134 269139604
3582 269139604 269604058 270255756 270789793 271166802 271777798 272141359 272973058 273659856 274402079
3573 274402079 275091486 276469409 277912198 278979285 280043964 280663632 280969684 281420420 282040782
3564 282040782 282772959 283195614 284526831 286023293 287329683 288838429 290498729 292422753
3556 292422753 294420829 296575612 298882632 301123382 303533692 306698331 310177258 313218311
3548 313218311 316605367 320196328 323649797 326756029 329872184 332869459 335445645 337619483
3540 337619483 339321097 340389806 340976310 340802211 340150638 339221163 337832613 336156458 334029602
3531 334029602 331792011 328924783 325686271 322100645 317667160 312822577 307577078 301384859
3523 301384859 295234718 289073183 282654156 276013558 269397689 263211808 257189717 250936811
3515 250936811 244854502 238890901 233203223 227739038 222516857 216910633 212018871 206840118
3507 206840118 202401810 197981560 193704328 189845926 185815938 182400500 179041942 175888562
3499 175888562 172985380 169714814 166410510 163545342 161228894 158648683 156331358 153948518
3491 153948518 151744599 149394259 147334889 145079231 143059406 141458360 140099481 138404891
3483 138404891 136550453 135014244 133315511 132288727 131345016 130327107 129125992 128181705
3475 128181705 127253046 126643322 125931947 125488693 124639961 124287888 123884246 123768789 123100123
3466 123100123 122802008 122421452 121953479 121791887 121592671 120964710 120608930 120053115 119301600
3457 119301600 118751688 117949216 117251229 116365902 115240419 113887714 112710470 111405689 110229538
3448 110229538 108292665 106804635 105215230 103894246 101773501 100059172 98360009 96515089
3440 96515089 94908325 92898529 91143094 89496697 87838038 86129175 84444726 82693967
3432 82693967 81146622 79711584 77846381 76302443 74980039 73830935 72751596 71609529
3424 71609529 70650587 69569007 68271864 67328535 66862783 65847934 65188508 64766106 64254607
3415 64254607 63436094 63248701 62655619 62227414 62131269 61510641 61258639 60716410 60393130 60477477
3405 60477477 60550993 59696304 59176257 59149250 58914936 58503260 57648848 57128042 56675952 56588850
3395 56588850 55835635 55200556 54789879 54402289 53844548 53179705 52350850 51431584 50803368
3386 50803368 50316962 49767195 49117444 48504246 47889035 47396031 46652997 46100152 45738187
3377 45738187 45355279 45257953 45235457 45145552 44703583 44666793 44564701 44632178 44610108 44577014 44881120
3366 44881120 45195120 45492698 45801694 46322771 46733550 47226418 47141829 47321389 47828415 48216760
3356 48216760 48786319 49194141 49810814 50310069 50467693 50541573 50936695 51285845 51263705 51413399
3346 51413399 51591380 51667483 51692191 51515060 51143302 50988765 50680816 50391223 50368898 49923355
3336 49923355 49224825 48771125 48142363 47647128 47066820 46255346 45513486 44877034 44154271
3327 44154271 43522486 42745769 42021415 41649848 41285931 40592373 40500187 40463230 39851051 39463105
3317 39463105 39476729 39437871 39448035 39502550 39378040 39657562 39840623 39931766 40386824 40915773
3307 40915773 41428048 42260986 43005384 43520579 43375359 43208540 43093245 42956027 43161493
3298 43161493 43436397 43841898 44087478 44217902 44530488 44636699 45090593 45778616 46602367
3289 46602367 47347010 47991411 48711938 49398250 50067379 50999725 52417969 53866256 54809868
3280 54809868 55640357 56971123 57781823 59014141 60128612 60776803 61512066 62344932 62687305
3271 62687305 62801388 63292260 63685811 63594607 63911816 63826508 63872161 63966078 63514102 62916993
3261 62916993 62463097 62294011 61621877 61064887 60117779 59063457 57992256 56485321 55522516
3252 55522516 53993213 52684347 51919296 51163005 50437693 49467336 49309327 48852792 48370436
3243 48370436 48458806 48242739 48101396 48673859 49423174 49954407 50618219 51956773 53127061
3234 53127061 54140120 55471076 57170767 58488345 59799595 59816093 58945166 57486137 55210637
3225 55210637 52759625 50068221 47160879 44871368 42848031 40620302 39147865 37838611
3217 37838611 36516821 35436250 34313354 33058987 32058516 31152128 30198583 29159763
3209 29159763 28593365 28034649 27167772 26489435 25822792 25300628 24569546 23913351 23864953 23142307
3199 23142307 22482275 21842509 21276395 20973041 20656962 19858683 19321633 19050835 18958888 18891914
3189 18891914 18642319 18184428 18016562 17714387 17438928 16766257 16539700 16222518 16146708 16238293
3179 16238293 16156034 15869560 15397468 15157013 15102601 15106451 14937618 14824804 14640561 14608867
3169 14608867 14365334 14406909 13835908 13729401 13756704 13862596 13817727 13678047 13699646 13550949
3159 13550949 13302426 13392749 13217837 13332560 13865122 13909898 13652707 13387869 13294518 13520567
3149 13520567 13401286 13142219 13103422 13238874 13031882 13083274 13447528 13714577 13772461 13558637
3139 13558637 13838729 14081703 13972914 14216403 14765376 14900185 15036411 14954346 14700643 15022462
3129 15022462 14840714 14853673 14751877 14760319 14781202 15093680 14755212 14532589 14543701 15000586
3119 15000586 15172448 14428247 13988427 13536526 13246491 12828706 12760200 12378789 11978975 11707481
3109 11707481 11729698 12126130 12145971 11696871 11438036 11374267 11225177 10891638 10636234 10437895
3099 10437895 10260713 9872190 9798765 9698631 9357897 9302187 9313273 8826949 8514165 8911058
3089 8911058 9202125 9084150 8914080 8552531 8499460 8441191 8041382 7787316 7764946 7910588
3079 7910588 7681874 7558680 7287949 7333249 7378527 7166318 7057888 6915500 6775695 6533464
3069 6533464 6594693 6353188 6558580 6787559 6475722 6172525 6282534 6454189 6418956 6233612
3059 6233612 6184056 6003651 5655096 5548989 5515815 5600528 5810241 5820450 5390524 5474042
3049 5474042 5659632 5308563 5350134 5263989 5183166 5250494 4987164 5317700 5241033 4934097
3039 4934097 5213161 5177298 5003319 5006752 4993486 4740497 4780435 4545051 4696971 4807679
3029 4807679 4953775 4561172 4367117 4746549 4494569 4454342 4689947 4606139 4731874 4562963
3019 4562963 4336881 4560167 4654759 4438063 4443561 4197929 4300781 4309436 4507311 4374083
3009 4374083 4380391 4706450 4736588 4513201 4134735 4461811 4444277 4322823 4503481 4631812
2999 4631812 4640060 4510404 4545119 4629022 4375078 4410172 4604462 4713722 4708818 4743762 4653780
2988 4653780 4481011 4629878 4747263 4613058 4614507 4661153 4942488 4954612 4836055 4705508
2978 4705508 4746906 4548009 4678628 4591529 4922461 5017701 5236157 5239702 5352564 5558730
2968 5558730 5493460 5455225 5529878 5602111 5750587 5690994 5932664 6061520 5978697 6110698 6259810
2957 6259810 6278901 6015608 5751257 5787097 6112897 6108528 6267989 6331963 6364717 6559246 6654449
2946 6654449 6724089 6772761 6503137 6723429 6960470 7038047 7131064 7217477 7192178 7412550 7811238
2935 7811238 7734630 7996108 8369574 8549233 9244982 9864186 10086340 10304905 10472034 10338880
2925 10338880 10233661 9892292 9449670 9243212 9137081 9225258 9022628 9088406 9283565 9147706
2915 9147706 9061842 9127718 9172560 9620245 9582601 9678238 9531188 9565812 9422347 9747876 9765844
2904 9765844 10048451 10690728 10991363 11505837 11892505 12251897 12243526 12149511 12182415 12095768
2894 12095768 11846349 11808790 11796518 12558280 12606337 12602755 12502749 12676544 12424437 12651781
2884 12651781 12324464 11878199 11936096 12311793 12226183 11864178 12055787 12483804 12585477 12424969
2874 12424969 12678279 12855194 12770045 12803638 12900449 13345851 13496912 13785806 14106018 14375245
2864 14375245 14881895 15567024 16098127 16383296 17156695 18177786 18968151 19773384 20991900
2855 20991900 21755557 22683148 23081052 23227184 23484577 23234771 22599490 21814252 21041199
2846 21041199 19525669 18401783 17302848 16312714 14992379 14054246 13341943 12469165 12086619
2837 12086619 11570520 10939500 10522931 10170459 9370631 9010438 8762839 8547139 7719437
2828 7719437 7169212 6939897 6757752 6532142 6426942 6121651 6190723 5966626 5897672 5666508
2818 5666508 5484566 5365149 5101636 4944052 4718849 4589653 4670735 4502516 4259378 3954857
2808 3954857 3996161 3833167 3730478 3725425 3480417 4048892 3600943 3486795 3245716 3445094
2798 3445094 3472858 3278375 3003631 2565838 2662690 2504246 2531386 2713601 2549498 2615534
2788 2615534 2831262 2719518 2293638 2271435 2491754 2564588 2792155 2761830 2833114 2635438
2778 2635438 2426114 2205220 2279406 2023881 2035620 2180611 2244555 2169491 2278824 2150795
2768 2150795 2184605 2122773 1842186 2055823 2114200 1950846 1520589 1180384 1462404 1622643
2758 1622643 1735782 1657530 1611188 1779397 1380645 1595946 1753539 1500845 1718810 1597656
2748 1597656 1430063 1609580 1631774 1694957 1659279 1544675 1683525 1696242 1884083 1562423
2738 1562423 1577071 1843719 1799768 1498928 1137374 1183856 1067686 1242159 1158276 1112881
2728 1112881 1420991 1248571 1311694 1746569 1251479 1091042 1018709 962248 1105660 1239867
2718 1239867 1435140 1432735 1116408 968563 1000141 1054324 917956 733896 1030489 1088972
2708 1088972 1000727 957145 836002 780346 482259 740855 980387 1178016 1263677 889610
2698 889610 384669 531007 654455 728064 875981 989275 931725 559222 583338 506360
2688 506360 833261 948712 866387 1036098 772662 966661 973568 1116168 1111858 624333 843329
2677 843329 900431 569650 598511 789144 732604 679111 985422 805231 663618 808422
2667 808422 746883 655116 605569 477048 587458 587610 561817 596941 781908 671265 669050
2656 669050 995742 615281 380743 141340 483212 671214 615173 808418 926559 730697
2646 730697 299411 481420 712045 719470 651122 809002 983670 705112 612453 348552
2636 348552 492280 730631 962205 1026782 1187312 1023547 1199529 1181565 743594 523349
2626 523349 483514 825539 675961 628410 809202 792286 559960 470638 411473 443565 548529
2615 548529 528443 478277 620900 759152 625451 600885 439168 285038 377756 336948 578772
2604 578772 823468 782247 912885 994206 1089823 869110 678302 416193 535131 449908
2594 449908 410477 490266 586062 938303 983376 815001 577942 319513 326002 395382 387270
2583 387270 551631 515203 548976 431171 562206 444706 750064 636573 374770 341309
2573 341309 435229 462707 378646 622730 568743 627493 717968 901049 1069792 1025167 881456
2562 881456 808613 888733 1092062 968182 814807 886964 699066 498292 714366 495327
2552 495327 813691 583831 209540 171345 256957 386630 329057 275935 250076 420215 493889
2541 493889 287734 221653 346613 470452 179411 -36402 147155 456991 607258 352931
2531 352931 450004 279423 322840 278022 131412 42103 283100 350158 373582 283456 342190
2520 342190 492547 526979 412873 321159 -91836 91255 221372 419077 245141 314153
2510 314153 638561 549036 400247 332320 420933 292300 321361 269305 217852 262261 415718
2499 415718 358004 -2750 186100 168536 351849 309685 178054 321498 168834 287371
2489 287371 231763 258170 154454 172362 196541 335817 343606 -25409 -47714 84202 -18228
2478 -18228 357009 505517 377092 98820 98018 411144 352426 158281 18531 201825 428890
2467 428890 236091 162225 458503 598169 559452 374231 280508 77817 129033 389006
2457 389006 199153 447725 426869 383832 237630 111317 193689 346856 490446 298161
2447 298161 19212 552327 342463 56656 113095 254530 101645 -202359 -92733 216217
2437 216217 263316 317078 -72858 -137030 248079 157362 188990 90278 200546 171452 313857
2426 313857 92262 93031 206372 112178 240044 435134 383114 255431 262382 255028 191817
2415 191817 598126 589287 351035 404247 255339 105038 -150811 -121518 268007 31180
2405 31180 -97706 343644 559617 584084 579660 256736 -35626 -21882 241037 315766 308227
2394 308227 304445 142164 111132 -229812 -43619 161767 99608 415312 314328 -262052
2384 -262052 -11395 6110 89722 269741 399600 475658 318879 267198 202419 138125 442577
2373 442577 542941 402878 310514 126159 377881 421970 572747 693209 582660 -119711
2363 -119711 38300 395135 293646 187410 381357 526917 696628 605081 266313 325668
2353 325668 285318 227164 545248 447830 564736 500572 35621 222884 384141 443673 283238
2342 283238 162090 275104 289587 507593 326928 286307 398668 344712 77490 161854
2332 161854 56464 65876 208146 37716 15712 -71516 10549 -135373 51997 -180683 -153532
2321 -153532 44886 107961 -3258 253559 527391 267008 -36742 -101140 -4465 200026
2311 200026 8462 -41776 194629 44302 -114538 35630 301206 91203 228700 222798
2301 222798 293407 396351 203305 87549 10355 17600 -27538 137887 -45558 186129 519022
2290 519022 505586 201241 334261 686674 523140 739318 720937 439551 367608 574665
2280 574665 802552 545313 435398 361795 446309 441034 62056 254787 315363 88448 125537
2269 125537 568441 290928 311772 392802 466891 403214 200047 535616 542554 438244 573102
2258 573102 307224 70168 237356 56960 -50857 -30569 464852 419123 306663 274004
2248 274004 108307 106773 36708 9918 190790 132943 172468 187060 217438 323297 353528
2237 353528 125773 303075 643607 684516 569701 500847 547839 65840 428955 215730
2227 215730 327618 695882 352722 401150 541415 682981 478216 596035 470619 539048
2217 539048 577463 458363 414024 757641 1092174 684315 544753 423687 331460 267821
2207 267821 274966 355675 451140 539791 466670 582880 636642 637079 693064 906984 827225 577269
2195 577269 576571 626702 349812 530213 648495 709053 629782 816944 1065029 1089562 923052
2184 923052 515578 667233 826211 770671 627126 1021415 1064962 1078012 1165184 1159028 1146538
2173 1146538 1061175 1201289 1480003 1256698 1507777 1458162 1317511 1349663 1282812 1554424
2163 1554424 1343944 1411283 1653904 2059875 2191820 1885885 2099598 2101447 2336945 2231700
2153 2231700 2372313 2151175 1864922 1914509 2060378 2671176 2760872 2746029 2679174 2703973
2143 2703973 2762743 2487394 2831094 2930873 2838061 3126362 3319645 3329282 3103517 3208161
2133 3208161 3622478 3655356 3742600 3884058 4309498 4726717 4821587 4800906 4846912 5084677
2123 5084677 5677723 5613611 5807499 6299971 6317438 6561159 6774111 7265297 7754371 8538453
2113 8538453 9018965 9199842 9735166 10380535 10794162 11602263 12526884 13545966 14520377
2104 14520377 15349618 16057271 17096450 18374819 20002151 22071088 24827483 28042210
2096 28042210 32271514 38020979 46180228 56900258 69011281 78432887 79447642 72779942
2088 72779942 63764109 54015043 44261275 36480817 30737043 26286463 22778641 20322323
2080 20322323 18401493 16843236 15693909 14929854 14079568 13239919 12536822 11214884 10040877
2071 10040877 9232472 9072113 8345225 7548354 7141924 6743769 6429260 6334393 6240021 5671590
2061 5671590 5092463 4748725 4555521 4426759 4211827 3909755 4031985 4021713 3529107 3343311
2051 3343311 3466715 3530166 3470800 3329846 3159639 2906379 3164790 3013168 2721747 2661773
2041 2661773 2513169 2350229 2290763 2187533 2318485 2577541 2447403 2167311 2003772 1865938
2031 1865938 1574886 1756272 1862711 1865617 1689645 1496309 1571551 1826930 1552938 1523025
2021 1523025 1487729 1300460 1671408 1811387 1693469 1555401 1240535 1339091 1461859 1609441
2011 1609441 1446826 978631 655783 847305 924294 721977 690953 692472 1263820 1261118 1301003
2000 1301003 1027234 868483 763370 898414 945757 897366 736514 643228 584295 506629
1990 506629 819406 922119 579368 602515 879247 1101967 938797 717627 859580 1152069
1980 1152069 1071413 949691 518657 345880 261410 340787 674729 680573 543974 694675
1970 694675 493316 369666 551174 613044 357615 302375 165049 535284 432492 288527
1960 288527 281533 207994 537076 478520 393412 549705 468006 566243 289623 98117 610848
1949 610848 457342 129746 241184 419852 192084 365637 358468 290890 381980 665533
1939 665533 457988 215291 134119 302400 280960 241886 86114 197196 236048 366809
1929 366809 543242 329561 448588 551668 546912 353571 199725 360371 240716 612359
1919 612359 502675 298481 205248 160071 53484 18591 48159 23674 290809 548770 445429
1908 445429 891909 638892 576657 312928 163232 285823 312220 169793 177215 340532
1898 340532 25987 253549 51434 263202 338189 77615 230869 344762 184676 -52824
1888 -52824 147922 -7110 -78650 240985 39621 -192813 -133457 -31918 86081 -56320
1878 -56320 -268200 70469 313896 352179 238034 332884 179346 65463 402364 450393
1868 450393 385528 163301 -20382 40673 245532 331369 -166872 -333916 -135382 -78070
1858 -78070 91111 359439 200323 -39118 -72417 169723 369626 240077 -96743 159
1848 159 153678 227751 368637 341613 73378 466935 580424 424263 409058 328042 511965
1837 511965 419554 39428 233353 429625 350123 234664 247220 356443 196328 98305
1827 98305 13404 208558 391435 157153 95598 271322 640347 582529 442099 403869 192736
1816 192736 145124 179044 27634 321722 257681 -18296 -18545 -79089 -107411 181163 294579
1805 294579 -28550 -231488 -133080 -89029 -216646 194727 125604 147499 228050 39542 16956
1794 16956 -30779 -268738 -248947 -580861 -58194 331790 137285 -40614 -68425 3178 -224140
1783 -224140 -345850 -407884 -278120 7340 283784 307000 34062 -148127 -156432 -273339
1773 -273339 15839 -286467 2508 121129 63287 -270163 -304231 87806 -86459 -4479
1763 -4479 -241497 -384863 -175462 13267 50783 284361 20999 181329 468975 115596
1753 115596 392656 166575 -211622 127852 52376 -61587 -29568 -111076 -124923 -392823
1743 -392823 -315089 103234 152862 -236301 -172553 194540 -64428 -331439 -451812 -94509
1733 -94509 -8757 -212342 109280 82415 -90747 -147991 -127893 -119128 -244132 -64597 -184331
1722 -184331 -144646 -59005 136624 174352 82445 186610 327712 137426 -127957 -138506 -63351
1711 -63351 98445 238928 299326 151591 -59692 -46939 -95660 -312022 6881 -9151 -125790
1700 -125790 69595 35390 19105 90485 86736 83887 24258 -248026 -37080 -126930 -125817 36315
1688 36315 -44905 145497 207245 234354 -215240 -302838 19060 244637 216244 295345 112442
1677 112442 -199256 -144358 -337087 -237347 52813 28492 -235476 -98431 -372969 -707980
1667 -707980 -481432 -489979 -527114 -291363 -118437 139043 -60018 -72460 107101 53266 87159
1656 87159 -61563 -151256 146930 161885 311194 9537 11454 169066 98297 -8565 31770
1645 31770 -68121 106437 198990 -114765 -226395 -218249 -61832 175760 421541 344292 173140
1634 173140 -17024 156620 -224604 -182514 -192203 -202613 -317619 -82006 13510 -145073 12058
1623 12058 502480 66226 -33900 -82999 -25303 -94486 -45337 64524 -144119 -364240 -156830
1612 -156830 -66922 -212142 -159813 -352525 -228277 -231931 -124699 66389 263924 47793
1602 47793 196338 431779 272958 367453 467091 252788 -127549 -86617 188747 418274
1592 418274 203909 285470 149741 -166093 330635 189369 171501 33306 -144799 -156408
1582 -156408 -404285 -564044 -370473 -96735 -137218 -99516 -437396 -469445 -165445 -463207
1572 -463207 -769417 -780637 -158240 -104527 -91340 91937 30276 20097 -384071 -386546 -102385
1561 -102385 -250464 -508382 -186949 201012 -178607 -349808 -260542 35752 79018 77401
1551 77401 192025 25702 -93933 9350 -238732 -135197 13933 -63778 33715 319520
1541 319520 -148420 -315219 54435 58877 60392 218610 11722 -55190 -58005 -10183 197718
1530 197718 7322 -18888 -107234 -68808 -39408 88406 -48214 -405199 -465688 -60623 -2549
1519 -2549 -290885 -217069 -34491 -251635 -201361 -253678 -561090 -57554 195583 817 -228633
1508 -228633 -535956 -292025 -204923 -15427 -2301 -85709 74827 -333685 -462439 -494941
1498 -494941 -274116 -313210 -114579 -139232 -181602 -222682 -218712 -318068 -323757 -155125 -149620 45740
1486 45740 59206 -207731 -549412 -84845 -353822 -329767 -26742 23284 -264685 -93472
1476 -93472 -77608 -46956 -338972 -196211 21573 98104 100311 -128181 -282315 77786 119830
1465 119830 28487 -175850 -176807 160126 10346 121488 142682 50529 17581 -190075 -66445
1454 -66445 43546 -177237 -171895 -70739 -108227 -140544 -174835 -240420 -73401 64214 -165411
1443 -165411 -215147 -274024 -253076 -176773 -213028 38361 -37570 -30138 -194947 2821 44386
1432 44386 96556 4769 -182505 -153552 -434579 -531638 -350142 -253358 -20982 -112776 -257311
1421 -257311 -172590 154303 207660 309647 167814 235463 61264 59160 -145995 -159851 -357009
1410 -357009 -343631 -35551 173674 39945 -159182 -205897 -223807 -328938 -375711 -302875 -322351
1399 -322351 -5723 57993 -59533 -195212 -246532 -224821 -271856 -61107 -60914 -155809 -84496
1388 -84496 79447 188116 -65192 -4174 290159 255372 -107965 -90341 -230759 -144732 -32031
1377 -32031 -320107 -492066 -325472 -148680 -84746 -231445 -441025 -799609 -463607 -81037
1367 -81037 -229258 -127070 -165849 -322794 -217229 -96421 3546 -20586 147659 -338608
1357 -338608 -196324 -39763 -287890 -226450 -175730 -200791 -62623 -154310 183576 238986 -31319
1346 -31319 329365 154432 3201 -215477 -397537 -251517 -151706 -332053 -300081 24629
1336 24629 -102454 -531572 -211926 -297445 -207346 -285520 54086 -58720 -296987 -150602
1326 -150602 -358887 -140992 -146021 -177906 -302301 378091 170904 -24894 15864 125282
1316 125282 -93172 -257949 -31386 7037 134423 -48984 -198140 52678 248950 177032
1306 177032 124800 276063 7017 -97279 -56148 -53941 -178286 -53932 -33903 -54240 -63009
1295 -63009 -238636 -104905 -92162 -95790 -603615 -245960 -44634 -37135 -113235 22885 61940
1284 61940 197577 -49875 -383998 -378914 -261801 -223190 -223055 -196582 -83363 -163318 -54045
1273 -54045 147556 -1494 -150156 -200515 10558 173326 66235 45435 -86491 1227
1263 1227 -169334 -456888 34174 -128913 -53424 -193820 -448378 -244835 -144998 125524
1253 125524 219579 172001 251993 23194 -187408 -210636 100266 -115996 -94883 -156293 -294740
1242 -294740 -254530 29931 16736 -135877 181595 166183 -16288 28915 60580 197733 34276
1231 34276 -366574 -526839 -442068 -337211 -471841 -427945 -145503 -124656 -94489 210423 105240
1220 105240 -36340 144737 267301 33589 -374151 -507737 -315424 -162429 -137829 70783
1210 70783 15943 -244206 -6769 -171655 -206823 -226445 -149713 227475 -78483 -137388 225412
1199 225412 54398 408558 408022 479879 386469 30048 -135111 -122068 -214790 140385 -85166
1188 -85166 -68943 -72219 -78799 27395 -32252 118060 12055 -33273 -45149 -56373 -148964 -216822
1176 -216822 -369227 -250380 -93783 -206762 -18413 240847 -42964 -158049 -363434 -377602
1166 -377602 -582685 -283878 36364 -30949 -207893 -121036 22844 -67317 -345669 -626475
1156 -626475 -494141 -280172 -517715 -383723 -41076 -80949 -116094 -247934 -209424 -134670
1146 -134670 -123731 -4220 52491 -93385 -155146 -158408 -180690 -128893 76398 33278 -37204
1135 -37204 38933 135180 -179753 -90258 137130 -56974 -75746 -1650 213449 63270 -390119
1124 -390119 -415803 2033 177891 1972 -46875 170748 -120129 101371 -19822 10158
1114 10158 210476 328125 391738 346389 34765 -49158 -30053 -149226 58005 53637 -128137
1103 -128137 -127598 -98672 -248360 -146186 -352905 -198406 -59562 -20315 -24446 189894 262226
1092 262226 -40357 -282762 -421309 -400146 -217208 -10009 -17067 296767 318650 78050
1082 78050 252762 453395 326694 448946 386376 191326 133775 36829 93512 19011 -155661
1071 -155661 -17584 93277 -168399 -263966 -70832 -30996 -305805 -291112 -78533 265606
1061 265606 383213 153670 -73237 -64076 -103964 -280675 -188736 -228112 -18366 87057 36513
1050 36513 -134395 -8000 -32262 42502 40248 71249 28451 53307 37346 367317 326747
1039 326747 -83765 62118 289463 25517 69275 -6453 -216536 27511 165335 70034
1029 70034 -203747 149622 -325706 107190 238292 98776 214513 195682 -10848 -298734
1019 -298734 -265141 -182903 92616 86343 -234888 -189666 -249126 -83091 -146725 -244506 70929
1008 70929 417161 504383 470441 65160 324827 -30811 -306427 -236734 -292819 -263231 -545215
997 -545215 -199381 -316702 -363537 -188149 -179681 -147984 -211944 -321116 108762 73791 -342151
986 -342151 -218632 33961 -132325 -205289 -205530 -367090 -179355 12801 -14271 -34527 145378
975 145378 -197675 -234664 -260507 -229016 171899 156686 -179930 -107484 -137614 -41248 25955
964 25955 101919 106507 -70617 -185669 -138857 29766 -172145 -122375 -245418 -187180 -68510
953 -68510 -10734 24879 344532 231870 294094 32737 -77510 -363528 -34707 156412 -2129
942 -2129 237599 204780 154425 -137754 37028 175082 259026 382060 417213 417666 304451
931 304451 16164 -103928 -55367 -202609 -41729 5672 87162 71692 188876 78202 -185401
920 -185401 -77519 -118789 135368 -7089 -220967 -31326 -205957 -111766 -262964 71800
910 71800 264314 137552 -178224 -293596 -415449 -580144 -437589 -329378 194963 40222
900 40222 -31261 -196565 -174986 -59593 14555 -141984 53457 243160 134709 -22014 155648
889 155648 175188 240779 230236 495 -300203 -182826 -1185 -109518 -294393 -624543
879 -624543 -348112 -139064 221654 278673 213576 -2278 -83101 15813 17227 -163204 -25479
868 -25479 -230289 -134783 30177 -9304 -105051 -148758 29927 28143 -117350 -191167 -31157
857 -31157 139995 -18293 134683 514423 179024 -4499 -131992 -275751 -531178 -403998
847 -403998 -19086 33791 43598 256892 52706 132767 7793 125476 406876 122691 -161909
836 -161909 63263 -14319 80651 263968 267704 -29220 -23218 115458 233320 190615 -116199
825 -116199 -45245 52221 155957 -98652 28952 134854 -108980 -325315 -9296 50281
815 50281 102680 -176243 45127 12214 -211300 -72516 182573 5586 -39198 -11717 245204
804 245204 183621 -50317 -123906 -88956 74594 -236152 -263589 -433008 -489855 -397831 -62918
793 -62918 28499 -398719 -545090 -30507 75074 10182 -3196 175956 41068 6383 -26956
782 -26956 171023 168528 3615 69638 146836 -34344 -92729 -144789 -286030 -144385 148461
771 148461 100235 -50310 50440 -232444 -130484 151815 196769 235063 134340 134620 101559
760 101559 241594 207800 -281167 -334747 -91134 63610 316695 412388 -28281 -135727
750 -135727 273455 309172 73967 -157227 25709 291219 179786 27709 -77869 4505
740 4505 206040 168363 56453 -147759 -38717 -168419 -173163 -180549 -86912 204199 -50941
729 -50941 -22923 -125112 -17222 242318 250813 -165309 -31893 -192242 -82805 35933 -140786
718 -140786 20608 -69227 99235 110207 -111519 -174821 -187157 -29931 -55554 -397259 -77131
707 -77131 -112567 33938 -85089 40375 -49671 -377759 -159004 -3762 16282 305217 286293
696 286293 133413 -211363 -145074 -121668 -35204 128767 6839 -4402 -183240 -80637 76099
685 76099 114090 33587 163955 526619 315341 -108355 -221821 -207231 141242 187419 37732
674 37732 -315470 -234889 -268286 -333533 -430504 -122797 -91373 97610 130860 104156 -3937
663 -3937 -45231 -219456 -185317 17494 -12258 -189763 -14259 133487 441065 127608 -69311
652 -69311 -10316 80176 -37898 84183 -194809 -186107 103433 116459 -195361 -471052 -344774
641 -344774 -334430 245248 195154 31224 6457 -25317 178393 215321 395614 668423 141036
630 141036 -393565 -260678 24693 60039 -18797 101532 -5316 -203141 -170172 -195729 -171743
619 -171743 -108161 63268 237562 -227104 -631596 -359878 1043 302869 7628 158914
609 158914 184158 188149 -118209 -124520 -34551 -244906 80561 338493 28842 28859 -216146 -65743
597 -65743 45480 -79200 -245414 -72926 -309589 17960 -217036 -350427 -163444 -234459
587 -234459 -11702 23829 389728 235707 -181160 -45928 32142 -84168 226278 436405
577 436405 250499 160311 45866 186477 291544 194308 364118 224750 95791 7297
567 7297 -44188 43693 -342717 -426089 -504723 -555168 -191930 111649 123700 -90953 -40327
556 -40327 6990 97484 -26469 -81804 -33484 -70678 -119133 6312 178155 238982 294359
545 294359 -12468 -45548 8221 -23209 -60648 -115067 -62445 5409 19150 -30721 391253
534 391253 192558 152456 85270 102499 -139330 -231404 -78446 216324 177552 -104608 -280148
523 -280148 -251423 -38122 86561 -137798 -294203 -137846 -181109 49868 235544 378228
513 378228 345646 202564 46541 267989 70787 -196080 -24718 -192204 2381 197423
503 197423 216939 -36928 -243160 -90050 73927 113608 -3189 104195 247246 -74058
493 -74058 -234403 -180092 -34786 -135892 110118 210967 129067 249721 295068 5783 -54970
482 -54970 154219 21316 -245291 487 -138117 -184256 10606 91375 210020 -263267
472 -263267 136823 102710 195072 -174230 -216933 -31906 58094 38093 -384170 -244152 -160330
461 -160330 -196216 -346969 -88223 -226118 -356755 -18766 244317 -9966 -1290 189052
451 189052 168490 -194940 -112752 -136966 -243273 -98324 -158896 -62910 46821 98214 -305349
440 -305349 -452943 -136400 85099 151764 484096 338371 288355 392895 320592 99341
430 99341 98275 185500 110076 7212 -226229 -240356 -185189 56109 -87001 -177503 12004
419 12004 122004 513709 291919 339792 462547 208236 443884 363846 14857 251831
409 251831 226899 -67534 -267288 -392542 -24358 175499 49108 -136141 -92594 182794
399 182794 299034 6087 23383 -176523 -160633 -378401 -403959 -244271 -231217 -462247 -527345
388 -527345 -217480 -368459 -167715 182572 415311 419171 96300 -66696 173929 212180
378 212180 -91544 33781 462834 170383 69890 -107225 -292445 92944 234492 146982
368 146982 287948 173681 382232 327912 -41966 140498 88328 -120639 -172211 -168898 -55946
357 -55946 164094 -99743 8604 41576 -91987 -447811 -342105 -200517 -256899 31820
347 31820 -45179 -174002 -202593 264688 -35420 -107578 -44466 14341 -10745 -12643 -183753
336 -183753 -421115 -312204 121481 -128241 -155249 -156084 -127289 -100225 -244121 -222001 -78236
325 -78236 32013 -114787 36080 94832 -320699 -170754 10755 -120297 25674 168674
315 168674 73659 93692 195021 88436 84582 -92131 -151672 -194312 -160412 -224383 -200272
304 -200272 123111 267349 71624 98054 103311 -178232 -365320 2132 -46692 88995 104599
293 104599 -31342 13242 32040 180802 311383 266920 480641 486860 437905 471091 516492
282 516492 489955 190566 138229 -200927 -142525 71423 50128 93339 -339012 -435851 -131561
271 -131561 130364 196788 180863 201265 59218 -165689 -200589 -416560 -337387 -246131 -285149
260 -285149 -300538 -77777 -77969 -1362 -37830 -94750 -437311 -312742 -205383 -87285 303759
249 303759 -41842 -82120 183481 -90959 187753 53075 -117890 -299601 -357201 -8942
239 -8942 -274584 -306373 -307450 38902 -253865 -420678 -254723 -145602 463744 272596 -238848
228 -238848 -298346 -164891 -359847 -343535 68806 84140 86983 71945 174367 -243498 -41119
217 -41119 -216909 -472121 -229090 -262509 -365904 -191489 -111009 -222163 -201593 -63065 161118
206 161118 301056 233899 112971 52781 217844 235342 328550 319200 -82099 335829 452168
195 452168 304239 175783 -227661 -490362 -521037 -321882 -104735 176400 194051 259396
185 259396 233431 235813 340806 197028 -24159 30019 -100701 92611 252513 -195022 -39357
174 -39357 88288 139115 65292 3117 -225152 -207992 68896 -36389 36324 142925 79160
163 79160 148956 188243 -274790 -144152 -72926 83740 174457 66589 23084 63789 7394
152 7394 -19864 -156432 -142422 -136732 -14546 5809 337926 211176 103552 190965 6863
141 6863 33691 160442 241755 104937 -76722 -313455 -153565 -70542 -38760 91703 342516
130 342516 54313 -177559 -25534 -109856 -145767 -89176 -36162 -146575 -62526 -7368 146
119 146 84403 45080 29870 -85243 182965 92714 -1730 -32281 73763 177385 197159 95500
107 95500 182673 -130224 -250008 -211930 -405369 -484729 -312424 -178530 -171394 22226 -35879
96 -35879 -153646 -94462 -36929 -232665 21287 -51651 14455 242034 58619 93780 43935
85 43935 -103596 -54806 189654 140164 -52624 -222394 -316519 -304023 -134005 -200137 -68579
74 -68579 75042 -99063 85791 130435 -34838 11489 31407 42144 251917 75583 7461
63 7461 114157 142455 23051 -31959 -61322 -24980 425188 329979 79519 -50490 4607
52 4607 75240 -64425 -6963 186945 -55377 53663 -71644 4833 174603 104689 24442
41 24442 -103943 -254783 -137492 -177692 -138669 -60439 -139228 -98487 -256732 -309332 -66485
30 -66485 37642 52606 -68532 -249951 -173463 57763 -13674 -88438 274125 232161 68857
19 68857 327661 165469 4052 -101128 -141565 76924 182894 220228 248776 59876 98991
8 98991 69338 -27583 -14702 -101427 96129 -43841 -20146 -289546
0 -289546
$$ Imaginary data points
##PAGE= N=2
##DATA TABLE= (X++(I..I)), XYDATA
16383 -3899122 -4122441 -4200617 -4057047 -4105590 -4021520 -3895211 -3782919 -3726088 -3590210 -3520976
16373 -3520976 -3415329 -3363295 -3514911 -3231762 -3190388 -3266191 -3161200 -3028728 -2775106 -2643715
16363 -2643715 -2506207 -2581474 -2825098 -2838607 -2704000 -2545213 -2344254 -2269815 -2582011 -2209742
16353 -2209742 -1766241 -1495437 -1720588 -1872989 -1810358 -1718364 -1469831 -1308886 -1563837 -1361956
16343 -1361956 -1415963 -1210476 -1296535 -1271669 -1353670 -1274146 -1102010 -1043536 -960164 -782216 -827549
16332 -827549 -916784 -622280 -444350 -504177 -361135 -212677 -368585 -241109 -47766 -294243
16322 -294243 -324462 -159541 -364330 -105922 -18425 164641 241659 397126 502039 530130
16312 530130 342307 445876 639356 590490 719878 859052 457225 462753 798533 743177
16302 743177 781663 821167 884268 841161 813700 974231 988203 975127 1161516 1524953 1464939
16291 1464939 1501060 1578007 1534432 1546007 1677657 2059058 2041014 1822200 1738896 1868541
16281 1868541 1720931 1935093 2036138 2171696 2145037 2085185 2011267 2104096 2291005 2335038
16271 2335038 2331953 2282684 2583948 2590048 2604918 2790942 2843068 3015061 2670325 2677689 2909918
16260 2909918 3015253 3350727 3330436 2933259 2988924 3095252 3097428 3168881 3358451 3669798
16250 3669798 3605081 3537661 3392677 3403046 3288577 3371140 3554349 3676368 3678917 3575683
16240 3575683 3742947 3891866 4042026 4088904 4010813 3827448 4030018 4047508 3955433 3478959
16230 3478959 3594639 3826754 3807898 4068691 4140628 4102736 4248821 4184060 4251906 4728925
16220 4728925 4715023 4909956 4908056 4623942 4176523 4345910 4620131 4787924 4836819 4633465
16210 4633465 4458511 4594938 4691850 4792124 4852899 4944569 5006398 4966256 4843297 4751950
16200 4751950 4862154 5332147 5105711 4981728 4872332 4996803 5147375 4853584 4946128 5207910
16190 5207910 5127030 5144996 5369994 5208120 5178876 5346615 4882952 5014687 5002102 4951098
16180 4951098 5011157 5055227 5329158 5370448 5471017 5534870 5494709 5330388 5127616 5118156 5413981
16169 5413981 5470463 5746724 5735235 5576591 5623322 5780130 5621030 5202335 5321585 5564872
16159 5564872 5501987 5268428 5478698 5835849 5970795 5771661 5898810 6106176 6091343 5999423
16149 5999423 5658702 5822538 5754630 5910548 6020453 6069270 6156646 5962683 5576879 5585719
16139 5585719 5666097 5727711 5960058 5995347 5895542 5683011 5868122 6145411 6335921 6405718
16129 6405718 6218946 6266817 6099598 6084089 6330896 6232308 6088017 6312785 6030308 5646342
16119 5646342 5799820 6040478 6297457 6226406 5625574 5787749 5941479 6058890 6196290 6453811
16109 6453811 6308305 6112802 6158762 5964188 6037161 5977351 6028656 5943659 5822358 6041313
16099 6041313 6119662 6041394 6132121 6205488 6287915 6527274 6261363 6076047 6191305 6094594
16089 6094594 6453885 6121338 5923212 5958536 6004874 6193519 6074873 6055056 5764246 6053607
16079 6053607 6001529 5965764 6096948 6235925 6376820 6560080 6440897 6273163 6436024 6601461
16069 6601461 6487818 6165889 6107434 6175804 6075226 5908558 6058499 6352737 6493509 6263844
16059 6263844 6151683 6166815 6508465 6413411 6413270 6542362 6603128 6388619 6551664 6711530
16049 6711530 6622914 6631198 6683958 6587092 6545452 6553007 6618332 6576204 6499244 6191352 6409110
16038 6409110 6336144 6563514 6674720 6366609 6260187 6271066 6529404 6396213 6326190 6131687
16028 6131687 6192578 6326529 6383304 6156892 6538118 6464603 6327081 6232048 6412530 6465825
16018 6465825 6351684 6368802 6386152 6668352 6676243 6473509 6633763 6461225 6361438 6419033
16008 6419033 6423918 6514714 6654571 6710882 6166601 6142387 6284277 6422485 6166141 6347306
15998 6347306 6593865 6476718 6282445 6134760 6369776 6282861 6331119 6668240 6480247 6382405
15988 6382405 6294575 6284989 6057156 6135344 6280854 6217483 6217864 6304434 6332783 6466259 6218006
15977 6218006 6140073 6292172 6199051 6468659 6235383 6496013 6533078 6811250 6342291 6084245
15967 6084245 6402921 6209752 6595395 6468544 6114212 6228981 6426378 6146593 6472786
15958 6472786 6747328 6490908 6306710 6310207 6379863 6072964 6220304 6393728 6523853 6455868
15948 6455868 6487832 6617293 6357228 6335733 6407405 6579691 6534829 6659732 6883764 6842608
15938 6842608 6558161 6268306 6708495 6588932 6218262 6385224 6530529 6432352 6169687 6367173
15928 6367173 6524268 6369986 6362943 6244698 6421258 6717583 6648153 6636999 6400339 6520826
15918 6520826 6463266 6600687 6580929 6483767 6604872 6442386 6349477 6203904 6251379 6613035
15908 6613035 6878725 6737800 6373351 6425972 6517734 6577935 6281322 6499511 6672242 6549227
15898 6549227 6509794 6545610 6687439 6453792 6497537 6540754 6661268 6725929 6273738 6438978
15888 6438978 6341986 6300593 6265570 6152295 6514282 6310695 6794935 6792913 6661136 6604992
15878 6604992 6386928 6484164 6431188 6417193 6584381 6541272 6366992 6029202 6135968 6414081
15868 6414081 6535005 6320482 6435771 6479170 6533327 6348272 6594837 6651487 6537212 6592572
15858 6592572 6745309 6817292 6863667 6865731 6772826 6707283 6669855 6465300 6511282 6627567 6510500
15847 6510500 6493273 6717423 6809292 6609709 6368446 6660200 6995656 6826980 6713956 6428583
15837 6428583 6659130 6745542 6393224 6523681 6746460 6322786 6282058 6569798 6784938 6599742
15827 6599742 6404344 6544630 6730526 7000322 6670162 6052512 6050492 6476337 6630259 6327240
15817 6327240 5979431 6002884 6179185 6121543 6160814 6322699 6644832 6635216 6528598 6621984
15807 6621984 6528458 6275557 6368819 6547994 6890290 6541446 6499519 6453083 6457630 6549954 6498014
15796 6498014 6475546 6322212 6155814 6397429 6633513 6567810 6375591 6444806 6509799 6370394
15786 6370394 6737457 6642355 6506198 6317768 6114563 6310901 6725319 6819722 6714224 6559769
15776 6559769 6756236 6818256 6427113 6516385 6601442 6496863 6451474 6605459 6463928 6427567
15766 6427567 6530854 6712351 6750383 6523405 6414230 6407167 6652173 6714691 6514959 6869183
15756 6869183 6825301 6550445 6603543 6489777 6543379 6396361 6664700 6871061 6776857 6937024
15746 6937024 7064763 6869300 6568431 6616853 6403329 6731083 6605767 6520952 6821383 6761363
15736 6761363 6651495 6654786 6639629 6384294 6354031 6062154 6529054 6749300 6457306 6300693
15726 6300693 6535948 6612466 6682601 7008942 6965596 6530993 6190137 6583436 6423858 6494324
15716 6494324 6663182 6454698 6348481 6668161 6881129 6949033 6886086 6704610 6501496 6757801
15706 6757801 6703920 6474226 6422186 6421815 6677879 6359840 6243555 6361238 6448703 6628016
15696 6628016 6673276 6750106 6688788 6872760 6817954 6642815 6725082 6616418 6658492 6856754
15686 6856754 6953567 6802445 6478280 6344409 6610697 6784967 6929005 6578653 6651203 6814375
15676 6814375 6561297 6504581 6871099 6909837 6819496 6835722 6785594 6661368 6845024 6539469
15666 6539469 6286910 6461449 6680274 6892845 6824186 6597723 6729440 6986766 6753721 6406914
15656 6406914 6328604 6415876 6429527 6470113 6614591 6661664 6556705 6342018 6098379 6250187
15646 6250187 6664980 6778243 6845257 6645994 7090034 6851825 6780552 6842196 6798602 6642996
15636 6642996 6284529 6121779 6416299 6329446 6699731 6773387 6620160 6594088 6338953 6714690
15626 6714690 6986090 6776093 6668628 6786843 6749167 6992242 6980774 6448698 6315449 6625900
15616 6625900 6619749 6412630 6425918 6510258 6619289 7071687 6708745 6508344 6693720 6924728
15606 6924728 6926634 6852796 6726503 6680793 6574551 6739769 6760530 6567889 6560012 6805043 6442184
15595 6442184 6489493 6401442 6356000 6255381 6513702 6752294 6624917 6726227 6669039 6355677
15585 6355677 6319672 6630358 6639940 6842247 6663517 6660070 6957014 7146472 6742181 6682598
15575 6682598 7083364 6850713 6803149 6627595 6729442 6872130 6736393 6592049 6997013 6883216
15565 6883216 6661204 6582074 6864166 6813750 6732737 6440129 6678874 6600207 6700208 6627039
15555 6627039 6374875 6570361 6458546 6403657 6558345 6786829 6762083 6739783 6594120 6643654
15545 6643654 6656390 6806885 6735902 7030991 6996143 6575823 6554384 6731445 6914220 6630937
15535 6630937 6375214 6523385 6595483 6738914 6686227 6290449 6253566 6522011 6700608 6837025
15525 6837025 6496807 6741734 6873237 6924629 6729616 6587445 6634585 6754017 6820615 6840914
15515 6840914 6810081 6630195 6479030 6609751 6665872 6543809 6543880 6861528 6994057 7001439 6844205
15504 6844205 6631691 6535899 6687268 6883405 6765485 6708770 6983425 6730943 6668656 6852207
15494 6852207 7037482 7137756 6918803 6862257 6689732 6467855 6492112 6418716 6337657 6810308
15484 6810308 6865412 6561624 6509743 6642806 7012247 6923093 6671415 6852898 6802790 6671747
15474 6671747 6735693 7039550 7034390 6783129 6723502 6725814 6762084 6724616 7043349 7152322 7048156
15463 7048156 6983280 6714861 6762677 6856614 6992795 6918684 6932661 7074742 6998991 6797494
15453 6797494 6799242 6679073 6710044 6848969 7045533 7325119 7172186 6679645 6556542 6521023
15443 6521023 6628464 6641392 6574147 6513585 6532393 6873730 6819463 6867888 7061563 7100403 6896769
15432 6896769 7010183 6748235 7034377 7060202 6908629 7105024 6817741 6619143 6692756 6584308
15422 6584308 6692115 6891073 6706244 6716513 6751584 6471704 6740831 6641878 6348631 6260579
15412 6260579 6437664 6756659 7167146 7347344 7166117 7024271 6992667 6683418 6870137 6905934
15402 6905934 6984410 6907447 6606614 6499348 6856591 6859220 6795613 7084825 6806312 6854972
15392 6854972 7035499 6978790 6608936 6551725 6813496 7017957 6722756 7175501 6849071 6877110
15382 6877110 6840308 6977239 6971306 6587903 6763825 6957828 6675968 6197676 6597866 6682861
15372 6682861 6720741 6832410 6792593 6940994 6748153 6829380 6882000 6816908 6859200 7005546
15362 7005546 6693146 6635099 6578550 6541241 6585659 6582049 6670655 6931164 7057409 7136178 7102225
15351 7102225 6974051 7186763 7197886 6811001 6433333 6510193 6870436 6575419 6446232 6661418
15341 6661418 6992049 6927162 6949029 6990646 7044539 6938091 7038028 6820906 6651834 6730837
15331 6730837 6994318 6994911 6878522 6752650 6665230 6807534 6821363 6913053 7332595 7303138 7021229
15320 7021229 6869933 6457911 6582752 6941477 7309900 7099881 6787648 6499466 6723469
15311 6723469 6890837 7045631 7013225 7067703 6905050 6830490 6526762 6729183 7102254 6647843
15301 6647843 6424086 6490693 6795717 6682269 6701990 6697393 6335479 6478657 6722356 6571389
15291 6571389 6273440 6788008 6984144 7012389 6984047 6972892 6673300 6794784 6876349 6881697
15281 6881697 6757880 6774270 6502475 6635105 6813324 6809931 6648793 6966157 7068425 6807301
15271 6807301 7283441 7157009 6850445 6899056 6957393 6797589 6870131 7110908 6624375 6817443
15261 6817443 7033060 6905559 7148385 7078457 7071751 6924416 7015014 6937274 6728416 6733330 6811711
15250 6811711 6731216 6735829 6771266 6653199 6768531 7054633 7139094 7242699 7278016 7235857 6738296
15239 6738296 6681168 6904984 6742764 6850825 7125136 7140120 6866867 6922594 7078044 7091701
15229 7091701 7208448 7054144 7020098 7177178 7133571 7000249 6984518 6972598 7299680 7351093
15219 7351093 7335314 7252082 7498718 7239329 6821611 6935225 7052639 7048600 6956072 6962645 6767127
15208 6767127 6924757 6800895 6880425 7026307 7207971 7033604 6963840 6900509 6968759 6966802
15198 6966802 6684395 7099491 7148232 6903439 6591947 6894367 7224810 6965764 6833188 6885760
15188 6885760 6823982 6925009 6862723 6706375 7228001 7154570 7034405 7208316 6968871 6726384
15178 6726384 6521840 6743851 7132387 7227005 7107562 7016736 7083550 7036810 7012777 7064478
15168 7064478 6986651 7175377 7027190 7143936 7177271 7101741 6875436 6793899 6832735 7078731
15158 7078731 7087913 6821227 6849053 6862440 6900030 6856642 6753830 6921972 6991488 6681284 6829672
15147 6829672 6894484 6811967 6907079 6953069 7118607 6946258 6944404 6918352 6934741 6625703 6647041
15136 6647041 7099061 7436580 7131621 6963954 6772220 6463906 6574182 6841213 7029903
15127 7029903 6945134 6847806 6793964 6887532 6967355 6827825 6742027 7468540 7391462 7186542 7053556
15116 7053556 7361259 7370764 7333625 7391679 7178243 7379718 7095655 6953919 6776306 6949307
15106 6949307 6983307 6878401 7040276 6928181 6801808 6636251 7076390 7165653 6885699 6921533
15096 6921533 6833828 6763208 7009341 7231358 7054006 6749371 6565083 6894667 7153619 6609411
15086 6609411 6775148 7016449 6988058 7309248 6953435 7125527 7188033 6844105 7111809 6942098
15076 6942098 7071467 7011284 7088152 7157066 7232810 6853983 6875880 6809545 6801234 6713742 6714889
15065 6714889 7138621 7391281 7288639 7054085 6970583 6946277 7172953 6948021 6919141 6867138
15055 6867138 6816383 6798696 6792937 7272062 7216600 6932757 7256661 7259700 6967793 6650883 6632431
15044 6632431 7010197 6872266 6761836 6959928 6855396 6717861 6787765 6899992 6957183 7033304
15034 7033304 6884567 6864471 6952958 7345194 7172966 6936555 7100228 7212232 7132591 6778865
15024 6778865 6925013 7167171 7114142 7112593 7118918 7265897 7231356 7078800 6912989 6787059
15014 6787059 7068314 7125453 7181135 7294894 7271845 6991682 6877369 7012405 7074425 7554850
15004 7554850 7503949 7200311 7126259 6993771 7345077 7181512 6856300 7341977 7285655 7309805
14994 7309805 7396216 7168791 7027073 7199995 7212300 7221772 7020824 7141328 7375583 7480854
14984 7480854 7505173 7255591 7172128 7038801 6846249 6944104 7025830 7033960 7142334 7190797 7347330
14973 7347330 7460247 7128053 7071589 7197650 6990689 6937893 7161887 7038555 7022639 7226092
14963 7226092 6879276 6651358 7027954 7235711 7183441 7082448 7085069 7107681 6981155 7107442
14953 7107442 7130814 6900067 6973325 7084267 7124982 7314944 7348827 7152917 7108387 7309797
14943 7309797 7003465 6822399 6518831 6678453 7268598 6985808 6951970 6789954 6728597 7003838
14933 7003838 7051607 7326638 6968257 6942442 7034899 6935749 7214628 7173917 7385257 7558226
14923 7558226 7698331 7521238 7335004 7194241 7100495 7245342 7403368 7308394 7035846 7254673
14913 7254673 7365989 7303692 7207596 7407014 7228739 7225817 7108971 7026898 7245647 7163900
14903 7163900 7163882 7181200 7197343 7258742 7055325 7179805 7306962 7180780 6789255 7114113 7331368
14892 7331368 7135544 7018867 7109739 7184595 7137271 7145101 7095927 7194128 7125266 7252849 7376023
14881 7376023 7367825 7587113 7391877 7261329 7119076 7109705 7139830 7065155 7328832 7195125
14871 7195125 7232619 7246672 6978849 7066750 7182088 7320154 7304832 7463631 7247548 7017302
14861 7017302 7324151 7617709 7615915 7338232 7165869 7082845 7632236 7523550 7165209 6972302
14851 6972302 7332174 7196977 7040025 6965236 7110963 6938467 6689375 6950715 6958460 7133807
14841 7133807 7217261 7134492 7035860 7056612 7261687 7279312 7247053 7068782 6887763 6915175 7323943
14830 7323943 7682771 7375061 7152991 7339157 7413944 7104104 7241619 7169724 6811828 6871209
$$ [...]
##END NTUPLES=NMR SPECTRUM
##END=
