##TITLE=1H_CA-9060-2
 CDCl3
 8 sc, 
 26.09.2022
##JCAMPDX= 6.0         $$ Bruker NMR JCAMP-DX V2.0
##DATA TYPE= NMR SPECTRUM
##DATA CLASS= NTUPLES
##ORIGIN= UXNMR, Bruker Analytische Messtechnik GmbH
##OWNER= root
$$ XWIN-NMR		Version 3.5
$$ Mon Sep 26 14:39:00 2022 Russian Standard Time (UT+4h)  she@DPX200
##.OBSERVE FREQUENCY= 200.1313499994
##.OBSERVE NUCLEUS= ^1H
##.ACQUISITION MODE= SIMULTANEOUS
##.ACQUISITION SCHEME= undefined
##.AVERAGES= 8
##.DIGITISER RES= 18
##SPECTROMETER/DATA SYSTEM= spect
##.PULSE SEQUENCE= zg30
##.SOLVENT NAME= CDCl3
##.SHIFT REFERENCE= (INTERNAL, CDCl3, 0, 15.748)
##AUDIT TRAIL= $$ (NUMBER, WHEN, WHO, WHERE, WHAT)
$$ ##TITLE= Audit trail, XWIN-NMR		Version 3.5
$$ ##JCAMPDX= 5.01
$$ ##ORIGIN= Bruker BioSpin GmbH
$$ ##OWNER= she
$$ F:/spectra/data/she/nmr/H-F/1/pdata/1/auditp.txt
$$ ##AUDIT TRAIL=  $$ (NUMBER, WHEN, WHO, WHERE, WHAT)
(   1,<2022-09-26 14:37:47.46 +0400>,<she>,<DPX200>,
      <created by zg, POWCHK disabled, PULCHK disabled
       configuration hash MD5:
       00 E9 B6 7A A2 85 ED C7 34 08 36 98 17 FE 4E 26
       data hash MD5: 16K
       75 96 C5 03 0E D9 09 9F 7C EE 53 5D 37 E6 5C 90>)
(   2,<2022-09-26 14:37:56.96 +0400>,<she>,<DPX200>,
      <Start of raw data processing
       efp BC_mod = 2 LB = 0.24 FT_mod = 6 PKNL = 1 PHC0 = -18031.42 PHC1 = 11.80069 SI = 16K 
       data hash MD5: 16K
       1D 36 2E 60 78 16 71 86 A9 DB B8 44 59 DD 34 F4>)
(   3,<2022-09-26 14:38:17.03 +0400>,<she>,<DPX200>,
      <pk PHC0 = -4.264861 PHC1 = 5.8 
       data hash MD5: 16K
       ED 48 47 BD 8B 85 84 BB 10 EB C4 C8 51 62 CB 3A>)
(   4,<2022-09-26 14:38:20.87 +0400>,<she>,<DPX200>,
      <abs ABSG = 5 
       data hash MD5: 16K
       08 20 2E 2C 8A BB C5 55 B3 34 A6 C1 F0 6A F0 39>)
$$ ##END=
$$ 
$$ hash MD5
$$ CF 87 05 24 F8 12 B3 6C AA 45 CA 0A 23 C7 8F A1
##$RELAX= 
##$RELAX= 
##$RELAX= 
##$RELAX= 
##$RELAX= 
##$RELAX= 
$$ Bruker specific parameters
$$ --------------------------
##$DU= <F:/spectra>
##$EXPNO= 1
##$NAME= <H-F>
##$PROCNO= 1
##$TYPE= <nmr>
##$USER= <she>
##$AMP= (0..31)
100 100 100 100 100 100 100 100 100 100 100 100 100 100 100 100 100 100 
100 100 100 100 100 100 100 100 100 100 100 100 100 100 
##$AQSEQ= 0
##$AQ_mod= 1
##$AUNM= <au_zg>
##$AUTOPOS= <>
##$BF1= 200.13
##$BF2= 200.13
##$BF3= 200.13
##$BF4= 200.13
##$BF5= 200.13
##$BF6= 200.13
##$BF7= 200.13
##$BF8= 200.13
##$BYTORDA= 1
##$CFDGTYP= 0
##$CFRGTYP= 5
##$CHEMSTR= <none>
##$CNST= (0..31)
1 1 145 1 1 1 1 1 1 1 1 1 1 1 1 1 1 1 1 1 1 1 1 1 1 1 1 1 1 1 1 1 
##$CPDPRG= <>
##$CPDPRG1= <>
##$CPDPRG2= <>
##$CPDPRG3= <>
##$CPDPRG4= <mlev>
##$CPDPRG5= <mlev>
##$CPDPRG6= <mlev>
##$CPDPRG7= <mlev>
##$CPDPRG8= <mlev>
##$CPDPRGB= <>
##$CPDPRGT= <>
##$D= (0..31)
0 1.2 0 0 0 0 0 0 0 0.06 0 0.03 0 0 0 0 0.0002 0 0 0 0 0 0 0 0 0 0 0 0 
0 0 0 
##$DATE= 1664188666
##$DBL= (0..7)
120 120 120 120 120 120 120 120 
##$DBP= (0..7)
150 150 150 150 150 150 150 150 
##$DBP07= 0
##$DBPNAM0= <>
##$DBPNAM1= <>
##$DBPNAM2= <>
##$DBPNAM3= <>
##$DBPNAM4= <>
$$ [...]
##$SUBNAM3= <"">
##$SUBNAM4= <"">
##$SUBNAM5= <"">
##$SUBNAM6= <"">
##$SUBNAM7= <"">
##$SUBNAM8= <"">
##$SUBNAM9= <"">
##$SW= 18.0517283424941
##$SWIBOX= (0..15)
0 0 2 0 0 0 0 0 0 0 0 0 0 0 0 0 
##$SW_h= 3612.71676300578
##$TD= 16384
##$TD0= 1
##$TE= 0
##$TE2= 300
##$TE3= 300
##$TEG= 300
##$TL= (0..7)
0 120 120 120 120 120 120 120 
##$TP= (0..7)
150 150 150 150 150 150 150 150 
##$TP07= 0
##$TPNAME0= <>
##$TPNAME1= <>
##$TPNAME2= <>
##$TPNAME3= <>
##$TPNAME4= <>
##$TPNAME5= <>
##$TPNAME6= <>
##$TPNAME7= <>
##$TPOAL= (0..7)
0.5 0.5 0.5 0.5 0.5 0.5 0.5 0.5 
##$TPOFFS= (0..7)
0 0 0 0 0 0 0 0 
##$TUNHIN= 0
##$TUNHOUT= 0
##$TUNXOUT= 0
##$USERA1= <user>
##$USERA2= <user>
##$USERA3= <user>
##$USERA4= <user>
##$USERA5= <user>
##$V9= 5
##$VALIST= <valist>
##$VCLIST= <CCCCCCCCCCCCCCC>
##$VD= 0
##$VDLIST= <DDDDDDDDDDDDDDD>
##$VPLIST= <PPPPPPPPPPPPPPP>
##$VTLIST= <TTTTTTTTTTTTTTT>
##$WBST= 1024
##$WBSW= 4
##$XGAIN= (0..3)
0 0 0 0 
##$XL= 0
##$YL= 0
##$YMAX_a= 426033
##$YMIN_a= -729907
##$ZGOPTNS= <>
##$ZL1= 120
##$ZL2= 120
##$ZL3= 120
##$ZL4= 120
##$ABSF1= 15.74028
##$ABSF2= -2.311569
##$ABSG= 5
##$ABSL= 3
##$ALPHA= 0
##$AQORDER= 0
##$ASSFAC= 0
##$ASSFACI= 0
##$ASSFACX= 0
##$ASSWID= 0
##$AUNMP= <proc_1d>
##$AZFE= 0.1
##$AZFW= 0.1
##$BCFW= 0
##$BC_mod= 2
##$BYTORDP= 0
##$COROFFS= 0
##$CY= -3
##$DATMOD= 1
##$DC= 0
##$DFILT= <>
##$DTYPP= 0
##$F1P= 0
##$F2P= 0
##$FCOR= 1
##$FTSIZE= 16384
##$FT_mod= 6
##$GAMMA= 0
##$GB= 0
##$INTBC= 1
##$INTSCL= 3.70164e-10
##$ISEN= 128
##$LB= 0.24
##$LEV0= 0
##$LPBIN= 0
##$MAXI= 10000
##$MC2= 0
##$MEAN= 0
##$ME_mod= 0
##$MI= 1.114404
##$NCOEF= 0
##$NC_proc= -6
##$NLEV= 6
##$NOISF1= 3.799351
##$NOISF2= 2.8
##$NSP= 0
##$NTH_PI= 0
##$NZP= 0
##$OFFSET= 15.74799
##$PC= 1
##$PHC0= -18035.69
##$PHC1= 17.60069
##$PH_mod= 1
##$PKNL= yes
##$PPARMOD= 0
##$PSCAL= 0
##$PSIGN= 0
##$REVERSE= no
##$SF= 200.130004712062
##$SI= 16384
##$SIGF1= 3
##$SIGF2= 2
##$SINO= 5.538805
##$SIOLD= 16384
##$SREGLST= <1H.CDCl3>
##$SSB= 0
##$STSI= 16384
##$STSR= 0
##$SW_p= 3612.71676300578
##$SYMM= 0
##$S_DEV= 0
##$TDeff= 16384
##$TDoff= 0
##$TI= <>
##$TILT= no
##$TM1= 0
##$TM2= 0
##$TOPLEV= 0
##$USERP1= <user>
##$USERP2= <user>
##$USERP3= <user>
##$USERP4= <user>
##$USERP5= <user>
##$WDW= 1
##$XDIM= 16384
##$YMAX_p= 275944326
##$YMIN_p= -410774
$$ End of Bruker specific parameters
$$ ---------------------------------
##NTUPLES= NMR SPECTRUM
##VAR_NAME=  FREQUENCY,     SPECTRUM/REAL,   SPECTRUM/IMAG
##SYMBOL=    X,             R,               I
##VAR_TYPE=  INDEPENDENT,   DEPENDENT,       DEPENDENT
##VAR_FORM=  AFFN,          ASDF,            ASDF
##VAR_DIM=   16384,         16384,           16384
##UNITS=     HZ,            ARBITRARY UNITS, ARBITRARY UNITS
##FACTOR=    0.220516191357247, 1,           1
##FIRST=     3151.6452437688, 0,             0
##LAST=      -461.071519236983, 0,           0
##MIN=       -461.071519236983, -410774,     0
##MAX=       3151.6452437688, 275944326,     0
$$ Real data points
##PAGE= N=1
##DATA TABLE= (X++(R..R)), XYDATA
$$ [...]
$$ plain form
6326 4919720 4899843 4795466 4723986 4394892 4206124 3936343 3869567 3778783 3588773 3472905
6316 3472905 3264367 3097549 3164079 3275946 3255179 3129709 2999855 3072085 3079277 3110878 3016476
6305 3016476 2885158 2911358 2938496 2952127 3089089 2923988 2977921 2931618 2774823 2797283 2816387
6294 2816387 2875038 3025221 2968922 3025223 3058565 3009483 3074048 3072374 3162264 3147213 3157088 3606268
6282 3606268 3730077 3804198 3719362 3605359 3560928 3676432 3670531 3495218 3407325 3416600 3316109
6271 3316109 3390900 3366957 3355815 3468920 3328029 3366084 3377859 3418682 3527764 3471115 3346099
6260 3346099 3419153 3364276 3484250 3611493 3542765 3685255 3782959 3727666 3552040 3808851
6250 3808851 3949290 3912833 3830600 3746060 3705124 3813621 3922472 3896904 4098146 4079676 4127230
$$ packed form
6326D919720j9877j04377p1480l29094j88768k69781o6776r0784j90010j15868
6316C472905k08538j66818O6530J11867k0767j25470j29854P2230P192L1601r4402
6305C016476j31318K6200K7138J3631J36962j65101N3933m6303j56795K2460J9104
6294B816387N8651J50183n6299N6301L3342m9082O4565j674Q9890j5051R875M49180
6282C606268J23809P4121q4836j14003m4431J15504n901j75313q7893R275j00491
6271C316109P4791k3943j1142J13105j40891L8055J1775M0823J09082n6649j25016
6260C346099P3054n4877J19974J27243o8728J42490R7704n5293j75626K56811
6250C808851J40439l6457q2233q4540m0936J08497J08851k5568K01242j8470M7554
$$ plain form
6239 4127230 4175500 4271035 4250328 4328089 4405603 4513640 4605393 4651712 4692515 4636671 4755589
6228 4755589 4981352 5250691 5416154 5616420 5749373 5989854 6344575 6697278 6717153 6616765
6218 6616765 6604383 6285275 6020078 5888447 5939728 5803143 5847753 5917370 5985281 6004390 5966347
6207 5966347 6040542 6286952 6337573 6489198 6735333 7030763 7321764 7695710 8121728 8487165
6197 8487165 8932902 9672960 10441014 11576322 12680090 13651397 14240818 14085810 13482157
6188 13482157 12391441 11312763 10449720 9804766 9238162 8699989 8485621 8430950 8256835
6179 8256835 8197385 8373082 8500016 8486307 8545342 8703034 9082820 9501313 9795286 10309871
6169 10309871 10994997 11871766 12809021 14083148 15608774 17323837 19172852 20521126 20711696
$$ packed form
6239D127230M8270R5535k0707P7761P7514J08037R1753M6319M0803n5844J18918
6228D755589K25763K69339J65463K00266J32953K40481L54721L52703J9875j00388
6218F616765j2382l19108k65197j31631N1281j36585M4610O9617O7911J9109l8043
6207E966347P4195K46410N0621J51625K46135K95430K91001L73946M26018L65437
6197H487165M45737P40058P68054J135308J103768R71307N89421j55008o03653
6188A3482157j090716j078678q63043o44954n66604n38173k14368n4671j74115
6179H256835n9450J75697J26934j3709N9035J57692L79786M18493K93973N14585
6169A0309871O85126Q76769R37255J274127J525626J715063J849015J348274J90570
$$ plain form
6160 20711696 19648635 17934695 15850698 14133594 12913065 11924351 11175346 10536302 10084092
6151 10084092 9803959 9575933 9408090 9232748 9301435 9279594 9122180 9236611 9419422 9583181
6141 9583181 9928160 10101978 10558668 11173154 11776132 12594659 13805821 14994149 16064105
6132 16064105 16682829 16525376 15471562 14025692 12522902 11324315 10397792 9822492 9355986
6123 9355986 8868081 8544704 8190641 7943842 7796613 7623278 7801602 7620953 7634825 7620709
6113 7620709 7537631 7429753 7406156 7582504 7812866 7990186 8064594 8313562 8716680 8938500
6103 8938500 9152874 9314425 9072536 8738239 8358864 7861407 7399913 7265560 7064080 6996905
6093 6996905 7063662 6915456 6653413 6629153 6575257 6380372 6484236 6694296 6600719 6592844 6545289
$$ packed form
6160B0711696j063061j713940k083997j717104j220529r88714p49005o39044m52210
6151A0084092k80133k28026j67843j75342O8687k1841j57414J14431J82811J63759
6141I583181L44979J73818M56690O14486O02978Q18527J211162J188328J069956
6132A6064105O18724j57453j053814j445870j502790j198587r26523n75300m66506
6123I355986m87905l23377l54063k46799j47229j73335J78324j80649J3872j4116
6113G620709q3078j07878k3597J76348K30362J77320P4408K48968M03118K21820
6103H938500K14374J61551k41889l34297l79375m97457m61494j34353k01480o7175
6093F996905O6757j48206k62043k4260n3896j94885J03864K10060r3577p875m7555
$$ plain form
6082 6545289 6775941 6628739 6598699 6547577 6715355 6724602 6675717 6623279 6621220 6653217 6740940
6071 6740940 6822759 6875885 6764029 6797420 6903610 6840737 6771865 6703549 6720585 6677528 6781941
6060 6781941 6768486 6823780 6740094 6756368 6787645 6861929 7021052 6933590 6976436 7042955 7049196
6049 7049196 7164583 7185340 7064510 7193706 7168068 7112014 7050411 7182969 7362335 7388834
6039 7388834 7381759 7409252 7533317 7603424 7795367 7613452 7628689 7677417 7759992 7953924 8023279
6028 8023279 7857124 7962526 8013964 7791834 7697013 7890866 7930664 8025779 8155294 8095518
6018 8095518 8253616 8215474 8196075 8149792 8227330 8456479 8385580 8398085 8392236 8556211 8687526
6007 8687526 8529709 8524742 8658268 8687375 8720106 8805859 8961649 8969739 8958314 9047856 9019537
$$ packed form
6082F545289K30652j47202l0040n1122J67778R247m8885n2438k059L1997Q7723
6071F740940Q1819N3126j11856L3391J06190o2873o8872o8316J7036m3057J04413
6060F781941j3455N5294q3686J6274L1277P4284J59123q7462M2846O6519O241
6049G049196J15387K0757j20830J29196k5638n6054o1603J32558J79366K6499
6039G388834p075K7493J24065P0107J91943j81915J5237M8728Q2575J93932O9355
6028H023279j66155J05402N1438k22130r4821J93853L9798R5115J29515n9776
6018H095518J58098l8142j9399m6283P7538K29149p0899J2505n849J63975J31315
6007H687526j57817m967J33526K9107L2731Q5753J55790Q090j1425Q9542k8319
$$ plain form
5996 9019537 9141472 9104209 9116523 9153846 9057089 9104403 9155425 9390735 9433006 9397145 9332345
5985 9332345 9288231 9258621 9485080 9622214 9589240 9560977 9617094 9739335 9864933 9930221 9961321
5974 9961321 10072665 10129739 10281905 10366963 10437588 10476470 10631416 10634162 10612145 10781937 10728589
5963 10728589 10707045 10628102 10683098 10814962 10879338 11010092 10872469 10786321 10999045 11129972
5953 11129972 11004172 10969580 11119519 11121146 11149037 11255174 11266747 11384818 11443435 11490695 11418053
5942 11418053 11641748 11795604 11828981 11785113 11838136 12037127 11873632 11914356 11996085 12068566
5932 12068566 12184502 12191408 12192113 12220234 12417618 12521587 12484557 12494140 12656306 12772824 12733943
5921 12733943 12687431 12803340 12708282 12870536 12987571 13182377 13238436 13265191 13330986 13313843
$$ packed form
5996I019537J21935l7263J2314L7323r6757M7314N1022K35310M2271l5861o4800
5985I332345m4114k9610K26459J37134l2974k8263N6117J22241J25598O5288L1100
5974I961321J11344N7074J52166Q5058P0625L8882J54946K746k2017J69792n3348
5963A0728589k1544p8943N4996J31864O4376J30754j37623q6148K12724J30927
5953A1129972j25800l4592J49939J627K7891J06137J1573J18071N8617M7260p2642
5942A1418053K23695J53856L3377m3868N3023J98991j63495M0724Q1729P2481
5932A2068566J15936O906P05K8121J97384J03969l7030R583J62166J16518l8881
5921A2733943m6512J15909r5058J62254J17035J94806N6059K6755O5795j7143
$$ plain form
5911 13313843 13163561 13142999 13443534 13541245 13650137 13700748 13644249 13651479 13702002 13818257 13793355
5900 13793355 13889702 13831108 13817985 14047497 13940616 14009666 14137868 14093930 14103355 14077730 14125449
5889 14125449 14175934 14143271 14173825 14119844 14194394 14267274 14107676 14357756 14417633 14525753 14544451
5878 14544451 14550809 14486783 14410458 14476956 14570232 14581998 14578685 14825830 14762577 14742231 14688893
5867 14688893 14694880 14597048 14599443 14737633 14782508 14807195 14884206 14991943 15049778 15066268 15085127
5856 15085127 14944263 15058920 15117659 15030532 14959917 15075896 15205563 15268395 15367548 15442757
5846 15442757 15482876 15621252 15776926 15750602 15725459 15820614 15598367 15459901 15462916 15302317
5836 15302317 15264371 15444108 15551980 15519500 15477145 15480663 15449150 15577107 15632176 15800259 15868354
$$ packed form
5911A3313843j50282k0562L00535R7711J08892N0611n6499P230N0523J16255k4902
5900A3793355R6347n8594j3123K29512j06881O9050J28202m3938R425k5625M7719
5889A4125449N0485l2663L0554n3981P4550P2880j59598K50080N9877J08120J8698
5878A4544451O358o4026p6325O6498R3276J1766l313K47145o3253k0346n3338
5867A4688893N987r7832K395J38190M4875K4687P7011J07737N7835J6490J8859
5856A5085127j40864J14657N8739q7127p0615J15979J29667O2832R9153P5209
5846A5442757M0119J38376J55674k6324k5143R5155k22247j38466L015j60599
5836A5302317l7946J79737J07872l2480m2355L518l1513J27957N5069J68083O8095
$$ plain form
5825 15868354 16065512 16174410 16487325 16663485 17086980 17407394 17735711 18033245 17867602
5816 17867602 17405765 16984129 16561846 16300359 16229392 16100771 16129961 15978108 16045360 16077056
5806 16077056 16011813 16100957 16242287 16392462 16514239 16780397 17182039 17346427 17689348 18227069
5796 18227069 18816990 19161044 19333002 19086568 18591064 17794531 16984654 16541973 16119631
5787 16119631 15775600 15607718 15399134 15377109 15225432 15288078 15366826 15238375 15250674 15351372
5777 15351372 15608072 15822703 16228935 16535560 16654810 17037519 17365507 17299473 17021212 16678033
5767 16678033 16216566 15680264 15145160 14673463 14480837 14224546 13860741 13683315 13621228 13496225
5757 13496225 13372574 13347314 13193402 13057780 13032102 13182744 13170737 13216323 13195560 13343930
$$ packed form
5825A5868354J97158J08898L12915J76160M23495L20414L28317K97534j65643
5816A7867602m61837m21636m22283k61487p0967j28621K9190j51853O7252L1696
5806A6077056o5243Q9144J41330J50175J21777K66158M01642J64388L42921N37721
5796A8227069N89921L44054J71958k46434m95504p96533q09877m42681m22342
5787A6119631l44031j67882k08584k2025j51677O2646P8748j28451J2299J00698
5777A5351372K56700K14631M06232L06625J19250L82709L27988o6034k78261l43179
5767A6678033m61467n36302n35104m71697j92626k56291l63805j77426o2087j25003
5757A3496225j23651k5260j53912j35622k5678J50642j2007M5586k0763J48370
$$ plain form
5747 13343930 13367719 13239202 13240568 13097737 12814328 12604870 12336541 12412396 12300294 12043917
5737 12043917 12006268 12109926 12020783 11849395 11862992 11898476 11849023 11880102 11869797 12013385 12060524
5726 12060524 11975577 11976778 12112901 12193423 12035169 12082602 12229782 12244999 12244398 12150158 12069891
5715 12069891 11948806 11695110 11609712 11493359 11210252 11039513 10941781 10982078 11029156 10932654
5705 10932654 10747758 10628224 10649404 10811821 10734252 10446995 10474759 10462061 10312392 10203580
5695 10203580 10266697 10238848 10284124 10268578 10186934 10159896 10101669 10012133 10150164 10066534 10103781
5684 10103781 10038686 10019664 10079062 10102184 10196589 10150607 10180112 10142835 10033047 10192410 10298133
5673 10298133 10322757 10363290 10274947 10255075 10428942 10312468 10194284 10396024 10534851 10629391
$$ packed form
5747A3343930K3789j28517J366j42831k83409k09458k68329P5855j12102k56377
5737A2043917l7649J03658q9143j71388J3597L5484m9453L1079j0305J43588M7139
5726A2060524q4947J201J36123Q0522j58254M7433J47180J5217o01r4240q0267
5715A2069891j21085k53696q5398j16353k83107j70739r7732M0297M7078r6502
5705A0932654j84896j19534K1180J62417p7569k87257K7764j2698j49669j08812
5695A0203580O3117k7849M5276j5546q1644k7038n8227q9536J38031q3630L7247
5684A0103781o5095j9022N9398K3122R4405m5982K9505l7277j09788J59363J05723
5673A0298133K4624M0533q8343j9872J73867j16474j18184K01740J38827R4540
$$ plain form
5663 10629391 10829536 10759880 10762761 10939636 10928562 10984229 11064587 11135410 11210930 11313763 11407368
5652 11407368 11544761 11660602 11696852 11689156 11891165 11982938 12226498 12335397 12477402 12711035
5642 12711035 12730715 12962823 13105769 13294518 13660586 13837473 14036720 14556937 15005317 15474767
5632 15474767 16077746 16545729 17016223 17402204 17622903 17771688 17911538 17963612 17902509 18152430
5622 18152430 18507419 18870342 19208605 19659288 20395427 21283189 22323173 23174237 23974487
5613 23974487 24994203 25793303 26451800 27079632 27722381 28260076 28879368 29229428 29488077
5604 29488077 29611623 29689754 29417727 29216213 29073103 29282691 29746080 30540267 31520475 32820818
5594 32820818 34236766 36042386 37700994 39270908 40434172 41377010 42142075 42163009 42247395
$$ packed form
5663A0629391K00145o9656K881J76875j1074N5667Q0358P0823P5520J02833R3605
5652A1407368J37393J15841L6250p696K02009R1773K43560J08899J42005K33633
5642A2711035J9680K32108J42946J88749L66068J76887J99247N20217M48380M69450
5632A5474767O02979M67983M70494L85981K20699J48785J39850N2074o1103K49921
5622A8152430L54989L62923L38263M50683P36139Q87762J039984Q51064Q00250
5613B3974487J019716P99100O58497O27832O42749N37695O19292L50060K58649
5604B9488077J23546P8131k72027k01514j43110K09588M63389P94187R80208J300343
5594C2820818J415948J805620J658608J569914J163264R42838P65065K0934Q4386
$$ plain form
5585 42247395 41860473 41111477 40234082 39469594 38726913 38261348 37548659 37428011 37548173
5576 37548173 37932498 38784179 39821587 41319167 43033028 44557975 46126823 47372628
5568 47372628 48304604 48713025 48645509 48486030 47974612 47247583 46308191 45090226 43691352
5559 43691352 42170272 41014056 40143307 39488531 39340587 39703980 40289775 41294718 42304046
5550 42304046 43226621 44295751 45307909 45709917 45755871 45422570 44280582 42723561 41016835
5541 41016835 39481282 38049715 36917348 35799870 34654132 33939881 33127410 32607341 32235474
5532 32235474 32377526 32633256 32792386 33278992 33638497 33884693 33943620 33671824 33256794 32459900
5522 32459900 31366613 29774290 28204888 26715823 25262935 24214617 23359069 22682467
$$ packed form
5585D2247395l86922p48996q77395p64488p42681m65565p12689j20648J20162
5576C7548173L84325Q51681J037408J497580J713861J524947J568848J245805
5568D7372628R31976M08421o7516j59479n11418p27029r39392j217965j398874
5559D3691352j521080j156216q70749o54776j47944L63393N85795J004943J009328
5550D2304046R22575J069130J012158M02008M5954l33301j141988j557021j706726
5541D1016835j535553j431567j132367j117478j145738p14251q12471n20069l71867
5532C2235474J42052K55730J59130M86606L59505K46196N8927k71796m15030p96894
5522C2459900j093287j592323j569402j489065j452888j048318q55548o76602
$$ plain form
5514 22682467 22017839 21539345 21143787 21017882 20928067 20840717 20858364 20964714 21089380 20957391
5504 20957391 20674571 20363114 19939151 19411738 18731169 18262247 18103766 17856314 17510917
5495 17510917 17360293 17119364 16859634 16824371 16884301 17023586 17027690 17067301 16976736 17011972 17371927
5484 17371927 17514938 17891370 18302238 18450788 18607028 19130387 19729023 20289614 20853414
5475 20853414 21607968 22470773 23546342 24917346 26672653 28777650 31234402 34574041
5467 34574041 38731326 43864316 49496867 54730506 57280293 56303867 52806789 48508451
5459 48508451 44359504 40922768 38212504 36304256 35163788 34421258 34008854 33592984 33000696
5450 33000696 32272953 31847724 31566283 31908015 32752213 34131115 36090917 38778403 42353917
$$ packed form
5514B2682467o64628m78494l95558j25905q9815q7350J7647J06350J24666j31989
5504B0957391k82820l11457m23963n27413o80569m68922j58481k47452l45397
5495A7510917j50624k40929k59730l5263N9930J39285M104L9611r0565L5236L59955
5484A7371927J43011L76432M10868J48550J56240N23359N98636N60591N63800
5475B0853414P54554Q62805J075569J371004J755307K104997K456752L339639
5467C4574041M157285N132990N632551N233639K549787r76426l497078m298338
5459D8508451m148947l436736k710264j908248j140468p42530m12404m15870n92288
5450C3000696p27743m25229k81441L41732Q44198J378902J959802K687486L575514
$$ plain form
5441 42353917 46417697 49702690 50511058 48556334 45571133 42747236 41167497 40790737
5433 40790737 41616173 43215896 44915533 45950175 45527999 44328391 42984002 42293109 42514087
5424 42514087 43300914 44392616 45060132 44647126 42538089 39373536 36056044 33211318 30881178
5415 30881178 29190452 28154909 27210523 26455311 25877788 25520258 25302037 25385511 25625975
5406 25625975 25816211 26384477 27053626 27974853 29044591 30088744 31183097 31799045 32002596
5397 32002596 32335759 32821564 33751660 35033033 36545954 37752747 38186647 37943782 36828014
5388 36828014 35386742 33878210 32443792 30767533 29058440 27575133 26491578 25741706
5380 25741706 25277808 24845142 24502689 24347391 24329204 24551236 24677282 24833049 25431422 26103236
$$ packed form
5441D2353917M063780L284993Q08368j954724k985201k823897j579739l76760
5433D0790737Q25436J599723J699637J034642m22176j199608j344389o90893K20978
5424D2514087P86827J091702O67516m13006k109037l164553l317492k844726k330140
5415C0881178j690726j035543r44386p55212n77523l57530k18221Q3474K40464
5406B5625975J90236N68266O69149R21227J069738J044153J094353O15948K03551
5397C2002596L33163M85805R30096J281373J512921J206793M33900k42865j115768
5388C6828014j441272j508532j434418j676259j709093j483307j083555p49872
5380B5741706m63898m32666l42453j55298j8187K22032J26046J55767N98373O71814
$$ plain form
5370 26103236 26732434 27347076 27907699 28529072 29063345 29431706 29511108 29431738 29045898 28730484
5360 28730484 28527398 28589288 29051385 29356215 29814224 30345781 31176657 32049971 32741599 33841457
5350 33841457 34885192 36218531 37892792 39641825 41491960 43642383 45940838 48640255
5342 48640255 52055226 55972696 60820535 66382237 72449233 78275806 82162067 82863508
5334 82863508 80811037 77954812 75753024 74616389 75022593 77198048 80894567 85903525
5326 85903525 92312489 99824067 107321785 113614461 117824482 120665487 123920129 128029394
5318 128029394 132348041 135455363 137283815 137717440 135111295 128318194 118296707 107524723
5310 107524723 98209914 90937572 85722016 82419909 80410552 79984367 80627463 82373634
$$ packed form
5370B6103236O29198O14642N60623O21373N34273L68361P9402p9370l85840l15414
5360B8730484k03086O1890M62097L04830M58009N31557Q30876Q73314O91628J099858
5350C3841457J043735J333339J674261J749033J850135K150423K298455K699417
5342D8640255L414971L917470M847839N561702O066996N826573L886261P01441
5334H2863508k052471k856225k201788j136635M06204K175455L696519N008958
5326H5903525O408964P511578P497718O292676M210021K841005L254642M109265
5318A28029394M318647L107322J828452M33625k606145o793101j0021487j0771984
5310A07524723r314809p272342n215556l302107k009357m26185O43096J746171
$$ plain form
5302 82373634 85583126 89906170 95145414 100155548 103350371 103529049 101023595 96621540
5294 96621540 91044742 85653766 81633024 78874180 76942353 74780332 70983299 65553654
5286 65553654 59865278 54643272 50436450 46968427 44119942 41827393 40036460 38412089
5278 38412089 37146098 36361965 35824362 35648711 35541459 35384325 34713621 33516375 32497709
5269 32497709 31331693 30206422 29641769 29217838 29241342 29521344 29764408 30041689 30416206
5260 30416206 31204362 32475760 34331434 36338863 38468601 39606012 39538758 38538191 37051383
5251 37051383 35789564 35290677 35531629 35759764 35523088 34314261 32454753 30225807 28258699
5242 28258699 26821848 25895142 25350738 24956622 24675077 24441469 24187910 24247435 24511984
$$ packed form
5302H2373634L209492M323044N239244N010134L194823J78678k505454m402055
5294I6621540n576798n390976m020742k758844j931827k162021l797033n429645
5286F5553654n688376n222006m206822l468023k848485k292549j790933j624371
5278C8412089j265991p84133n37603j75651j07252j57134o70704j197246j018666
5269C2497709j166016j125271n64653m23931K3504K80002K43064K77281L74517
5260C0416206P88156J271398J855674K007429K129738J137411o7254j000567j486808
5251C7051383j261819m98887K40952K28135k36676j208827j859508k228946j967108
5242B8258699j436851r26706n44404l94116k81545k33608k53559N9525K64549
$$ plain form
5233 24511984 25006407 25933593 27411489 29223909 31517952 34031297 36513310 38248263
5225 38248263 38781454 38326087 37031487 35626848 34707133 34133877 34253553 34713821 34595007
5216 34595007 33976483 32679680 30237935 27431876 24836483 22831971 21119928 19775397
5208 19775397 18797649 17965023 17331531 16793784 16478026 16482973 16401302 16461869 16676570 16777319
5198 16777319 17128060 17784395 18573810 19045855 19266050 19235911 19234874 19501024 20024436 20792194
5188 20792194 21701598 22202203 21518327 20172211 18180982 16458292 14979786 13760501 12667424
5179 12667424 11925851 11399794 10721667 10338630 9921231 9351122 8969809 8778641 8620924
5170 8620924 8309303 8151755 8180607 8031660 7813162 7698278 7634441 7410758 7201192 7060118
$$ packed form
5233B4511984M94423R27186J477896J812420K294043K513345K482013J734953
5225C8248263N33191m55367j294600j404639r19715n73256J19676M60268j18814
5216C4595007o18524j296803k441745k806059k595393k004512j712043j344531
5208A9775397r77748q32626o33492n37747l15758M947q1671O0567K14701J00749
5198A6777319L50741O56335P89415M72045K20195l0139j037K66150N23412P67758
5188B0792194R09404N00605o83876j346116j991229j722690j478506j219285j093077
5179A2667424p41573n26057o78127l83037m17399n70109l81313j91168j57717
5170H620924l11621j57548K8852j48947k18498j14884o3837k23683k09566j41074
$$ plain form
5160 7060118 7155986 7247424 7124348 6957116 6825066 6735096 6589197 6434869 6370848 6353444
5150 6353444 6177742 5949007 5878101 5697564 5654540 5624405 5672050 5524259 5371181 5388584
5140 5388584 5318053 5244550 5292368 5148695 5142861 5135673 5024492 4921686 4897219 4886323 4904856
5129 4904856 4882504 4876932 4920366 4872746 4862858 4924905 4843615 4802959 4853901 4774242 4869131 4837066
5117 4837066 4750326 4564107 4483249 4404892 4379834 4404558 4194269 4128718 4176043 4247024 4120278
5106 4120278 4195056 4079490 4171336 4158541 4130641 4019591 3888197 3957967 3940271 3870076 3799270
5095 3799270 3812476 3928716 3956956 3925945 3987633 4034707 4091187 4013922 3796972 3717398 3714183
5084 3714183 3746037 3723449 3691656 3766755 3790648 3539145 3431377 3494280 3485323 3473409 3473660 3499097
$$ packed form
5160G060118R5868R1438j23076j67232j32050q9970j45899j54328o4021j7404
5150F353444j75702k28735p0906j80537m3024l0135M7645j47791j53078J7403
5140E388584p0531p3503M7818j43673n834p188j11181j02806k4467j0896J8533
5129D904856k2352n572M3434m7620r888O2047q1290m0656N0942p9659R4889l2065
5117D837066q6740j86219q0858p8357k5058K4724k10289o5551M7325P0981j26746
5106D120278P4778j15566R1846j2795k7900j11050j31394O9770j7696p0195p0806
5095C799270J3206J16240K8240l1011O1688M7074N6480p7265k16950p9574l215
5084C714183L1854k2588l1793P5099K3893k51503j07768O2903q957j1914K51K5437
$$ plain form
5072 3499097 3486383 3464984 3448895 3465165 3350255 3508689 3609412 3562668 3544350 3320198 3424785
5061 3424785 3442041 3274166 3328903 3383031 3540726 3571778 3527814 3543422 3495934 3470111 3527277
5050 3527277 3553180 3640015 3579097 3640865 3658406 3620367 3627581 3706895 3746609 3736518 3681948 3555828
5038 3555828 3646543 3732626 3716207 3808884 3927008 3973114 4101049 4130501 4254014 4354212 4301280
5027 4301280 4414649 4390842 4518145 4676789 4727151 4736581 4732083 4894678 4894824 4862315 4786235
5016 4786235 4727025 4830302 4864167 4880329 4944121 4992176 4843669 4890655 4882816 4895073 4838894
5005 4838894 4897183 4922065 5029610 5052414 5021616 4924880 4910374 5047633 5180769 5267030 5278364
4994 5278364 5185552 5155053 5319064 5199757 5274413 5507622 5412809 5193599 5346996 5323162
$$ packed form
5072C499097j2714k1399j6089J6270j14910J58434J00723m6744j8318k24152J04587
5061C424785J7256j67875N4737N4128J57695L1052m3964J5608m7488k5823N7166
5050C527277K5903Q6835o0918O1768J7541l8039P214P9314L9714j0091n4570j26120
5038C555828R0715Q6083j6419R2677J18124M6106J27935K9452J23513J00198n2932
5027D301280J13369k3807J27303J58644N0362R430m498J62595J46l2509p6080
5016D786235n9210J03277L3865J6162O3792M8055j48507M6986p839J2257n6179
5005D838894N8289K4882J07545K2804l0798r6736j4506J37259J33136Q6261J1334
4994E278364r2812l0499J64011j19307P4656K33209r4813k19210J53397k3834
$$ plain form
4984 5323162 5292334 5600624 5677810 5675524 5631363 5874890 6010553 6144891 6222825 6359709 6412628
4973 6412628 6320330 6304451 6417321 6382998 6300558 6324928 6317527 6404811 6420456 6565063 6584974
4962 6584974 6652308 6585540 6844381 6854491 6942970 7111981 7125089 7213540 7243648 7373810 7442302
4951 7442302 7623590 7889811 8036513 8164412 8392710 8732851 8970887 9253651 9676643 9940716
4941 9940716 10348196 10875065 11162278 11494598 11847651 12277121 13037002 13969111 15091024
4932 15091024 16307730 17588671 18741838 19530164 20233851 20102083 19395313 18510779 17415365
4923 17415365 16410053 15737625 15277962 14917246 14815912 14916853 15258007 15793320 16287012
4914 16287012 17095357 18222566 19217730 19942553 20276270 19982202 19170507 18062425 16766478
$$ packed form
4984E323162l0828L08290P7186k286m4161K43527J35663J34338P7934J36884N2919
4973F412628r2298j5879J12870l4323q2440K4370p401Q7284J5645J44607J9911
4962F584974O7334o6768K58841J0110Q8479J69011J3108Q8451L0108J30162O8492
4951G442302J81288K66221J46702J27899K28298L40141K38036K82764M22992K64073
4941I940716M07480N26869K87213L32320L53053M29470P59881R32109J121913
4932A5091024J216706J280941J153167P88326P03687j31768p06770q84534j095414
4923A7415365j005312o72428m59663l60716j01334J00941L41154N35313M93692
4914A6287012Q08345J127209R95164P24823L33717k94068q11695j108082j295947
$$ plain form
4905 16766478 15372485 14323707 13511726 12818168 12199528 11854562 11620103 11405936 11142488
4896 11142488 11061712 11147333 11276137 11136684 10942795 10774394 10685345 10587054 10288353 10239640
4886 10239640 10345133 10477678 10432682 10305633 10547512 10732248 10778106 10942748 11218366 11447468
4876 11447468 11667262 12031836 12301978 12833697 13380492 13988956 14670825 15725298 16886031
4867 16886031 18248372 19792799 21491107 23107743 24362799 24939933 24911764 24230330 23055559
4858 23055559 21845873 20608589 19626745 18902669 18398780 18367272 18328536 18387083 18932917 19661417
4848 19661417 20474885 21387754 22400317 23380455 23638898 23367690 22362459 21042514 19332358
4839 19332358 17738096 16334436 15117904 14225043 13569128 12630712 12217474 11811366 11233793
$$ packed form
4905A6766478j393993j048778q11981o93558o18640l44966k34459k14167k63448
4896A1142488q0776Q5621J28804j39453j93889j68401q9049r8291k98701m8713
4886A0239640J05493J32545m4996j27049K41879J84736M5858J64642K75618K29102
4876A1447468K19794L64574K70142N31719N46795O08464O81869J054473J160733
4867A6886031J362341J544427J698308J616636J255056N77134k8169o81434j174771
4858B3055559j209686j237284r81844p24076n03889l1508l8736N8547N45834P28500
4848A9661417Q13468R12869J012563R80138K58443k71208j005231j319945j710156
4839A9332358j594262j403660j216532q92861o55915r38416m13238m06108n77573
$$ plain form
4830 11233793 10808690 10392041 10107490 9950892 10104130 9961782 9875648 9710273 9595021 9446354
4820 9446354 9397464 9420008 9514951 9511992 9649954 9694392 9858828 9741931 9878982 9945164 10117069
4809 10117069 10306046 10366390 10545282 10596341 10845452 11056463 11321686 11537609 11711690 11769234
4799 11769234 11957711 12347239 12647738 13025685 13471590 13954394 14604946 15364846 16196678
4790 16196678 17276332 18584371 20206323 22098835 24407244 27826581 32161948 37575184
4782 37575184 43708480 49610554 52745291 52134597 48084116 41225905 34516050 29164270
4774 29164270 25237333 22661777 21010442 19782258 18770824 17908385 17323794 16729973 16307194
4765 16307194 15958776 15646099 15577336 15436186 15199628 15241441 15222882 15242142 15107088 15078029
$$ packed form
4830A1233793m25103m16649k84551j56598J53238j42348q6134j65375j15252j48667
4820I446354m8890K2544R4943k959J37962M4438J64436j16897J37051O6182J71905
4809A0117069J88977O0344J78892N1059K49111K11011K65223K15923J74081N7544
4799A1769234J88477L89528L00499L77947M45905M82804O50552P59900Q31832
4790A6196678J079654J308039J621952J892512K308409L419337M335367N413236
4782C7575184O133296N902074L134737o10694m050481o858211o709855n351780
4774B9164270l926937k575556j651335j228184j011434q62439n84591n93821m22779
4765A6307194l48418l12677o8763j41150k36558M1813j8559J9260j35054k9059
$$ plain form
4755 15078029 15270544 15423779 15365713 15369574 15385541 15629582 15850312 16034508 16249679 16490061
4745 16490061 16777957 17023481 17620947 18105773 18620009 19281682 20000989 20855912 21766704
4736 21766704 22797476 24087773 25418125 26969424 28664039 30232920 31596142 32677457
4728 32677457 32864240 32480104 32001940 31254219 30706629 30605481 31013411 31889675 33191203
4719 33191203 35033245 37360165 40257126 43755308 47882993 52438112 57285064 61852083
4711 61852083 64574917 64290561 61933194 57571579 50826279 43588430 37470255 32760574
4703 32760574 29439603 26961875 25244412 23871350 22678848 21751258 20881415 20171933 19592081
4694 19592081 18956080 18426288 17965845 17605789 17377587 17121885 17085223 16967767 16830660 16764645
$$ packed form
4755A5078029J92515J53235n8066L861J5967K44041K20730J84196K15171K40382
4745A6490061K87896K45524N97466M84826N14236O61673P19307Q54923R10792
4736B1766704J030772J290297J330352J551299J694615J568881J363222J081315
4728C2677457J86783l84136m78164p47721n47590j01148M07930Q76264J301528
4719C3191203J842042K326920K896961L498182M127685M555119M846952M567019
4711F1852083K722834k84356k357367m361615o745300p237849o118175m709681
4703C2760574l320971k477728j717463j373062j192502r27590q69843p09482n79852
4694A9592081o36001n29792m60443l60056k28202k55702l6662j17456j37107o6015
$$ plain form
4684 16764645 16880521 16871394 16998086 17402565 17670384 17886975 18323803 18857912 19332807 19920334
4674 19920334 20593173 21854113 23108701 24660497 26467164 28637488 30894884 33387787
4666 33387787 35693134 37214262 37794347 37255508 35954041 34237142 32524664 31302912
4658 31302912 30390879 29881045 30144205 30593128 31454733 32547404 33570848 34531489 35235762
4649 35235762 34775901 33523581 31287872 28749353 26423407 23878380 21952889 20099913
4641 20099913 18673626 17390858 16309108 15455370 14671076 13965910 13302020 12659702 12237592
4632 12237592 11900360 11511391 11062663 10754965 10512985 10276590 10159802 9857431 9754433
4623 9754433 9656166 9417255 9268492 9078828 8966650 8912582 8647045 8560975 8442358 8432396
$$ packed form
4684A6764645J15876r127J26692M04479K67819K16591M36828N34109M74895N87527
4674A9920334O72839J260940J254588J551796J806667K170324K257396K492903
4666C3387787K305347J521128N80085n38839j301467j716899j712478j221752
4658C1302912r12033n09834K63160M48923Q61605J092671J023444R60641P04273
4649C5235762m59861j252320k235709k538519k325946k545027j925491j852976
4641B0099913j426287j282768j081750q53738p84294p05166o63890o42318m22110
4632A2237592l37232l88969m48728l07698k41980k36395j16788l02371j02998
4623I754433r8267k38911j48763j89664j12178n4068k65537q6070j18617r962
$$ plain form
4613 8432396 8243344 8142528 8016086 7767086 7752070 7648754 7529213 7403515 7397933 7382586
4603 7382586 7315941 7165478 7116819 7219696 7054216 6932309 6854806 6951945 6861792 7014106
4593 7014106 6882743 6956601 7040305 7053117 7110703 7099457 7059917 7041479 7060753 6841137 6825370
4582 6825370 6866438 6685980 6766019 6875202 6707263 6636416 6475455 6316898 6357172 6151103
4572 6151103 6171821 6263986 6117177 6105851 5906440 5886278 5936573 5840103 5905721 5993249 6120961
4561 6120961 6190703 6183329 6133700 6162418 6322052 6281281 6283961 6251441 6305066 6494045 6585818
4550 6585818 6601645 6394131 6303963 6366528 6377826 6409003 6545924 6464135 6417575 6468483 6437190
4539 6437190 6324504 6456120 6493309 6498466 6593319 6542250 6700808 6772420 6679191 6706920 7002896
$$ packed form
4613H432396j89052j00816j26442k49000j5016j03316j19541j25698n582j5347
4603G382586o6645j50463m8659J02877j65480j21907p7503R7139r0153J52314
4593G014106j31363P3858Q3704J2812N7586j1246l9540j8438J9274k19616j5767
4582F825370M1068j80458Q0039J09183j67939p0847j60961j58557M0274k06069
4572F151103K0718R2165j46809j1326j99411k0162N0295r6470O5618Q7528J27712
4561F120961O9742p374m9629K8718J59634m0771K680l2520N3625J88979R1773
4550F585818J5827k07514r0168O2565J1298L1177J36921q1789m6560N0908l1293
4539F437190j12686J31616L7189N157R4853n1069J58558P1612r3229K7729K95976
$$ plain form
4528 7002896 7113478 7197739 7209053 7173757 7398787 7648133 7694115 7858496 7848305 7910745 7877257
4517 7877257 8016202 8127746 8280002 8451099 8564517 8593345 8726397 8941078 9204096 9288343
4507 9288343 9487135 9643413 9697191 9969941 10359950 10650483 10862276 10968007 11255195 11849978
4497 11849978 12324228 12829511 13327237 13923712 14543682 15375860 16324937 17248020 18640325
4488 18640325 20253733 21866111 23649585 25703437 27851934 29864236 31157774 31604837
4480 31604837 31029474 29521938 27470342 25238162 23051255 21223599 19849546 18622797
4472 18622797 17777960 17142269 16756100 16272569 16045059 15871104 15717038 15558464 15415740
4463 15415740 15608190 15758613 16137537 16544653 16881120 17346126 17629126 17727928 17691186 17736909
$$ packed form
4528G002896J10582Q4261J1314l5296K25030K49346M5982J64381j0191O2440l3488
4517G877257J38945J11544J52256J71097J13418K8828J33052K14681K63018Q4247
4507I288343J98792J56278N3778K72750L90009K90533K11793J05731K87188N94783
4497A1849978M74250N05283M97726N96475O19970Q32178R49077R23083J392305
4488A8640325J613408J612378J783474K053852K148497K012302J293538M47063
4480C1604837n75363j507536k051596k232180k186907j827656j374053j226749
4472A8622797q44837o35691l86169m83531k27510j73955j54066j58574j42724
4463A5415740J92450J50423L78924M07116L36467M65006K83000R8802l6742M5723
$$ plain form
4453 17736909 17784012 17848971 18191613 18838806 19435360 20233396 21270715 22316076 23735854
4444 23735854 25338578 27230290 29329989 31301320 33236069 34511400 34956961 34819888
4436 34819888 33852353 32326083 31091669 29768284 28905711 28391728 28284705 28440615 29101254
4427 29101254 30267529 31640068 33406591 35464669 37394898 38868792 39914422 40243974
4419 40243974 40242947 39537948 38380998 36951817 34995111 32952534 30976131 28932644 27102699
4410 27102699 25474476 23865866 22624661 21711744 20899275 20215425 19634632 19327456 19181164
4401 19181164 18767035 18639680 18569568 18437488 18505139 18558981 18719223 18905065 19194505 19575499
4391 19575499 20109721 20697825 21434215 22392801 23649158 25002567 26789042 28520116 30134324
$$ packed form
4453A7736909M7103O4959L42642O47193N96554P98036J037319J045361J419778
4444B3735854J602724J891712K099699J971331J934749J275331M45561j37073
4436C4819888r67535j526270j234414j323385q62573n13983j07023J55910O60639
4427B9101254J166275J372539J766523K058078J930229J473894J045630L29552
4419D0243974j027p04999j156950j429181j956706k042577j976403k043487j829945
4410B7102699j628223j608610j241205r12917q12469o83850n80793l07176j46292
4401A9181164m14129j27355p0112j32080O7651N3842J60242J85842K89440L80994
4391A9575499N34222N88104P36390R58586J256357J353409J786475J731074J614208
$$ plain form
4382 30134324 31304516 31890468 31874146 31457782 31351025 31044624 30795246 30532957 30027476
4373 30027476 28895582 27382572 25696627 23954743 22416114 21172394 20478439 19621371
4365 19621371 19210790 19130087 18976313 19229025 19804172 20414375 21172399 21917245 22722231 22927551
4355 22927551 22562211 21587917 20282032 18775170 17397904 16341117 15233308 14491356 13869400
4346 13869400 13113785 12613956 12219276 11957354 11691014 11343907 11222205 10751463 10805148 10669544
4336 10669544 10771292 10647228 10550954 10555895 10397683 10528148 10540039 10688684 10856824 10949449
4326 10949449 11169713 11563690 11908561 12485913 13071689 13890840 14892702 15913899 16905895
4317 16905895 17777777 18481784 18445797 17755522 16587821 15236455 13954331 12871705 11930752
$$ packed form
4382C0134324J170192N85952j6322m16364j06757l06401k49378k62289n05481
4373C0027476j131894j513010j685945j741884j538629j243720o93955q57068
4365A9621371m10581q0703j53774K52712N75147O10203P58024P44846Q04986K05320
4355B2927551l65340r74294j305885j506862j377266j056787j107809p41952o21956
4346A3869400p55615m99829l94680k61922k66340l47107j21702m70742N3685j35604
4336A0669544J01748j24064r6274M941j58212J30465J1891J48645J68140R2625
4326A0949449K20264L93977L44871N77352N85776Q19151J001862J021197R91996
4317A6905895Q71882P04007l5987o90275j167701j351366j282124j082626r40953
$$ plain form
4308 11930752 11025483 10475075 9901518 9374961 9049820 8749688 8531907 8344493 8320795 7932517
4298 7932517 7848079 7805060 7736715 7676267 7577073 7443179 7244469 7234088 7214926 7116664 6961891
4287 6961891 6973099 6921574 6919707 6928951 6717199 6701818 6797277 6516045 6404392 6334884 6084195
4276 6084195 5922496 5989093 6075586 6034811 5904728 5860564 5828326 5873707 5854938 5600929 5683877
4265 5683877 5564074 5440071 5329378 5356575 5258705 5230624 5314271 5419810 5462238 5439281 5458944
4254 5458944 5425410 5427819 5427971 5427972 5258494 5212562 5242323 5261100 5167756 5025171 4983140 4870675
4242 4870675 4813342 4812616 4788626 4929271 4773683 4814902 4819167 4710120 4845513 4966780 4866987
4231 4866987 4900233 4865483 5078536 5096728 4976671 5059006 5076377 4872618 4804195 4750938 4689957
$$ packed form
4308A1930752r05269n50408n73557n26557l25141l00132k17781j87414k3698l88278
4298G932517q4438m3019o8345o0448r9194j33894j98710j0381j9162r8262j54773
4287F961891J1208n1525j867R244k11752j5381R5459k81232j11653o9508k50689
4276F084195j61699O6597Q6493m0775j30083m4164l2238M5381j8769k54009Q2948
4265E683877j19803j24003j10693K7197r7870k8081Q3647J05539M2428k2957J9663
4254E458944l3534K409J52Jj69478m5932K9761J8777r3344j42585m2031j12465
4242D870675n7333p26k3990J40645j55588M1219M265j09047J35393J21267r9793
4231D866987L3246l4750K13053J8192j20057Q2335J7371k03759o8423n3257o0981
$$ plain form
4220 4689957 4602360 4573733 4583283 4683503 4532016 4545615 4497026 4316543 4302918 4311669 4257852
4209 4257852 4216203 4177015 4212418 4171887 4129296 4154050 4210764 4263610 4139726 4165635 4323291
4198 4323291 4250967 4173939 4183063 4019349 4055687 4183037 4141905 4352803 4386719 4271663 4302364
4187 4302364 4348002 4406765 4520908 4520077 4441942 4628019 4548385 4512585 4451401 4475048 4635495
4176 4635495 4578861 4555081 4584665 4692460 4793242 4748318 4804940 4794567 4871051 4891294 4920166
4165 4920166 5066239 5218300 5314633 5389546 5364506 5360752 5384091 5495792 5748678 6123749 6217626
4154 6217626 6202765 6446282 6842367 7246443 7730915 8243738 8994254 9649928 10208118 10267560
4144 10267560 9755345 9114262 8497994 8152998 7929965 7791272 7804028 7638010 7640108 7777226
$$ packed form
4220D689957q7597k8627R550J00220j51487J3599m8589j80483j3625Q751n3817
4209D257852m1649l9188L5403m0531m2591K4754N6714N2846j23884K5909J57656
4198D323291p2324p7028R124j63714L6338J27350m1132K10898L3916j15056L0701
4187D302364M5638N8763J14143q31p8135J86077p9634l5800o1184K3647J60447
4176D635495n6634k3780K9584J07795J00782m4924N6622j0373P6484K0243K8872
4165D920166J46073J52061R6333P4913k5040l754K3339J11701K52886L75071R3877
4154F217626j4861K43517L96085M04076M84472N12823P50516O55674N58190N9442
4144A0267560n12215o41083o16268l44996k23033j38693J2756j66018K098J37118
$$ plain form
4134 7777226 7925143 8004676 7979967 8014517 8072598 8112116 8192622 8351175 8571293 8635514 8862482
4123 8862482 9072339 9316503 9351623 9713091 9904232 10022550 10322892 10551723 10841338 11087749
4113 11087749 11322638 11559553 11738928 12069359 12334639 12488102 12754681 13022967 13360215
4104 13360215 13650443 14029828 14410330 14719571 14953107 15319188 15724524 15868665 16106895
4095 16106895 16576980 16856736 17166202 17654256 18077015 18392481 18625667 19155755 19490284
4086 19490284 19815311 20307032 20690908 21068032 21339003 21639955 22064787 22584312 22800910
4077 22800910 23235680 23816279 24270572 24581564 24948627 25154860 25716027 26152237 26479948
4068 26479948 27025661 27447335 27589024 27802220 27886273 28044693 28188949 28475994 28932668 29186565
$$ packed form
4134G777226J47917P9533k4709L4550N8081L9518Q0506J58553K20118O4221K26968
4123H862482K09857K44164L5120L61468J91141J18318L00342K28831K89615K46411
4113A1087749K34889K36915J79375L30431K65280J53463K66579K68286L37248
4104A3360215K90228L79385L80502L09241K33536L66081M05336J44141K38230
4095A6106895M70085K79756L09466M88054M22759L15466K33186N30088L34529
4086A9490284L25027M91721L83876L77124K70971L00952M24832N19525K16598
4077B2800910M34770N80599M54293L10992L67063K06233N61167M36210L27711
4068B6479948N45713M21674J41689K13196Q4053J58420J44256K87045M56674K53897
$$ plain form
4058 29186565 29553127 29890441 30227157 30746117 31269672 31801375 32292402 32830369 33381255
4049 33381255 34164979 34917946 35729398 36345154 37214356 38061705 39072173 40357310 41493798
4040 41493798 42664590 43876220 45433637 46975411 48725540 50603199 52346152 54352653
4032 54352653 56456271 58921937 61301557 63722327 66361007 69038921 71772923 74512615
4024 74512615 77242812 80325436 83644657 86660489 90050271 93593699 97037311 100613038
4016 100613038 104076448 107761889 111415433 114746544 117881759 120744471 123469780 125891170
4008 125891170 128248028 130451574 132634858 134859052 136907380 138889326 140924469 142542541
4000 142542541 144000146 145133301 146078074 146724195 146732327 146226377 145545013 144650181 143525563
$$ packed form
4058B9186565L66562L37314L36716N18960N23555N31703M91027N37967N50886
4049C3381255P83724P52967Q11452O15756Q69202Q47349J010468J285137J136488
4040D1493798J170792J211630J557417J541774J750129J877659J742953K006501
4032E4352653K103618K465666K379620K420770K638680K677914K734002K739692
4024G4512615K730197L082624L319221L015832L389782L543428L443612L575727
4016A00613038L463410L685441L653544L331111L135215K862712K725309K421390
4008A25891170K356858K203546K183284K224194K048328J981946K035143J618072
4000A42542541J457605J133155R44773O46121Q132n05950o81364q94832j124618
$$ plain form
3991 143525563 142287284 141209634 139709866 138017853 136398732 134425268 132100242 129646500
3983 129646500 127132228 124225588 121047050 117729403 114476503 110993991 107337069 103670520
3975 103670520 100231280 96946426 93614713 90275953 87055758 83787995 80459380 77380091
3967 77380091 74256167 71071441 68048668 65076929 62345083 59555249 56753843 54267125
3959 54267125 52057223 49759740 47706375 45682993 43727332 42103196 40492661 39050427
3951 39050427 37714284 36184298 34845586 33543443 32455198 31427118 30437937 29531381
3943 29531381 28714284 27996678 27319153 26882546 26362716 25973809 25456652 25107152 24817832
3934 24817832 24556193 24104002 23825337 23350717 22912683 22662821 22323788 22002928 21725820
$$ packed form
3991A43525563j238279j077650j499768j692013j619121j973464k325026k453742
3983A29646500k514272k906640l178538l317647l252900l482512l656922l666549
3975A03670520l439240l284854l331713l338760l220195l267763l328615l079289
3967G7380091l123924l184726l022773k971739k731846k789834k801406k486718
3959E4267125k209902k297483k053365k023382j955661j624136j610535j442234
3951C9050427j336143j529986j338712j302143j088245j028080r89181r06556
3943B9531381q17097p17606o77525m36607n19830l88907n17157l49500k89320
3934B4817832k61639m52191k78665m74620m38034k49862l39033l20860k77108
$$ plain form
3925 21725820 21505946 21417773 21258221 21024949 20854929 20845923 20651934 20447158 20371517 20342938
3915 20342938 20211359 20154059 19983550 20065828 20119785 20127505 20171874 20126873 20148916 20248808 20424401
3904 20424401 20503361 20657538 20743281 20871079 21099908 21134277 21220138 21317051 21565221 21623168
3894 21623168 21639647 21792458 21997391 22174524 22326802 22481124 22794272 22849266 22779410 22958875
3884 22958875 22881207 22898102 22551579 22535017 22772727 22762999 22749199 22577070 22416055 22346320 22195057
3873 22195057 22180559 22164606 21942859 21689846 21583914 21265252 20961370 20686984 20254199 19984464
3863 19984464 19692079 19407221 19048048 18507773 18301274 18109583 17745002 17429313 17164354
3854 17164354 16865479 16759278 16221458 15716182 15542603 15313018 15167825 15018028 14884744
$$ packed form
3925B1725820k19874q8173j59552k33272j70020r006j93989k04776p5641k8579
3915B0342938j31579n7300j70509Q2278N3957P720M4369m5001K2043R9892J75593
3904B0424401P8960J54177Q5743J27798K28829L4369Q5861R6913K48170N7947
3894B1623168J6479J52811K04933J77133J52278J54322L13148N4994o9856J79465
3884B2958875p7668J6895l46523j6562K37710r728j3800j72129j61015o9735j51263
3873B2195057j4498j5953k21747k53013j05932l18662l03882k74386m32785k69735
3863A9984464k92385k84858l59173n40275k06499j91691l64581l15689k64959
3854A7164354k98875j06201n37820n05276j73579k29585j45193j49797j33284
$$ plain form
3845 14884744 14581279 14435235 14451991 14138681 14024736 13907145 13774011 13697759 13626945 13482415
3835 13482415 13299321 13193949 13099345 13012009 12987097 12893454 12890961 12818515 12907982 12910238 12828617
3824 12828617 13012028 13018351 13001428 13126548 13143088 13165033 13122680 13165349 13161382 13263077 13108600
3813 13108600 12902092 13015756 13067003 13009015 12976402 13024043 13047134 12924282 12972532 12835911
3803 12835911 12907236 13031462 13088658 12933435 12886522 12822444 12755844 12796246 12661555 12849544
3793 12849544 12861530 12644036 12626549 12796922 12888575 13039106 13199559 13352515 13377547 13559041
3783 13559041 13673687 13764854 13941582 14256050 14525371 14950580 15278907 15527277 15705102 16066816
3773 16066816 16559076 16935980 17289775 17669433 18178539 18796019 19194131 19716249 20150507
$$ packed form
3845A4884744l03465j46044J6756l13310j13945j17591j33134p6252p0814j44530
3835A3482415j83094j05372r4604q7336k4912r3643k493p2446Q9467K256q1621
3824A2828617J83411O323j6923J25120J6540K1945m2353M2669l967J01695j54477
3813A3108600k06508J13664N1247n7988l2613M7641K3091j22852M8250j36621
3803A2835911P1325J24226N7196j55223m6913o4078o6600M0402j34691J87989
3793A2849544J1986k17494j7487J70373R1653J50531J60453J52956K5032J81494
3783A3559041J14646R1167J76728L14468K69321M25209L28327K48370J77825L61714
3773A6066816M92260L76904L53795L79658N09106O17480L98112N22118M34258
$$ plain form
3764 20150507 20631007 21009805 21260558 21679673 22134154 22664239 23231827 23773433 24537744
3755 24537744 25302684 26093832 26907610 27892489 28843247 29449984 30197334 30952916 31592559
3746 31592559 32272479 32929038 33526718 34274072 35076437 35898370 36824826 37441624 38096351
3737 38096351 38675989 39292162 39906350 40419761 40925369 41275483 41435219 41555046 41643655 41586249
3727 41586249 41673687 41601739 41265955 40985036 40880226 40624901 40259342 40044145 39752032 39624712
3717 39624712 39385225 39151800 39061048 38912494 38623955 38433989 38487516 38469236 38516010 38425207
3707 38425207 38679874 38999001 39341405 39931533 40627269 41298803 42194134 43211280 44619328
3698 44619328 46102221 47438764 49098060 50795801 52357275 53943484 55609371 57464528
$$ packed form
3764B0150507M80500L78798K50753M19115M54481N30085N67588N41606P64311
3755B4537744P64940P91148Q13778R84879R50758O06737P47350P55582O39643
3746C1592559O79920O56559N97680P47354Q02365Q21933R26456O16798O54727
3737C8096351N79638O16173O14188N13411N05608L50114J59736J19827Q8609n7406
3727D1586249Q7438p1948l35784k80919j04810k55325l65559k15197k92113j27320
3717C9624712k39487k33425r0752j48554k88539j89966N3527j8280M6774r0803
3707C8425207K54667L19127L42404N90128O95736O71534Q95331J017146J408048
3698D4619328J482893J336543J659296J697741J561474J586209J665887J855157
$$ plain form
3690 57464528 59184777 60891866 62734746 64573610 66456514 68207185 69981534 71971476
3682 71971476 73824041 75234885 76709408 78278099 79799419 80766175 81819037 82669375
3674 82669375 83201820 83875229 84397427 84884125 85246665 85663476 86259887 86667887 87032045
3665 87032045 87817797 88488452 89437915 90447018 91579915 92836002 93970494 95334280 96526770
3656 96526770 97625309 98506699 99749032 100849538 101781627 103321440 105071488 106804725
3648 106804725 109126414 111451663 113901217 116556981 119305931 122376035 125210449 128237044
3640 128237044 131432122 134578139 137776243 141394633 145466153 149800155 154461664 159611626
3632 159611626 165229565 171274703 177602651 183842235 189799755 195505433 200187553 203879186
$$ packed form
3690E7464528J720249J707089J842880J838864J882904J750671J774349J989942
3682G1971476J852565J410844J474523J568691J521320R66756J052862Q50338
3674H2669375N32445O73409N22198M86698L62540M16811N96411M08000L64158
3665H7032045P85752O70655R49463J009103J132897J256087J134492J363786J192490
3656I6526770J098539Q81390J242333J100506R32089J539813J750048J733237
3648A06804725K321689K325249K449554K655764K748950L070104K834414L026595
3640A28237044L195078L146017L198104L618390M071520M334002M661509N149962
3632A59611626N617939O045138O327948O239584N957520N705678M682120L691633
$$ plain form
3624 203879186 206619356 208410440 209472414 210102020 210533257 210827584 211290477 211941350 212822397
3615 212822397 213812413 214866027 215797613 216339267 216617212 216412573 215364101 213544763 211878684
3606 211878684 210245075 208854894 207908792 207491661 207704780 208748873 210340104 212306981
3598 212306981 214595795 217476663 220661974 224062165 227659393 231422520 235482339 239670702
3590 239670702 243885843 248122675 252072472 255769823 259148875 262285042 264815570 266968068
3582 266968068 269043949 270641927 272120632 273182419 274103198 274749825 275293873 275546258 275809999
3573 275809999 275944326 275762616 275367721 274675464 273887112 272901851 271821585 270530557 269151264
3564 269151264 267712420 266200104 264797615 263173994 261599833 260026768 258648077 257058684
$$ packed form
3624B03879186K740170J791084J061974O29606M31237K94327M62893O50873Q81047
3615B12822397R90016J053614R31586N41654K77945k04639j048472j819338j666079
3606B11878684j633609j390181r46102m17131K13119J044093J591231J966877
3598B12306981K288814K880868L185311L400191L597228L763127M059819M188363
3590B39670702M215141M236832L949797L697351L379052L136167K530528K152498
3582B66968068K075881J597978J478705J061787R20779O46627N44048K52385K63741
3573B75809999J34327j81710l94895o92257p88352r85261j080266j291028j379293
3564B69151264j438844j512316j402489j623621j574161j573065j378691j589393
$$ plain form
3556 257058684 255247238 253521766 251822741 249845363 247443455 245017945 242389052 239283498
3548 239283498 235645725 231703119 227400726 222913338 218325374 213667055 208890592 204011503
3540 204011503 199307627 194467847 189517520 184344200 179100113 173904278 168799742 163888365
3532 163888365 158983791 154129849 149196681 144438083 140073129 135861265 131703955 127771764
3524 127771764 124142115 120913146 118006224 115297003 113093723 111064876 109540585 108291415
3516 108291415 107263514 106794186 106385635 106418868 106890315 107564576 108497059 109802053 111727808
3507 111727808 114003471 117033289 121024390 125789452 131250135 137510328 144438430 151940333
3499 151940333 159297924 166384658 172650034 177361448 180719642 182296603 182369936 181292626
$$ packed form
3556B57058684j811446j725472j699025j977378k401908k425510k628893l105554
3548B39283498l637773l942606m302393m487388m587964m658319m776463m879089
3540B04011503m703876m839780m950327n173320n244087n195835n104536m911377
3532A63888365m904574m853942m933168m758598m364954m211864m157310l932191
3524A27771764l629649l228969k906922k709221k203280k028847j524291j249170
3516A08291415j027901m69328m08551L3233M71447O74261R32483J304994J925755
3507A11727808K275663L029818L991101M765062N460683O260193O928102P501903
3499A51940333P357591P086734O265376M711414L358194J576961P3333j077310
$$ plain form
3491 181292626 179260054 177041623 174832146 173037309 171739438 170712188 169798850 168774186
3483 168774186 167330488 164830946 161083229 155758649 149184497 141280337 132645933 123532530
3475 123532530 114427812 105741724 97624851 90329256 83753292 77971959 72959034 68517057
3467 68517057 64505630 60965414 57762641 55032569 52332145 49921554 47765348 45725600
3459 45725600 44025446 42432803 40921067 39481272 38095785 36870748 35589516 34629208
3451 34629208 33702924 32656723 31814859 30993654 30210633 29407082 28740956 28081082 27394620
3442 27394620 26703361 26157044 25479857 24930816 24506384 24052737 23474181 22832300 22372263
3433 22372263 22015969 21654930 21201604 20793211 20387490 19931105 19753101 19564038 19185458
$$ packed form
3491A81292626k032572k218431k209477j794837j297871j027250r13338j024664
3483A68774186j443698k499542l747717n324580o574152p904160q634404r113403
3475A23532530r104718q686088q116873p295595o575964n781333n012925m441977
3467F8517057m011427l540216l202773k730072k700424k410591k156206k039748
3459D5725600j700154j592643j511736j439795j385487j225037j281232r60308
3451C4629208r26284j046201q41864q21205p83021q03551o66126o59874o86462
3442B7394620o91259n46317o77187n49041m24432m53647n78556o41881m60037
3433B2372263l56294l61039m53326m08393m05721m56385j78004j89063l78580
$$ plain form
3424 19185458 18719388 18519224 18240570 17997543 17757763 17510630 17238681 17204189 16909862 16289825
3414 16289825 16131145 15975311 15706321 15621956 15361660 15143835 14880649 14715539 14517091 14068145
3404 14068145 13763981 13690739 13404799 13178032 13184921 12973869 12746318 12432320 12519941 12346209
3394 12346209 12342781 12157038 12124664 12029185 11949624 11867776 11745966 11713167 11665618 11660178 11546868
3383 11546868 11617217 11628970 11576750 11601163 11496130 11431649 11406501 11448607 11541903 11449349 11457385
3372 11457385 11474000 11285271 11294115 11292825 11352570 11256370 11038727 10936536 10967778 11068910 10883642
3361 10883642 10767407 10775496 11002060 10923438 10897887 10893099 10708100 10582326 10688043 10578472
3351 10578472 10525810 10509362 10546281 10696875 10673097 10524120 10463478 10349164 10372881 10488296
$$ packed form
3424A9185458m66070k00164k78654k43027k39780k47133k71949l4492k94327o20037
3414A6289825j58680j55834k68990q4365k60296k17825k63186j65110j98448m48946
3404A4068145l04164p3242k85940k26767O889k11052k27551l13998Q7621j73732
3394A2346209l428j85743l2374r5479p9561q1848j21810l2799m7549n440j13310
3383A1546868P0349J1753n2220K4413j05033o4481k5148M2106R3296r2554Q036
3372A1457385J6615j88729Q844j290N9745r6200k17643j02191L1242J01132j85268
3361A0883642j16235Q089K26564p8622k5551m788j84999j25774J05717j09571
3351A0578472n2662j6448L6919J50594k3778j48977o0642j14314K3717J15415
$$ plain form
3341 10488296 10556752 10618054 10709370 10610879 10502096 10684874 10715819 10727241 10709984 10577892 10466902
3330 10466902 10545789 10550859 10709912 10763589 10699398 10748988 10826544 10841375 10832825 10887029 11007066
3319 11007066 11183281 11232003 11364457 11578098 11786210 11801050 11810175 11991268 12176236 12228869
3309 12228869 12334958 12374296 12701536 12940925 12966165 13157275 13513717 13850440 14015172 14054667
3299 14054667 13997934 14154493 14185592 14096684 13832804 13922749 13852918 13845014 13952293 14096848 14077233
3288 14077233 13897661 13890180 13912695 13963325 14075119 14198862 14206943 14225256 14151661 14093623 14188162
3277 14188162 14343466 14407536 14283379 14214353 14262133 14245635 14308560 14369250 14382841 14431444 14654021
3266 14654021 14656131 14661859 14935700 15201814 15373111 15820182 16216944 16524657 16999014 17204929
$$ packed form
3341A0488296O8456O1302R1316r8491j08783J82778L0945J1422j7257j32092j10990
3330A0466902P8887N070J59053N3677o4191M9590P7556J4831q550N4204J20037
3319A1007066J76215M8722J32454K13641K08112J4840R125J81093J84968N2633
3309A2228869J06089L9338L27240K39389K5240J91110L56442L36723J64732L9495
3299A4054667n6733J56559L1099q8908k63880Q9945o9831p904J07279J44555j9615
3288A4077233j79572p481K2515N0630J11794J23743Q081J8313p3595n8038R4539
3277A4188162J55304O4070j24157o9026M7780j6498O2925O0690J3591M8603K22577
3266A4654021K110N728K73841K66114J71297M47071L96762L07713M74357K05915
$$ plain form
3256 17204929 17327220 17346869 17208507 17249505 17179796 17245381 17608074 17808317 18100133 18466308
3246 18466308 18835624 19267373 19568194 20168629 20673141 21393459 22350661 23149363 24279112
3237 24279112 25581302 26729113 27950343 29489754 31174284 32653796 33995074 35380224
3229 35380224 36095140 36223527 35701788 34359879 32317955 30063258 27809211 25748156 23860427
3220 23860427 22535941 21320615 19925857 18713613 17736659 16718692 15925322 15344660 14784685
3211 14784685 14424286 13995420 13379423 13005784 12804386 12185537 11741008 11622546 11329495
3202 11329495 11090812 10826116 10547706 10372678 10211587 9914030 9745152 9674034 9358493 9071699
3192 9071699 8877809 8702562 8538056 8407656 8203328 7986062 7891451 7725923 7465807 7521534
$$ packed form
3256A7204929J22291J9649j38362M0998o9709O5585L62693K00243K91816L66175
3246A8466308L69316M31749L00821O00435N04512P20318R57202P98702J129749
3237B4279112J302190J147811J221230J539411J684530J479512J341278J385150
3229C5380224P14916J28387n21739j341909k041924k254697k254047k061055j887729
3220B3860427j324486j215326j394758j212244r76954j017967p93370n80662n59975
3211A4784685l60399m28866o15997l73639k01398o18849m44529j18462k93051
3202A1329495k38683k64696k78410j75028j61091k97557j68878p1118l15541k86794
3192I071699j93890j75247j64506j30400k04328k17266r4611j65528k60116N5727
$$ plain form
3182 7521534 7334831 7228886 7035810 6831193 6664341 6589521 6431385 6572535 6565315 6546042
3172 6546042 6419980 6268329 6454651 6386097 6364081 6311492 6283138 6084656 6053883 6069274 5928840
3161 5928840 5904528 5801934 5765192 5758825 5713545 5755832 5703419 5561544 5538525 5572452 5672706
3150 5672706 5671335 5648689 5784316 5882449 6008264 6055462 6100372 6331725 6646742 6866065 6857899
3139 6857899 6668636 6770547 6774808 6857546 6930018 6618821 6516858 6385476 6120772 5969732
3129 5969732 5789245 5699703 5586699 5188776 5054152 4879716 4868689 4961282 4750614 4529627
3119 4529627 4295979 4255071 4168138 3926031 3918661 3867313 3672853 3748533 3560311 3608033 3622872
3108 3622872 3568681 3455313 3476790 3520917 3483705 3416932 3388013 3379383 3371218 3309542 3368406 3398599
$$ packed form
3182G521534j86703j05945j93076k04617j66852p4820j58136J41150p220j9273
3172F546042j26062j51651J86322o8554k2016n2589k8354j98482l0773J5391j40434
3161E928840k4312j02594l6742o367m5280M2287n2413j41875k3019L3927J00254
3150E672706j371k2646J35627R8133J25815M7198M4910K31353L15017K19323q166
3139F857899j89263J01911M261Q2738P2472l11197j01963j31382k64704j51040
3129E969732j80487q9542j13004l97923j34624j74436j1027R2593k10668k20987
3119D529627k33648m0908q6933k42107p370n1348j94460P5680j88222M7722J4839
3108C622872n4191j13368K1477M4127l7212o6773k8919q630q165o1676N8864L0193
$$ plain form
3096 3398599 3392355 3460794 3276282 3003358 3048085 3056757 2960649 2978189 2884586 2954352 2902156
3085 2902156 2995476 2899263 2756722 2934622 2898476 2733805 2847966 2824171 2855276 2787156 2489651
3074 2489651 2438349 2588022 2697167 2631143 2626274 2638068 2603016 2648355 2483671 2422822 2286707
3063 2286707 2303836 2398957 2459498 2340420 2221828 2265025 2470725 2549899 2439582 2430322 2380229
3052 2380229 2175981 2139477 2141427 2137374 2216254 2108272 2033961 2005646 1960373 1978302 2013585
3041 2013585 2048872 2054821 2178550 2178611 2034175 2051345 2131575 2096288 1894156 1897278 1918389 2060014
3029 2060014 2109742 1984356 1971917 1962357 1971350 2032753 2018083 1990519 2125954 2142062 2084287
3018 2084287 2134737 2193152 2198315 2133010 2019650 1828768 1997571 2041312 1986767 2170082 2032980
$$ packed form
3096C398599o244O8439j84512k72924M4727Q672r6108J7540r3603O9766n2196
3085B902156R3320r6213j42541J77900l6146j64671J14161k3795L1105o8120k97505
3074B489651n1302J49673J09145o6024m869J1794l5052M5339j64684o0849j36115
3063B286707J7129R5121O0541j19078j18592M3197K05700P9174j10317r260n0093
3052B380229k04248l6504J950m053P8880j07982p4311k8315m5273J7929L5283
3041B013585L5287N949J23729O1j44436J7170Q0230l5287k02132L122K1111J41625
3029B060014M9728j25386j2439r560Q993O1403j4670k7564J35435J6108n7775
3018B084287N0450N8415N163o5305j13360j90882J68803M3741n4545J83315j37102
$$ plain form
3007 2032980 2033616 2136033 2105039 2074904 2209655 2387465 2280260 2408668 2345502 2285429 2259454
2996 2259454 2459046 2555504 2503804 2382000 2459920 2442877 2393712 2380730 2382003 2521046 2697700
2985 2697700 2598179 2561918 2729528 2794430 2745143 2776880 2650055 2530770 2739400 2649413 2763359
2974 2763359 2959409 2914691 2997559 3033772 2997422 3040934 3010789 3117433 3217263 3316288 3376281
2963 3376281 3437516 3516737 3716249 3710414 3743411 3826828 3803327 3857603 3978107 3907078 3904834
2952 3904834 3893313 4057833 4398190 4376022 4276782 4388044 4432446 4366709 4353990 4420375 4468636
2941 4468636 4469895 4737662 4637637 4694042 4931191 4908152 4929753 4695641 4654968 4817674 4934821
2930 4934821 5088888 5190771 5315018 5389233 5352185 5469660 5509261 5714509 5827632 5828122 5909256
$$ packed form
3007B032980O36J02417l0994l0135J34751J77810j07205J28408o3166o0073k5975
2996B259454J99592R6458n1700j21804P7920j7043m9165j2982J273J39043J76654
2985B697700r9521l6261J67610O4902m9287L1737j26825j19285K08630q9987J13946
2974B763359J96050m4718Q2868L6213l6350M3512l0145J06644R9830R9025N9993
2963C376281O1235P9221J99512n835L2997Q3417k3501N4276J20504p1029k244
2952C904834j1521J64520L40357k2168r9240J11262M4402o5737j2719O6385M8261
2941D468636J259K67767j00025N6405K37149k3039K1601k34112m0673J62706J17147
2930D934821J54067J01883J24247P4215l7048J17475L9601K05248J13123M90Q1134
$$ plain form
2919 5909256 6108056 6314362 6353139 6417742 6491570 6713120 6727983 6779245 7066815 7068520 7048953
2908 7048953 7167358 7253818 7290742 7312593 7210147 7416801 7443726 7521844 7723649 7956541
2898 7956541 8106889 8264089 8582165 8816605 9148783 9599761 9918445 10156873 10642320 11252045
2888 11252045 11758058 12095085 12340890 12765059 13313636 13682395 14275470 15056679 15730497
2879 15730497 16388558 16960664 17101684 16809207 16041830 15169625 14390670 13591235 12813248
2870 12813248 12123482 11737785 11336280 10805727 10369041 9932364 9707919 9668909 9444360 9254779
2860 9254779 8981495 8757567 8506638 8277773 7979850 7499183 7254504 6996344 6794166 6609938
2850 6609938 6356239 6099414 5921844 5725435 5569031 5534743 5418892 5221042 5154213 4955156
$$ packed form
2919E909256J98800K06306L8777O4603P3828K21550J4863N1262K87570J705j9567
2908G048953J18405Q6460L6924K1851j02446K06654K6925P8118K01805K32892
2898G956541J50348J57200L18076K34440L32178M50978L18684K38428M85447O09725
2888A1252045N06013L37027K45805M24169N48577L68759N93075P81209O73818
2879A5730497O58061N72106J41020k92477p67377q72205p78955p99435p77987
2870A2813248o89766l85697m01505n30553m36686m36677k24445l9010k24549j89581
2860I254779k73284k23928k50929k28865k97923m80667k44679k58160k02178j84228
2850F609938k53699k56825j77570j96409j56404l4288j15851j97850o6829j99057
$$ plain form
2840 4955156 4892189 4757447 4606035 4398735 4324282 4210308 4122967 4073401 3951574 3706227
2830 3706227 3550924 3409696 3523306 3361565 3152340 3073471 2849192 2735683 2557070 2575278
2820 2575278 2670363 2699152 2531942 2337928 2267048 2252541 2173835 2056767 2052098 2134535 2165142
2809 2165142 2089039 2006118 1904451 1846863 1909063 1766511 1675621 1660795 1714470 1685385 1538634
2798 1538634 1537436 1484338 1603703 1659694 1430528 1407634 1518291 1290054 1307474 1383411 1374546
2787 1374546 1201714 1108644 1138820 1015042 1119365 1236096 1234824 1032818 1098457 1015859 1106341
2776 1106341 1100729 1198399 1127189 1092569 1007242 892667 781232 701903 977265 1019498 1062057
2765 1062057 949059 832755 882143 819184 872662 961792 942788 803267 802263 828055 765667
$$ packed form
2840D955156o2967j34742j51412k07300p4453j13974q7341m9566j21827k45347
2830C706227j55303j41228J13610j61741k09225p8869k24279j13509j78613J8208
2820B575278R5085K8789j67210j94014p0880j4507p8706j17068m669Q2437L0607
2809B165142p6103q2921j01667n7588O2200j42552r0890j4826N3675k9085j46751
2798A538634j198n3098J19365N5991k29166k2894J10657k28237J7420P5937q865
2787A374546j72832r3070L0176j23778J04323J16731j272k02006O5639q2598R0482
2776A106341n612R7670p1210l4620q5327j14575j11435p9329K75362M2233M2559
2765A062057j12998j16304M9388o2959N3478Q9130j9004j39521j004K5792o2388
$$ plain form
2754 765667 766980 899741 875972 750007 841963 810472 813120 729192 671223 729812 798253 834124
2742 834124 881502 857363 599032 502493 512926 468578 573289 555809 600275 689474 579580
2731 579580 578864 667396 703801 575272 624886 666652 622706 749217 700449 656409 692417 666420
2719 666420 648393 548015 447211 542637 578031 420379 499519 475873 421339 470795 465690
2708 465690 532781 545096 597877 631260 539949 531539 591840 444464 391981 410065 500532 540112
2696 540112 624831 582251 500224 531660 539136 417880 371560 256509 218326 268633 344541
2685 344541 294696 279995 311939 290723 257298 228104 329745 410752 414498 408039 348128 275000
2673 275000 242955 221648 294398 364960 284968 253102 240518 155525 298531 220259 230920
$$ packed form
2754G65667J313J32761k3769j25965R1956l1491K648q3928n7969N8589O8441L5871
2742H34124M7378k4139k58331r6539J0433m4348J04711j7480M4466Q9199j09894
2731E79580p16Q8532L6405j28529M9614M1766m3946J26511m8768m4040L6008k5997
2719F66420j8027j00378j00804R5426L5394j57652P9140k3646n4534M9456n105
2708D65690O7091J2315N2781L3383r1311q410O0301j47376n2483J8084R0467L9580
2696E40112Q4719m2580q2027L1436P476j21256m6320j15051l8183N0307P5908
2685C44541m9845j4701L1944k1216l3425k9194J01641Q1007L746o459n9911p3128
2673B75000l2045k1307P2750P0562p9992l1866j2584q4993J43006p8272J0661
$$ plain form
2662 230920 338928 399288 309739 273811 370568 547837 498766 458539 255490 114359 314743
2651 314743 330624 401555 445291 347951 339000 305922 350110 331601 345126 297941 333407 325567
2639 325567 261320 361717 429224 465932 589631 564628 513177 608585 537580 419156 451536
2628 451536 544662 508958 523933 450774 393152 382419 500891 526600 449324 351180 490833
2617 490833 630663 490793 418534 502630 426262 549714 619011 575658 545356 577284 653049
2606 653049 589627 585641 484356 580351 782837 873714 799770 503880 595892 628384 392890
2595 392890 479053 615591 643030 678610 623172 436729 365922 426751 472212 568882 570812
2584 570812 617796 639379 627755 698251 759159 605589 631254 715959 845676 754519 682380
$$ packed form
2662B30920J08008O0360q9549l5928R6757J77269m9071m0227k03049j41131K00384
2651C14743J5881P0931M3736r7340q951l3078M4188j8509J3525m7185L5466p840
2639C25567o4247J00397O7507L6708J23699k5003n1451R5408p1005j18424L2380
2628D51536R3126l5704J4975p3159n7622j0733J18472K5709p7276r8144J39653
2617D90833J39830j39870p2259Q4096p6368J23452O9297m3353l0302L1928P5765
2606F53049o3422l986j01285R5995K02486R0877p3944k95890R2012L2492k35494
2595C92890Q6163J36538K7439L5580n5438j86443p0807O0829M5461R6670J930
2584E70812M6984K1583j1624P0496O0908j53570K5665Q4705J29717r1157p2139
$$ plain form
2573 682380 679472 631938 549024 585472 851245 820253 742382 590718 576125 543425 446087
2562 446087 486659 411757 450956 546880 454275 454774 457498 357335 454463 593556 522153 496585
2550 496585 449173 420794 469110 440172 391036 449788 386691 436253 550492 587904 612573
2539 612573 505642 500261 532665 386847 429367 248808 287755 359670 394217 504394 389704
2528 389704 304800 284974 258898 262766 307071 414003 381102 431014 345596 376514 344438 281521
2516 281521 217693 360797 382353 380255 236504 341198 275604 140459 328267 212659 13553
2505 13553 -44282 300991 155080 26032 154494 162614 252740 322671 165963 48545 102962
2494 102962 240923 249860 210963 164365 263115 89656 135045 230418 86080 80235 198322
$$ packed form
2573F82380k908m7534q2914L6448K65773l0992p7871j51664j4593l2700r7338
2562D46087M0572p4902L9199R5924r2605M99K724j00163R7128J39093p1403k5568
2550D96585m7412k8379M8316k8938m9136N8752o3097M9562J14239L7412K4669
2539F12573j06931n381L2404j45818M2520j80559L8947P1915L4547J10177j14690
2528C89704q4904j9826k6076L868M4305J06932l2901M9912q5418L0918l2076o2917
2516B81521o3828J43104K1556k098j43751J04694o5594j35145J87808j15608j99106
2505A3553n7835L45273j45911j29048J28462Q120R0126O9931j56708j17418N4417
2494A02962J37961Q937l8897m6598R8750j73459M5389R5373j44338n845J18087
$$ plain form
2483 198322 219111 217292 123431 171357 226818 412808 415943 258423 297389 148878 62225
2472 62225 114568 6929 126624 250990 251680 161409 169305 262568 205511 -24602 -123833 22000
2460 22000 162595 143073 94758 65341 22923 -8651 73973 160779 187291 156503 110564 44681
2448 44681 122929 211555 147377 147800 25105 27782 127561 224586 223593 150079 55293 214737
2436 214737 150113 -2870 101768 43646 85445 23568 -189991 -188722 -171115 -44638 -5705
2425 -5705 48186 130673 98273 22966 95071 167350 158280 203350 85487 54217 20090 55668
2413 55668 -7344 -22360 -53094 24679 134827 109763 122212 109267 79031 48962 177024
2402 177024 134315 178620 108037 20401 -37174 -82540 12768 38397 -38480 27962 84593 51141
$$ packed form
2483A98322K0789j819r3861M7926N5461J85990L135j57520L8966j48511q6653
2472F2225N2343j07639J19695J24366O90r0271P896R3263n7057k30113r9231J45833
2460B2000J40595j9522m8315k9417m2418l1574Q2624Q6806K6512l0788m5939o5883
2448D4681P8248Q8626o4178M23j22695K677R9779R7025r93p3514r4786J59444
2436B14737o4624j52983J04638n8122M1799o1877k13559J269J7607J26477L8933
2425e705N3891Q2487l2400p5307P2105P2279r070M5070j17863l1270l4127L5578
2413E5668o3012j5016l0734P7773J10148k5064J2449j2945l0236l0069J28062
2402A77024m2709M4305p0583q7636n7575m5366R5308K5629p6877O6442N6631l3452
$$ plain form
2390 51141 -37049 10530 -22827 116009 50510 -69441 23546 122020 -21068 -71128 83530
2379 83530 -43049 6850 46873 -116318 -96688 58360 -39956 -83782 -11075 -45959 101979
2368 101979 130895 -4313 171711 142994 84003 -65394 25113 198007 164186 250263 159942
2357 159942 178227 215528 147634 249852 188581 223737 74159 21686 131107 118235 171870
2346 171870 70896 -1501 10638 55435 60593 47636 144565 213098 185441 27315 7186
2335 7186 -70349 -106185 51358 29681 -41103 -126826 -164698 43700 108590 104297 171269 270973
2323 270973 241773 85693 -67415 -226060 -51263 -9825 -65265 -172751 -70996 -140675
2313 -140675 67916 153054 10692 11786 50670 42131 -204459 -290193 -242538 -148736 18463
$$ packed form
2390E1141q8190M7579l3357J38836o5499j19951R2987R8474j43088n0060J54658
2379H3530j26579M9899M0023j63191J9630J55048r8316m3826P2707l4884J47938
2368A01979K8916j35208J76024k8717n8991j49397R0507J72894l3821Q6077r0321
2357A59942J8285L7301o7894J02218o1271L5156j49578n2473J09421j2872N3635
2346A71870j00974p2397J2139M4797N158j2957R6929O8533k7657j58126k0129
2335G186p7535l5836J57543k1677p0784q5723l7872K08398O4890m293O6972R9704
2323B70973k9200j56080j53108j58645J74797M1438n5440j07486J01755o9679
2313a40675K08591Q5138j42362J094L8884q539k46590q5734M7655R3802J67199
$$ plain form
2302 18463 115530 107197 80451 93963 112267 208563 195331 53828 7572 8144 206206 272368
2290 272368 237263 146013 205645 200713 111342 133106 187805 274224 202032 129287 21155 23208
2278 23208 52109 87496 219706 133804 32163 69060 238939 209143 183064 87151 54052
2267 54052 160741 92124 15209 114952 110510 85265 174701 73290 273756 246349 57503
2256 57503 7182 53574 -18862 110926 183017 258761 299389 161634 71938 117831 333563
2245 333563 185288 80132 170029 263209 248873 322746 293793 82009 36726 229554 149057
2234 149057 334605 301278 203060 25697 26929 145201 153526 138776 50256 17083 79951
2223 79951 106738 61113 -154072 -68123 21880 48821 -31602 -23014 87810 -18223 32576
$$ packed form
2302A8463R7067q333k6746J3512J8304R6296j3232j41503m6256N72J98062O6162
2290B72368l5105r1250N9632m932q9371K1764N4699Q6419p2192p2745j08132K053
2278B3208K8901L5387J32210q5902j01641L6897J69879k9796k6079r5913l3099
2267E4052J06689o8617p6915R9743m442k5245Q9436j01411K00466k7407j88846
2256E7503n0321M6392p2436J29788P2091P5744M0628j37755q9696M5893K15732
2245C33563j48275j05156Q9897R3180j4336P3873k8953k11784m5283J92828q0497
2234A49057J85548l3327r8218j77363J232J18272Q325j4750q8520l3173O2868
2223G9951K6787m5625k15185Q5949R0003K6941q0423Q588J10824j06033N0799
$$ plain form
2212 32576 126659 203551 400975 258087 109047 95263 173956 177818 201437 174562 100673
2201 100673 188986 210149 284150 278122 406044 307592 338067 260646 214595 319884 436018
2190 436018 452809 234021 140434 227609 175319 273929 494495 478339 318062 460511 476669
2179 476669 424604 352063 485551 415476 491776 709717 677798 499523 368520 394160 609418
2168 609418 673098 593989 511167 668828 817227 879513 814702 553393 523429 808667 819640
2157 819640 746571 840710 699129 852060 940834 933137 954556 917753 1091346 1027158 1089755
2146 1089755 1129977 1281425 1268834 1272498 1432052 1424101 1477718 1369271 1346333 1521409 1550463
2135 1550463 1519526 1697659 1814457 1636630 1675092 1630602 1635840 1903541 1944041 1974380 2179489
$$ packed form
2212C2576R4083P6892J97424j42888j49040j3784P8693L862K3619k6875p3889
2201A00673Q8313K1163P4001o028J27922r8452L0475p7421m6051J05289J16134
2190D36018J6791k18788r3587Q7175n2290R8610K20566j6156j60277J42449J6158
2179D76669n2065p2541J33488p0075P6300K17941l1919j78275j31003K5640K15258
2168F09418O3680p9109q2822J57661J48399O2286o4811k61309k9964K85238J0973
2157H19640p3069R4139j41581J52931Q8774p697K1419l6803J73593o4188O2597
2146A089755M0222J51448j2591L664J59554p951N3617j08447k2938J75076K9054
2135A550463l0937J78133J16798j77827L8462m4490N238K67701M0500L0339K05109
$$ plain form
2124 2179489 2331109 2342741 2628116 2635266 2722395 3104840 3340848 3160738 3397338 3548061
2114 3548061 3726591 3897991 4326907 4657232 4861056 5316316 5444613 5924350 6342957 6927175
2104 6927175 7409164 7784949 8270952 8996280 9911867 11082209 12492035 14547004 17388785
2095 17388785 20867574 25506754 31594270 39155314 46833858 50180057 44890060 35934426
2087 35934426 28180457 22150124 18112643 15177038 13037625 11591409 10388170 9345792
2079 9345792 8615193 8193927 7891786 7537608 7135276 6658654 6035445 5583177 5152139 4727415
2069 4727415 4499375 4166870 3766122 3601269 3440226 3520045 3341753 3323408 3226238 2872845
2059 2872845 2695257 2534790 2393469 2251391 2243821 2075522 1907405 1879350 2054956 2017667
$$ packed form
2124B179489J51620J1632K85375P150Q7129L82445K36008j80110K36600J50723
2114C548061J78530J71400M28916L30325K03824M55260J28297M79737M18607N84218
2104F927175M81989L75785M86003P25328R15587J170342J409826K054969K841781
2095A7388785L478789M639180O087516P561044P678544L346199n289997q955634
2087C5934426p753969o030333m037481k935605k139413j446216j203239j042378
2079I345792p30599m21266l02141l54178m02332m76622o23209m52268m31038m24724
2069D727415k28040l32505m00748j64853j61043P9819j78292j8345r7170l53393
2059B872845j77588j60467j41321j42078p570j68299j68117k8055J75606l7289
$$ plain form
2049 2017667 1728413 1555333 1476180 1579617 1380249 1356430 1390017 1445862 1343552 1351971 1290408
2038 1290408 1218728 1241668 1218381 1235996 1186172 1195702 1074428 1109111 1096139 1062289 1040175
2027 1040175 974457 932921 948391 861248 903743 845035 839301 900451 807115 757020 832747 740001
2015 740001 643690 561316 378492 283055 432740 505238 487060 543388 589781 535694 630900
2004 630900 528839 610232 575079 576185 560675 503802 565560 400082 278549 337017 448322
1993 448322 443856 315487 375726 182858 276837 349123 319575 247579 215829 296910 292347 337972
1981 337972 300875 311659 186203 359864 335605 401880 543785 417296 241128 103600
1971 103600 127463 218769 432861 379093 317305 169299 235336 205489 203376 263886 199279
$$ packed form
2049B017667k89254j73080p9153J03437j99368k3819L3587N5845j02310Q419o1563
2038A290408p1680K2940k3287J7615m9824R530j21274L4683j2972l3850k2114
2027A040175o5718m1536J5470q7143M2495n8708n734O1150r3336n0095P5727r2746
2015G40001r6311q2374j82824r5437J49685P2498j8178N6328M6393n4087R5206
2004F30900j02061Q1393l5153J106j5510n6873O1758j65478j21533N8468J11305
1993D48322m466j28369O0239j92868R3979P2286k9548p1996l1750Q1081m563M5625
1981C37972l7097J0784j25456J73661k4259O6275J41905j26489j76168j37528
1971A03600K3863R1306K14092n3768o1788j48006O6037k9847k113O0510o4607
$$ plain form
1960 199279 78800 97569 269297 375603 206014 264199 185737 143500 118676 136372 159973
1949 159973 182259 100342 100397 153531 103336 323425 135578 100988 20921 131694 145407 185004
1937 185004 50183 96515 245899 285811 197181 317121 324927 234903 37229 -17401 -83078
1926 -83078 -28010 84342 26608 63749 138665 161685 256750 226449 310539 26329 175899
1915 175899 153003 53934 60793 -53515 88961 -13584 -92515 44154 302079 179888 126462
1904 126462 216924 179265 21013 -138516 -31364 111894 182939 142484 43227 195239 222959
1893 222959 190251 154636 149152 215228 103317 69314 218993 106988 94419 112588 279158
1882 279158 73265 37566 14980 19646 35328 17760 17256 -142433 47077 24870 -22362 65767
$$ packed form
1960A99279j20479J8769J71728J06306j69589N8185p8462m2237k4824J7696K3601
1949A59973K2286q1917N5N3134n0195K20089j87847l4590q0067J10773J3713L9597
1937A85004j34821M6332J49384L9912q8630J19940P806r0024j97674n4630o5677
1926h3078N5068J12352n7734L7141P4916K3020R5065l0301Q4090k84210J49570
1915A75899k2896r9069O859j14308J42476j02545p8931J36669K57925j22191n3426
1904A26462R0462l7659j58252j59529J07152J43258P1045m0455r9257J52012K7720
1893B22959l2708l5615n484O6076j11911l4003J49679j12005j2569J8169J66570
1882B79158k05893l5699k2586M666J5682j7568n04j59689J89510k2207m7232Q8129
$$ plain form
1870 65767 -105752 -121045 33814 -20857 -38393 7590 -21470 -22483 62641 83234 76210 -1548
1858 -1548 82912 10636 -131298 32345 -45818 -82010 108379 206575 130775 -26562 -50025
1847 -50025 14801 132683 -10316 -24613 214278 174428 287978 205543 255159 320610 86749
1836 86749 51540 8747 12691 41359 50704 141529 66188 -67061 39167 64427 35154 74941
1824 74941 51845 148500 327415 298877 159685 103027 10580 65838 154519 201081 171680
1813 171680 228217 189861 125927 235623 304583 206910 6401 25815 78366 79705 188766
1802 188766 347828 288540 108930 182339 -56279 97249 -596 -67377 83523 41583 -31279
1791 -31279 -6178 1845 -217777 -38425 126359 86003 106211 4425 29920 -24271 447
$$ packed form
1870F5767j71519j5293J54859n4671j7536M5983k9060j013Q5124K0593p024p7758
1858a548Q4460p2276j41934J63643p8163l6192J90389R8196p5800j57337k3463
1847e0025O4826J17882j42999j4297K38891l9850J13550q2435M9616O5451k33861
1836H6749l5209m2793L944K8668R345R0825p5341j33249J06228K5260k9273L9787
1824G4941k3096R6655J78915k8538j39192n6658r2447N5258Q8681M6562k9401
1813A71680N6537l8356o3934J09696O8960r7673k00509J9414N2551J339J09061
1802A88766J59062n9288j79610P3409k38618J53528r7845o6781J50900m1940p2862
1791c1279K5101Q023k19622J79352J64784m0356K0208j01786K5495n4191K4718
$$ plain form
1780 447 145972 64754 73573 -20741 67349 -97545 -96333 52901 51583 -50222 -79362 -36845
1768 -36845 -14914 147505 86161 -20270 -5628 108239 -65029 -31185 162619 9003 -8960
1757 -8960 -120377 29538 56466 49841 62356 -61894 -194298 -102916 -74050 -51306 -38720
1746 -38720 -60734 -70956 -710 -65495 -161121 -27986 33724 58103 -84706 -52710 43562
1735 43562 97839 -50872 -169436 -74324 -217576 -1019 65424 86544 154070 141720 62560
1724 62560 -34256 20895 31535 59141 -62312 1881 192819 124586 161327 72350 -23398
1713 -23398 -83316 8542 -44633 -87449 13823 96168 21925 -99961 -156383 -23623 -55090
1702 -55090 -103518 50273 -100939 -22569 71746 129455 94272 100641 111507 38014 -11837 -26743
$$ packed form
1780D47J45525q1218Q819r4314Q8090j64894J212J49234j318j01805k9140M2517
1768c6845K1931J62419o1344j06431J4642J13867j73268L3844J93804j53616j7963
1757h960j11417J49915K6928o625J2515j24250j32404R1382K8866K2744J2586
1746c8720k2014j0222P0246o4785r5626J33135O1710K4379j42809L1996R6272
1735D3562N4277j48711j18564R5112j43252K16557O6443K1120O7526j2350p9160
1724F2560r6816N5151J0640K7606j21453O4193J90938o8233L6741q8977r5748
1713b3398n9918R1858n3175m2816J01272Q2345p4243j21886n6422J32760l1467
1702e5090m8428J53791j51212P8370R4315N7709l5183O369J0866p3493m9851j4906
$$ plain form
1690 -26743 56816 130816 -69511 -5027 -70141 -41419 -83891 -43886 1904 -4061 52781 -93735
1678 -93735 27815 110560 853 -72490 -159016 -151408 -78372 59572 88422 -16282 -39038
1667 -39038 -4323 7475 -58816 65900 192373 28641 19805 13873 236612 132234 41448
1656 41448 114775 169786 -13432 -90509 14586 136379 204677 25317 -16343 8306 61103
1645 61103 25035 69929 83132 144009 69300 90534 18948 -65343 -101097 -123614 -30524 -220222
1633 -220222 -194572 10167 -51909 17842 -38679 1643 6834 -84402 -112268 -113290 -213115 -224648
1621 -224648 -72027 -228274 -139454 -233413 -151114 237880 214391 150387 204214 61542 -38216
1610 -38216 -25986 -93372 -112824 6758 -16641 52678 166710 105999 83719 42589 89933
$$ packed form
1690b6743Q3559P4000k00327O4484o5114K8722m2472M0005M5790n965N6842j46516
1678i3735J21550Q2745j09707p3343q6526P608P3036J37944K8850j04704k2756
1667c9038L4715J1798o6291J24716J26473j63732q836n932K22739j04378r0786
1656D1448P3327N5011j83218p7077J05095J21793O8298j79360m1660K4649N2797
1645F1103l6068M4894J3203O0877p4709K1234p1586q4291l5754k2517R3090j89698
1633b20222K5650K04739o2076O9751n6521M0322N191r1236k7866j022r9825j1533
1621b24648J52621j56247Q8820r3959Q2299L88994k3489o4004N3827j42672r9758
1610c8216J2230o7386j9452J19582k3399O9319J14032o0711k2280m1130M7344
$$ plain form
1599 89933 55704 52806 -46638 118625 76625 -23273 -37366 39013 56376 92436 68918 -103845
1587 -103845 -23829 -67348 -103968 65284 192709 101219 -48316 -42504 31140 -140187 -342
1576 -342 84682 34305 -108485 -237725 -123428 -37139 -44336 -46245 -46102 -153103 -179971 -84447
1564 -84447 24064 204971 189433 90736 73864 170427 134212 34729 -81938 -280792 -332727
1553 -332727 -297941 -121350 -124390 -71594 38922 72657 100728 17512 -111943 -29509 -43519
1542 -43519 -65277 -90515 -85162 -56103 -124472 -162590 -73890 -125620 -119984 -48422 45566 2678
1530 2678 120488 90380 9736 48184 -13032 -146624 -88575 -62033 -70079 -84841 -39761 9069
1518 9069 184530 215244 171509 166532 157638 121288 46171 -31643 -95175 26097 5762 14610
$$ packed form
1599H9933l4229k898r9444J65263m2000r9898j4093P6379J7363L6060k3518j72763
1587a03845Q0016m3519l6620J69252J27425r1490j49535N812P3644j71327J39845
1576c42Q5024n0377j42790j29240J14297Q6289p197j909J43j07001k6868R5524
1564h4447J08511J80907j5538r8697j6872R6563l6215r9483j16667j98854n1935
1553c32727L4786J76591l040N2796J10516L3735K8071q3216j29455Q2434j4010
1542d3519k1758k5238N353K9059o8369l8118Q8700n1730N636P1562R3988m2888
1530B678J17810l0108q0644L8448o1216j33592N8049K6542q046j4762M5080M8830
1518I069J75461L0714m3735m977q894l6350p5117p7814o3532J21272k0335Q848
$$ plain form
1506 14610 -45375 -37418 -69500 -40105 -62102 -45185 -31022 -66114 -41073 80775 -20922 2387
1494 2387 48945 91498 -98015 4557 -21458 -27859 126930 -80338 -157235 -131683 -85275
1483 -85275 -47297 48320 -5229 -94433 -133042 71004 136648 -33823 -79187 13167 52607
1472 52607 30945 -50586 -45428 -63110 -74046 52949 25718 -9802 -100081 -170402 -131561 11900
1460 11900 -6360 -26896 -149599 -144141 9939 4246 -41797 34534 -65961 142746 143705 21278
1448 21278 -90766 -159609 64756 62846 36488 6875 55371 -16733 -103084 62406 70067 136557
1436 136557 175794 188316 145905 148809 146374 73049 -26945 -51918 -19810 35558 49475 129791
1424 129791 50103 27655 75728 -62125 -102460 -57980 -42889 -39528 -39710 -140766 -119571 -47061
$$ packed form
1506A4610n9985P957l2082K9395k1997J6917J4163l5092K5041J21848j01697K3309
1494B387M6558M2553j89513J02572k6015o401J54789k07268p6897K5552M6408
1483h5275L7978R5617n3549q9204l8609K04046O5644j70471m5364R2354L9440
1472E2607k1662q1531N158j7682j0936J26995k7231l5520r0279p0321L8841J43461
1460A1900j8260k0536j22703N458J54080n693m6043P6331j00495K08707R59j22427
1448B1278j12044o8843K24365j910k6358k9613M8496p2104q6351J65490P661O6490
1436A36557L9237J2522m2411K904k435p3325r9994k4973L2108N5368J3917Q0316
1424A29791p9688k2448M8073j37853m0335M4480J5091L361j82j01056K1195P2510
$$ plain form
1412 -47061 -98902 -76775 -774 -68262 84062 -99916 -9631 -58478 -163519 -28202 -43669
1401 -43669 -40356 97 -27009 101706 -1214 3114 -140488 -147348 -67495 -203579 -136027 39487
1389 39487 63031 -62094 -244879 -161570 -103262 -124683 -46250 -78328 -46194 1929 -65201
1378 -65201 8627 -29168 14844 -155294 -94223 -70855 -43655 82554 -16785 -41915 -138016
1367 -138016 135549 318208 212826 11111 -74154 49909 -56522 -148486 -198361 -121691
1357 -121691 128974 153197 155485 73690 54518 -66020 19068 -83079 -44091 78961 82374
1346 82374 -140314 -131395 -21338 16925 -4547 94107 234032 123871 -28323 -503 23966
1335 23966 -19493 -85057 -149672 52868 89299 34211 103545 53586 52722 27957 -175761 -109629
$$ packed form
1412d7061n1841K2127P6001o7488J52324j83978R0285m8847j05041J35317j5467
1401d3669L313M0453k7106J28715j02920M328j43602o860P9853j36084O7552J75514
1389C9487K3544j25125j82785Q3309N8308k1421P8433l2078L2134M8123o7130
1378f5201P3828l7795M4012j70138O1071K3368K7200J26209r9339k5130r6101
1367a38016K73565J82659j05382k01715q5265J24063j06431r1964m9875P6670
1357a21691K50665K4223K288q1795j9172j20538Q5088j02147L8988J23052L413
1346H2374k22688Q919J10057L8263k1472R8654J39925j10161j52194K7820K4469
1335B3966m3459o5564o4615K02540L6431n5088O9334m9959q64k4765k03718O6132
$$ plain form
1323 -109629 -45008 -48044 -51695 -88955 -137648 -210873 -131312 -28587 -42772 -41835 -69865 -127182
1311 -127182 -10607 109200 -2368 -225327 -19975 52403 -123359 -40795 -40185 -115304 -100306
1300 -100306 -47477 -68075 -278716 -24902 54191 -18586 63024 154737 212627 194162 122479
1289 122479 -101049 -98272 -62913 -91968 -34765 -31821 -146886 -115589 30432 -31190 -164900
1278 -164900 -108747 -58752 123534 186159 102759 -5440 14973 97811 198525 42044 -54684
1267 -54684 -40577 -78241 10878 -20156 60776 178443 -121872 -300920 -244800 -218464 -16197
1256 -16197 134915 26136 -6579 -72008 -136608 -197836 61253 60640 -782 12106 47275 -116995
1244 -116995 -204578 -66646 -82888 -78696 41803 173525 -88007 -231669 -242887 -160984 -85305
$$ packed form
1323a09629O4621l036l651l7260m8693p3225P9561J02725j4185R37k8030n7317
1311a27182J16575J19807j11568k22959K05352P2378j75762Q2564O10p5119J4998
1300a00306N2829k0598k10641K53814P9093p2777Q1610R1713N7890j8465p1683
1289A22479k23528K777L5359k9055N7203K944j15065L1297J46021o1622j33710
1278a64900N6153M9995J82286O2625q3400j08199K0413Q2838J00714j56481r6728
1267e4684J4107l7664Q9119l1034Q0932J17667l00315j79048N6120K6336K02267
1256a6197J51112j08779l2715o5429o4600o1228K59089o13o1422J2888L5169j64270
1244a16995q7583J37932j6242M192J20499J31722k61532j43662j1218Q1903P5679
$$ plain form
1233 -85305 -54937 1833 -180176 -280909 -169187 -15250 152145 -17800 -38322 -103569 -13622
1222 -13622 51391 38994 1403 -42322 25046 92531 142308 829 -40441 -43319 46659 79534
1210 79534 47247 56617 150864 106303 92182 58280 50390 54526 4272 -4514 -11382 9232 130183
1197 130183 163236 169880 127366 -117518 -51576 -71021 -82620 -23221 -2059 15649 12362 21407
1185 21407 44743 -21834 -13982 55741 -57687 -51309 -63893 -26052 -24314 -177900 -44471 24978
1173 24978 -62730 -44220 3310 -65448 63649 -12247 59532 79233 188056 128822 111192
1162 111192 36685 -168848 6340 99050 104489 111491 -35163 -77764 -86256 6396 -53276 -93597
1150 -93597 -26117 37989 -36821 -27264 90864 93487 76374 52514 18002 -118407 -34021 -30323
$$ packed form
1233h5305L0368N6770j82009j00733J11722J53937J67395j69945k0522o5247Q9947
1222a3622O5013j2397l7591m3725O7368O7485M9777j41479m1270k878Q9978L2875
1210G9534l2287R370R4247m4561j4121l3902p890M136n0254q786o868K0614J20951
1197A30183L3053O644m2514k44884O5942j9445j1599N9399K1162J7708l287R045
1185B1407K3336o6577P852O9723j13428O378j2584L7841J738j53586J33429O9449
1173B4978q7708J8510M7530o8758J29097p5896P1779J9701J08823n9234j7630
1162A11192p4507k05533J75188R2710N439P002j46654m2601q492R2652n9672m0321
1150i3597O7480O4106p4810R557J18128K623j7113k3860l4512j36409Q4386L698
$$ plain form
1138 -30323 -18147 -119600 23876 177887 68333 16485 63102 -72855 33540 -59997 31316
1127 31316 144002 42146 -26016 48661 100783 72321 -52011 -113868 -162572 -184226 -228486
1116 -228486 -59867 36087 -85248 -38558 -109970 83874 72811 -58061 72982 94806 108386
1105 108386 16371 -1660 -88750 -74420 12801 50130 19745 32708 89074 68773 -36079
1094 -36079 35958 85750 -91755 -96312 -19457 -131113 -110560 -60424 -28831 -16544 74618 182600
1082 182600 -50945 -45663 55000 -28364 -168095 -141204 -17591 188166 17773 -106560
1072 -106560 -34702 117643 37804 -18830 -48977 -46572 -174093 -108511 -116946 -49195 20295 -162587
1060 -162587 -191348 -112971 -60836 -116281 -138495 -231385 -142200 -168001 -124523 -12838 -13800 -46371
$$ packed form
1138c0323J2176j01453J43476J54011j09554n1848M6617j35957J06395r3537R1313
1127C1316J12686j01856o8162P4677N2122k8462j24332o1857m8704k1654m4260
1116b28486J68619R5954j21335M6690p1412J93844j1063j30872J31043K1824J3580
1105A08386r2015j8031q7090J4330Q7221L7329l0385J2963N6366k0301j04852
1094c6079P2037M9792j77505m557P6855j11656K0553N0136L1593J2287R1162J07982
1082A82600k33545N282J00663q3364j39731K6891J23613K05757j70393j24333
1072a06560P1858J52345p9839n6634l0147K405j27521O5582q435O7751O9490j82882
1060a62587k8761P8377N2135n5445k2214r2890Q9185k5801M3478J11685r62l2571
$$ plain form
1048 -46371 -66296 -104433 109798 -65011 -112438 -12683 23509 105894 56906 39748 59327
1037 59327 25744 114984 76183 52901 -60859 -156137 -75866 -40373 -32508 -51048 -40871 -126073
1025 -126073 9999 -18078 -149342 -100697 50854 -62846 16394 91120 -13810 -42421 -118162
1014 -118162 -91089 -86254 -16765 -87854 -31980 97311 114205 -18712 -121695 28648 161556
1003 161556 48843 2264 37872 -106388 -103756 -100113 -41400 -74467 13366 22621 122266 15076
991 15076 67240 -84840 -233579 -233730 -69550 60746 119172 69925 -81353 -149547 -168836
980 -168836 -71086 -71178 -1704 66403 158746 101546 112922 67069 36826 35055 16860 122560
968 122560 144426 -95720 -47748 46074 67559 82895 29230 -63507 -48889 26171 78974 52167
$$ packed form
1048d6371j9925l8137K14231j74809m7427R9755L6192Q2385m8988j7158J9579
1037E9327l3583Q9240l8801k3282j13760r5278Q0271L5493P865j8540J0177q5202
1025a26073J36072k8077j31264M8645J51551j13700P9240P4726j04930k8611p5741
1014a18162K7073M835O9489p1089N5874J29291J6894j32917j02983J50343J32908
1003A61556j12713m6579L5608j44260K632L643N8713l3067Q7833R255R9645j07190
991A5076N2164j52080j48739j51J64180J30296N8426m9247j51278o8194j9289
980a68836R7750r2O9474O8107R2343n7200J1376m5853l0243j771j8195J05700
968A22560K1866k40146M7972R3822K1485J5336n3665r2737J4618P5060N2803k6807
$$ plain form
956 52167 -52104 -267 -178389 -177498 -29281 -69553 6010 -49728 -64541 -140007 37244 69856
944 69856 -25643 -99593 -112142 34631 -113300 -115113 -47034 -58800 17910 56607 -15043 7559
932 7559 -7549 16708 108981 56522 159024 131365 124374 211096 168223 181079 98297 172050
920 172050 67505 84835 134947 93712 -6031 50355 90284 86092 83489 -72711 6593 27676
908 27676 134991 317858 217601 -42205 -192120 -148974 -70701 -115063 21115 65155 8478
897 8478 22337 9242 77189 -29044 -134381 25584 35350 50101 67811 -90352 -87046 -30803
885 -30803 12013 73028 -79884 -148100 -169561 -174228 -132771 -130024 -111780 -105202 -191978 -65778
873 -65778 53521 73375 -13739 -36837 -203745 -117580 18866 -11915 -35170 14083 142885
$$ packed form
956E2167j04271N1837j78122Q91J48217m0272P5563n5738j4813p5466J77251L2612
944F9856r5499p3950j2549J46773j47931j813O8079j1766P6710L8697p1650K2602
932G559j5108K4257R2273n2459J02502k7659o991Q6722m2873J2856q2782P3753
920A72050j04545J7330N0112m1235r9743N6386L9929m192k603j56200P9304K1083
908B7676J07315J82867j00257k59806j49915M3146P8273m4362J36178M4040n6677
897H478J3859j3095O7947j06233j05337J59965R766J4751J7710j58163L306N6243
885c0803M2816O1015j52912o8216k1461m667M1457K747J8244O578q6776J26200
873f5778J19299J9854q7114k3098j66908Q6165J36446l0781k3255M9253J28802
$$ plain form
862 142885 66497 81350 -28859 -57382 -149237 -92337 -33659 -10872 96146 71216 70098 -57231
850 -57231 -66280 -50444 86970 17322 -168085 -275856 -98201 17839 12032 -190 82245
839 82245 120397 50164 28142 97254 33457 -78255 -136057 -16453 -111940 -128115 29825
828 29825 36453 -108290 -57213 90402 -33325 -55827 -167835 -171354 -236417 -227450 -262494 -96866
816 -96866 -194260 -149229 47696 -44533 -267934 -177748 -183688 -160881 5013 25944 -82686
805 -82686 -26136 117622 19581 86041 125460 44403 -151859 -245902 -116143 -284859 -85307
794 -85307 37254 19813 -140931 -25577 166034 69479 -32177 -175828 -139493 -155751 -109047
783 -109047 -38351 -175359 -107547 86061 143097 49074 -55082 98081 111048 -26136 56113
$$ packed form
862A42885p6388J4853j10209k8523r1855N6900N8678K2787J07018k4930j118j27329
850e7231r049J5836J37414o9648j85407j07771J77655J16040n807j2222Q2435
839H2245L8152p0233k2022O9112o3797j11712n7802J19604r5487j6175J57940
828B9825O628j44743N1077J47615j23727k2502j12008l519o5063Q967l5044J65628
816i6866r7394M5031J96925r2229k23401R0186n940K2807J65894K0931j08630
805h2686N6550J43758r8041O6460L9419q1057j96262r4043J29759j68716J99552
794h5307J22561j7441j60744J15354J91611r6555j01656j43651L6335j6258M6704
783a09047P0696j37008O7812J93608N7036r4023j04156J53163J2967j37184Q2249
$$ plain form
772 56113 3849 -103428 -169872 -118602 -71915 -84503 -164385 -139638 -24495 -86327 -143971 14979
760 14979 123833 -24894 -55326 -16295 97805 -7934 -145698 -257052 -79869 -17649 200202
749 200202 118443 -139878 -92065 29574 16784 64826 2256 -50487 -32137 44184 -100188
738 -100188 -237513 -132173 -119467 -95136 -37124 66158 -104843 59384 89301 68437 -33609
727 -33609 19210 -32382 -258557 -116120 -41306 -129862 -144351 -222695 -88138 -43223 6742
716 6742 27736 27413 -53698 -89624 -119586 -72869 140074 188889 223893 105364 6865 -42438
704 -42438 -118204 -58640 91205 29933 -8854 -17880 14852 -133186 -145574 -139779 -76453 -168779
692 -168779 24469 -4582 5725 -99606 -142100 -76570 -24573 103075 44947 89908 162120
$$ packed form
772E6113n2264j07277o6444N1270M6687j2588p9882K4747J15143o1832n7644J58950
760A4979J08854j48727l0432L9031J14100j05739j37764j11354J77183O2220K17851
749B00202q1759k58321M7813J21639j2790M8042o2570n2743J8350P6321j44372
738a00188j37325J05340J2706K4331N8012J03282j71001J64227K9917k0864j02046
727c3609N2819n1592k26175J42437P4814q8556j4489p8344J34557M4915M9965
716F742K0994l23q1111l5926k9962M6717K12943M8815L5004j18529r8499m9303
704d2438p5766N9564J49845o1272l8787r026L2732j48038j2388N795O3326r2326
692a68779J93248k9051J0307j05331m2494O5530N1997J27648n8128M4961P2212
$$ plain form
681 162120 175373 -86362 -148586 41403 38647 -21133 96625 194720 55784 48344 69494
670 69494 27707 -71053 24079 152795 122422 194645 29369 132863 141807 -18322 9018
659 9018 99564 -118660 -24576 81294 -66874 -181581 -167926 -177430 -256630 1980 83839
648 83839 11617 444 -131314 -112437 -91721 -203807 -120838 -95004 -85951 58815 41486 104671
636 104671 133852 186188 113818 -20946 54996 122991 42623 -191618 -91832 -22159 -83765
625 -83765 -22901 60208 -107251 -127435 4087 121116 109396 93753 -32091 -44831 83346
614 83346 80397 -38492 -180041 34692 37022 -23283 154828 95000 71988 -57618 -231702
603 -231702 -186046 -53014 -43731 12190 292 84343 124441 26422 -2423 -58711 -51902 8905
$$ packed form
681A62120J3253k61735o2224J89989k756n9780J17758R8095j38936p440K1150
670F9494m1787r8760R5132J28716l0373P2223j65276J03494Q944j60129K7340
659I018R0546k18224R4084J05870j48168j14707J3655r504p9200K58610Q1859
648H3839p2222j1173j31758J8877K0716j12086Q2969K5834R053J44766j7329O3185
636A04671K9181N2336p2370j34764P5942O7995q0368k34241R9786O9673o1606
625h3765O0864Q3109j67459k0184J31522J17029j1720j5643j25844j2740J28177
614H3346k949j18889j41549K14733K330o0305J78111n9828k3012j29606j74084
603b31702M5656J33032R283N5921j1898Q4051M0098r8019k8845n6288O809O0807
$$ plain form
591 8905 19972 13144 175793 -89960 -122844 -94326 -96144 -101041 -100484 -128822 -162852 -71490 35077
578 35077 -13302 -133346 -49354 73779 -40540 -165709 -134082 -43040 -84440 -44873 -44463 -48050
566 -48050 -216586 -349462 -219494 -173169 -189006 -159229 1615 -33266 10352 82563 -16004
555 -16004 42514 153391 184529 149722 -44562 -218141 -181364 -82540 -77227 94886 173151
544 173151 131098 95098 -33255 72791 26368 115173 122360 129438 199954 53798 143137 194804
532 194804 172480 50780 64189 148709 43391 77990 100135 17131 36826 74198 22515
521 22515 46530 -10118 56765 30514 -95204 -49328 14013 -53893 -37797 72130 15102 -34117
509 -34117 84399 -8423 -124898 -97021 -19952 82321 52823 71878 113738 24834 31325 35908
$$ packed form
591H905J1067o828J62649k65753l2884K8518j818m897N57k8338l4030R1362J06567
578C5077m8379j20044Q3992J23133j14319j25169L1627R1042m1400L9567M10l587
566d8050j68536j32876J29968M6325j5837K9777J60844l4881M3618P2211r8567
555a6004N8518J10877L1138l4807j94284j73579L6777R8824N313J72113P8265
544A73151m2053l6000j28353J06046m6423Q8805P187P078P0516j46156Q9339N1667
532A94804k2324j21700J3409Q4520j05318L4599K2145q3004J9695L7372n1683
521B2515K4015n6648O6883k6251j25718M5876O3341o7906J6096J09927n7028m9219
509c4117J18516r2822j16475K7877P7069J02273k9498J9055M1860q8904O491M583
$$ plain form
497 35908 -2556 296881 227117 104273 98170 -3451 -9880 -30331 -137566 21764 85337
486 85337 60038 58373 -138474 -190470 -146898 -144522 -13156 31671 17703 14942 95178 127864
474 127864 132051 -20022 -68311 -61818 131602 144718 26095 -60256 73581 60577 48388
463 48388 76379 5729 21708 -5112 -84152 72731 161883 -5898 4056 48756 -14045 40578
451 40578 -111360 -160800 -49578 -221307 -57626 -80131 -91023 6158 -21054 -184128 -58492
$$ packed form
497C5908l8464K99437o9764j22844o103j01621o429k0451j07235J59330O3573
486H5337k5299j665j96847n1996M3572K376J31366M4827j3968k761Q0236L2686
474A27864M187j52073m8289O493J93420J3116j18623q6351J33837j3004j2189
463D8388K7991p0650J5979k6820p9040J56883Q9152j67781R954M4700o2801N4623
451D0578j51938m9440J11222j71729J63681k2505j0892R7181k7212j63074J25636
$$ [...]
##END NTUPLES=NMR SPECTRUM
##END=
