##TITLE=1H_CA-9054-2 
 CDCl3
 8 sc, 
 1.09.2022
##JCAMPDX= 6.0         $$ Bruker NMR JCAMP-DX V2.0
##DATA TYPE= NMR SPECTRUM
##DATA CLASS= NTUPLES
##ORIGIN= UXNMR, Bruker Analytische Messtechnik GmbH
##OWNER= root
$$ XWIN-NMR		Version 3.5
$$ Thu Sep  1 09:34:31 2022 Russian Standard Time (UT+4h)  she@DPX200
##.OBSERVE FREQUENCY= 200.1313499994
##.OBSERVE NUCLEUS= ^1H
##.ACQUISITION MODE= SIMULTANEOUS
##.ACQUISITION SCHEME= undefined
##.AVERAGES= 8
##.DIGITISER RES= 18
##SPECTROMETER/DATA SYSTEM= spect
##.PULSE SEQUENCE= zg30
##.SOLVENT NAME= CDCl3
##.SHIFT REFERENCE= (INTERNAL, CDCl3, 0, 15.7502)
##AUDIT TRAIL= $$ (NUMBER, WHEN, WHO, WHERE, WHAT)
$$ ##TITLE= Audit trail, XWIN-NMR		Version 3.5
$$ ##JCAMPDX= 5.01
$$ ##ORIGIN= Bruker BioSpin GmbH
$$ ##OWNER= she
$$ F:/spectra/data/she/nmr/H-F/1/pdata/1/auditp.txt
$$ ##AUDIT TRAIL=  $$ (NUMBER, WHEN, WHO, WHERE, WHAT)
(   1,<2022-09-01 09:32:47.56 +0400>,<she>,<DPX200>,
      <created by zg, POWCHK disabled, PULCHK disabled
       configuration hash MD5:
       00 E9 B6 7A A2 85 ED C7 34 08 36 98 17 FE 4E 26
       data hash MD5: 16K
       7C 5A C9 FF 01 38 37 64 BD D8 B8 08 4B D5 6A D2>)
(   2,<2022-09-01 09:32:52.76 +0400>,<she>,<DPX200>,
      <Start of raw data processing
       efp BC_mod = 2 LB = 0.24 FT_mod = 6 PKNL = 1 PHC0 = -18043.9 PHC1 = 26.00069 SI = 16K 
       data hash MD5: 16K
       41 90 D5 13 03 70 45 6A 26 EE 10 99 3F 58 21 CF>)
(   3,<2022-09-01 09:33:07.78 +0400>,<she>,<DPX200>,
      <pk PHC0 = -2.540599 PHC1 = 0 
       data hash MD5: 16K
       FE F0 B0 7A D7 56 9D F3 2E C4 67 82 8E AF 0C 05>)
(   4,<2022-09-01 09:33:10.79 +0400>,<she>,<DPX200>,
      <abs ABSG = 5 
       data hash MD5: 16K
       9A 34 E9 86 33 C9 74 04 0E F4 79 A7 4F A1 91 02>)
$$ ##END=
$$ 
$$ hash MD5
$$ 91 82 F4 CC 46 47 26 82 B3 BD 66 00 12 67 B6 56
##$RELAX= 
##$RELAX= 
##$RELAX= 
##$RELAX= 
##$RELAX= 
##$RELAX= 
$$ Bruker specific parameters
$$ --------------------------
##$DU= <F:/spectra>
##$EXPNO= 1
##$NAME= <H-F>
##$PROCNO= 1
##$TYPE= <nmr>
##$USER= <she>
##$AMP= (0..31)
100 100 100 100 100 100 100 100 100 100 100 100 100 100 100 100 100 100 
100 100 100 100 100 100 100 100 100 100 100 100 100 100 
##$AQSEQ= 0
##$AQ_mod= 1
##$AUNM= <au_zg>
##$AUTOPOS= <>
##$BF1= 200.13
##$BF2= 200.13
##$BF3= 200.13
##$BF4= 200.13
##$BF5= 200.13
##$BF6= 200.13
##$BF7= 200.13
##$BF8= 200.13
##$BYTORDA= 1
##$CFDGTYP= 0
##$CFRGTYP= 5
##$CHEMSTR= <none>
##$CNST= (0..31)
1 1 145 1 1 1 1 1 1 1 1 1 1 1 1 1 1 1 1 1 1 1 1 1 1 1 1 1 1 1 1 1 
##$CPDPRG= <>
##$CPDPRG1= <>
##$CPDPRG2= <>
##$CPDPRG3= <>
##$CPDPRG4= <mlev>
##$CPDPRG5= <mlev>
##$CPDPRG6= <mlev>
##$CPDPRG7= <mlev>
##$CPDPRG8= <mlev>
##$CPDPRGB= <>
##$CPDPRGT= <>
##$D= (0..31)
0 1.2 0 0 0 0 0 0 0 0.06 0 0.03 0 0 0 0 0.0002 0 0 0 0 0 0 0 0 0 0 0 0 
0 0 0 
##$DATE= 1662010366
##$DBL= (0..7)
120 120 120 120 120 120 120 120 
##$DBP= (0..7)
150 150 150 150 150 150 150 150 
##$DBP07= 0
##$DBPNAM0= <>
##$DBPNAM1= <>
##$DBPNAM2= <>
##$DBPNAM3= <>
##$DBPNAM4= <>
$$ [...]
##$SUBNAM3= <"">
##$SUBNAM4= <"">
##$SUBNAM5= <"">
##$SUBNAM6= <"">
##$SUBNAM7= <"">
##$SUBNAM8= <"">
##$SUBNAM9= <"">
##$SW= 18.0517283424941
##$SWIBOX= (0..15)
0 0 2 0 0 0 0 0 0 0 0 0 0 0 0 0 
##$SW_h= 3612.71676300578
##$TD= 16384
##$TD0= 1
##$TE= 0
##$TE2= 300
##$TE3= 300
##$TEG= 300
##$TL= (0..7)
0 120 120 120 120 120 120 120 
##$TP= (0..7)
150 150 150 150 150 150 150 150 
##$TP07= 0
##$TPNAME0= <>
##$TPNAME1= <>
##$TPNAME2= <>
##$TPNAME3= <>
##$TPNAME4= <>
##$TPNAME5= <>
##$TPNAME6= <>
##$TPNAME7= <>
##$TPOAL= (0..7)
0.5 0.5 0.5 0.5 0.5 0.5 0.5 0.5 
##$TPOFFS= (0..7)
0 0 0 0 0 0 0 0 
##$TUNHIN= 0
##$TUNHOUT= 0
##$TUNXOUT= 0
##$USERA1= <user>
##$USERA2= <user>
##$USERA3= <user>
##$USERA4= <user>
##$USERA5= <user>
##$V9= 5
##$VALIST= <valist>
##$VCLIST= <CCCCCCCCCCCCCCC>
##$VD= 0
##$VDLIST= <DDDDDDDDDDDDDDD>
##$VPLIST= <PPPPPPPPPPPPPPP>
##$VTLIST= <TTTTTTTTTTTTTTT>
##$WBST= 1024
##$WBSW= 4
##$XGAIN= (0..3)
0 0 0 0 
##$XL= 0
##$YL= 0
##$YMAX_a= 320640
##$YMIN_a= -595279
##$ZGOPTNS= <>
##$ZL1= 120
##$ZL2= 120
##$ZL3= 120
##$ZL4= 120
##$ABSF1= 15.74358
##$ABSF2= -2.30827
##$ABSG= 5
##$ABSL= 3
##$ALPHA= 0
##$AQORDER= 0
##$ASSFAC= 0
##$ASSFACI= 0
##$ASSFACX= 0
##$ASSWID= 0
##$AUNMP= <proc_1d>
##$AZFE= 0.1
##$AZFW= 0.1
##$BCFW= 0
##$BC_mod= 2
##$BYTORDP= 0
##$COROFFS= 0
##$CY= -3
##$DATMOD= 1
##$DC= 0
##$DFILT= <>
##$DTYPP= 0
##$F1P= 0
##$F2P= 0
##$FCOR= 1
##$FTSIZE= 16384
##$FT_mod= 6
##$GAMMA= 0
##$GB= 0
##$INTBC= 1
##$INTSCL= 3.70164e-10
##$ISEN= 128
##$LB= 0.24
##$LEV0= 0
##$LPBIN= 0
##$MAXI= 10000
##$MC2= 0
##$MEAN= 0
##$ME_mod= 0
##$MI= 1.114404
##$NCOEF= 0
##$NC_proc= -7
##$NLEV= 6
##$NOISF1= 3.799351
##$NOISF2= 2.8
##$NSP= 0
##$NTH_PI= 0
##$NZP= 0
##$OFFSET= 15.75019
##$PC= 1
##$PHC0= -18046.44
##$PHC1= 26.00069
##$PH_mod= 1
##$PKNL= yes
##$PPARMOD= 0
##$PSCAL= 0
##$PSIGN= 0
##$REVERSE= no
##$SF= 200.130004270231
##$SI= 16384
##$SIGF1= 3
##$SIGF2= 2
##$SINO= 5.538805
##$SIOLD= 16384
##$SREGLST= <1H.CDCl3>
##$SSB= 0
##$STSI= 16384
##$STSR= 0
##$SW_p= 3612.71676300578
##$SYMM= 0
##$S_DEV= 0
##$TDeff= 16384
##$TDoff= 0
##$TI= <>
##$TILT= no
##$TM1= 0
##$TM2= 0
##$TOPLEV= 0
##$USERP1= <user>
##$USERP2= <user>
##$USERP3= <user>
##$USERP4= <user>
##$USERP5= <user>
##$WDW= 1
##$XDIM= 16384
##$YMAX_p= 459294800
##$YMIN_p= -625652
$$ End of Bruker specific parameters
$$ ---------------------------------
##NTUPLES= NMR SPECTRUM
##VAR_NAME=  FREQUENCY,     SPECTRUM/REAL,   SPECTRUM/IMAG
##SYMBOL=    X,             R,               I
##VAR_TYPE=  INDEPENDENT,   DEPENDENT,       DEPENDENT
##VAR_FORM=  AFFN,          ASDF,            ASDF
##VAR_DIM=   16384,         16384,           16384
##UNITS=     HZ,            ARBITRARY UNITS, ARBITRARY UNITS
##FACTOR=    0.220516191357247, 1,           1
##FIRST=     3152.0855481663, 0,             0
##LAST=      -460.631214839484, 0,           0
##MIN=       -460.631214839484, -625652,     0
##MAX=       3152.0855481663, 459294800,     0
$$ Real data points
##PAGE= N=1
##DATA TABLE= (X++(R..R)), XYDATA
$$ [...]
6252A1451359O26173J1418p36274q91413j091767j051274j049143o46767o51214
6243E971098n76183m60012l81323p466l48712j64037l65796j07283l5555j48213
6233C376518j95734j15125p458k00024k07464k69245J17849j06n7379j11381k07113
6222B123338J9507Q4209o2628r1972j10796Q4882k2373J56053k43286Q5212j58036
6211A864110K3178J57443Q2084j37339K66833o4376j94102L5999L0451L70082
6201B434363q1883O833l12994J56901R5991j31816L158J2205J22048K7554n6201
6190B276159O4549r354j27346o2741r6228K04196J09321l4466p2510J02853R9855
6179B454288o6242q6650l8581J39862j69830k33979j9455R7506J23328j89566
$$ plain form
6252 11451359 12077532 12088950 11352676 10461263 9369496 8318222 7269079 6622312 5971098
6243 5971098 5394915 4934903 4553580 4546114 4197402 4033365 3667569 3560286 3524731 3376518
6233 3376518 3180784 3065659 3058201 2858177 2650713 2381468 2499317 2499211 2441832 2330451 2123338
6222 2123338 2142845 2227054 2164426 2072454 1961658 2046540 2024167 2180220 1936934 2022146 1864110
6211 1864110 1887288 2044731 2126815 1989476 2256309 2191933 1997831 2033830 2064281 2434363
6201 2434363 2352480 2359313 2046319 2203220 2299211 2167395 2170553 2182758 2304806 2332360 2276159
6190 2276159 2340708 2331354 2204008 2141267 2045039 2249235 2358556 2324090 2251580 2354433 2454288
6179 2454288 2388046 2301396 2262815 2402677 2232847 1998868 1979413 2076919 2200247 2010681
6169B010681j04576O9757o2508J13423j4054J83848J52116j65995j2608L5419
6159B205503k10974j3911J03512o3587p7045r6816N4710J71897P1843n0666J36149
6148B230615J62500l755j80181k45340K52091L02616L3712L0800K15065n1303
6138B746820K25666N5507o6204R5789j35114J55492j0842o2105J0504k7646j33910
6127B853957j30793o1178q0202l7413k21703Q0473j1140J08767k44971l06001
6117A949796R7617j14923M1600J94968m9535j12727l6616L18337K54309k6895
6107B515931j07701K97383j1546o3109n3792j59500J28274J15764j22060O55j09454
6096B430845q6213J09181j02147o6732K53422K483k20713K32321L6216n1468J27700
$$ plain form
6169 2010681 1906105 1975862 1913354 2026777 2012723 2196571 2348687 2182692 2170084 2205503
6159 2205503 1994529 1980618 2084130 2020543 1943498 1846682 1901392 2073289 2145132 2094466 2230615
6148 2230615 2393115 2389360 2209179 1963839 2215930 2518546 2552258 2583058 2798123 2746820
6138 2746820 2972486 3027993 2961789 3057578 2922464 3077956 3067114 3005009 3015513 2987867 2853957
6127 2853957 2723164 2661986 2581784 2544371 2322668 2403141 2392001 2500768 2255797 1949796
6117 1949796 2047413 1932490 1974090 2169058 2119523 2006796 1970180 2288517 2542826 2515931
6107 2515931 2408230 2705613 2694067 2630958 2577166 2417666 2545940 2661704 2539644 2540299 2430845
6096 2430845 2344632 2453813 2351666 2284934 2538356 2540839 2320126 2552447 2588663 2537195 2664895
6085B664895J15022l0801k3649k2234o5639R1007M1005J0319n1511j01835P3280
6074B699859k081o4984K3108J24613q1555k43014j05070M398l3427l4813N8168
6063B345202p0063k87939m1954N1283j5372L8511J10898j21805K66744l30785
6053A944720o5812K24625o4403J09649M897o4645j0497j10215J42215K58418j22144
6042B246808j22479j09824J06449l2846k03051J22720j1129n127J04066o0272
6032B035315N4248J07977J10075q717M6291N468L3238P3810J07942O2112k83790
6021B343969m3396P7855m4414Q8754J26207k6749M600K35966K60012k4758L1122
6010C029168l3068K20516N3604j07194j64296K35093j05j98545o5588J57252j24286
$$ plain form
6085 2664895 2779917 2749116 2725467 2703233 2637594 2728601 2769606 2779925 2728414 2626579 2699859
6074 2699859 2697778 2632794 2655902 2780515 2698960 2455946 2350876 2355274 2321847 2287034 2345202
6063 2345202 2275139 1987200 1945246 1996529 1981157 2019668 2130566 2008761 2275505 1944720
6053 1944720 1878908 2103533 2039130 2148779 2153676 2089031 2078534 1968319 2110534 2368952 2246808
6042 2246808 2124329 2014505 2120954 2088108 1885057 2007777 1996648 1991521 2095587 2035315
6032 2035315 2089563 2197540 2307615 2298898 2345189 2350657 2383895 2457705 2565647 2627759 2343969
6021 2343969 2300573 2378428 2334014 2422768 2548975 2522226 2526826 2762792 3022804 2998046 3029168
6010 3029168 2996100 3216616 3270220 3163026 2998730 3233823 3233718 3035173 2969585 3126837 3002551
5999C002551n4929Q3445P5655J12949O343l31792P0728L07904j90452r3399M6335
5988C035338J34783L7952P7684l4605J83960j82173J66820Q6295J68696J41685
5978C816435q787q1413P1787K04183J16886j76665j43508j19082J52008L4364
5968C866208l6082L96170p1889K143J14299l0309R6688J72335J65693L53796Q7958
5957E117010L56739M54233J14043K85757J58221m6542k40091l4401k44905n4595
5947E865469k6748K32493J4955M0219K9719o6089K14555K10147K64706K17952
5937F997378J61198K34479K69434L34977M98314O92379P31110O19826P96720J080104
5927A2415919P68231L83588L4368k73423o31160r22536p89673n81276m94347k87598
$$ plain form
5999 3002551 2947622 3031067 3106722 3219671 3226014 2894222 2964950 3272854 3082402 2989003 3035338
5988 3035338 3170121 3208073 3285757 3251152 3435112 3252939 3419759 3506054 3674750 3816435
5978 3816435 3807648 3726235 3798022 4002205 4119091 3942426 3798918 3679836 3831844 3866208
5968 3866208 3830126 4226296 4154407 4156550 4270849 4240540 4337228 4509563 4675256 5029052 5117010
5957 5117010 5473749 5927982 6042025 6327782 6486003 6439461 6199370 6164969 5920064 5865469
5947 5865469 5838721 6071214 6086169 6126388 6156107 6090018 6304573 6514720 6779426 6997378
5937 6997378 7158576 7393055 7662489 7997466 8495780 9188159 9919269 10539095 11335815 12415919
5927 12415919 13184150 13567738 13602106 13328683 12697523 11774987 10985314 10404038 9909691 9622093
5917I622093l11895k44725l4158L858j39310J15475L68885K37384L09920M61874
5907A0389401J83567M78439P56372O27826Q48977J220590J490133J349991J186604
5898A8531900N33605K3537q62322j553949j538827r50685j244069p00533o42782
5889A1595875m27500k47159m6266j85671l02057n0579L4160l4300K48396K34920
5879A0819819J85618J80529M23323N46692O39273Q71334O57968P53899P47479
5870A5825934N37746l13393p15914j085485q77496p76409q21261p53992m48294
5861A0571436l89226j99405j40814O5656J38363q0844l2348Q2798M2533J22595
5851A0180744L22536Q458J87030J8608j16196J78704M7075q4160m2075p7113j56564
$$ plain form
5917 9622093 9310198 9065473 9031315 9035173 8895863 9011338 9380223 9617607 9927527 10389401
5907 10389401 10572968 11051407 11807779 12435605 13284582 14505172 15995305 17345296 18531900
5898 18531900 19065505 19089042 18226720 16672771 15133944 14183259 12939190 12238657 11595875
5889 11595875 11168375 10921216 10874950 10689279 10387222 10336643 10370803 10336503 10584899 10819819
5879 10819819 11005437 11185966 11609289 12155981 12795254 13666588 14324556 15078455 15825934
5870 15825934 16363680 16050287 15334373 14248888 13371392 12594983 11773722 11019730 10571436
5861 10571436 10182210 9982805 9841991 9907647 10046010 9965166 9932818 10015616 10058149 10180744
5851 10180744 10503280 10511738 10698768 10717376 10601180 10779884 10826959 10742799 10700724 10623611 10467047
5840A0467047k70198m41617l55286l85314j93982k10314K3976r0466j62111l4955
5830H346780l2687J68069K74107l9921q0105n8949J01266L18223K69255R3749
5820I359787n8297J56994p3200j08392m853j43911k80000P6600j3100r6012o4778
5809H750838j30246k03645K4588j21448j6582k817m6274j30591p4084R8413k50921
5798G897231j10641r4211j58840j61764j76675p3337Q9564l7537Q5354j23920
5788G135224O9439l4830j05870n5172j18672q7943K35133K53026j4102j69396
5778G106837q6244J17312Q1775p2374O6114L1230P2738j64190J04401j674k14368
5767G041557J08943j20803L6967n37J29566k9180O0595n1603m4573K890N2329
$$ plain form
5840 10467047 10196849 9755232 9399946 9014632 8820650 8610336 8634312 8543846 8381735 8346780
5830 8346780 8314093 8482162 8756269 8716348 8636243 8577294 8678560 8996783 9266038 9359787
5820 9359787 9301490 9458484 9385284 9276892 9272039 9128128 8848128 8924728 8911628 8815616 8750838
5809 8750838 8620592 8416947 8441535 8320087 8303505 8300688 8254414 8123823 8049739 8148152 7897231
5798 7897231 7786590 7692379 7533539 7371775 7195100 7121763 7211327 7173790 7259144 7135224
5788 7135224 7204663 7169833 7063963 7008791 6890119 6802176 7037309 7290335 7276233 7106837
5778 7106837 7020593 7137905 7219680 7147306 7213420 7244650 7317388 7153198 7257599 7255925 7041557
5767 7041557 7150500 7029697 7066664 7066127 7195693 7166513 7227108 7175505 7130932 7133822 7186151
5756G186151k4257m1493j95951K25392q8562m7165K0934j7601P1144j2348Q8680
5745G164924K29794j45597n4698J31755Q6000R6062k48114L8371l3284j33422
5735G131791j9668n1136n3259P8286J51220m2859O1496J49464K1119R4720J60929
5724G682103j04312m4537K30395K91205M7812Q7972K34626j76192k4717P8687
5714H303042n889j71203l20952l70717j96490Q2794q9096k43160J09195j17336
5704F980188j29116r2435Q8243q7382j29369K8434j47411K20531J26659k67971
5694F590371n6596K1112J28473j5760j2809O811m415j12597J09785r4346j68761
5683F391268J22822N6661J3237p1788j60387L8865q2145m0737P1740j7365j3041
$$ plain form
5756 7186151 7161894 7120401 6924450 7149842 7061280 7014115 7035049 7017448 7088592 7076244 7164924
5745 7164924 7394718 7249121 7194423 7326178 7412178 7508240 7260126 7298497 7265213 7131791
5735 7131791 7112123 7060987 7007728 7086014 7237234 7194375 7255871 7405335 7426454 7521174 7682103
5724 7682103 7577791 7533254 7763649 8054854 8102666 8190638 8425264 8249072 8224355 8303042
5714 8303042 8297153 8125950 7804998 7434281 7237791 7320585 7231489 6988329 7097524 6980188
5704 6980188 6851072 6758637 6846880 6759498 6630129 6658563 6511152 6731683 6858342 6590371
5694 6590371 6533775 6554887 6683360 6667600 6654791 6661602 6657187 6544590 6654375 6560029 6391268
5683 6391268 6514090 6570751 6583988 6512200 6351813 6390678 6308533 6267796 6339536 6322171 6309130
5672F309130k02795J43385l5711L3511J63516q7019l09534K34281O7938o9599
5662F247103O4869j26214L63084r8816k32376p7124M4299K12472M4276M3153K06307
5651F691033j43386j58234K3545j33393Q1894N0651q662l844J5996j03095J20590
5640F433095J8606k96663J03566L68686R7297k61646j40625q5448j4618M7096
5630F269346k1393j58642J67282O9738m5803K1490j08336J45513J2888K6847j19099
5619F259831Q9528K0947j47910O0984j09680j39475M6700N6973K0176N035l0173
5608F132936J69667q2001j8667r5780n8874J63720K41201M2695q9424p0164P6776
5597F412085p044j72371J23669j28088L2812L2543n4425n480J09542J80772n9744
$$ plain form
5672 6309130 6106335 6249720 6214009 6247520 6411036 6324017 6014483 6248764 6316702 6247103
5662 6247103 6311972 6185758 6548842 6450026 6217650 6140526 6184825 6397297 6441573 6484726 6691033
5651 6691033 6547647 6389413 6412958 6279565 6361459 6412110 6403448 6399604 6415600 6312505 6433095
5640 6433095 6451701 6155038 6258604 6627290 6724587 6462941 6322316 6236868 6222250 6269346
5630 6269346 6247953 6089311 6256593 6326331 6280528 6302018 6193682 6339195 6352083 6378930 6259831
5619 6259831 6349359 6370306 6222396 6283380 6173700 6034225 6080925 6137898 6158074 6163109 6132936
5608 6132936 6302603 6220602 6201935 6106155 6047281 6211001 6452202 6494897 6405473 6335309 6412085
5597 6412085 6405041 6232670 6356339 6228251 6261063 6293606 6239181 6233701 6343243 6524015 6464271
5586F464271J37262j02552K7816J63835j90588P6017n2332l4744L48067J18567
5576F955619M65J62826l1112m948P0330q1911R0079M4654j44289J07137K4790
5565G193640K3544p1345R4815j01602K98536j338J246m4215l1006K31237Q0043
5554G673555j05821O6693R084L1404K25937j02263J80420j04959K3032J71511
5544H068593J46293O2359j36755O7144J30088K09288J44434J23566P2198j50142
5534H737066L2286M9685o6268J88671J52855J94162P8318K018j4875K76118L15337
5523I945373K559j31455p547J22598M9625m2910L8033k943L40174K11196L4047
5512A0558750K61649n9688n7941L38486J34944J97163M00662R2186L19628Q5365
$$ plain form
5586 6464271 6601533 6498981 6526797 6690632 6500044 6576061 6523729 6488985 6837052 6955619
5576 6955619 6956084 7118910 7087798 7082850 7153180 7071269 7161348 7206002 7061713 7168850 7193640
5565 7193640 7217184 7145839 7240654 7139052 7437588 7436250 7437496 7393281 7362275 7593512 7673555
5554 7673555 7567734 7634427 7643511 7674915 7900852 7798589 7979009 7874050 7897082 8068593
5544 8068593 8214886 8277245 8140490 8207634 8337722 8547010 8691444 8815010 8887208 8737066
5534 8737066 8769352 8819037 8752769 8941440 9094295 9288457 9366775 9368793 9353918 9630036 9945373
5523 9945373 9947932 9816477 9808930 9931528 9981153 9938243 9976276 9973333 10313507 10524703 10558750
5512 10558750 10820399 10760711 10702770 11041256 11176200 11373363 11774025 11866211 12185839 12271204
5502A2271204N3032n1372j55790O5240L7450L4336J60830j98262J13413R8571
5492A2428652m5257j67117n3198j7386j44805J0412J88038J03539R2221J13329
5482A2508428K86382K45312M86030M04058K61839K37163K33508L83205N60861
5473A5606786j06084R2525k00016l52217j08426m13258o4270J05800j35960j75101
5463A4249779j82861j21870l0879m6973K09386r462J01854N8201L5493K54416
5453A4517084J2307J04953L50001L20708P6772K65978N06648K57627p2628J88078
5443A6527528m587n7334K00661l43410n0001j41749q2584q0458j12532P7849Q452
5432A5941835m9423K22885L11442J69499p1285Q4771Q5211j10063J88171J91764
$$ plain form
5502 12271204 12324236 12272864 12117074 12182314 12219764 12254100 12414930 12216668 12330081 12428652
5492 12428652 12383395 12216278 12163080 12145694 12000889 12011301 12199339 12302878 12395099 12508428
5482 12508428 12794810 13040122 13526152 13930210 14192049 14429212 14662720 15045925 15606786
5473 15606786 15500702 15593227 15393211 15040994 14932568 14519310 14455040 14560840 14424880 14249779
5463 14249779 14066918 13945048 13914169 13867196 14076582 14067120 14168974 14227175 14262668 14517084
5453 14517084 14529391 14634344 14984345 15305053 15381825 15647803 16154451 16412078 16339450 16527528
5443 16527528 16522941 16465607 16666268 16322858 16272857 16131108 16048524 15968066 15855534 15933383 15941835
5432 15941835 15892412 16115297 16426739 16596238 16524953 16609724 16694935 16584872 16773043 16964807
5422A6964807K16660J85975K07619r5903J38233L74495J81953j1707j80032Q1567
5412A8063667P3602K5598J54353J12987J15789O8869R5834K29529K47601M20880
5402A9608709M09777N00553J42124L75533k96956k54248j11818j45974r5995k03993
5392A9927712n2632j46963K10106K56188L17045K59201J98986J32991j72744J78813
5382B1108703M19438M38940L28903M92591M06151N96702Q92333Q45625R35041
5373B6464427O08398L88114P9648l56936r20247r74751p19150o18681m79833k54125
5363B3216864k07989k39404L0783o7197J12503K74210J05158K53719L86895M70923
5353B4336465O20099L80514L98342P67814R76865J120769J084641J255588J330252
$$ plain form
5422 16964807 17181467 17367442 17575061 17479158 17617391 17991886 18173839 18162132 17982100 18063667
5412 18063667 18137269 18162867 18317220 18430207 18545996 18614865 18710699 18940228 19187829 19608709
5402 19608709 20018486 20519039 20661163 21036696 20739740 20485492 20373674 20227700 20131705 19927712
5392 19927712 19875080 19728117 19938223 20194411 20511456 20770657 20969643 21102634 20929890 21108703
5382 21108703 21528141 21967081 22295984 22788575 23194726 23791428 24683761 25529386 26464427
5373 26464427 27072825 27460939 27540587 27183651 26263404 25288653 24569503 23950822 23470989 23216864
5363 23216864 23008875 22769471 22800254 22733057 22845560 23119770 23224928 23478647 23865542 24336465
5353 24336465 24956564 25337078 25735420 26503234 27480099 28600868 29685509 30941097 32271349
5344C2271349P75593k74911p22868j225610j296252j223197q33443l59392l84153
5335B6727116j92243o0786l7719q3171k8630J18340K98631J80935L53663L09111
5325B7585247M85650N65967N89524P45293J024620J124711J374807J478936J391618
5316C6366373J201272O62272J28982m29465m89997n49618p09350n80111k25966
5307C5374392q5451J30036R6478L32316L32468L17264L45374L84108N28339L55240
5297C8110564P01344J055926Q03865Q49166J068637J465693J678981J668511J877764
5288D9280451K052429J695215J856475J852352J836831J542369J462840J708845
5280F3287807J650348J779730K238956K435733K501168L007343L052245K619709
$$ plain form
5344 32271349 33046942 32772031 32049163 30823553 29527301 28304104 27470661 27111269 26727116
5335 26727116 26534873 26474087 26436368 26353197 26324567 26442907 26741538 26922473 27276136 27585247
5325 27585247 28070897 28636864 29226388 29971681 30996301 32121012 33495819 34974755 36366373
5316 36366373 37567645 38229917 38358899 37929434 37439437 36889819 36180469 35600358 35374392
5307 35374392 35288941 35418977 35515455 35847771 36180239 36497503 36842877 37226985 37755324 38110564
5297 38110564 38811908 39867834 40671699 41520865 42589502 44055195 45734176 47402687 49280451
5288 49280451 51332880 53028095 54884570 56736922 58573753 60116122 61578962 63287807
5280 63287807 64938155 66717885 68956841 71392574 73893742 76901085 79953330 82573039
5272H2573039K590682K086683J361619P63647j46475j047618k258857l259256
5264H2663464l529933l970688m083714l861019l461184l197669k780282k551140
5256E5227835k306044j774037j637085j361241j411526j182752r86937q32224
5248D3735989p42208m83465m24871n91454r29074j338036j332487j280141q28657
5239C5785596q05071q67947p55411o43884l32804l90361o40481k42127r3275j20281
5229C0893954l28705n1729J78129K24394L75862M93951N83247Q50511R61964P23815
5219C4905393R61790O92374N61498L08319p1381o10030n50996l13900j12238k12240
5209C5558589j22366l92363m76927m10591n82281n13187m63395l69988m8670J39640
$$ plain form
5272 82573039 85163721 87250404 88612023 89375670 89229195 88181577 85922720 82663464
5264 82663464 79133531 75162843 71079129 67218110 63756926 60559257 57778975 55227835
5256 55227835 52921791 51147754 49510669 48149428 46737902 45555150 44568213 43735989
5248 43735989 42993781 42510316 42085445 41493991 40564917 39226881 37894394 36614253 35785596
5239 35785596 34980525 34112578 33357167 32713283 32380479 31990118 31349637 31107510 31014235 30893954
5229 30893954 30565249 30513520 30691649 30916043 31291905 31785856 32369103 33219614 34181578 34905393
5219 34905393 35867183 36559557 37121055 37429374 37357993 36747963 36196967 35883067 35770829 35558589
5209 35558589 35436223 35043860 34566933 34156342 33574061 33060874 32597479 32227491 32178821 32318461
5199C2318461L40136O10429R23977J155523J324835J691850J925184J961824K048591
5190D4300810J537389Q28659R7306l68157k42252J69451L95148P47445M06301
5181D7872100m00180j029331j943224k368055k136542j854731j628769j289485
5173C5221783q95840n12417n05870j77069Q846Q7664K82955N93061P14344Q62404
5163C5679861N12811N54626M02050k38600J60062O30668P91062Q17254P24844
5154D0034638M13488o02895j124397j431228j488579j265547r72592p05229p12567
5145C2145092l75202l25666k53098j11798J2818K20311K41408K00247K61800N45449
5135C2561361M11321M25419P73234P01187P31690R66714J026855R67579J344174
$$ plain form
5199 32318461 32658597 33269026 34193003 35348526 36673361 38365211 40290395 42252219 44300810
5190 44300810 45838199 46666858 46764164 46396007 46153755 46323206 46718354 47465799 47872100
5181 47872100 47471920 46442589 44499365 42131310 39994768 38140037 36511268 35221783
5173 35221783 34325943 33813526 33307656 33130587 33139433 33227097 33510052 34103113 34817457 35679861
5163 35679861 36192672 36747298 37149348 36910748 37070810 37701478 38492540 39309794 40034638
5154 40034638 40448126 39845231 38720834 37289606 35801027 34535480 33562888 32857659 32145092
5145 32145092 31769890 31444224 31191126 31079328 31092146 31312457 31553865 31754112 32015912 32561361
5135 32561361 32972682 33398101 34171335 34872522 35604212 36570926 37597781 38565360 39909534
5126C9909534J463407R16220O14761O92156J93895J94453J64423K16686O39287
5117D5004822N92862O56466R25163P62189M50406Q55018R76847J330890J235275
5108E2789938J188504J654228J976599J909394K252652K577086K568229K809992
5100F9726622K862343K986949K682497K470978K228131J794334J849258K189176
5092H8790288K073108K113394J813507J465831J369696R53592Q92577L83914k23477
5083I9632430l04009p37587o75037l64711k23746j97897L71314O81335M87535
5074I8669627N13718Q57423J221868J332018J570564K078486K359376K423407
5066A11026487K534355K830374K852986K646664K407486J643908P28463o87334
$$ plain form
5126 39909534 41372941 42289161 42903922 43596078 43789973 43984426 44148849 44365535 45004822
5117 45004822 45597684 46254150 47179313 47941502 48391908 49246926 50223773 51554663 52789938
5108 52789938 53978442 55632670 57609269 59518663 61771315 64348401 66916630 69726622
5100 69726622 72588965 75575914 78258411 80729389 82957520 84751854 86601112 88790288
5092 88790288 90863396 92976790 94790297 96256128 97625824 98579416 99471993 99855907 99632430
5083 99632430 99328421 98590834 97915797 97551086 97327340 97129443 97500757 98182092 98669627
5074 98669627 99183345 100040768 101262636 102594654 104165218 106243704 108603080 111026487
5066 111026487 113560842 116391216 119244202 121890866 124298352 125942260 126670723 125983389
5058A25983389j859194k812845l327133l470168l752958l334914k891546k766407
5050A01768224k233028k022834j886540j727858j951454k058910k192230k196493
5042H5498877k263300k543459k288344k327874k173601k259166j952762j442896
5034F8247475j550372j393567r96344o59198r52057k57976l04635k28041M7620
5025F1952905J62983N17107M01477O18433N64682P34236N48923O68878N04959
5016F6674583N26707M16798M02130L09613J69162L08632L03353K66512k89347
5007F9088143p21774j359217j666682j671731j609086q94309n99427n45290n94064
4998E9426563q43766q22417p79387o88754m16389j87000j24055K63830K80199
$$ plain form
5058 125983389 124124195 121311350 117984217 114514049 110761091 107426177 104534631 101768224
5050 101768224 99535196 97512362 95625822 93897964 91946510 89887600 87695370 85498877
5042 85498877 83235577 80692118 78403774 76075900 73902299 71643133 69690371 68247475
5034 68247475 66697103 65303536 64307192 63647994 62695937 62437961 62133326 61905285 61952905
5025 61952905 62115888 62632995 63034472 63652905 64217587 64951823 65500746 66169624 66674583
5016 66674583 67201290 67618088 68020218 68329831 68498993 68807625 69110978 69377490 69088143
5007 69088143 68366369 67007152 65340470 63668739 62059653 61165344 60565917 60020627 59426563
4998 59426563 58582797 57760380 56980993 56292239 55875850 55688850 55564795 55828625 56108824
4989E6108824M32566R92886J125444J085366J256988J458681J478433J368778
4981F5307966J005390O92651L13318m37378r47564j053114q31085l01876j05843
4972F3642465l49682j183849j351111j657020j979168j716627j393310j108550
4964E2903148q18086k26584j02542j27076L00327L57641N55558N68460N53214
4955E3964060Q43237P52277M94938P21851L81038K39177J78657L21318J62579
4946E8059132N2041K37374n94488j322206j624939j771911j875962j607934j796011
4937D7755096j526453r25668q74751p83812k83278l96342k1165J98953J34634
4928D3277214M38415O61070Q00088N02804N37648P36316P13291N87858M19282
$$ plain form
4989 56108824 56541390 57534276 58659720 59745086 61002074 62460755 63939188 65307966
4981 65307966 66313356 67006007 67319325 66881947 65934383 64881269 64050184 63748308 63642465
4972 63642465 63292783 62108934 60757823 59100803 57121635 55405008 54011698 52903148
4964 52903148 52085062 51858478 51755936 51628860 51929187 52286828 52842386 53410846 53964060
4955 53964060 54807297 55559574 56054512 56776363 57157401 57396578 57575235 57896553 58059132
4946 58059132 58111173 58348547 57754059 56431853 54806914 53035003 51159041 49551107 47755096
4937 47755096 46228643 45302975 44428224 43644412 43361134 42964792 42943627 43142580 43277214
4928 43277214 43715629 44376699 45176787 45679591 46217239 46953555 47666846 48254704 48673986
4919D8673986K31761k41833k48901n89872q58185r49196j282732j470810j386196
4910D1878022j483736j258858j290212j232787r65424q31303o43940n01070n55484
4901C3115208m63377l67851r5188k4551L6822m6699l1337J15967J31879K23916
4891C2594789K7819q6911J13708P552o5559l61348q24824r57740r92680r84906
4881B8469900r69663j015327r39964p03597r05673q85230l51665m76749n30075
4872B1691957k05287m27192l21306k16565l03062l28410k42999l42088k15841
4863A9089207o4659m71312n5789Q8009J24974p7676j55532J07476J29400J04773
4853A8818871k5669o437J31108l5758K3860J77023J03632l5287k2371M8414n2340
$$ plain form
4919 48673986 48905747 48663914 48415013 47825141 46966956 46017760 44735028 43264218 41878022
4910 41878022 40394286 39135428 37845216 36612429 35647005 34815702 34171762 33670692 33115208
4901 33115208 32651831 32283980 32188792 32164241 32201063 32154364 32123027 32238994 32370873 32594789
4891 32594789 32622608 32535697 32649405 32656957 32591398 32230050 31405226 30447486 29454806 28469900
4881 28469900 27500237 26484910 25544946 24841349 23935676 23050446 22698781 22222032 21691957
4872 21691957 21486670 21059478 20738172 20521607 20218545 19890135 19647136 19305048 19089207
4863 19089207 19024548 18553236 18497447 18585456 18710430 18632754 18477222 18584698 18714098 18818871
4853 18818871 18793202 18786765 18917873 18882115 18905975 19082998 19186630 19151343 19128972 19177386 19125046
4842A9125046r5794J43971L23042M0298j8467J94821L35373L15022J39082N55431
4832B1057825M27221K89762L01393J95009K23212k809J73560J28540J84563o0907
4822B2917369k86674l37123j87172k13514j60382l95779m87113m14245J00961
4813B0536328j71125p666n594M6544l08177L43192N97749K74973J56976M83111
4803B1946311N00685N04253M15504K68099M20614M53823L50001K42290n6532k62518
4793B4782530n64724o73877p77001r32396n88522p17107p92663n29261l06310
4784A8900669l22946l37658m40685j80370k46515j16755k027J66652K2153j3158
4774A7429360K89277M64597J14139K13938L70209J78596J39633J53982m0935k11483
$$ plain form
4842 19125046 19029252 19173223 19496265 19536563 19518096 19712917 20048290 20363312 20502394 21057825
4832 21057825 21485046 21774808 22076201 22271210 22494422 22491613 22665173 22793713 22978276 22917369
4822 22917369 22630695 22293572 22106400 21892886 21732504 21336725 20849612 20435367 20536328
4813 20536328 20365203 20357537 20351943 20398487 20090310 20433502 21031251 21306224 21463200 21946311
4803 21946311 22446996 22951249 23366753 23634852 24055466 24509289 24859290 25101580 25045048 24782530
4793 24782530 24217806 23543929 22766928 21834532 21246010 20528903 19736240 19206979 18900669
4784 18900669 18577723 18240065 17799380 17619010 17372495 17255740 17253713 17420365 17442518 17429360
4774 17429360 17718637 18183234 18297373 18511311 18881520 19060116 19199749 19353731 19312796 19101313
4764A9101313j5675j42133k72160n67695m12576m35845l11633m70730j06816l62080
4754A6003970j92428j87986l03355r2018l26184M0435K8023m712K3868K34699
4744A5224312o9661J92740M6316J06227O5484n3856n489k00081o1067j18206q3977
4733A5042742k8645k31118j34517k63434N241j01197j73072m14948j68284O08
4723A3533376n1201k06905O3752J71586j26021J1863l5907m6579K20623J37847
4713A3672434J4118o6213K28820J89854j22496k03283k37114l93948j51557j80780
4703A2749835o1564m12146J10402p3441j53942J03393j18909l28883j47546J2310
4693A1679509n1911p3192m03736j43450j36905r5164l43q3406o8370n938q1032
$$ plain form
4764 19101313 19085638 18943505 18671345 18103650 17691074 17255229 16943596 16472866 16366050 16003970
4754 16003970 15811542 15623556 15320201 15228183 14901999 14942434 14970457 14965745 14989613 15224312
4744 15224312 15154651 15347391 15393707 15499934 15565418 15511562 15506073 15305992 15244925 15126719 15042742
4733 15042742 15014097 14782979 14648462 14385028 14390269 14289072 14116000 13701052 13532768 13533376
4723 13533376 13482175 13275270 13339022 13510608 13384587 13396450 13360543 13313964 13534587 13672434
4713 13672434 13686552 13620339 13849159 14039013 13916517 13713234 13476120 13082172 12930615 12749835
4703 12749835 12688271 12276125 12386527 12313086 12159144 12262537 12143628 11814745 11667199 11679509
4693 11679509 11627598 11554406 11150670 11007220 10870315 10775151 10774808 10691402 10623032 10617094 10536062
4682A0536062o1277M3190k31079j70612j4259J50874p3317j96312j02351j37114
4672I743805n6252j70370j33241k5504k7733o6608R2234J2918L8233j76455j0170
4661I220857j5707j01838p1461N6308k7786n2886P1695Q2967j74186j16382n9790
4650H811791J20683O8435m0601o2585L4519j27763O8822Q1420j14896M4166L4592
4639H918583L5569J81765m4947p4934j21104J75286K44025n4919r8545N6694K8742
4628I246215R9487k8407J42782J63703j61292J18169L47118K2661J45918L04901
4618A0401255j16220k81897N4680K16988o9386p8171J4944L5747J36138J52429
4608A0466507l142l05230j83958k1200k4457j69520p4414m2077j29259J40013
$$ plain form
4682 10536062 10474785 10517975 10286896 10116284 10102025 10252899 10179582 9983270 9880919 9743805
4672 9743805 9687553 9517183 9383942 9358438 9330705 9264097 9356331 9369249 9407482 9231027 9220857
4661 9220857 9205150 9103312 9031851 9088159 9060373 9007487 9079182 9162149 8987963 8871581 8811791
4650 8811791 8932474 9000909 8960308 8897723 8932242 8804479 8873301 8954721 8839825 8883991 8918583
4639 8918583 8954152 9135917 9090970 9016036 8894932 9070218 9314243 9259324 9160779 9217473 9246215
4628 9246215 9345702 9317295 9460077 9623780 9462488 9580657 9927775 9950436 10096354 10401255
4618 10401255 10285035 10003138 10057818 10274806 10205420 10127249 10142193 10177940 10314078 10466507
4608 10466507 10463365 10158135 9974177 9952977 9928520 9759000 9684586 9642509 9513250 9653263
4598I653263P7694j37735L6485j0786N6298m6023J48730j69601m76184J08737
4588I240878J19491l5798j73572j31008J51428M4726j40970k69749j08228R2426
4578H789624l19573k48235J86023J68933q14k18573l04629J03685K16100l16864
4568H055677J74382J4547k59608n3185o0810j66241L403O2248J76162J45425J5709
4557H107709O8172k17739o9192N4667J08776k9171K4680m0314M6562K61027Q8740
4546H403917p9424J73032r6411J71746J14673P1511J9860o1930J20607k6442o4905
4535H746234M16810K3783n13129J8685L27171J60078Q0840m7779k73375J4229
4525H953547K81789j34962K099J99402m6772k24469L753r5084q578N5927o2344
$$ plain form
4598 9653263 9730957 9593222 9629707 9618921 9675219 9629196 9777926 9608325 9132141 9240878
4588 9240878 9360369 9324571 9150999 9019991 9171419 9216145 9075175 8805426 8697198 8789624
4578 8789624 8470051 8221816 8407839 8576772 8575958 8357385 8052756 8156441 8372541 8055677
4568 8055677 8230059 8244606 7984998 7931813 7871003 7704762 7708165 7770413 7946575 8092000 8107709
4557 8107709 8175881 7958142 7888950 7943617 8052393 8023222 8047902 8007588 8054150 8315177 8403917
4546 8403917 8324493 8497525 8401114 8572860 8687533 8759044 8778904 8716974 8837581 8811139 8746234
4535 8746234 9163044 9186827 8673698 8692383 9019554 9179632 9260472 9212693 8939318 8953547
4525 8953547 9235336 9100374 9102473 9301875 9255103 9030634 9034387 8939303 8930725 8986652 8924308
4514H924308L6139J02177J06640R0623l8075J80887m1403K9347k937J62680j08117
4503I442269j10031J59021n7694j4979L00080J23779j03162K3922K9087K24898
4493A0017190p7704J31537j8417r9136m6199j00464n177K54797K45352N6695r5439
4482A0263035j03274m5853J45409J34766j98699J62798P1825j32457O4019o044
4472A0355525k66139R8498J82615j06073k06765Q7371P8620J66458K76094j35861
4462A0530343l431M43190J17085j40827j89317j85228m7116J02563J11604k2482
4452A0716384J52471l4998L1073O1799P0436J58730R6463J23577J83260L26804
4442A1885999K94879n6988K41748J75951J04323J78159L77318K04248J50214K97096
$$ plain form
4514 8924308 8960447 9062624 9169264 9259887 9221812 9402699 9361296 9390643 9387706 9550386 9442269
4503 9442269 9332238 9491259 9433565 9418586 9718666 9842445 9739283 9763205 9792292 10017190
4493 10017190 9939486 10071023 10052606 9953470 9907271 9806807 9801630 10056427 10301779 10358474 10263035
4482 10263035 10159761 10113908 10259317 10394083 10195384 10358182 10430007 10297550 10361569 10355525
4472 10355525 10089386 10187884 10370499 10264426 10057661 10145032 10223652 10390110 10666204 10530343
4462 10530343 10526912 10970102 11087187 10946360 10757043 10571815 10524699 10627262 10738866 10716384
4452 10716384 10868855 10833857 10864930 10926729 10997165 11155895 11252358 11375935 11559195 11885999
4442 11885999 12180878 12123890 12365638 12541589 12645912 12824071 13201389 13405637 13555851 13852947
4432A3852947R38L01095L19496Q9632P799N4778K16404J20058l9862j50408R0887
4421A4863764R2197J98309J94007K69346n7246J39419J35210K88462K17186R6938
4411A6437592L30823R2508K45979K90880K96596L40624M71965K34388J50028L67135
4401A9258518L28296K12886J99966M06587L71454L17346L15368K05128K22375
4392B1837924K48979O9189J90931K88024L06279L42548O97551N86632O33405M25781
4382B5627243m4719L74987N46847J56964K48460N8671J46421K43190j07968j96168
4372B7053928j86836N7243Q3080J33377K54627K51996K85387K39872M30048N43580
4362B9146302N72421Q22974N17186P72550J001934Q76440O25946K43342K54246
$$ plain form
4432 13852947 13853885 14154980 14474476 14564108 14571907 14626685 14843089 14963147 14923285 14772877 14863764
4421 14863764 14955961 15154270 15348277 15617623 15560377 15699796 15835006 16123468 16340654 16437592
4411 16437592 16768415 16860923 17106902 17397782 17694378 18035002 18506967 18741355 18891383 19258518
4401 19258518 19586814 19799700 19999666 20406253 20777707 21095053 21410421 21615549 21837924
4392 21837924 22086903 22156092 22347023 22635047 22941326 23283874 23981425 24568057 25201462 25627243
4382 25627243 25582524 25957511 26504358 26661322 26909782 26968453 27114874 27358064 27250096 27053928
4372 27053928 26867092 26924335 27007415 27140792 27395419 27647415 27932802 28172674 28602722 29146302
4362 29146302 29718723 30541697 31058883 31831433 32833367 33709807 34335753 34579095 34833341
4353C4833341L67930J60354K1445K30966o3401n29033l74310k26508j08167j26907
4343C4185710m36777k03544k61894k82882J31270o960M98297L58215M54509O78971
4333C5114915Q78100J108518P92655Q32826N42918K13813J4102n43174p97754
4324C8156919j057428j421053j309100j349277j361239j331874j386117j455510
4316B7485321r17816j032297r16254j055616r98235o27493q70489p09408o67087
4307A9690626o32132o35380m62379m10412k26655k29750m45793l39379k36139
4298A6072607k21657l51691l80331j06894j63338q7928p6186m6910j06089n9587
4288A4471996m8657j34343j47405o3605j50412j36619p1164m8328k29695j43031
$$ plain form
4353 34833341 35201271 35361625 35383070 35614036 35550635 35021602 34647292 34420784 34312617 34185710
4343 34185710 33748933 33545389 33283495 33000613 33131883 33124923 33623220 33981435 34435944 35114915
4333 35114915 35993015 37101533 37894188 38727014 39269932 39483745 39497847 38954673 38156919
4324 38156919 37099491 35678438 34369338 33020061 31658822 30326948 28940831 27485321
4316 27485321 26567505 25535208 24618954 23563338 22565103 21937610 21067121 20357713 19690626
4307 19690626 19058494 18423114 17960735 17550323 17323668 17093918 16648125 16308746 16072607
4298 16072607 15850950 15499259 15118928 15012034 14848696 14760768 14684582 14637672 14531583 14471996
4288 14471996 14423339 14288996 14141591 14077986 13927574 13790955 13719791 13671463 13441768 13298737
4278A3298737o1936J65805m9221R9951Q7475Q979q2275J99794L7685K72890k21319
4267A3756565J04116J82644N2953K36757J25985J97349J05016L48850K63010K07415
4257A5580660O8436J94562J34517M17584M62641L62290N57736N43230M85244Q62421
4247A9669321O61443P99226N12341P56809P87904P49456N64752Q23915Q62957
4238B6188124N94306M76635M64867M34592K27091J21530j62896j17710R0197j29245
4228B8187491k93694k24235o3926p5267L00045N0054M62830M16076K34486M26453
4218B9420313N54119N10370K84092M03073L32305K64860K57537K96135K35439
4209C2558243J27894j44823m16738n65145j20436o76264q68083p75211p33047
$$ plain form
4278 13298737 13236801 13402606 13353385 13453336 13540811 13549790 13467515 13667309 13704994 13977884 13756565
4267 13756565 13860681 14043325 14096278 14333035 14459020 14656369 14761385 15110235 15373245 15580660
4257 15580660 15649096 15843658 15978175 16395759 16858400 17220690 17778426 18321656 18806900 19669321
4247 19669321 20330764 21129990 21642331 22399140 23187044 23936500 24501252 25325167 26188124
4238 26188124 26782430 27259065 27723932 28158524 28385615 28507145 28344249 28226539 28316736 28187491
4228 28187491 27893797 27669562 27605636 27530369 27830414 27880468 28343298 28759374 28993860 29420313
4218 29420313 29974432 30484802 30768894 31171967 31504272 31769132 32026669 32322804 32558243
4209 32558243 32686137 32541314 32124576 31559431 31438995 30762731 29894648 29119437 28386390
4200B8386390r79211p11116n57643p25077m11235o08503m49527r5761k67862l79487
4190B3200968m50685j44825k79589N7373j88555m04027k90782m86020p2039o01605
4180B0340214k58501m17091o79403m71620o16308m57796l41743l94801n98576
4171A6104375l23554m79855j48608j55762m46745l20197l73313j24756k84526
4162A3447059l37108j2627J2551j88945p1461j03071q133m2433j89964l3744j4900
4151A2457224o0888K23292j18211j68712K15196Q9603j92234Q1729j3624P3942
4141A2587317K0297R1235J17088K49954J70217L5805L1312R3894M0159K80164
4131A3717442M8142J16060K51095R3465J56592K42412L97229Q6942L53860M90996
$$ plain form
4200 28386390 27407179 26696063 26138420 25413343 25002108 24393605 23944078 23848317 23580455 23200968
4190 23200968 22750283 22605458 22325869 22383242 22194687 21790660 21499878 21013858 20941819 20340214
4180 20340214 20081713 19664622 18985219 18513599 17897291 17439495 17097752 16702951 16104375
4171 16104375 15780821 15300966 15152358 14996596 14549851 14229654 13856341 13731585 13447059
4162 13447059 13109951 13097324 13109875 12920930 12849469 12746398 12738265 12695832 12505868 12472124 12457224
4151 12457224 12396336 12619628 12501417 12332705 12547901 12637504 12445270 12526999 12513375 12587317
4141 12587317 12607614 12698849 12815937 13065891 13236108 13271913 13303225 13397119 13437278 13717442
4131 13717442 13765584 13881644 14132739 14226204 14382796 14625208 15022437 15109379 15463239 15954235
4121A5954235N73788L93799N84727N61990N70514O89544J005432J321631J315504
4112B2971164J338867J438401J173994P50879P31742k6087p85459j246106j404156
4103B4943239j072575j005815r29566p33315l36258m19544l30066p0915k14514
4094A9830671p8466j68862r6359J85344J93449K07013J83179J28218J4559M33905
4084B0832651K51109L32197K65621L51408L60293J28765N38123N38617L74685
4075B3973469P46993L56376M28275N66475M83723O16688N26432M15011K85475
4066B8398917O08279R34230O23461N21076M64889P05849R04402R96691J048973
4057C5206767J074287J255238R85681J056776Q23886P37320Q20623R44149J227157
$$ plain form
4121 15954235 16528023 16921822 17506549 18068539 18639053 19328597 20334029 21655660 22971164
4112 22971164 24310031 25748432 26922426 27673305 28405047 28378960 27593501 26347395 24943239
4103 24943239 23870664 22864849 21935283 21201968 20865710 20446166 20116100 20045185 19830671
4094 19830671 19752205 19583343 19486984 19672328 19865777 20072790 20255969 20384187 20398746 20832651
4084 20832651 21083760 21415957 21681578 22032986 22393279 22522044 23060167 23598784 23973469
4075 23973469 24720462 25076838 25505113 26071588 26555311 27171999 27698431 28113442 28398917
4066 28398917 29007196 29941426 30564887 31085963 31550852 32256701 33161103 34157794 35206767
4057 35206767 36281054 37536292 38521973 39578749 40402635 41139955 41960578 42904727 44131884
4048D4131884J145394J375147J398691J539586J584626J535265J487775J739677
4040E5938045J785389K065321K293570K821102K653938K584269K861521L402669
4032G6405824L820912M055091M432512M703469N329562N833903O541749P246522
4024A18369544Q192364Q755310R917566J0235158J0416604R743888Q134508N117817
4016A88882759J730994j596973l766115m161939m011669l215173j962650j149867
4008A70749367l03418O07194J309918J695689J971153K507142K631741K964917
4000A84133703L358181L423883L313772L328352L561234L589355L348449L228263
3992B11285192L075668K804440K598677K510100K244178K191094J604097J326377
$$ plain form
4048 44131884 45277278 46652425 48051116 49590702 51175328 52710593 54198368 55938045
4040 55938045 57723434 59788755 62082325 64903427 67557365 70141634 73003155 76405824
4032 76405824 80226736 84281827 88714339 93417808 98747370 104581273 111123022 118369544
4024 118369544 126561908 135317218 145234784 155469942 165886546 175630434 183764942 188882759
4016 188882759 190613753 189016780 185250665 181088726 177077057 173861884 171899234 170749367
4008 170749367 170445949 171053143 172363061 174058750 176029903 178537045 181168786 184133703
4000 184133703 187491884 190915767 194229539 197557891 201119125 204708480 208056929 211285192
3992 211285192 214360860 217165300 219763977 222274077 224518255 226709349 228313446 229639823
3984B29639823J150350P62931M70511N5453l2220l94203o80058j125245j484496
3975B28362846j698836j795923k130553k497652k770897k972681l334113l409858
3967B07752333l425048l298691l743282l882907l662133l664857m002375l887367
3959A78185673l888500m025221l903623l916666l834116l647412l624773m040960
3951A47304402l426311l323499l536941l244169l277524l081130k885199k800783
3943A21728846k669699k880009k581820k457063k500438k539172k362667j937412
3935A01800566k206260k340173j981823j965481j947090j553349j329775j504068
3927H6972547j160084j203173j404415q99223r57763q82252n66079m33720l90376
$$ plain form
3984 229639823 230790173 231553104 232023615 232079068 232046848 231652645 230972587 229847342 228362846
3975 228362846 226664010 224868087 222737534 220239882 217468985 214496304 211162191 207752333
3967 207752333 204327285 201028594 197285312 193402405 189740272 186075415 182073040 178185673
3959 178185673 174297173 170271952 166368329 162451663 158617547 154970135 151345362 147304402
3951 147304402 143878091 140554592 137017651 133773482 130495958 127414828 124529629 121728846
3943 121728846 119059147 116179138 113597318 111140255 108639817 106100645 103737978 101800566
3935 101800566 99594306 97254133 95272310 93306829 91359739 89806390 88476615 86972547
3927 86972547 85812463 84609290 83204875 82305652 81347889 80465637 79899558 79465838 79075462
3918G9075462k72360N3407K18798N86245O87466R45483J449607J859448K089901
3909H6693457K152138K336499K829953L033100L030455L401606L661474L814028
3901A10952710M601052M544028M388163L871141K421914K81078k278162m550167
3893A24231757o545368p505320p949895p487359o750507o419500n855480m731770
3885G0986558m486122m092595l464304l013336k754437k618493k136563j936229
3877D6484479j930126j506214j528416j522769j182154j142462j137657j168403
3869C5366278r67982q57485q34448p30882q75681r59702o95430q11547o86536
3860B7946585m71164n38535n98297o59794m95331m45353m08798m43359m19762
$$ plain form
3918 79075462 78803102 78856509 79075307 79661552 80349018 81294501 82744108 84603556 86693457
3909 86693457 88845595 91182094 94012047 97045147 100075602 103477208 107138682 110952710
3901 110952710 115553762 120097790 124485953 128357094 130779008 131060086 128781924 124231757
3893 124231757 117686389 110181069 102231174 94743815 87993308 81573808 75718328 70986558
3885 70986558 66500436 62407841 58943537 55930201 53175764 50557271 48420708 46484479
3877 46484479 44554353 43048139 41519723 39996954 38814800 37672338 36534681 35366278
3869 35366278 34398296 33540811 32706363 31975481 31099800 30140098 29444668 28633121 27946585
3860 27946585 27475421 26936886 26338589 25678795 25183464 24738111 24329313 23885954 23466192
3851B3466192k68108n39793m06276j42003l38420l33450m56540m20183o7679l99646
3841B0094094j38957k52789l13811k18049k45108k26465k19323k43734k33673
3832A8002185r0741p9120k19658q1082j05480l16227k16447m4571j5310j09780
3822A6723769j28656m1132l25708N9231j32687k54310J56675j65943O4308J70204
3812A6125751j37041k39487r8991l5903j43486m8645r1618J3114J09873K9681
3802A5483248Q9416J56272j2109j61324k9498k89087n2103J40521j47613J71659
3792A5349382J08149j38655m0546j02293K04793j64399J6110Q8894l584j47049
3782A5170802J77999J05608j42654J61740o2168j35612q8362M3811k6274q4975
$$ plain form
3851 23466192 23198084 22658291 22252015 22110012 21771592 21438142 20981602 20561419 20493740 20094094
3841 20094094 19955137 19702348 19388537 19170488 18925380 18698915 18479592 18235858 18002185
3832 18002185 17911444 17832324 17612666 17531584 17426104 17109877 16893430 16848859 16833549 16723769
3822 16723769 16595113 16553981 16228273 16287504 16154817 15900507 16057182 15891239 15955547 16125751
3812 16125751 15988710 15749223 15650232 15614329 15470843 15422198 15330580 15343694 15453567 15483248
3802 15483248 15572664 15728936 15716827 15555503 15526005 15236918 15184815 15325336 15177723 15349382
3792 15349382 15457531 15318876 15278330 15176037 15380830 15216431 15232541 15321435 15317851 15170802
3782 15170802 15348801 15454409 15311755 15473495 15411327 15275715 15187353 15231164 15204890 15119915
3772A5119915J57149k6555j38480L8477k9621j10683k3149J69795J73138p9943
3762A5250043k6365k8508J52438k794j9387n8133K3107K16616m9480J21070K0661
3751A5599268J01850J59671K0732O1290q5504j4654J94247J49861O8739m8358
3741A6207142Q0348J18718K87790K40277K19028l9415P767K8961J03641J63525
3731A7417782K23407L26446K34355j5218M8853M34944j09421K57528N03888L05577
3721A9628141M28650J95846J42466L33258K26368K67098L84147K75138Q5551N08611
3711B2475274J83978M67176K78340L10902M61586J72148M18106L12289K54565
3702B5334364M40296L13348O03588M24208K66006O57107M55158M22291M17774
$$ plain form
3772 15119915 15277064 15250509 15112029 15150506 15120885 15010202 14987053 15156848 15329986 15250043
3762 15250043 15223678 15195170 15347608 15344814 15325427 15267294 15290401 15507017 15457537 15578607 15599268
3751 15599268 15701118 15860789 15881521 15942811 15857307 15842653 16036900 16186761 16255500 16207142
3741 16207142 16287490 16406208 16693998 16934275 17153303 17113888 17121655 17150616 17254257 17417782
3731 17417782 17641189 17967635 18201990 18186772 18235625 18670569 18561148 18818676 19322564 19628141
3721 19628141 20056791 20252637 20395103 20728361 20954729 21221827 21605974 21881112 21966663 22475274
3711 22475274 22659252 23126428 23404768 23715670 24177256 24349404 24767510 25079799 25334364
3702 25334364 25774660 26088008 26691596 27115804 27381810 28038917 28494075 28916366 29334140
3693B9334140O03866O59196L69830M30028P80983O10796Q45760P03888L56099
3684C4694586O90639Q36692O10455J024932Q70257P38208J020751Q41931Q81601
3675D2210052R37121J261515J053264R41610J100633J210954J550235J134918
3667E1400302J328205J404914J620278J675407J684219J713914K164606K055479
3659F5047324K042615K164741K113341K192243K412446K633609K535990K493830
3651H3636139K663163K748981K999541K615976K602411K623240K556907K699180
3643A05145538K623857K143685K279927K589415K322369K121437J934219J982407
3635A23142854K049829J820385J545836J644335J464144J402001R87443J165194
$$ plain form
3693 29334140 29938006 30597202 30967032 31397060 32178043 32788839 33634599 34338487 34694586
3684 34694586 35385225 36221917 36832372 37857304 38727561 39465769 40486520 41328451 42210052
3675 42210052 43147173 44408688 45461952 46403562 47504195 48715149 50265384 51400302
3667 51400302 52728507 54133421 55753699 57429106 59113325 60827239 62991845 65047324
3659 65047324 67089939 69254680 71368021 73560264 75972710 78606319 81142309 83636139
3651 83636139 86299302 89048283 92047824 94663800 97266211 99889451 102446358 105145538
3643 105145538 107769395 109913080 112193007 114782422 117104791 119226228 121160447 123142854
3635 123142854 125192683 127013068 128558904 130203239 131667383 133069384 134056827 135222021
3627A35222021J081942Q93908R57259J308784J159290R00971J214421J501916
3619A44240512J277678J628289J858471J965666J874524K132072K292214K529055
3611A59798481K856975K914253L184845L525614L946314M114326M272777M792490
3603A89406075N021620N664615N949919O214891O407972O538522O900860O880403
3595B38984877P249942P114560P094631P110109P111397O747239O534494O495182
3587B94442431O298789O256583O262911N852315N660183N401845M827836M505540
3579C39508433M033834L465353L153417K522135J995857J403265J179680R69419
3571C58231393L50356M80779L77598K61286L35086J71819L21379L30458J15781
$$ plain form
3627 135222021 136303963 137197871 138155130 139463914 140623204 141524175 142738596 144240512
3619 144240512 145518190 147146479 149004950 150970616 152845140 154977212 157269426 159798481
3611 159798481 162655456 165569709 168754554 172280168 176226482 180340808 184613585 189406075
3603 189406075 194427695 200092310 206042229 212257120 218665092 225203614 232104474 238984877
3595 238984877 246234819 253349379 260444010 267554119 274665516 281412755 287947249 294442431
3587 294442431 300741220 306997803 313260714 319113029 324773212 330175057 335002893 339508433
3579 339508433 343542267 347007620 350161037 352683172 354679029 356082294 357261974 358231393
3571 358231393 358581749 359062528 359440126 359701412 360036498 360208317 360529696 360860154 360975935
3562C60975935K87614N92601K90413N22270N58501O88325R35478P59580P09642
3553C66320359J025236J040444J188102J205517J083153J347436J742863J633678
3545C76586788J570387J745584J603804J398648J375387J915196J337189R67881
3537C88500864R41945P62053P44484Q22622O40442J043985J075237J130883J646954
3528C97309469J849829K494253K744144K960789L300281L796697L496459L371114
3520D21323035L307249L092405K706508K187970K096443J732652J459269J045714
3512D38951245J161468J217720J118333J620517J845641K136513K657501K645361
3504D53354299K494565K077846J241924J26166j108257k634972m073427n062123
$$ plain form
3562 360975935 361263549 361856150 362146563 362668833 363227334 363915659 364851137 365610717 366320359
3553 366320359 367345595 368386039 369574141 370779658 371862811 373210247 374953110 376586788
3545 376586788 378157175 379902759 381506563 382905211 384280598 386195794 387532983 388500864
3537 388500864 389442809 390204862 390949346 391771968 392412410 393456395 394531632 395662515 397309469
3528 397309469 399159298 401653551 404397695 407358484 410658765 414455462 417951921 421323035
3520 421323035 424630284 427722689 430429197 432617167 434713610 436446262 437905531 438951245
3512 438951245 440112713 441330433 442448766 444069283 445914924 448051437 450708938 453354299
3504 453354299 455848864 457926710 459168634 459294800 458186543 455551571 451478144 446416021
3496D46416021n860874n932449n415849n059689m064706l419888k303080j489249
3488D12870237p90960o54743p59641j036351j404034j799724j971520k123062
3480D02330202k359189k321014k687393k757525l004650l647757m499410m940023
3472C76113241n705407n854175o032614o167156o031544o207533n829251o194874
3464C28090687o718808o913723p717739q632504r410517j0341382j1234908j1690998
3456B55430108j1838681j1734417j1283071j0728492r869505r294050q567541
3449A82114351p822322p191724o345382o031075n276909m908979m708341m433834
3441A35395785m154926l627950l557906l521665l205312k995119k908968k783970
$$ plain form
3496 446416021 440555147 434622698 429206849 424147160 420082454 416662566 414359486 412870237
3488 412870237 412079277 411424534 410664893 409628542 408224508 406424784 404453264 402330202
3480 402330202 399971013 397649999 394962606 392205081 389200431 385552674 381053264 376113241
3472 376113241 370407834 364553659 358521045 352353889 346322345 340114812 334285561 328090687
3464 328090687 321371879 314458156 306740417 298107913 288697396 278356014 267121106 255430108
3456 255430108 243591427 231857010 220573939 209845447 199975942 190681892 182114351
3449 182114351 174292029 167100305 160754923 154723848 149446939 144537960 139829619 135395785
3441 135395785 131240859 127612909 124055003 120533338 117328026 114332907 111423939 108639969
3433A08639969k621761k657130k646907k625553k434166k311732k412661k456614
3425H8473445k276397k371528k437257k175179k132636k233036k158024j986803
3417G0702585j864456j850781j778996j686815j385504j670880j140326j211743
3409E8113084j647351j301829j194202j062811j112505j327571j212193j039665
3401D8214957r23791r99724q99045p38923p46259o72156r29800n40282p26340
3392D1038637q37908n20129n60959r35754m05813n09918o31088m40949m04353
3383C5791766m02628n95265k37211n64266m87245m58491m71271n91709k04751
3374C1778929k78566m18429l05506l25191l22238k45520l55922l61847q5674j83207
$$ plain form
3433 108639969 106018208 103361078 100714171 98088618 95654452 93342720 90930059 88473445
3425 88473445 86197048 83825520 81388263 79213084 77080448 74847412 72689388 70702585
3417 70702585 68838129 66987348 65208352 63521537 62136033 60465153 59324827 58113084
3409 58113084 56465733 55163904 53969702 52906891 51794386 50466815 49254622 48214957
3401 48214957 47291166 46291442 45392397 44653474 43907215 43235059 42305259 41764977 41038637
3392 41038637 40200729 39680600 39119641 38183887 37778074 37268156 36637068 36196119 35791766
3383 35791766 35389138 34793873 34556662 33992396 33505151 33046660 32575389 31983680 31778929
3374 31778929 31500363 31081934 30776428 30451237 30128999 29883479 29527557 29165710 29080036 28896829
3364B8896829o27024l96474O8710k23357j74237r7474p5229k15837r4520k08235
3354B6853152n82679m1365q2023k02407j05981l09749j64968j23098j8442p0191
3344B5152249k27457j12796j02708q7865j70204p0215K03105M0744n6214k1558
3334B4547081j24263J56431j01699n0292K10370O1242J85317p3535j1793K51184
3324B5050043J49739M2596J73260M58654K08501O4296L72654K84411M04639K86764
3314B7495557K93464M78341N45832M39252Q61960P31526O36266R41490J190828
3305C3614516J007197J222244J237993J285207J571973J388502J373584J295822
3297D3997038J532918K007627K086406K244897K279523K047963K053641J849846
$$ plain form
3364 28896829 28269805 27873331 27942041 27718684 27544447 27446973 27371744 27155907 27061387 26853152
3354 26853152 26270473 26229108 26147085 25944678 25838697 25528948 25363980 25240882 25222440 25152249
3344 25152249 24924792 24811996 24709288 24621423 24451219 24381004 24584109 24624853 24568639 24547081
3334 24547081 24422818 24579249 24477550 24427258 24637628 24698870 24884187 24810652 24798859 25050043
3324 25050043 25199782 25242378 25415638 25874292 26082793 26147089 26519743 26804154 27208793 27495557
3314 27495557 27789021 28267362 28813194 29252446 30114406 30845932 31482198 32423688 33614516
3305 33614516 34621713 35843957 37081950 38367157 39939130 41327632 42701216 43997038
3297 43997038 45529956 47537583 49623989 51868886 54148409 56196372 58250013 60099859
3289F0099859J825972K220942K602976L120905L065980M075117N080471O032485
3281H8124707P045754P462961N582810J850164l452584o957804p468281o868454
3273H5319273n915718m546390l520513k447582j504286j137481m39108J46306
3265F5954501L31920O04995O85727L90183N55039J166938J294444J802990K472003
3256G5258740K777071L555760M582573N914225O317388N483451K460141k485196
3248A03864153p154507q605257q653303p511912o272443n070542m008096l110830
3240E3477263k780133k294698j798714j528561j452526p90325p05074l32531l78988
3231D1415713r4614N7217R9237L46490O61179J051153J434458J407027J503543
$$ plain form
3289 60099859 61925831 64146773 66749749 69870654 72936634 77011751 82092222 88124707
3281 88124707 95170461 102633422 108216232 110066396 106613812 99656008 92187727 85319273
3273 85319273 79403555 74857165 71336652 68889070 67384784 66247303 65808195 65954501
3265 65954501 66286421 66891416 67577143 67967326 68522365 69689303 70983747 72786737 75258740
3256 75258740 78035811 81591571 86174144 92088369 98405757 103889208 106349349 103864153
3248 103864153 96709646 88104389 79451086 71939174 65666731 60596189 56588093 53477263
3240 53477263 50697130 48402432 46603718 45075157 43622631 42832306 42127232 41794701 41415713
3231 41415713 41321099 41378316 41477553 41824043 42485222 43536375 44970833 46377860 47881403
3222D7881403J041074n3954j315683k074780k563724j964559j581666j360555
3214C8007556j210398j200572r97658j025471r76511q88525o06059o59413p4973
3205C0367976k3781j23611O2666K39498M67040R16013J065837J129039J401591
3196C5502268J897037J843855J318060q1993j356291j993099k182834j666628
3188C3280375j640961j200744q28223q64302p32738p23202o16504o18426k81310
3179B5773965o93748n39763l11289j64074j47460m7302O898j58621O7578P8617
3169B3864801o6837j21988K49368K11005J17882L76673K14262L39157M69807N01551
3159B6155681N68044O66835J66652O33497L86566M00148J55134L75315P89962
$$ plain form
3222 47881403 48922477 48868523 47552840 45478060 42914336 40949777 39368111 38007556
3214 38007556 36797158 35596586 34598928 33573457 32596946 31708421 31102362 30442949 30367976
3205 30367976 30344195 30220584 30283250 30522748 30989788 31905801 32971638 34100677 35502268
3196 35502268 37399305 39243160 40561220 40479227 39122936 37129837 34947003 33280375
3188 33280375 31639414 30438670 29610447 28746145 28013407 27290205 26673701 26055275 25773965
3179 25773965 25080217 24540454 24229165 24065091 23917631 23870329 23877227 23718606 23786184 23864801
3169 23864801 23797964 23675976 23925344 24136349 24254231 24630904 24845166 25184323 25654130 26155681
3159 26155681 26723725 27390560 27557212 28190709 28577275 28977423 29132557 29507872 30297834
3150C0297834M14538M54240O66184P25166Q18333J268497J269434J095099J244239
3141C8253564J401293J549572J910578K298539K960640L317766L878088M873740
3133F0443780N796292P685720J0067764J2440045J4911866J5706843J2590396
3126A39642706M605124o318750j4245732j5804481j3873160j0976225p923007
3119G5106475n591967m173214l086829k563683k348535j801141j186389l68691
3111E3986026J4440N10714J156428J727123K731009L530696M576589O514800Q804133
3102H3551958J1336065J3639313J4116614J0696669K231439q699547j5448004
3095A11424507j6198268j4196795j1079565q791566o406470m795763m137175l683414
$$ plain form
3150 30297834 30712372 31166612 31832796 32557962 33376295 34644792 35914226 37009325 38253564
3141 38253564 39654857 41204429 43115007 45413546 48374186 51691952 55570040 60443780
3133 60443780 66240072 73925792 83993556 96433601 111345467 127052310 139642706
3126 139642706 144247830 137929080 123683348 107878867 94005707 83029482 75106475
3119 75106475 69514508 65341294 62254465 59690782 57342247 55541106 54354717 53986026
3111 53986026 54000466 54511180 55667608 57394731 60125740 63656436 68233025 74747825 83551958
3102 83551958 94888023 108527336 122643950 133340619 135572058 126872511 111424507
3095 111424507 95226239 81029444 69949879 61158313 54751843 49956080 45818905 42135491
3087D2135491l127218k905602k434044k090195j885950j429858j582728j396502
3079B5283394j151243j108479r22179p72841o99896p30556n71820n91081n31799
3070A8203500m58002m52313o02230o22478k67357m28708m82870m32328l56001
3061A4101213l75945m01402l53310l36008l22500l12074j75177k63901j80850
3052A1380046l39347k49415k06429l28812j10635l3293j44509r014l45681l43547
3042I269364r2763j09063j67953j82262j90352j22921p7019k8198k88260k17757
3032G792816j36361k03059o6186l01969k08191J93396P893j65681l54725k40611
3022F317322L8953J59559k4831K5660j50728j12267p1221j43173j78656j49007
$$ plain form
3087 42135491 39008273 36102671 33668627 31578432 29692482 28262624 26679896 25283394
3079 25283394 24132151 23023672 22101493 21328652 20628756 19898200 19326380 18735299 18203500
3070 18203500 17745498 17293185 16690955 16068477 15801120 15372412 14889542 14457214 14101213
3061 14101213 13725268 13323866 12970556 12634548 12312048 11999974 11824797 11560896 11380046
3052 11380046 11040699 10791284 10584855 10256043 10145408 10112115 9967606 9958592 9612911 9269364
3042 9269364 9176601 9067538 8899585 8717323 8526971 8404050 8327031 8298833 8010573 7792816
3032 7792816 7656455 7453396 7387210 7085241 6877050 7070446 7078339 6912658 6557933 6317322
3022 6317322 6356275 6515834 6491003 6516663 6365935 6253668 6182447 6039274 5860618 5711611
3012E711611L3819l6668j10874J3091q1174j37177j20837l01732Q0718O1574o705
3001E105646j51723j29501k4864J0656l8290O24j35174J35995L1955n72l6893
2990D767859N043Q6480k59359K2461l6855J21278j9520r0895j69289L8016j02661
2979D362558j88563K7434k98331K9209r3901K77460k75328j38394K34751q5058
2969C851837q8597k5672j32877J79255N9658K6838j57185q1671R8602K02202m4375
2958C888015j26514j941r9126j52039J28601j77646k05806K51017r3534J67715
2948C578742k9410k57780j04131j59076J87814k102k04363Q6367j229P7469j75707
2937B996594N6197J88754k00863j60766L3443K03455j01461J34363n8426O1247
$$ plain form
3012 5711611 5745430 5708762 5597888 5610979 5529805 5392628 5271791 4970059 5050777 5112351 5105646
3001 5105646 4953923 4824422 4799558 4810214 4771924 4772548 4637374 4773369 4805324 4804752 4767859
2990 4767859 4772902 4859382 4600023 4622484 4585629 4706907 4687387 4596492 4427203 4465219 4362558
2979 4362558 4173995 4201429 3903098 3932307 3838406 4115866 3840538 3702144 3936895 3851837
2969 3851837 3763240 3737568 3604691 3783946 3843604 3870442 3713257 3631586 3730188 3932390 3888015
2958 3888015 3761501 3759560 3660434 3508395 3636996 3459350 3253544 3504561 3411027 3578742
2948 3578742 3549332 3291552 3187421 3028345 3216159 3214057 3009694 3096061 3094832 3172301 2996594
2937 2996594 3052791 3241545 3040682 2879916 2913359 3116814 3015353 3149716 3091290 3152537
2927C152537j20669L881M6034q0690L5911k86349J29625K5657o5709K73365P2205
2916C185798k74229K25092O6309k9660o9242M8101J68663k0136k8820l6035j69169
2905C066672N2892n614J77832o6875k36777J51752J91017j02568K222j43684K0341
2894C107210l0436l4027O3927k9638K41342R9474J6435K10990j9350o3811k76680
2883C285436J16842k0653N4947o0500j76610j12805N374J25468K81685P2250N6971
2872C628405K13672k43355j17122J10752L20929k3811R0771K21609l8948P1511
2862D234413K75058J96629J66954J24730j20245K6154q015m1884j50368k03240
2852D500186m7984J26284l2684j14668N596k18782j58392J67670K71394q3618
$$ plain form
2927 3152537 3031868 3035749 3081783 3001093 3037004 2750655 2880280 2905937 2840228 3113593 3185798
2916 3185798 2911569 3136661 3202970 3173310 3104068 3152169 3320832 3300696 3271876 3235841 3066672
2905 3066672 3119564 3113950 3291782 3224907 2988130 3139882 3330899 3228331 3230553 3086869 3107210
2894 3107210 3076774 3042747 3106674 3077036 3318378 3417852 3434287 3645277 3625927 3562116 3285436
2883 3285436 3402278 3381625 3436572 3376072 3199462 3086657 3092031 3217499 3499184 3571434 3628405
2872 3628405 3842077 3598722 3481600 3592352 3913281 3889470 3980241 4201850 4162902 4234413
2862 4234413 4509471 4706100 4873054 4997784 4877539 4903693 4895678 4853794 4703426 4500186
2852 4500186 4452202 4578486 4545802 4431134 4436730 4217948 4059556 4227226 4498620 4415002
2842D415002k22182j02518Q7859j19851N2508k17929k93589k67114N5300K3838
2832C411324k55260m35773P9347R0897p8970k38826J8033j36634k79713J07006
2822B281431o5066O314R1375l9496k4815P1766K37490L9841j45700L1105j03917
2811B380328l3798N3270o7655R677p5519j84011M3136l1552J12638l44829k19538
2800A642147J50702k04801p2881l7067M2268J503K2492j31535k0261l0761K77528
2789A639334j60107j14573P7309K1531J80849r9562o8872J22248O6008k39151
2779A425014n7222l9881p5631P7302O0990Q803r4025j41619J46364j7493J37349
2768A429951j01895n8161J1148M254l9935J59663K0054j65929K8361l9340j03644
$$ plain form
2842 4415002 4192820 4090302 4178161 4058310 4110818 3892889 3599300 3332186 3387486 3411324
2832 3411324 3156064 2720291 2799638 2890535 2811565 2572739 2590772 2454138 2174425 2281431
2822 2281431 2216365 2222679 2314054 2274558 2249743 2321509 2558999 2598840 2453140 2484245 2380328
2811 2380328 2346530 2399800 2332145 2341822 2266303 2082292 2125428 2093876 2206514 1861685 1642147
2800 1642147 1792849 1588048 1515167 1478100 1520368 1521871 1544363 1412828 1392567 1361806 1639334
2789 1639334 1479227 1364654 1441963 1463494 1644343 1544781 1475909 1598157 1664165 1425014
2779 1425014 1367792 1327911 1252280 1329582 1390572 1399375 1305350 1163731 1310095 1292602 1429951
2768 1429951 1328056 1269895 1281043 1285297 1245362 1405025 1425079 1259150 1287511 1248171 1144527
2757A144527J28607l44101J05341P6124k0772M7815j55352R6399k9399J92004
2747A241193o4198j42142r4674O5033J5030j78750J57146j49178k31611L40595
2737I58444J61198Q5516P7147k04914j85486M4915J42232j65005M2470n5510J00528
2726A001535P5952L9132j72222n0612J19812j84441J73725P82m8645J17668m6035
2715A026651j76633J35874j23496j57670n9999K610J65091p1100j53368K39223
2705H27183n8741J03296k3642Q3612J6432j33l4297J27994j16443P7767Q2278
2694A085306k06406J53615j74883J00569o2509j51455l8771J53828L3331k18378
2684F74247j89713J27805J22P4215Q2289j54691j12357J2740K80354n5610j86768
$$ plain form
2757 1144527 1273134 929033 1034374 1110498 1089726 1137541 982189 1078588 1049189 1241193
2747 1241193 1176995 1034853 940179 1005212 1020242 841492 998638 849460 617849 958444
2737 958444 1119642 1205158 1282305 1077391 891905 936820 1079052 914047 956517 901007 1001535
2726 1001535 1077487 1116619 944397 893785 1013597 829156 1002881 1003663 955018 1072686 1026651
2715 1026651 850018 985892 862396 704726 644727 647337 812428 741328 587960 827183
2705 827183 768442 871738 848096 931708 948140 948007 913710 1041704 925261 1003028 1085306
2694 1085306 878900 1032515 857632 958201 895692 744237 705466 859294 892625 674247
2684 674247 484534 612339 612461 686676 768965 614274 501917 514657 795011 739401 552633
2673E52633N0438k5006J92758j46672l09653L5276L93784O2438q6518J07580j28213
2662F98845j79994K11127J06166p732L41588j55290k12574j69151L0737N6741
2652G20463K705j26385j84668J7307K77962k01799j1426K90356j23648M4774n2141
2641F53500n4482J15593N3433L97m5626j12809j19990J40309M8803j10982M5110
2630F13256L125p929j91627l735R3774l2203Q4561R1452l45764j08129J89676
2619C86457Q3975M645r989j93178J54397J10179j63842J72097j1065P6865J95567
2608H06108r1369K3608j14402K13708k9906j08348o316K71711j52768k10392P4696
2597F76330j62226M5625j4516J7188j602n0044J29008k1504j40738p6182j11154
$$ plain form
2673 552633 603071 578065 770823 624151 314498 349774 743558 805996 719478 827058 698845
2662 698845 518851 729978 836144 828412 1170000 1014710 802136 632985 663722 720463
2652 720463 723168 596783 412115 429422 707384 505585 494159 784515 660867 705641 653500
2641 653500 599018 714611 768044 768441 722815 610006 490016 630325 679128 568146 613256
2630 613256 616381 608452 416825 413090 506864 474661 559222 650674 304910 196781 386457
2619 386457 470432 475077 465088 271910 426307 536486 372644 544741 533676 610541 806108
2608 806108 714739 738347 623945 837653 807747 699399 693083 964794 812026 601634 676330
2597 676330 514104 559729 545213 562401 560799 510755 639763 618259 477521 401339 290185
2586B90185M6819M1101j12926M846K14148J13131l8849k81190J53246m9208K61404
2575F42707j19306R1958M0242k2666Q0257n5979j00464K175j45067k93939J86163
2564C06081O2542q1444Q5991J72010j8955j73748Q0107J00435J38087r0558j84751
2553C95797j2922O5505L29557j73536j56241J6724n9422j17631J6751J11828K8952
2542D45362j59929r1675J53628J41930j47772j01630m6300l0769J38301l4959
2532B66187J9125P9594K09440J05254k81908r1140j25479K08179J25758j84009
2522C31001o7796n3459j512r6183K30423Q4410l5161L1857N3911M8037j30204
2511C95324l8552j71969m280P117J00939m7780P4369M9331K2922N7253q1247L6959
$$ plain form
2586 290185 337004 378105 265179 270025 484173 597304 558455 277265 430511 381303 642707
2575 642707 523401 615359 655601 632935 713192 657213 556749 558924 413857 119918 306081
2564 306081 368623 287179 373170 545180 526225 352477 432584 533019 671106 580548 395797
2553 395797 382875 448380 777937 604401 448160 464884 405462 287831 304582 416410 445362
2542 445362 285433 193758 347386 489316 341544 239914 193614 162845 301146 266187
2532 266187 285312 364906 574346 679600 397692 306552 181073 389252 515010 331001
2522 331001 263205 209746 208234 112051 342474 426884 391723 423580 477491 525528 395324
2511 395324 356772 184803 180523 187640 288579 240799 315168 364499 387421 444674 363427 400386
2499D00386J61513j54214k35860n8700l7708L06152N5989j15130j87847K55100
2489C89681O4300l2670J46668j27222k5003L0077k4216k23245j48171J39709J54758
2478C44666j2197K5700K5136j04109N2825L9608M5420p3527j53985R7969J08125
2467C95631j48035m7830k5967J9860J49083r157k594j74466o7009N8537J23785
2456B71838J49720K8903q8352j54948O9593J22491k16108L6299o9379J30988M2689
2445C23734L9519j73834R5420J24568q809K8096j52600q4523r1453K46018N5927
2434D02063q0971j62671J73264L3706j11237j97729Q607J57374o3885j8529M4602
2423A84594O0414J44033j46046n7008K8861j202n2731J9946Q6220l167j2592M1832
$$ plain form
2499 400386 561899 407685 171825 113125 75417 381569 437558 322428 134581 389681
2489 389681 453981 421311 567979 440757 415754 445831 421615 198370 50199 189908 344666
2478 344666 332469 358169 383305 279196 332021 371629 417049 343522 189537 287506 395631
2467 395631 247596 199766 173799 193659 342742 333585 330991 156525 89516 148053 271838
2456 271838 421558 450461 362109 207161 276754 399245 183137 219436 150057 281045 323734
2445 323734 363253 189419 284839 409407 400598 428694 276094 191571 100118 346136 402063
2434 402063 321092 158421 331685 365391 254154 56425 65032 222406 158521 139992 184594
2423 184594 245008 389041 242995 185987 214848 213646 160915 180861 267081 263914 251322 293154
2411B93154J18520K0501j6461n5802l7704L4968j56845k2244m6811o7470R3165
2400A56971J65080J72733l97137J12519K19076j78811j34561J15713N0253L7765
2390C19601j07422m805P7937j32857M9206k91722P141O1429J48707O5954p3506
2379A19663K51608j01496q4935k9693r8941n4750K7639O8313L2630K28783o3628
2368B95193m369N5237M1070L3445j33096j42036J94067O0073p2825n8318K36353
2357E04794M0194J15007Q9721j12359m7040l56447P7386j6425j32l8077j2984
2346B43638J01145J35673j37165K4345J16378j1295O6689j05536n3321K5116k36013
2335A69654K0536R2300j69004j92575K1382K47038J47848J33288l4703q1757n723
$$ plain form
2411 293154 411674 432175 415714 359912 322208 357176 200331 178087 131276 63806 156971
2400 156971 322051 494784 97647 210166 429242 250431 115870 231583 281836 319601
2390 319601 212179 207374 285311 152454 201660 -90062 -82921 -21492 127215 193169 119663
2379 119663 371271 269775 184840 155147 56206 1456 29095 97408 130038 358821 295193
2368 295193 290824 346061 387131 420576 287480 145444 339511 399584 326759 268441 504794
2357 504794 544988 659995 749716 637357 590317 233870 311256 294831 294699 256622 243638
2346 243638 344783 480456 343291 367636 484014 472719 539408 433872 380551 405667 169654
2335 169654 190190 282490 113486 -79089 -57707 189331 337179 470467 435764 354007 348284
2324C48284R5546q167n2472k14037P5025j4314j09998l6968Q7988j6677j28220
2313B5990Q6316l4922j15581P6719K91904m956j66003j92760J10131P4047K6102
2302A76987J13760R9649n531j11272j14151L847J2823R9520K6732q9001J51454
2291C64817n2091J60290n7898k31396p046n6732J78447l8749K2057O3043n328
2280C39414O26N4778J2635P0930k1388j7526r2915n4177k26499R8767O6994m0104
2268A91535k171j93965K42588q0158m3392J03560J7043K509P3307J68804l4750
2257D44910k01656r0339J05704J17662n6563r0356j06015j3634J02132R0804O5576
2246C68225j8934q4256J19691R5014n4912p3705N4717O9990m8167k70396n4744
$$ plain form
2324 348284 443830 435663 383191 169154 244179 229865 119867 82899 170887 154210 25990
2313 25990 112306 77384 -38197 38522 330426 325470 159467 -33293 76838 150885 176987
2302 176987 290747 390396 384865 273593 159442 163289 176112 275632 302364 213363 364817
2291 364817 312726 473016 415118 183722 176676 119944 298391 259642 281699 344742 339414
2280 339414 340040 394818 407453 478383 456995 439469 346554 292377 65878 164645 231639 191535
2268 191535 189364 -4601 237987 157829 114437 217997 235040 237549 310856 479660 444910
2257 444910 243254 152915 258619 376281 319718 229362 123347 109713 211845 302649 368225
2246 368225 349291 265035 384726 479740 424828 351123 405840 475830 427663 157267 102523
2235A02523O9716J90919J74023j13581r4654j55235P4591K63659Q5485k9800R0283
2224F57929p6278M8503q1859M1773j5422j18290O9418p0835p406m7812K191N506
2212D07418O6730j13085P5360R7875Q5377k35385J23862R1459P9j39820K7404
2201D87274L9596l7544L167j10736K34389k8839O0882l57068J871J85958K21832
2190G00782Q6966j23028J15707m54j99202N244J55137m7258J4653J30249q0400
2179G58396m7698k6541P8742O673O2882K8515K03971J80100k0139j64930q1104
2168I78867O1292j07123J33116J08508K9720O6830M3791N0812J72102j53824j95767
2157A188324J9994K37375j46920Q1603L49918j41513k39348J08140J96398j0400
$$ plain form
2235 102523 172239 363158 537181 423600 328946 173711 248302 511961 597446 567646 657929
2224 657929 581651 630154 548295 590068 574646 456356 525774 454939 447533 399721 401912 407418
2212 407418 474148 361063 436423 534298 619675 384290 508152 599611 599690 459870 487274
2201 487274 526870 489326 492493 381757 616146 587307 648189 291121 292992 478950 700782
2190 700782 787748 664720 780427 779973 580771 586015 741152 693894 708547 838796 758396
2179 758396 710698 684157 762899 769572 832454 860969 1064940 1245040 1224901 1059971 978867
2168 978867 1040159 933036 1066152 1174660 1204380 1271210 1315001 1365813 1537915 1384091 1188324
2157 1188324 1208318 1445693 1298773 1380376 1730294 1588781 1349433 1457573 1653971 1643571
2147A643571J42121k5103K2674J2638O108K99338Q1993O9072k24080J1599Q4109
2136B124040K17798J29889J08496J69591J23689J06486J6861J52962L4010J98401
2126C382223K31114K20433J93841L9288P0110P1676L11109K09571J58462K33829
2116E121656J33059M02144L61544M13951J90436L85189P29452K57693K95308Q04285
2106I094717O37883P03632P65961O32814P30413J041067R53821J375346J711716
2097A7647370K044155K768779L537795M791188O144627P554761R191125Q696476
2089F2376276M696317k650164q810531j0018361q243818o209523m570464l658529
2081B2911203k598518k031856j597140j365963j531180r88303p56144o62131o40045
$$ plain form
2147 1643571 1785692 1760589 1783263 1795901 1802009 2101347 2183340 2252412 2028332 2039931 2124040
2136 2124040 2341838 2471727 2580223 2749814 2873503 2979989 2996850 3149812 3183822 3382223
2126 3382223 3613337 3833770 4027611 4066899 4137009 4208685 4519794 4729365 4887827 5121656
2116 5121656 5254715 5656859 6018403 6432354 6622790 7007979 7737431 7995124 8290432 9094717
2106 9094717 9732600 10436232 11202193 11835007 12565420 13606487 14560308 15935654 17647370
2097 17647370 19691525 22460304 25998099 30789287 36933914 44488675 53679800 62376276
2089 62376276 67072593 64422429 55611898 45593537 37349719 31140196 26569732 22911203
2081 22911203 20312685 18280829 16683689 15317726 13786546 12798243 12042099 11379968 10739923
2072A0739923o92964o88640o06258o14813o36379n69066k82207m07946m22445
2063E819205l22863k16072j30803n3364j33659l32233m14423P0884J9150j84565
2053D121257j57151l0733j59213k43917l1249k96660j35814J01777j60871k37667
2043B769759l06128Q8558l80k9082j8117k51626J05406j55287j52507J1676R0873
2032B153145K8402j38683j78220J63203N2502l4664m6204k17157j72557p5584
2022A534183K5330k18653J35784R1407n1393J04530q1382o714J98813k95248k01671
2011A234986J46275k06714j06363J4377P3983M2917j70816J9545m55n966J27353
2000A169122o6482j08451k16609j11056k5467K59389n3152l16807K42766p8553
$$ plain form
2072 10739923 10046959 9358319 8752061 8137248 7500869 6931803 6649596 6241650 5819205
2063 5819205 5496342 5280270 5149467 5096103 4962444 4630211 4215788 4286672 4305822 4121257
2053 4121257 3964106 3933373 3774160 3530243 3498994 3202334 3066520 3168297 3007426 2769759
2043 2769759 2463631 2552189 2551809 2522727 2504610 2252984 2358390 2203103 2050596 2062272 2153145
2032 2153145 2181547 2042864 1864644 2027847 2080349 2045685 1999481 1782324 1609767 1534183
2022 1534183 1559513 1340860 1476644 1568051 1516658 1621188 1539806 1533092 1731905 1436657 1234986
2011 1234986 1381261 1174547 1068184 1082561 1156544 1199461 1028645 1048190 1047735 1041769 1169122
2000 1169122 1102640 994189 777580 666524 641057 900446 847294 530487 773253 694700
1990F94700J58421q5995j03340K859k52186j18286K40174K09197j87761m5041
1980E12742Q0825K19099m7692m9196j56330O4907P7009R2565P9182M0227j50578
1969G62760k54242J48296J01163M9013j62570k72409n9601K224Q2267n602J66656
1958E57955K05739l04322j65837k3625r6015j70187P7111J33245q9224n9393J30778
1947A96225J54038J48285Q8207j36278R392J10099j88792M3412L6731p3274p0169
1936C17876J40209L4305o9550n3250k8451J02843M0186j21413k4341J87255p3027
1925D52642J20956r7065K6394k6275L3361p9410j30421R6699j06939n2769r1836
1914A45337m07n225K6438J39941l8265r1519p0652L7418n92R5106q0537l75J29606
$$ plain form
1990 694700 853121 767126 663786 666645 414459 296173 536347 745544 557783 512742
1980 512742 593567 812666 764974 715778 559448 624355 701364 793929 873111 913338 762760
1969 762760 508518 656814 757977 806990 644420 372011 312410 314634 396901 391299 557955
1958 557955 763694 459372 293535 269910 173895 3708 80819 214064 124840 65447 196225
1947 196225 350263 498548 586755 450477 459869 569968 381176 424588 461319 388045 317876
1936 317876 458085 492390 422840 369590 341139 443982 484168 362755 338414 525669 452642
1925 452642 573598 476533 502927 476652 510013 430603 300182 396881 289942 237173 145337
1914 145337 144930 139705 166143 306084 267819 176300 105648 143066 142474 237580 157043 156668 286274
1901B86274Q4206M8619q3890J33363q6713j92315j3323n0748r2967K14931J88020
1890D35457k03296j62266J32226r129J67686J38966j64496Q8803j78673j20001
1880A25277q8753K19111L35157J6562j21469o9231k3333j0384j12998k51717R0610
1869A08832J6620P9636j25218o6991P1496P6915M6015N8296k39648j331L5947
1858F0569j10285k7229J22234K44459n3791L1009j01594R549o5911j11415J10050
1847A07645L8587l9673J07600L2537j38268j33386N7627J43007K951j304J5378
1836A92701j23068R6861J22127l9990j02955L9130Q5579K5803j08382m8719P2085
1825B11172Q0893l2819N8602k4244P1952r8096O8270Q8664N3722n580k37918M0231
$$ plain form
1901 286274 370480 419099 335209 468572 381859 189544 176221 125473 32506 247437 435457
1890 435457 232161 69895 202121 192992 360678 499644 335148 423951 245278 125277
1880 125277 36524 255635 590792 607354 485885 416654 393321 382937 269939 18222 108832
1869 108832 125452 205088 79870 12879 84375 161290 207305 265601 25953 24622 60569
1858 60569 -49716 -76945 45289 289748 235957 266966 165372 174921 109010 -2405 107645
1847 107645 146232 106559 214159 246696 108428 -24958 32669 175676 178627 177323 192701
1836 192701 69633 166494 288621 248631 145676 184806 270385 296188 187806 139087 211172
1825 211172 292065 259246 317848 293604 365556 267460 335730 424394 478116 472536 234618 274849
1813B74849K3851K1552J5203J29364j10962q2419L2642p4856j27665L3021J17113
1802B51693j08876p3369R0184j89449j19784M5980J36464L1495p2247J07678K9306
1791A29075j93101J03375Q5327J36847J92969p1107l21734k6499J41595K2126
1781A98873j8143m478N4777n8362j35363l5532q955K27349R2550l4914L0619O853
1769C15274l3123j98995r8139J42364p0006k5802K5779m6197R3066O7338k43162
1758g1603k1954J85714k8443J48598m6204m8606M7541K0620k4841n4605k6331
1747G9886O1120q6604K769j74507p8699J45958R0699p5357j33126J79208j15775
1736a04428P1137P255j63544K11347p9202m9579M8780P9030L0088n6820J6194
$$ plain form
1813 274849 298700 320252 335455 464819 353857 271438 304080 229224 101559 134580 251693
1802 251693 142817 69448 159632 -29817 -149601 -103621 32843 64338 -7909 99769 129075
1791 129075 -64026 39349 124676 261523 454492 383385 61651 35152 176747 198873
1781 198873 180730 176252 231029 172667 37304 1772 -7183 220166 312716 277802 308421 315274
1769 315274 282151 83156 -14983 127381 57375 31573 57352 11155 104221 171559 -71603
1758 -71603 -93557 92157 63714 212312 166108 117502 165043 185663 160822 106217 79886
1747 79886 141006 54402 57171 -117336 -196035 -50077 40622 -34735 -167861 11347 -104428
1736 -104428 -33291 -26036 -189580 21767 -57435 -107014 -58234 20796 50884 -5936 10258
1725A0258r4883r4932P6886Q6310K25124j72386J00925J31818j00439l40271N9016
1714a12574Q9408j9447L2063k39118J4628m9594J56999J72376j12008n0019K15354
1703I8068L4880M5828j30064J78123j39666k44332K47860j25230K5429r6393J13304
1692G807J63474k54269p230j31178L5634R8425Q7697K5634K8869q2344N6280p9312
1680e0513j20346J45068J05364j09861K0685N4531K25194j67917j29048J22067
1670I5224k2927n1931r6549J05792j82006K1189K31967P8501q8687K6688r3468
1659B3793j7165L2284j03818j82552K19931J55524k21365J26972l1455k51101
1649b48952j2294J57468J05517l474l6811j2752K10959l0231j30279j18095k3358
$$ plain form
1725 10258 -84625 -179557 -102671 -16361 208763 36377 137302 269120 168681 -171590 -112574
1714 -112574 -23166 -42613 -10550 -249668 -235040 -284634 -127635 44741 -67267 -117286 98068
1703 98068 132948 178776 48712 226835 87169 -157163 90697 -34533 -9104 -105497 7807
1692 7807 171281 -82988 -90218 -221396 -185762 -87337 360 25994 54863 -27481 28799 -50513
1680 -50513 -170859 -25791 79573 -30288 -9603 44928 270122 102205 -26843 95224
1670 95224 72297 20366 -76183 29609 -152397 -131208 100759 179260 90573 117261 23793
1659 23793 6628 38912 -64906 -247458 -27527 127997 -93368 33604 2149 -248952
1649 -248952 -261246 -103778 1739 -1735 -38546 -51298 159661 129430 -849 -118944 -142302
1638a42302J23230M3155J3650J62792j9356j4256n5947q0241q9007K2955j90245
1627b25572L4846K75159M3980J21979Q4485j91906k04320J40278k57910j09087
1617b88068j5085L9885L76379p1626q4090j43960M2939R0992k1266R5324J43999
1606A65423J51223q9109O4588p3601j28247L3183j49762l0312K11532K8119J08960
1595B91997j60928k09047N2592N1551j417p3588r7028Q3123L9220R3801m5880
1584B4396q6688J279L0201N46j4111n2930o3429j4597k17373K89617M8306k03950
1572b58733J53252J17128J6554j90396Q148J78047m4308P2125L4361M0416o5102
1561F1492r4981m968j56727N8397j3554q9896j60925J36503J50906K5330K11622
$$ plain form
1638 -142302 -19072 24083 37733 200525 181169 166913 110966 30725 -58282 -35327 -225572
1627 -225572 -190726 84433 128413 250392 334877 142971 -61349 78929 -178981 -288068
1617 -288068 -303153 -263268 113111 41485 -42605 -186565 -143626 -52634 -73900 21424 165423
1606 165423 316646 227537 292125 218524 90277 123460 -26302 -56614 154918 183037 291997
1595 291997 131069 -77978 -25386 26165 24748 -48840 -145868 -62745 -23525 70276 24396
1584 24396 -62292 -61013 -30812 -30266 -44377 -97307 -160736 -175333 -392706 -103089 -54783 -258733
1572 -258733 -105481 11647 28201 -162195 -154047 24000 -20308 51817 86178 126594 61492
1561 61492 -33489 -38457 -195184 -136787 -150341 -240237 -401162 -264659 -113753 -88423 123199
1550A23199k3806r6571r7117j69616J42376J1286n1940L13267J07978m2919k25412
1539i275m0399j7687M7345o0333l0212R6732J40353j09057J3315j0759k23451
1528b03428J62332J17596q68r3574m6011k31534j4348N1250J9838K37162r6537
1517i8122J1820l622l1574R4272j74373K35060K7051q4214M7441Q9319m6239J43798
1505B10617k51096k12387K27776J29571k18250M5750R0685j51077j6338J35276
1495i473K0328N3250K743k01058j4642P4653J01656l9596k47181J32829Q4547
1484d1944o436k4649L5643o0843J75372j9007j40268K88974J40035j64356k26980
1473d4459r4592J04883P4920n6753j65308j21231J30473Q5345K06737j4523J55447
$$ plain form
1550 123199 99393 2822 -94295 -263911 -121535 -110249 -162189 151078 259056 216137 -9275
1539 -9275 -49674 -67361 -20016 -80349 -110561 -13829 126524 17467 30782 20023 -203428
1528 -203428 -41096 76500 75632 -17942 -63953 -295487 -309835 -258585 -238747 -1585 -98122
1517 -98122 -86302 -89924 -121498 -27226 -201599 33461 60512 -23702 23739 113058 66819 210617
1505 210617 -40479 -252866 -25090 104481 -113769 -68019 22666 -128411 -144749 -9473
1495 -9473 10855 64105 66848 -134210 -148852 -74199 27457 -12139 -259320 -126491 -41944
1484 -41944 -48380 -73029 -37386 -98229 77143 58136 -82132 206842 346877 182521 -44459
1473 -44459 -139051 -34168 40752 -16001 -181309 -302540 -172067 -86722 120015 105492 260939
1462B60939j70011l2045m1660J2910l4070J28488k7953l8860j61594j1213J48922
1451C3853P4656j41646j03893J84437N8042J49824n6249j34933n1388k40997J91576
1440c6718j08192Q4555J30565j67281j93278K72782N9548j85644J0285J38612
1430E234M6728j05312R1445o1260m8119j66760J32681J45612O2886p3467p9089
1419d9421K9926l5426j75472m7273J87903J9404m4745R3556K847O570J52082j87096
1407d7145J45183K5940j29920J30700r965m4206m7704r0656j70711k0235o6537
1396c25256J75285J38662k75941m1868L05796Q8839R1859N9027j39898J04100
1386A80605r0084j5285K2089k33281R8300r5408N7399K199Q09r1386J9963n4209
$$ plain form
1462 260939 90928 58883 17223 30133 -3937 124551 96598 57738 -103856 -115069 33853
1451 33853 108509 -33137 -137030 47407 105449 255273 199024 64091 12703 -228294 -36718
1440 -36718 -144910 -60355 70210 -97071 -290349 -17567 41981 -143663 -133378 5234
1430 5234 51962 -53350 38095 -23165 -71284 -238044 -105363 40249 103135 29668 -49421
1419 -49421 -19495 -54921 -230393 -277666 -89763 -70359 -115104 -21548 -18701 -12131 139951 -47145
1407 -47145 98038 123978 -5942 124758 114793 70587 22883 -67773 -238484 -258719 -325256
1396 -325256 -149971 -11309 -287250 -329118 -23322 65517 157376 216403 76505 180605
1386 180605 90521 75236 97325 -135956 -37656 -133064 -75665 -73466 -72657 -164043 -144080 -198289
1374a98289j51245J29491o5196J06746M8049o7099j92536j7725K68649J17437
1364b1718L2941j3330Q5242P4505K264J43294l3829k15405J15334o2782m1223
1353F5293r5445o4047M9234j9918M3314K7241j00503J13684k17832M9203o6646
1342b16422J61817l5812J3888M8725K6653K8159n5774J822O5696k53147j31873
1331c46268L38806J91518J4317k78714j2104N7766J43922k1240j06369K0176j08444
1320a06634J70889J07052r064j7103k6854P8741n7173l9875j20415j79174J20373
1309g9237J34177l0412k5570j91291r400N1644J90798j75400J32795J421m0785
1298d1260N5174L2078j68045j86357J90431J11908J44357k9934O2808j31367j57265
$$ plain form
1374 -198289 -349534 -220043 -285239 -178493 -130444 -197543 -390079 -407804 -139155 -21718
1364 -21718 11223 -2107 83135 157640 159904 303198 269369 53964 169298 106516 65293
1353 65293 -30152 -94199 -44965 -64883 -21569 5672 -94831 18853 -198979 -149776 -216422
1342 -216422 -54605 -90417 -76529 -27804 -1151 27008 -28766 -26944 38752 -214395 -346268
1331 -346268 -7462 184056 198373 -80341 -92445 -34679 109243 88003 -18366 1810 -106634
1320 -106634 64255 171307 162243 145140 118286 197027 139854 99979 -20436 -199610 -79237
1309 -79237 54940 24528 -1042 -192333 -201733 -150089 40709 -134691 -1896 -475 -41260
1298 -41260 13914 45992 -122053 -308410 -117979 -6071 138286 108352 171160 39793 -117472
1287a17472n6913O1379P4510j49059r0324L1708J10157J5770J58773K32j53162
1276a14401m3641J03911j63523k2206J58230J15967n386j5921O9986n624j36933
1265e9541M6914n3394J9198J85259R5143j42782j25471k97746m6239K21856J59587
1254B784p0434R8312J1814J24762j23716k02499J05657j07431m1824J70300R2607
1243F0332j28825J32757j54439k48820K18372M1491J3701p251m3609r0830J62883
1232d4238J66797j48113K10278j51426o4968p3808J35867R8891n7918r9029q1109
1221a08776r8891L4557K33523L149k4250l8432j71789o079J79820j70118r6546
1210b63832P1459J2869M3259j3880O4682P8792k82953L4206K88810O2244Q4041
$$ plain form
1287 -117472 -174385 -113006 -38496 -187555 -277879 -246171 -136014 -120244 38529 38761 -114401
1276 -114401 -158042 -54131 -217654 -239860 -81630 34337 28951 13030 83016 77392 -59541
1265 -59541 -12627 -66021 -46823 138436 233579 90797 -34674 -332420 -378659 -156803 2784
1254 2784 -67650 30662 42476 167238 43522 -158977 -53320 -160751 -202575 -32275 60332
1243 60332 -68493 64264 -90175 -338995 -120623 -79132 -65431 -72682 -116291 -207121 -44238
1232 -44238 122559 -25554 184724 33298 -31670 -105478 30389 129280 71362 -27667 -108776
1221 -108776 -207667 -173110 60413 63562 39312 880 -170909 -176988 2832 -167286 -263832
1210 -263832 -192373 -179504 -136245 -150125 -85443 -6651 -289604 -255398 33412 95656 179697
1199A79697j25004l36081M3368K20697j2533j63407j35938J13544m6528R5604
1189a66581J32479j70036M2532K08209q9105n9872p2514j01565K6265J58019J28328
1178C6159P4174l04861R4316J02712P9688Q8214j19744P0943k09526j30049M6651
1167a71323j16593J36129Q1601J11990J4099K045N6475J09823j96057o4477O2575
1156B6287j91094J27935J79018k25198O464J95688j72652l6285k5678K9358k5949
1145a12106J14690r2207n8393L25462m6763j88966K5286j55819J31324J5034j03437
1134a45895J24915J15286j54889j15783l5044M7941J98198j98702J17028O7931
1124B0986j10972j07066p3392J12618k17890q1114j4502n7530K31372O1389o0932
$$ plain form
1199 179697 54693 -281388 -238020 -17323 -29856 -193263 -329201 -215657 -262185 -166581
1189 -166581 -34102 -204138 -161606 46603 -42502 -102374 -174888 -276453 -250188 -92169 36159
1178 36159 110333 -194528 -100212 2500 82188 170402 50658 121601 -87925 -217974 -171323
1167 -171323 -287916 -151787 -70186 41804 55903 57948 114423 224246 28189 -36288 26287
1156 26287 -164807 -36872 142146 -83052 -76588 119100 -53552 -89837 -115515 -86157 -112106
1145 -112106 2584 -89623 -148016 177446 130683 -58283 -32997 -188816 -57492 -42458 -145895
1134 -145895 -20980 94306 -60583 -176366 -211410 -163469 34729 -163973 -46945 20986
1124 20986 -89986 -197052 -270444 -157826 -375716 -456830 -471332 -528862 -297490 -236101 -297033
1113b97033O0399j82892O2574J06485p4648K10543K37264m0954r7414L6660p8141
1102e7157N9976J09581j68291R1385k9213K2940j77731J30232R0393j21102N2349
1091C362n5356J79026j9324m9339J44928j31984k17470q1537J2446K15726n7032
1080e6554J09343Q9622j50415m9044O1915J1979J49128o0972q1378l2701m1926
1069e1003Q1558L0698o4921K7923J9397j53357r163k6822J19777K24748M714j84272
1057A9277k69032J97274J18568n6990P2396j38653R5589q272N497r6985j10889
1046a72220J87869J64251q2914j48048O9603o8411o4523M0287J12163n500k8809
1035C748Q054M8260m2306j70695K18338O5147l70290p8118k2750o3836K57173
$$ plain form
1113 -297033 -236634 -419526 -356952 -250467 -325115 -114572 122692 81738 -15676 20984 -57157
1102 -57157 2819 112400 -55891 35494 6281 29221 -148510 -18278 72115 -48987 3362
1091 3362 -51994 127032 107708 58369 203297 71313 -146157 -227694 -215248 478 -56554
1080 -56554 52789 142411 -8004 -57048 4867 16846 165974 105002 23624 -9077 -51003
1069 -51003 30555 61253 -3668 24255 43652 -109705 -118868 -145690 -25913 198835 203549 19277
1057 19277 -249755 -52481 66087 9097 81493 -57160 38429 30157 35654 -61331 -172220
1046 -172220 15649 179900 96986 -51062 18541 -49870 -114393 -74106 38057 32557 3748
1035 3748 11802 60062 17756 -152939 65399 130546 -239744 -317862 -340612 -404448 -147275
1024a47275p2580J17222M7728L2365k07843p5561Q9667Q6809O186P343J72006
1013E6067J64881J01559l26541l8453k7157j31232k1561o9770L256K5970M751
1002b58230R0208k6296P4376J88309M0736j32767r9583J7634J69276P3966m7234
991I0395k1088o9656J30515j929k18156j6381M924J01538R0789J4457j85022j14054
979a93668o7437l7065r712r6919J81864J06287P5284r1742o7783m4111O4416Q3246
967i7340J48459J03102r2689j13087r3559k2924J94444J84121l0662J5737m53231
956b57629R3244L9117J8617j1259j03279M5426n7057p9549R6464R0906j95079
945c20078J19159L8522J64535J23490l43534Q3859J38964j09772J80038o8418
$$ plain form
1024 -147275 -219855 -102633 -54905 -22540 -230383 -305944 -216277 -129468 -123282 -115939 56067
1013 56067 220948 322507 -4034 -42487 -69644 -200876 -222437 -292207 -288951 -262981 -258230
1002 -258230 -168022 -194318 -119942 68367 109103 -23664 -123247 -105613 63663 137629 90395
991 90395 69307 -349 130166 128237 -89919 -106300 -101376 162 90951 105408 -79614 -193668
979 -193668 -261105 -298170 -307882 -404801 -222937 -116650 -41366 -133108 -200891 -245002 -180586 -97340
967 -97340 51119 154221 61532 -51555 -145114 -168038 26406 210527 179865 195602 -257629
956 -257629 -164385 -125268 -106651 -117910 -221189 -175763 -232820 -312369 -215905 -124999 -320078
945 -320078 -200919 -162397 2138 125628 -217906 -134047 4917 -104855 75183 6765
935F765j19742p4681M0065L2860j19884J22271J81590j2361p736n2320o7774j15131
923a86078J11964Q6591j12990J4670P5050M0462J664j34296o0856N5644K5712
912h2463J67792j7926k5803n2976J27592j00663K5011K9851k62633o6219M5124
901b13313J36778J35311p4366k6302N816K0108k336J27787Q2821k36218J16719
890G2805L4597q3097J04621M8035j87443J11506j00970j46326n4111P4610O8573
879e7200K7868M5858m4391K51136n1752k20470P9922Q8443j00867j4684N5979
868E9842o9575n5622j1931J71514J24024j26889p9911n1767J73136Q2120n5690
857A59251j10283M8251j87573M2717j9329r9672j28226K09243J74135j11276l9064
$$ plain form
935 6765 -112977 -187658 -147593 -114733 -234617 -112346 69244 56883 49147 -3173 -70947 -186078
923 -186078 -74114 12477 -100513 -85843 -10793 29669 31333 -102963 -163819 -108175 -82463
912 -82463 85329 67403 41600 -11376 116216 15553 40564 70415 -192218 -258437 -213313
901 -213313 -76535 58776 -15590 -41892 -36076 -15968 -18304 109483 192304 -43914 72805
890 72805 107402 24305 128926 176961 -10482 101024 54 -146272 -200383 -125773 -57200
879 -57200 -29332 16526 -27865 223271 171519 -48951 30971 119414 18547 3863 59842
868 59842 -9733 -65355 -77286 94228 218252 91363 11452 -40315 132821 214941 159251
857 159251 48968 97219 -90354 -47637 -66966 -166638 -294864 -85621 88514 -22762 -61826
846f1826L4031J06411K0503P7022q5619j62091j42665l1404m365J00983m2479
835a91499N3316P2017r4422L9930J85635Q0390p4469j13216P9512l03863K4595
824b42074J35826J97738r2275l06497J97620K45640k813l5169k02828l3855p4519
813b13206j65233K8136J26832K04785J15519J67256j89613k05654K9502m6769
803a48445O3142K46546R6683k06845l2069q4070J31695K4319k00359K6523L4564
792d8316M2240j65451J55583R5561j18189j9823j76637J37280J46158k44671j26818
781c23083N1084k8308J08245q0096J54669L11164o7101k02509N465p2346J4043
770a28773M5757J2774K16939q9656k092j11286j12622j03980O2702n9942O1778
$$ plain form
846 -61826 -27795 78616 99119 176141 90522 -71569 -214234 -245638 -250003 -149020 -191499
835 -191499 -138183 -66166 -160588 -120658 64977 145367 70898 -42318 37194 -266669 -242074
824 -242074 -106248 91490 -785 -307282 -109662 135978 133165 97996 -104832 -138687 -213206
813 -213206 -378439 -350303 -223471 -18686 96833 264089 74476 -131178 -101676 -148445
803 -148445 -85303 161243 257926 51081 19012 -65058 66637 90956 -109403 -82880 -48316
792 -48316 -6076 -171527 -15944 79617 -38572 -58395 -235032 -97752 48406 -196265 -323083
781 -323083 -271999 -300307 -192062 -272158 -117489 193675 126574 -75935 -70470 -142816 -128773
770 -128773 -83016 -70242 146697 57041 54949 -56337 -168959 -272939 -210237 -270179 -208401
759b08401k9772K4923m7778N3477J33584J17023J8038j38319J92690r1814j28079
748a04428J75554l1599j5823L8750j16730J11186L5962m3637o4140R8669O5114
737A48878Q1207j36916j23973j6251J15927P1134r153p8680N3593r9206j12507
726a05947K96669O170J07785k55592P1480Q1116M6842j13519k11722P7128K9857
715C0267j52770N640K3362K8708R2508l5532k1461l3239m9779K1402n4166r4148
703b39208J14064J13170l6078M9354m7391j49266J63618J44122J51793K5964l09001
692a8859o7066P1279p4759Q7153J29754O4919k94740k273K13972J7752j41407
681a4275n8857P6510L2j50868K08579R7347q007q683j03884o3325j25898L4529
$$ plain form
759 -208401 -238173 -213250 -261028 -207551 -73967 43056 61094 -77225 115465 23651 -104428
748 -104428 71126 39527 23704 62454 -54276 56910 92872 49235 -14905 83764 148878
737 148878 230085 93169 -30804 -47055 68872 140006 130853 52173 105766 6560 -105947
726 -105947 190722 196892 304677 49085 120565 201681 248523 135004 -76718 410 30267
715 30267 -122503 -116863 -93501 -64793 27715 -7817 -29278 -62517 -112296 -90894 -145060 -239208
703 -239208 -125144 -11974 -48052 1302 -46089 -195355 -31737 112385 264178 290142 -18859
692 -18859 -85925 -14646 -89405 -2252 127502 192421 -102319 -104592 109380 127132 -14275
681 -14275 -73132 3378 3410 -147458 61121 158468 150461 141778 37894 -25431 -151329 -116800
669a16800Q4923L1220j8809J45359Q1681j06896k26535j74359L567K15329L2781
658d8539m5237P6107k5599M6498N7983j43093j40068J5075J47773Q3943J16579
647A41422m2659j54465j37159K47757N5637j9886j81720j02160J03750K2282N2800
636a4401j09538P5953P554J74785p3315n8880O860N3506k7606j8548j29101j12386
624b25117J1908o0104K30666K7951O6631m4408J0332p2882j5890L5479k15090
613b50524J88751J00415l4396j55615l0831r0200o506N5450P3215P0034m9017
602a29224j02163K02583M5731r410P0806Q7607P8777p1617m4968M9136j13318
591F3940l4812p5357O9981o4700J8431o5885K453n218n3992O3564n2226K37707
$$ plain form
669 -116800 -31877 -657 -19466 125893 207574 100678 -125857 -300216 -296649 -81320 -48539
658 -48539 -93776 -17669 -43268 3230 61213 -81880 -221948 -206873 -59100 24843 141422
647 141422 98763 -55702 -192861 54896 110533 90647 -91073 -193233 -89483 -67201 -14401
636 -14401 -123939 -47986 -40432 134353 61038 2158 9018 62524 34918 16370 -112731 -225117
624 -225117 -213209 -273313 -42647 -14696 51935 7527 17859 -55023 -70913 -35434 -250524
613 -250524 -61773 38642 4246 -151369 -182200 -272400 -278906 -223456 -150241 -80207 -129224
602 -129224 -231387 -28804 16927 7517 78323 165930 244707 173090 128122 177258 63940
591 63940 29128 -46229 23752 -40948 -22517 -88402 -85949 -91167 -145159 -81595 -133821 103886
579A03886L0247O7962l26312j95333K59653P3815j09602J92075K7427J58842j78848
568A03812j85158Q5466j5297N2720O435P4463j07470k20772J48888N0775l02049
557c08187P4201K21777J20753L3685q0777n8142n8522L2592l8556Q7818P2657
546I9299R2119J26357j86296J09688j01232j86512J66586j60218R6697N5673m2560
535F9601k6051j18121O2738K03375M3113o0646k2746J27222l7587L8342k37531
524D1709r5146O8564J00657L6684r4402J15185j11528m4617L3374J3115N3484
513A17079j63443k6027L2063j51810O3492J49952J25699o3431k12208J46288q596
$$ plain form
579 103886 134133 202095 -124217 -319550 -59897 13918 -95684 96391 123818 282660 103812
568 103812 -81346 4120 -11177 41543 47978 122441 14971 -205801 -56913 -6138 -308187
557 -308187 -233986 -12209 108544 142229 61452 3310 -55212 -22620 -61176 26642 99299
546 99299 191418 317775 131479 241167 139935 -46577 120009 -40209 56488 112161 69601
535 69601 43550 -74571 -11833 191542 234655 174009 151263 278485 240898 279240 41709
524 41709 -53437 15127 115784 152468 58066 173251 61723 17106 50480 63595 117079
513 117079 -46364 -72391 -40328 -192138 -128646 21306 147005 83574 -128634 17654 9058
$$ [...]
##END NTUPLES=NMR SPECTRUM
##END=
