##TITLE=1H_CA-9054-1 
 CDCl3
 8 sc, 
 1.09.2022
##JCAMPDX= 6.0         $$ Bruker NMR JCAMP-DX V2.0
##DATA TYPE= NMR SPECTRUM
##DATA CLASS= NTUPLES
##ORIGIN= UXNMR, Bruker Analytische Messtechnik GmbH
##OWNER= root
$$ XWIN-NMR		Version 3.5
$$ Thu Sep  1 09:30:45 2022 Russian Standard Time (UT+4h)  she@DPX200
##.OBSERVE FREQUENCY= 200.1313499994
##.OBSERVE NUCLEUS= ^1H
##.ACQUISITION MODE= SIMULTANEOUS
##.ACQUISITION SCHEME= undefined
##.AVERAGES= 8
##.DIGITISER RES= 18
##SPECTROMETER/DATA SYSTEM= spect
##.PULSE SEQUENCE= zg30
##.SOLVENT NAME= CDCl3
##.SHIFT REFERENCE= (INTERNAL, CDCl3, 0, 15.7436)
##AUDIT TRAIL= $$ (NUMBER, WHEN, WHO, WHERE, WHAT)
$$ ##TITLE= Audit trail, XWIN-NMR		Version 3.5
$$ ##JCAMPDX= 5.01
$$ ##ORIGIN= Bruker BioSpin GmbH
$$ ##OWNER= she
$$ F:/spectra/data/she/nmr/H-F/1/pdata/1/auditp.txt
$$ ##AUDIT TRAIL=  $$ (NUMBER, WHEN, WHO, WHERE, WHAT)
(   1,<2022-09-01 09:27:55.26 +0400>,<she>,<DPX200>,
      <created by zg, POWCHK disabled, PULCHK disabled
       configuration hash MD5:
       00 E9 B6 7A A2 85 ED C7 34 08 36 98 17 FE 4E 26
       data hash MD5: 16K
       E4 13 27 3F 40 DD 17 48 C3 C7 EC 3B 92 26 7C 7D>)
(   2,<2022-09-01 09:27:57.45 +0400>,<she>,<DPX200>,
      <Start of raw data processing
       efp BC_mod = 2 LB = 0.24 FT_mod = 6 PKNL = 1 PHC0 = -18053.37 PHC1 = 26.60069 SI = 16K 
       data hash MD5: 16K
       46 28 D5 E5 7B 58 E1 B9 95 30 F9 6E 9C 1A B0 B2>)
(   3,<2022-09-01 09:28:18.92 +0400>,<she>,<DPX200>,
      <pk PHC0 = 9.467553 PHC1 = -0.6000003 
       data hash MD5: 16K
       C5 78 07 A1 61 F2 99 AC FC 3A 2C 5B F1 EF 5D A8>)
(   4,<2022-09-01 09:28:22.10 +0400>,<she>,<DPX200>,
      <abs ABSG = 5 
       data hash MD5: 16K
       EF 5B 7B 9D 5D 1C 31 66 2A 13 37 3A 1E AD 81 6F>)
$$ ##END=
$$ 
$$ hash MD5
$$ 62 18 58 CA 72 CC 3B C1 F1 01 D8 D4 88 00 F2 A5
##$RELAX= 
##$RELAX= 
##$RELAX= 
##$RELAX= 
##$RELAX= 
##$RELAX= 
$$ Bruker specific parameters
$$ --------------------------
##$DU= <F:/spectra>
##$EXPNO= 1
##$NAME= <H-F>
##$PROCNO= 1
##$TYPE= <nmr>
##$USER= <she>
##$AMP= (0..31)
100 100 100 100 100 100 100 100 100 100 100 100 100 100 100 100 100 100 
100 100 100 100 100 100 100 100 100 100 100 100 100 100 
##$AQSEQ= 0
##$AQ_mod= 1
##$AUNM= <au_zg>
##$AUTOPOS= <>
##$BF1= 200.13
##$BF2= 200.13
##$BF3= 200.13
##$BF4= 200.13
##$BF5= 200.13
##$BF6= 200.13
##$BF7= 200.13
##$BF8= 200.13
##$BYTORDA= 1
##$CFDGTYP= 0
##$CFRGTYP= 5
##$CHEMSTR= <none>
##$CNST= (0..31)
1 1 145 1 1 1 1 1 1 1 1 1 1 1 1 1 1 1 1 1 1 1 1 1 1 1 1 1 1 1 1 1 
##$CPDPRG= <>
##$CPDPRG1= <>
##$CPDPRG2= <>
##$CPDPRG3= <>
##$CPDPRG4= <mlev>
##$CPDPRG5= <mlev>
##$CPDPRG6= <mlev>
##$CPDPRG7= <mlev>
##$CPDPRG8= <mlev>
##$CPDPRGB= <>
##$CPDPRGT= <>
##$D= (0..31)
0 1.2 0 0 0 0 0 0 0 0.06 0 0.03 0 0 0 0 0.0002 0 0 0 0 0 0 0 0 0 0 0 0 
0 0 0 
##$DATE= 1662010074
##$DBL= (0..7)
120 120 120 120 120 120 120 120 
##$DBP= (0..7)
150 150 150 150 150 150 150 150 
##$DBP07= 0
##$DBPNAM0= <>
##$DBPNAM1= <>
##$DBPNAM2= <>
##$DBPNAM3= <>
##$DBPNAM4= <>
$$ [...]
##$SUBNAM3= <"">
##$SUBNAM4= <"">
##$SUBNAM5= <"">
##$SUBNAM6= <"">
##$SUBNAM7= <"">
##$SUBNAM8= <"">
##$SUBNAM9= <"">
##$SW= 18.0517283424941
##$SWIBOX= (0..15)
0 0 2 0 0 0 0 0 0 0 0 0 0 0 0 0 
##$SW_h= 3612.71676300578
##$TD= 16384
##$TD0= 1
##$TE= 0
##$TE2= 300
##$TE3= 300
##$TEG= 300
##$TL= (0..7)
0 120 120 120 120 120 120 120 
##$TP= (0..7)
150 150 150 150 150 150 150 150 
##$TP07= 0
##$TPNAME0= <>
##$TPNAME1= <>
##$TPNAME2= <>
##$TPNAME3= <>
##$TPNAME4= <>
##$TPNAME5= <>
##$TPNAME6= <>
##$TPNAME7= <>
##$TPOAL= (0..7)
0.5 0.5 0.5 0.5 0.5 0.5 0.5 0.5 
##$TPOFFS= (0..7)
0 0 0 0 0 0 0 0 
##$TUNHIN= 0
##$TUNHOUT= 0
##$TUNXOUT= 0
##$USERA1= <user>
##$USERA2= <user>
##$USERA3= <user>
##$USERA4= <user>
##$USERA5= <user>
##$V9= 5
##$VALIST= <valist>
##$VCLIST= <CCCCCCCCCCCCCCC>
##$VD= 0
##$VDLIST= <DDDDDDDDDDDDDDD>
##$VPLIST= <PPPPPPPPPPPPPPP>
##$VTLIST= <TTTTTTTTTTTTTTT>
##$WBST= 1024
##$WBSW= 4
##$XGAIN= (0..3)
0 0 0 0 
##$XL= 0
##$YL= 0
##$YMAX_a= 174027
##$YMIN_a= -273057
##$ZGOPTNS= <>
##$ZL1= 120
##$ZL2= 120
##$ZL3= 120
##$ZL4= 120
##$ABSF1= 15.73477
##$ABSF2= -2.31708
##$ABSG= 5
##$ABSL= 3
##$ALPHA= 0
##$AQORDER= 0
##$ASSFAC= 0
##$ASSFACI= 0
##$ASSFACX= 0
##$ASSWID= 0
##$AUNMP= <proc_1d>
##$AZFE= 0.1
##$AZFW= 0.1
##$BCFW= 0
##$BC_mod= 2
##$BYTORDP= 0
##$COROFFS= 0
##$CY= -3
##$DATMOD= 1
##$DC= 0
##$DFILT= <>
##$DTYPP= 0
##$F1P= 0
##$F2P= 0
##$FCOR= 1
##$FTSIZE= 16384
##$FT_mod= 6
##$GAMMA= 0
##$GB= 0
##$INTBC= 1
##$INTSCL= 3.70164e-10
##$ISEN= 128
##$LB= 0.24
##$LEV0= 0
##$LPBIN= 0
##$MAXI= 10000
##$MC2= 0
##$MEAN= 0
##$ME_mod= 0
##$MI= 1.114404
##$NCOEF= 0
##$NC_proc= -7
##$NLEV= 6
##$NOISF1= 3.799351
##$NOISF2= 2.8
##$NSP= 0
##$NTH_PI= 0
##$NZP= 0
##$OFFSET= 15.74358
##$PC= 1
##$PHC0= -18043.9
##$PHC1= 26.00069
##$PH_mod= 1
##$PKNL= yes
##$PPARMOD= 0
##$PSCAL= 0
##$PSIGN= 0
##$REVERSE= no
##$SF= 200.13000559406
##$SI= 16384
##$SIGF1= 3
##$SIGF2= 2
##$SINO= 5.538805
##$SIOLD= 16384
##$SREGLST= <1H.CDCl3>
##$SSB= 0
##$STSI= 16384
##$STSR= 0
##$SW_p= 3612.71676300578
##$SYMM= 0
##$S_DEV= 0
##$TDeff= 16384
##$TDoff= 0
##$TI= <>
##$TILT= no
##$TM1= 0
##$TM2= 0
##$TOPLEV= 0
##$USERP1= <user>
##$USERP2= <user>
##$USERP3= <user>
##$USERP4= <user>
##$USERP5= <user>
##$WDW= 1
##$XDIM= 16384
##$YMAX_p= 322803854
##$YMIN_p= -2567295
$$ End of Bruker specific parameters
$$ ---------------------------------
##NTUPLES= NMR SPECTRUM
##VAR_NAME=  FREQUENCY,     SPECTRUM/REAL,   SPECTRUM/IMAG
##SYMBOL=    X,             R,               I
##VAR_TYPE=  INDEPENDENT,   DEPENDENT,       DEPENDENT
##VAR_FORM=  AFFN,          ASDF,            ASDF
##VAR_DIM=   16384,         16384,           16384
##UNITS=     HZ,            ARBITRARY UNITS, ARBITRARY UNITS
##FACTOR=    0.220516191357247, 1,           1
##FIRST=     3150.76272635331, 0,            0
##LAST=      -461.954036652474, 0,           0
##MIN=       -461.954036652474, -2567295,    0
##MAX=       3150.76272635331, 322803854,    0
$$ Real data points
##PAGE= N=1
##DATA TABLE= (X++(R..R)), XYDATA
$$ [...]
6357G82618J35185O915J02528j06700j18687J63251L5228O9828j19650J5516J91684
$$ 782618 917803 924718 1027246 920546 801859 965110 1000338 1070166 950516 966032 1157716
6346A157716P8078q8606K85482K37207K10510J3401M5682l35711o332K579l4636
$$ 1157716 1235794 1147188 1432670 1669877 1880387 1893788 1939470 1603759 1597427 1600006 1565370
6335A565370j2835r5993j19603Q9293q2131j38740k64165j51111J37856k04709
$$ 1565370 1552535 1456542 1336939 1426232 1344101 1205361 941196 790085 927941 723232
6325G23232M8207j17234L474o4049J72071N0305l4091J0400K2736k02531j3027
$$ 723232 771439 654205 657679 593630 765701 816006 781915 792315 815051 612520 599493
6314E99493o2970J53143J1499k29443j17089N3398K86992n5197l6887J43878k9745
$$ 599493 536523 689666 701165 471722 354633 408031 695023 639826 602939 746817 717072
6303G17072q2245R8399j60993l7689J34198N8798k5126J70137q0166j29403P848
$$ 717072 634827 733226 572233 534544 668742 727540 702414 872551 792385 662982 670830
6292F70830J03705q6029J25665m6165k34061R2501J28640k20958j11315K13492
$$ 670830 774535 688506 814171 768006 533945 626446 755086 534128 422813 636305
6282F36305J99071o1596K8285j69403j2044J46703l41991Q8268J57960J16299
$$ 636305 835376 773780 802065 632662 620618 767321 425330 513598 671558 787857
6272G87857j16810q7905J82597R7379k3934j95394J32911K42768K841j50142r6886
$$ 787857 671047 583142 765739 863118 839184 643790 776701 1019469 1022310 872168 775282
6261G75282l9437j74851p6024J16330J20135j60085O5479j7159O4093J01387j17379
$$ 775282 735845 560994 484970 601300 721435 561350 626829 609670 673763 775150 657771
6250F57771J83694o6889n4365R7315M6075o8332P360Q8809K0819L0807J58305
$$ 657771 841465 774576 720211 817526 863601 795269 802629 891438 912257 943064 1101369
6239A101369n2797o5902K1795j4051j01548J7568j027m0291L6600q6178k8245
$$ 1101369 1048572 982670 1004465 990414 888866 906434 905407 865116 901716 815538 787293
6228G87293K99954Q716k6196n7759K20610R1328m9957j16153j91468K53395M0865
$$ 787293 1087247 1095963 1069767 1012008 1232618 1323946 1273989 1157836 966368 1219763 1260628
6217A260628N7410R9905K18440R4847J42957J73681L18868L09129K48444J78404
$$ 1260628 1318038 1417943 1636383 1731230 1874187 2047868 2366736 2675865 2924309 3102713
6207C102713j75913n2483j44869q5744n7880k24258p0906Q6171q971j9181J80900
$$ 3102713 2926800 2874317 2729448 2643704 2585824 2361566 2290660 2376831 2367860 2348679 2529579
6196B529579N608j10322n1152K99994o4712J22588J12400J72863K80986J56524
$$ 2529579 2535187 2424865 2373713 2673707 2608995 2731583 2843983 3016846 3297832 3454356
6186C454356K64616O11607L58213M41646Q44445R47304N43020O61269K09319l34032
$$ 3454356 3718972 4330579 4688792 5130438 5974883 6922187 7465207 8126476 8335795 8001763
6176H001763n93526n30031o71765o65083n33158l46755N5069n4654l29168p0683
$$ 8001763 7408237 6878206 6206441 5541358 5008200 4661445 4716514 4661860 4332692 4262009
6166D262009K62320o0256n8016J41672L8518K44847K4334K12483K41401J76920
$$ 4262009 4524329 4464073 4406057 4547729 4586247 4831094 4855428 5067911 5309312 5486232
6156E486232O41079O03931R05237J231914J404263J291903R21981M07062m28245
$$ 5486232 6127311 6731242 7636479 8868393 10272656 11564559 12486540 12893602 12465357
6147A2465357r68192j315107j540853q03559o28287q20077o56753l36740k28050
$$ 12465357 11497165 10182058 8641205 7837646 7209359 6389282 5732529 5395789 5167739
6138E167739j10671k33910j8767k06939j60237J42036J92322M5J17908Q9843O5692
$$ 5167739 5057068 4823158 4804391 4597452 4437215 4579251 4771573 4771618 4889526 4979369 5045061
6127E045061L63942L82979M15836M23516P00355J013117Q04238M74432l19938
$$ 5045061 5409003 5791982 6207818 6631334 7331689 8344806 9149044 9623476 9303538
6118I303538p80193p38591r33966p49778q42568o75359k32038p0600j90909k73692
$$ 9303538 8523345 7784754 6850788 6101010 5258442 4583083 4351045 4280445 4089536 3815844
6108C815844l19970j89427r0299j31726n0722l1554p9931k78772J23167j35657
$$ 3815844 3495874 3306447 3216148 3084422 3033700 3002146 2922215 2643443 2766610 2630953
6098B630953J37150J62442P5728P7646J25209K36572P8540K01557j20696n5326
$$ 2630953 2768103 2930545 3006273 3083919 3209128 3445700 3524240 3725797 3605101 3549775
6088C549775l19921l12924k21530k52165K382q1204K5263j62682N0386k16237
$$ 3549775 3229854 2916930 2695400 2443235 2445617 2364413 2389676 2226994 2277380 2061143
6078B061143j09563m5417p6111M3310l9685J50349k8624j68215j75201j05187
$$ 2061143 1951580 1906163 1830052 1873362 1833677 1984026 1955402 1787187 1611986 1506799
6068A506799L2358O578j13355l6671R4149j47859r9433N5531L8416j69481J71251
$$ 1506799 1539157 1545735 1432380 1395709 1489858 1341999 1242566 1298097 1336513 1167032 1338283
6057A338283J46487o7284o7744m6426o0564K4900J05121R2092k13836J1446l0186
$$ 1338283 1484770 1417486 1349742 1303316 1242752 1267652 1372773 1464865 1251029 1262475 1232289
6046A232289j04971j1074r07r5920K2557J58120N153Q5315j07396J75605J25042
$$ 1232289 1127318 1116244 1115337 1019417 1041974 1200094 1205247 1290562 1183166 1358771 1483813
6035A483813k11142P430K3270j37197q4253J88795K15517j58360q745J25710N212
$$ 1483813 1272671 1280101 1303371 1166174 1081921 1270716 1486233 1327873 1319128 1444838 1450050
6024A450050j06645K0188l5586J02437j95722M3524J20027q3770j19337n6701
$$ 1450050 1343405 1363593 1328007 1430444 1234722 1278246 1398273 1314503 1195166 1138465
6014A138465j03493K65440n7137o3123O2425K18764K30546o7350o1455j81735
$$ 1138465 1034972 1300412 1243275 1180152 1242577 1461341 1691887 1624537 1563082 1381347
6004A381347K09678r4133p7097k177j73307J64817j34421j05291l6271P831J35178
$$ 1381347 1591025 1496892 1419795 1417618 1244311 1409128 1274707 1169416 1133145 1140976 1276154
5993A276154o0952l8974R8912J01922J11046N1328J68471k65171J8933j62682
$$ 1276154 1215202 1176228 1275140 1377062 1488108 1539436 1707907 1442736 1461669 1298987
5983A298987q7803J99852j54966p6922J69209O9121J84143j98647q129Q2834O203
$$ 1298987 1211184 1411036 1256070 1179148 1348357 1417478 1601621 1402974 1394845 1477679 1483882
5972A483882n4777j21935n1480K40050J10244n8616j04630r4902N4015j33396
$$ 1483882 1429105 1307170 1255690 1495740 1605984 1547368 1442738 1347836 1401851 1268455
5962A268455J7200p4293Q8840J95344J00215r1983j98933O3938J5793l6131J32912
$$ 1268455 1285655 1211362 1300202 1495546 1595761 1503778 1304845 1368783 1384576 1348445 1481357
5951A481357J81811j1232j80433M3296J01227J95504j68151N9153n7235K5489
$$ 1481357 1663168 1651936 1471503 1514799 1616026 1811530 1643379 1702532 1645297 1670786
5941A670786J3083K0345n023J52419j581j05235j38935O8119o9024O2900J28044
$$ 1670786 1683869 1704214 1699191 1851610 1850029 1744794 1605859 1673978 1604954 1667854 1795898
5930A795898M4293L517J4969J2805J6644j34595J59790j6309j20966m6485r6661
$$ 1795898 1840191 1843708 1858677 1871482 1888126 1753531 1913321 1897012 1776046 1729561 1632900
5919A632900p493r0540K8681J69J33825j56210K537O2782P4784k0334K08674n6940
$$ 1632900 1625407 1534867 1563548 1563717 1697542 1541332 1543869 1606651 1681435 1661101 1869775 1812835
5907A812835k04198L1591j701P9250l3745m9240J95134m2635n3957L9854J73540
$$ 1812835 1608637 1640228 1638527 1717777 1684032 1634792 1829926 1787291 1733334 1773188 1946728
5896A946728M2976j7374l1375M4875L92519j20868j19867L50243j13772q8003
$$ 1946728 1989704 1972330 1940955 1985830 2378349 2257481 2137614 2487857 2374085 2286082
5886B286082J92580J08376L29335N2463J28826k9188K6356q9620N7529j75452
$$ 2286082 2478662 2587038 2916373 2968836 3097662 3068474 3094830 3005210 3062739 2887287
5876B887287k37315R0878p5949P0341m464o7781k2983Q0592n6184o3643k1579
$$ 2887287 2649972 2740850 2664901 2735242 2730778 2662997 2640014 2720606 2664422 2600779 2579200
5865B579200l4141M8121j72500L38823O3019L7822k904l28484n0098M6159q6006
$$ 2579200 2545059 2593180 2420680 2759503 2822522 2860344 2857440 2528956 2478858 2525017 2439011
5854B439011l4863j6647r9396j8843N0022J96607N2787q2551L4226N163J86665
$$ 2439011 2404148 2387501 2288105 2269262 2319284 2515891 2568678 2486127 2520353 2525516 2712181
5843B712181j39974K40322J50166O6980M0062Q7001J88177N6948M0209j1801J62241
$$ 2712181 2572207 2812529 2962695 3029675 3069737 3156738 3344915 3401863 3442072 3430271 3592512
5832C592512l49957j50641p3109n4j70262K16717P520p9130J60653l7431q0794
$$ 3592512 3242555 3091914 3018805 3018751 2848489 3065206 3072726 2993596 3154249 3116818 3036024
5821C036024N8685n8762K38927L9647n511K29643M01107L49586K24809J41116
$$ 3036024 3094709 3035947 3274874 3314521 3309010 3538653 3939760 4289346 4514155 4655271
5811D655271o2908j5422j84334m83970k1301j87555l39164j62788j61786o4300
$$ 4655271 4592363 4576941 4392607 3908637 3887336 3699781 3360617 3197829 3036043 2971743
5801B971743n4472p5049j08811j18536j63424J6536k6341l1962J46546l4916J90435
$$ 2971743 2917271 2842222 2733411 2614875 2451451 2467987 2441646 2409684 2556230 2521314 2711749
5790B711749r2266j80838L4152l9402j8655J94676J54338j96566j30761j34537
$$ 2711749 2619483 2438645 2472797 2433395 2414740 2609416 2763754 2567188 2436427 2301890
5780B301890j35131J87670L8531j9512K26750o4721k07980J08086N6891N5963
$$ 2301890 2166759 2354429 2392960 2373448 2600198 2535477 2327497 2435583 2492474 2548437
5770B548437J39224p0512q4179r6683n3635k15757K1480J75140r1965N9646P2759
$$ 2548437 2687661 2617149 2532970 2436287 2382652 2166895 2188375 2363515 2271550 2331196 2403955
5759B403955k29834N358Q3934k0486L9677n3961k2690N8518n3451j13897m4488
$$ 2403955 2174121 2179479 2263413 2242927 2282604 2228643 2205953 2264471 2211020 2097123 2052635
5748B052635k7446J3556R0348j52279j78923k9439p9757L6048J39098O502J21010
$$ 2052635 2025189 2038745 2129093 1976814 1797891 1768452 1688695 1724743 1863841 1870343 1991353
5737A991353j84916k00096J62448M2240j75893k5481N3028J30718l9812j37117
$$ 1991353 1806437 1606341 1768789 1811029 1635136 1609655 1662683 1793401 1753589 1616472
5727A616472J8762Q272O9401j39608o7340q6274R4140J27455r2350R0621p8735
$$ 1616472 1635234 1643506 1712907 1573299 1505959 1419685 1513825 1641280 1548930 1639551 1560816
5716A560816p0763J6210M0067q5720J12536o8387K14099J17828J3182n8951M258
$$ 1560816 1490053 1506263 1546330 1460610 1573146 1504759 1718858 1836686 1849868 1790917 1795175
5705A795175P3023R876q1129j18894N1950k80308j90394J55312J65308Q4063l8353
$$ 1795175 1868198 1878074 1796945 1678051 1730001 1449693 1259299 1414611 1579919 1663982 1625629
5694A625629n7175R5441L6791j45255j64989N6374M5528K8051r1084n1312M4961
$$ 1625629 1568454 1663895 1700686 1555431 1390442 1446816 1492344 1520395 1429311 1377999 1422960
5683A422960l2369m7202j28241M7519l0809J18262J63960N7570q4110j85358j08321
$$ 1422960 1390591 1343389 1215148 1262667 1231858 1350120 1514080 1571650 1487540 1302182 1193861
5672A193861P3262n0466m8018K08395m4543o4775j14639l6698L7603m7057n4276
$$ 1193861 1267123 1216657 1168639 1377034 1332491 1267716 1153077 1116379 1153982 1106925 1052649
5661A052649K25398L2953j95415O0654Q7832r7527j1472j5011o237J57910j33263
$$ 1052649 1278047 1311000 1115585 1176239 1264071 1166544 1155072 1140061 1133824 1291734 1158471
5650A158471j84104K26804j76134Q8321R1332R58J88914R4718Q9206j54641l70928
$$ 1158471 974367 1201171 1025037 1113358 1204690 1205648 1394562 1489280 1578486 1423845 1052917
5639A052917L7082N8503J0339L37559K0129o0988n3127r0380j03264J36532M5595
$$ 1052917 1089999 1148502 1158841 1496400 1516529 1455541 1402414 1312034 1208770 1345302 1390897
5628A390897l4804k05361J2651K23470K1264K594k49745l7985k4336m6911K6925
$$ 1390897 1356093 1150732 1163383 1386853 1408117 1410711 1160966 1122981 1098645 1051734 1078659
5617A078659K66069J40078n8687Q6904q7475K4340L06635j06342o1422J30194
$$ 1078659 1344728 1484806 1426119 1513023 1425548 1449888 1756523 1650181 1588759 1718953
5607A718953j18501L041j44046J19273m8408R551O2655j39073O1316j03000J87018
$$ 1718953 1600452 1603493 1459447 1578720 1530312 1539863 1602518 1463445 1524761 1421761 1608779
5596A608779O5646j73981J49160L6330o8250L62129O566o1042j16450k24768k3706
$$ 1608779 1674425 1500444 1649604 1685934 1617684 1979813 1986379 1925337 1808887 1584119 1560413
5585A560413J63393j45870j12357K00198n6927J17030r1128n9865k11126K79239
$$ 1560413 1723806 1577936 1465579 1665777 1608850 1725880 1634752 1574887 1363761 1643000
5575A643000J88053j74576O9385J13682q1010L4805r9230L3756J29171K6685P7299
$$ 1643000 1831053 1656477 1725862 1839544 1758534 1793339 1694109 1727865 1857036 1883721 1961020
5564A961020l9773J7493r3542p531j07444K69406R4723L06998J4673j43073n5601
$$ 1961020 1921247 1938740 1845198 1837667 1730223 1999629 2094352 2401350 2416023 2272950 2217349
5553B217349P0010j20373J01844r51J11483M9376n9145k52622r420J64860P8727
$$ 2217349 2287359 2166986 2268830 2267879 2379362 2428738 2369593 2116971 2107551 2272411 2351138
5542B351138L1363j20207m6910J25560K61607K1119j36412J57425K10018l14886
$$ 2351138 2382501 2262294 2215384 2340944 2602551 2623670 2487258 2644683 2854701 2539815
5532B539815m4573J15789O9649J26618N7714r6700J60720K20345N5942J4022P9385
$$ 2539815 2495242 2611031 2680680 2807298 2865012 2768312 2929032 3149377 3205319 3219341 3298726
5521C298726j09087O4751r3204K76797j59710J1522Q3126j60654n8641M6170K24760
$$ 3298726 3189639 3254390 3161186 3437983 3278273 3289795 3372921 3212267 3153626 3199796 3424556
5510C424556O0171k0549J68226P2810j0871o1717K06647l6145j25246M8179J27867
$$ 3424556 3484727 3464178 3632404 3705214 3694343 3632626 3839273 3803128 3677882 3726061 3853928
5499C853928J20497m5001j68204P3439n403J55294J2330l00250l1391K21461J23868
$$ 3853928 3974425 3929424 3761220 3834659 3829256 3984550 3996880 3696630 3665239 3886700 4010568
5488D010568J42703P4348p6085n2669N2639J344J80069J30812j52909K56056L63923
$$ 4010568 4153271 4227619 4151534 4098865 4151504 4152848 4332917 4463729 4310820 4566876 4930799
5477D930799R1142k00253j00318R7112q0178J31478P7722J27394o5235Q2925P4706
$$ 4930799 5021941 4821688 4721370 4818482 4738304 4869782 4947504 5074898 5009663 5092588 5167294
5466E167294o4474K27383K25389J30609K2131K32941P4616J49954J53826K59805
$$ 5167294 5102820 5330203 5555592 5686201 5708332 5941273 6015889 6165843 6319669 6579474
5456F579474M5549J05432K61109J21063K5566L46631L48628L63777R6221K99080
$$ 6579474 6625023 6730455 6991564 7112627 7138193 7484824 7833452 8197229 8293450 8592530
5446H592530L57876L43303K45887P66768O02962Q19992J068348J058065J238178
$$ 8592530 8950406 9293709 9539596 10306364 10909326 11729318 12797666 13855731 15093909
5437A5093909J438181P57659j36811k35399m87492n27952m30059J7707L05130
$$ 15093909 16532090 17289749 17152938 16917539 16430047 15902095 15472036 15489743 15794873
5428A5794873j22837j97389m84242o08916k32167k54959j18723j27105O177J15227
$$ 15794873 15672036 15474647 14990405 14381489 14149322 13894363 13775640 13648535 13654712 13769939
5418A3769939J66097K62771M09126M02664M70616O71874P68088J241504J678447
$$ 13769939 13936036 14198807 14607933 15010597 15481213 16153087 16921175 18162679 19841126
5409A9841126J873001K109543J966232J381213M33401l03848n15580K2964O59239
$$ 19841126 21714127 23823670 25789902 27171115 27604516 27300668 26785088 26808052 27467291
5400B7467291N59320R26389O08860m45131j663597k188849k290215j878123j519876
$$ 27467291 28026611 28953000 29561860 29116729 27453132 25264283 22974068 21095945 19576069
5391A9576069j242958j019194p00549p69871l24505k99724l73305n3683Q4497
$$ 19576069 18333111 17313917 16613368 15843497 15518992 15219268 14845963 14792280 14876777
5382A4876777L06128K74317N08495O95040O45050P59243R34523L01797J65948
$$ 14876777 15182905 15457222 15965717 16660757 17305807 18065050 18999573 19301370 19467318
5373A9467318J45153N86604O63376Q47122Q70650O18984l31659q81354j290458
$$ 19467318 19612471 20199075 20862451 21709573 22580223 23199207 22867548 21986194 20695736
5364B0695736j481111j229411q47444o43580o95710m84809j01382k16849J61569
$$ 20695736 19214625 17985214 17137770 16494190 15798480 15313671 15212289 14995440 15157009
5355A5157009J0731L28172L86225M29802M44210L58117Q5745M12292M42849O02920
$$ 15157009 15167740 15495912 15882137 16311939 16756149 17114266 17200011 17612303 18055152 18658072
5345A8658072J186260J084977J487053J869778J930939J431492Q68452k30673
$$ 18658072 19844332 20929309 22416362 24286140 26217079 27648571 28517023 28286350
5337B8286350m66251r08996p23240k58800l8714p7251j96284j85998n89928k81295
$$ 28286350 27820099 26911103 26187863 25929063 25890349 25813098 25616814 25430816 24840888 24559593
5327B4559593p33463o48701o00251m14775l50291j16079K92925L60798N06553
$$ 24559593 23826130 23177429 22577178 22162403 21812112 21696033 21988958 22349756 22856309
5318B2856309Q80046J289932J509459J779228K435406L104964K714403K416577
$$ 22856309 23736355 25026287 26535746 28314974 30750380 33855344 36569747 38986324
5310C8986324J603976J089223J36631M6980r3588K65242O84521J274397J593578
$$ 38986324 40590300 41679523 41816154 41863134 41769546 42034788 42719309 43993706 45587284
5301D5587284J233645n9533j878073k801326l511890l489253l027491k756647
$$ 45587284 46820929 46761396 44883323 42081997 38570107 35080854 32053363 29296716
5293B9296716k050856j311447j197141n39871p03244l10967K9401L19376M12264
$$ 29296716 27245860 25934413 24737272 24197401 23494157 23183190 23212591 23531967 23944231
5284B3944231P04626J031519J274561J455775J270979P93711Q04760L80394K73672
$$ 23944231 24648857 25680376 26954937 28410712 29681691 30475402 31280162 31660556 31934228
5275C1934228P04677P84882Q09974L34230o99190j537571k444330k843901k361900
$$ 31934228 32638905 33423787 34233761 34567991 33868801 32331230 29886900 27042999 24681099
5266B4681099k166187j565286j596104j128631r16560p12700p46303n59120m96343
$$ 24681099 22514912 20949626 19353522 18224891 17308331 16595631 15849328 15290208 14793865
5257A4793865m28092k39988j70820l69451O1453k5527j7584r833j4472P4249K44342
$$ 14793865 14365773 14125785 13954965 13585514 13646967 13621440 13603856 13594023 13579551 13653800 13898142
5246A3898142N44963N41291Q07176P99060J150927J288909J694175J535069Q97785
$$ 13898142 14443105 14984396 15791572 16590632 17741559 19030468 20724643 22259712 23157497
5237B3157497O099o27258r00385q46599p43385o07716j50007J3738l11452q19337
$$ 23157497 23163596 22536338 21635953 20789354 20045969 19438253 19288246 19301984 18990532 18171195
5227A8171195p18723q43720o84088l58974o2348k03185k21298J12737L76994L01163
$$ 18171195 17452472 16608752 15924664 15565690 15503342 15300157 15078859 15191596 15568590 15869753
5217A5869753K67286P68240J115993J116237J537262J920145K015862J779799
$$ 15869753 16137039 16905279 18021272 19137509 20674771 22594916 24610778 26390577
5209B6390577J296209N80570m21322o49833q11075m10297K09464K69996K00381
$$ 26390577 27686786 28267356 27846034 27196201 26385126 25974829 26184293 26454289 26654670
5200B6654670k05473o77766j314769j807071j844787j513883j062759q05163r59370
$$ 26654670 26449197 25771431 24456662 22649591 20804804 19290921 18228162 17422999 16463629
5191A6463629o49962m68419l20377l19094N48J06449J09597o6996K9929O18071
$$ 16463629 15813667 15345248 15024871 14705777 14706325 14812774 14922371 14855375 14885304 15503375
5181A5503375N76605M32295M78909L95518K10894L31553M59886M40708N98305
$$ 15503375 16079980 16512275 16991184 17386702 17597596 17929149 18389035 18829743 19428048
5172A9428048O33016M95211J21503p92354r61252r27534p83395n96142m83133
$$ 19428048 20061064 20556275 20677778 19885424 18924172 17996638 17213243 16617101 16133968
5163A6133968k96061j10960j12157J59346J21079N74715K72994O55282O35076
$$ 16133968 15837907 15726947 15614790 15774136 15895215 16469930 16742924 17398206 18033282
5154A8033282R31093R11903J041294J655121J763417K209967K752979K852941
$$ 18033282 18964375 19876278 20917572 22572693 24336110 26546077 29299056 32151997
5146C2151997K415703J801811N47712o10771j044099j311193r58804p65671o68682
$$ 32151997 34567700 36369511 36917223 36306452 35262353 33951160 32992356 32226685 31558003
5137C1558003n66898r57528j126614j232640j211204p67667m36229m15815j99728
$$ 31558003 30991105 30033577 28906963 27674323 26463119 25695452 25259223 24843408 24643680
5128B4643680J73996N94583P35708J413198J710353J866527K729826K745983K655971
$$ 24643680 24817676 25412259 26147967 27561165 29271518 31138045 33867871 36613854 39269825
5119C9269825J756759P61920l0417m42915n64961k66936q0214j6591j73209m36872
$$ 39269825 41026584 41788504 41758087 41315172 40750211 40483275 40403061 40386470 40213261 39776389
5109C9776389l03674l10968l19299n67053j612688k388656k595072k566855k326947
$$ 39776389 39472715 39161747 38842448 38275395 36662707 34274051 31678979 29112124 26785177
5100B6785177j942802j136255j145004q34619n91377l2326o997K10365L81817
$$ 26785177 24842375 23706120 22561116 21726497 21135120 21102794 21095797 21306162 21687979
5091B1687979N80394J38563M05043K85195o6411j90869K07597J65926L02772L86177
$$ 21687979 22268373 22406936 22811979 23097174 23030763 22839894 23047491 23213417 23516189 23902366
5081B3902366N87483L90895m00761j405183j820445k175614j973116j378930j180481
$$ 23902366 24489849 24880744 24479983 23074800 21254355 19078741 17105625 15726695 14546214
5072A4546214r63662j021174n75199n83556m23238n79908l70055k71127k2541
$$ 14546214 13582552 12561378 11986179 11402623 10979385 10399477 10029422 9758295 9735754
5063I735754m64696k17569j7183n1197N0091J3021k61406j71062l39109m11350
$$ 9735754 9271058 9053489 9036306 8985109 9035200 9048221 8786815 8615753 8276644 7865294
5053G865294m51017m37729k24482k36356r4104j95928l18154l30425o1910N6003
$$ 7865294 7414277 6976548 6752066 6515710 6421606 6225678 5907524 5577099 5515189 5571192
5043E571192k01693l04248N7642k04904j69323j31521K3087j01634q9769q5082
$$ 5571192 5369499 5065251 5122893 4917989 4748666 4617145 4640232 4538598 4448829 4363747
5033D363747K7908J67815j03243k44671L2112l89389o5029Q651j20973O0177k30934
$$ 4363747 4391655 4559470 4456227 4211556 4243668 3854279 3789250 3797901 3676928 3737105 3506171
5022C506171j85674j25373Q5286L2136J11480J39175j49420k29970j86390N6344
$$ 3506171 3320497 3195124 3280410 3312546 3424026 3563201 3413781 3183811 2997421 3053765
5012C053765l4802q2617O2150N6142O2644j80576j28534O4912j29911n5004J65824
$$ 3053765 3018963 2936346 2998496 3054638 3117282 2936706 2808172 2873084 2743173 2688169 2853993
5001B853993J32020r6431o9216k4411j09499m9145M804J07890j70473j09885L502
$$ 2853993 2986013 2889582 2820366 2795955 2686456 2637311 2642115 2750005 2579532 2469647 2473149
4990B473149p3986k42632J61522J00542J1042M9894n655j75677M7611m8087j53442
$$ 2473149 2399163 2156531 2318053 2418595 2429637 2479531 2473876 2298199 2345810 2297723 2144281
4979B144281j04969L8402K38398L498q5143N6170r2408L6193j02620m9728J95774
$$ 2144281 2039312 2077714 2316112 2319610 2234467 2290637 2198229 2234422 2131802 2082074 2277848
4968B277848L4863j08524p261r3111K3972m32o2777J08932m1104n3862R1540j36423
$$ 2277848 2312711 2204187 2196926 2103815 2127787 2127355 2064578 2173510 2132406 2078544 2170084 2033661
4956B033661J58989K3259k53181O095J26227j23531n4240Q5536L8897k8574j13580
$$ 2033661 2192650 2215909 1962728 1968823 2095050 1971519 1917279 2002815 2041712 2013138 1899558
4945A899558p4045P435K26781l227l0660O1906J36299k52j20480l6534K25357
$$ 1899558 1825513 1832948 2059729 2056502 2025842 2087748 2224047 2223795 2103315 2066781 2292138
4934B292138J83102j39019j69685L19210j6774o8359m4571Q7459Q4784j02817
$$ 2292138 2475240 2336221 2166536 2485746 2468972 2400613 2356042 2443501 2528285 2425468
4924B425468K6755j06657p2705J09361K96400l3115r5187N6459k46325Q9137K6575
$$ 2425468 2452223 2345566 2272861 2382222 2678622 2645507 2550320 2606779 2360454 2449591 2476166
4913B476166k48299K5499K0120k96539J18521j1541o4327K40828L4822n6933l5445
$$ 2476166 2227867 2253366 2273486 1976947 2095468 2083927 2019600 2260428 2295250 2238317 2202872
4902B202872m3632P3394n094P5764J20007K093P6173R276P8236J07625O0445k47118
$$ 2202872 2159240 2232634 2227540 2303304 2423311 2425404 2501577 2510853 2589089 2696714 2757159 2510041
4890B510041j95544Q9546M36156j04729j39347J19822J98632J70133n634K08611
$$ 2510041 2314497 2404043 2840199 2735470 2596123 2715945 2914577 3084710 3079076 3287687
4880C287687j17885J75845K19859k5849j65173j13194M6836r6768j57463k8515
$$ 3287687 3169802 3345647 3565506 3539657 3374484 3261290 3308126 3211358 3053895 3025380
4870C025380m6902j95303k4136n9813M3111P1105r9527l5687Q918r7524M8165
$$ 3025380 2978478 2783175 2759039 2699226 2742337 2813442 2713915 2678228 2687146 2589622 2637787
4859B637787n9830r3782J70320q5313J68825N3884j29717j84310q0449J70730
$$ 2637787 2577957 2484175 2654495 2569182 2738007 2791891 2662174 2477864 2397415 2568145
4849B568145J25850j72198l8826J62225l2933j70911j3148r905j7929R2147P7111
$$ 2568145 2693995 2521797 2482971 2645196 2612263 2441352 2428204 2418299 2400370 2492517 2569628
4838B569628j45458j19745J6590j23388J20450K30131J65248j1315k35q4705j35484
$$ 2569628 2424170 2304425 2321015 2197627 2318077 2548208 2713456 2702141 2701906 2617201 2481717
4827B481717o845N5683O7654R2099m7617k7031k07666J01684m773j02973m014
$$ 2481717 2474872 2530555 2598209 2690308 2642691 2615660 2407994 2509678 2504905 2401932 2397918
4816B397918l8596J62262r2848p1024m5949n2374j7726J8714j19903n8762N1237
$$ 2397918 2359322 2521584 2428736 2357712 2311763 2259389 2241663 2260377 2140474 2081712 2132949
4805B132949P0597J19014m2748k5066O827K7592j51583m258N4998J14569r914
$$ 2132949 2203546 2322560 2279812 2254746 2261573 2289165 2137582 2133324 2188322 2302891 2292977
4794B292977K3816K6841p3779j80167k03439q771J12070l2282K8013J04706M6899
$$ 2292977 2316793 2343634 2269855 2089688 1886249 1877478 1989548 1957266 1985279 2089985 2136884
4783B136884r8946k50200Q5024J61976o563l7067o5194N1508q7908j12139J40751
$$ 2136884 2037938 1787738 1872762 2034738 2028175 1991108 1925914 1977422 1889514 1777375 1918126
4772A918126j37084k3338K1638O723m1266Q5353M9450l0548J11094K8125j63091
$$ 1918126 1781042 1757704 1779342 1786065 1744799 1830152 1879602 1849054 1960148 1988273 1825182
4761A825182j66423n9057q2596K15809O2183Q9363j1650L0426j51320m8058J31489
$$ 1825182 1658759 1599702 1517106 1732915 1795098 1884461 1872811 1903237 1751917 1703859 1835348
4750A835348N1608L5570P362q5434J58802N3368r3704L46137j92724j36198o5358
$$ 1835348 1886956 1922526 1929888 1844454 2003256 2056624 1962920 2309057 2116333 1980135 1914777
4739A914777J14833M3053J14811o1051M877l1872O6132p7609R1843k08358k42368
$$ 1914777 2029610 2072663 2187474 2126423 2131300 2099428 2165560 2087951 2179794 1971436 1729068
4728A729068J61689P1681J92133j35955K8395J39872J38746O8082N3636r9822
$$ 1729068 1890757 1962438 2154571 2018616 2047011 2186883 2325629 2393711 2447347 2347525
4718B347525r0046Q8445l0247M2722K1026J80090j39892r2793J02666j59868O9046
$$ 2347525 2257479 2345924 2315677 2358399 2379425 2559515 2419623 2326830 2429496 2269628 2338674
4707B338674o9460n052n1229R3876N6844o2952O000l8069K00242K25962N5979
$$ 2338674 2269214 2264162 2212933 2306809 2363653 2300701 2306701 2268632 2468874 2694836 2750815
4696B750815P7169j7049K69919K18040p0800j9672M3743m3235P6446O092q1764
$$ 2750815 2827984 2810935 3080854 3298894 3228094 3208422 3252165 3208930 3285376 3291468 3209704
4685C209704N1431l6940j81680k41451K8163J06975m7584J04492J09133P9209
$$ 3209704 3261135 3224195 3042515 2801064 2829227 2936202 2888618 2993110 3102243 3181452
4675C181452q8576p9402n2873l7391k7267M5066L50704q7976N8543o6741j34044
$$ 3181452 3092876 3013474 2960601 2923210 2895943 2941009 3291713 3203737 3262280 3195539 3061495
4664C061495j83428q1839j9740j08754n3755j03745j8030n1168J00044M0853J47651
$$ 3061495 2878067 2796228 2776488 2667734 2613979 2510234 2492204 2441036 2541080 2581933 2729584
4653B729584J57737j2653q4135J01440P0114k0781p7984n3347J38007N6505J11212
$$ 2729584 2887321 2874668 2790533 2891973 2962087 2941306 2863322 2809975 2947982 3004487 3115699
4642C115699j87274r9263M9144k03621L3866J19710Q1322j59075J16990n3747
$$ 3115699 2928425 2829162 2878306 2674685 2708551 2828261 2909583 2750508 2867498 2813751
4632B813751J27978K02080n2760k014J00585K34769k4054K1788Q9513p9447N5642
$$ 2813751 2941729 3143809 3091049 3089035 3189620 3424389 3400335 3422123 3511636 3432189 3487831
4621C487831l0185N3259P2804n4260p1798K8707n5327J2499J4239k143K8081N8913
$$ 3487831 3457646 3510905 3583709 3529449 3457651 3486358 3431031 3443530 3457769 3455626 3483707 3542620
4609C542620M4641L8552m0712k66231J15055Q428k20139j54993N7016l6083n5488
$$ 3542620 3587261 3625813 3585101 3318870 3433925 3442353 3222214 3067221 3124237 3088154 3032666
4598C032666N9461j3754L3241j83212k2888p4439J18088m6511j60323k7116j17401
$$ 3032666 3092127 3078373 3111614 2928402 2905514 2831075 2949163 2902652 2742329 2715213 2597812
4587B597812K76997N9397o6531k4456j37764j80783k3690p9745k18714O678J57604
$$ 2597812 2874809 2934206 2867675 2843219 2705455 2524672 2500982 2421237 2202523 2209201 2366805
4576B366805P3428j8880m8090j07728k35287J13487K12600q808j20536k2641J665
$$ 2366805 2440233 2421353 2373263 2265535 2030248 2143735 2356335 2347527 2226991 2204350 2206015
4565B206015l7162j16937M4070O5794n8635k63435l0342J91838n5184k00722J36927
$$ 2206015 2168853 2051916 2095986 2161780 2103145 1839710 1809368 2001206 1946022 1745300 1882227
4554A882227J69945L4208j05353j03093N9399Q7812j81582J84917L7375P3096
$$ 1882227 2052172 2086380 1981027 1877934 1937333 2025145 1843563 2028480 2065855 2138951
4544B138951q9152n1525N1634L5832J41391O4401k97360k08518J05768M9198R0767
$$ 2138951 2049799 1998274 2049908 2085740 2227131 2291532 1994172 1785654 1891422 1940620 2031387
4533B031387l2324p5079Q6459r27p3354Q0261p4993p5407m2019l5558o9800j8810
$$ 2031387 1999063 1923984 2010443 2009516 1936162 2016423 1941430 1866023 1824004 1788446 1718646 1699836
4521A699836M6340K1681K29065p7694q9881R3488j25291J14284n8355j24493n8845
$$ 1699836 1746176 1767857 1996922 1919228 1829347 1922835 1797544 1911828 1853473 1728980 1670135
4510A670135J44442k74204J29773l7987K66796q1041p1209K64407m5896o4924
$$ 1670135 1814577 1540373 1670146 1632159 1898955 1817914 1746705 2011112 1965216 1900292
4500A900292M6509Q0886j72193J9940J320K2039K9354J6334k05894O7057J21144
$$ 1900292 1946801 2027687 1855494 1875434 1876754 1898793 1928147 1944481 1738587 1805644 1926788
4489A926788k35257j0419J64872J29901n241j07373j05716M5783L271J0201p0717
$$ 1926788 1691531 1681112 1845984 1975885 1970644 1863271 1757555 1803338 1806609 1816810 1746093
4478A746093P3613J8285l0653J05033R903j64864L1114R1328r604N7639k24677
$$ 1746093 1819706 1837991 1807338 1912371 1922274 1757410 1788524 1879852 1870248 1927887 1703210
4467A703210n0937K28368O9204o1747O1008P6922m8094J15305o4950J68093n1665
$$ 1703210 1652273 1880641 1949845 1888098 1949106 2026028 1977934 2093239 2028289 2196382 2144717
4456B144717k43843Q4727J01736m1631k7939J30721K33437M5401n8456m6911O8368
$$ 2144717 1900874 1985601 2087337 2045706 2017767 2148488 2381925 2427326 2368870 2321959 2390327
4445B390327J18806L2047p3998q8956J7972M1478K68411q1486k0208J74485K307
$$ 2390327 2509133 2541180 2467182 2378226 2396198 2437676 2706087 2624601 2604393 2778878 2781185
4434B781185R3584Q4321k32273K12016Q6054j97175j58473R6964k1107J68037
$$ 2781185 2874769 2959090 2726817 2938833 3024887 2827712 2669239 2766203 2745096 2913133
4424B913133k02069j11218K01161q36k5495o7419R5856j6792n9561M6609L771
$$ 2913133 2711064 2599846 2801007 2800171 2774676 2707257 2803113 2786321 2726760 2773369 2777140
4413B777140p41q4876j52842J19882K8971m080q1553j71356J95130J27185J26591
$$ 2777140 2776399 2691523 2538681 2658563 2687534 2683454 2601901 2430545 2625675 2752860 2879451
4402B879451J8899M8962J99008j20395q5726m8132r2623j67391j70310J10122
$$ 2879451 2898350 2947312 3146320 3025925 2940199 2892067 2799444 2632053 2461743 2571865
4392B571865k0050j16539l8689j55587J97444k959r3967k19590K16353K23418
$$ 2571865 2551815 2435276 2396587 2241000 2438444 2435485 2341518 2121928 2338281 2561699
4382B561699k54332j45769J07201M15258k99253m1325o3532J23353Q5469k11716
$$ 2561699 2307367 2161598 2268799 2684057 2384804 2343479 2279947 2403300 2488769 2277053
4372B277053q3696k357L9231l5062P8684q1496j73429k6041R9509J72344o3179
$$ 2277053 2193357 2191000 2230231 2195169 2273853 2192357 2018928 1992887 2092396 2264740 2201561
4361B201561j10616n1848j6903K13557j6059J4340j10901k2637k58576k3275J92502
$$ 2201561 2090945 2039097 2022194 2235751 2219692 2234032 2123131 2100494 1841918 1818643 2011145
4350B011145O5158q922J44462P1150q7287Q1683q2364j01835N0855K9150J12824
$$ 2011145 2076303 2067381 2211843 2282993 2195706 2277389 2195025 2093190 2144045 2173195 2286019
4339B286019q3588J00503o7191O5982O938k14863n4499Q5828l3420j07154R5497
$$ 2286019 2202431 2302934 2235743 2301725 2308663 2093800 2039301 2125129 2091709 1984555 2080052
4328B080052J67888N6911L1837j2107O214l677Q772L8868N062l1120j09168J37438
$$ 2080052 2247940 2304851 2336688 2324581 2330795 2327118 2335890 2374758 2379820 2348700 2239532 2376970
4316B376970n0230l6994J35604J57554k8440k80043r5836J70884k7127k0724P978
$$ 2376970 2326740 2289746 2425350 2582904 2554464 2274421 2178585 2349469 2322342 2301618 2309596
4305B309596L91844J9520j53143M3464l0000k17632J48737Q5000N305n3032j56355
$$ 2309596 2701440 2720960 2567817 2611281 2581281 2363649 2512386 2597386 2602691 2549659 2393304
4294B393304Q7593L4257n3161O2118l2999J01110J03886K31019n1128K5406k12377
$$ 2393304 2480897 2515154 2461993 2524111 2491112 2592222 2696108 2927127 2875999 2901405 2689028
4283B689028l2128o5480p0635R5271K5211J1185j36392j8800l4895q3457J32250
$$ 2689028 2656900 2591420 2520785 2616056 2641267 2652452 2516060 2497260 2462365 2378908 2511158
4272B511158J67539q973M7501r3717K19164q0395J7427j32604o9641N8504P4978
$$ 2511158 2678697 2669724 2717225 2623508 2842672 2762277 2779704 2647100 2577459 2635963 2710941
4261B710941j26034K65320j80898k91382J30249J07758l7091J24376j28619q8897
$$ 2710941 2584907 2850227 2669329 2377947 2508196 2615954 2578863 2703239 2574620 2485723
4251B485723j25947j29910J45243j85207R0944M4584O0903J24382O5154j9009
$$ 2485723 2359776 2229866 2375109 2189902 2280846 2325430 2386333 2510715 2575869 2556860
4241B556860Q7606j47753m6735L4898k8978r1638L573O8619K5958N7080o6408
$$ 2556860 2644466 2496713 2449978 2484876 2455898 2364260 2367833 2436452 2462410 2519490 2453082
4230B453082R3328j79186P6684J05069j44585r2027K70247o4965n6034m5146J08825
$$ 2453082 2546410 2367224 2443908 2548977 2404392 2312365 2582612 2517647 2461613 2416467 2525292
4219B525292j66753M448J55405P9592K09410J30614k08326j28853P3249Q4773
$$ 2525292 2358539 2362987 2518392 2597984 2807394 2938008 2729682 2600829 2674078 2758851
4209B758851m729J4606J15274j31109k1689K80129k4687k39870l6962N6315K85209
$$ 2758851 2754122 2768728 2884002 2752893 2731204 3011333 2986646 2746776 2709814 2766129 3051338
4198C051338J17738k07833k48909J09009j46554J76393o96L9974R3791j5614j6490
$$ 3051338 3169076 2961243 2712334 2821343 2674789 2851182 2850486 2890460 2984251 2968637 2952147
4187B952147M8528J27768k25410j45215K62511P3587N7236j90720j15947j67313
$$ 2952147 3000675 3128443 2903033 2757818 3020329 3093916 3151152 2960432 2844485 2677172
4177B677172L5447K65940K67713o4578j60301K20524N8682j17622K1219j11063
$$ 2677172 2712619 2978559 3246272 3181694 3021393 3241917 3300599 3182977 3204196 3093133
4167C093133J95223J61366k8131p2433j26957J30823N8934J7458j1728R9629Q4270
$$ 3093133 3288356 3449722 3421591 3349158 3222201 3353024 3411958 3429416 3417688 3517317 3601587
4156C601587j8201j1862k66179J2530Q7205L92k18010l2046J71463O3130K78994
$$ 3601587 3583386 3571524 3305345 3317875 3405080 3405472 3187462 3155416 3326879 3390009 3669003
4145C669003l4123j63237L0262J58406j1484J65115J27965k0028K03722m9964
$$ 3669003 3634880 3471643 3501905 3660311 3648827 3813942 3941907 3921879 4125601 4075637
4135D075637j09488J94408j3710n007j35976q2091M07887J80588J26331M4088
$$ 4075637 3966149 4160557 4146847 4141840 4005864 3923773 4331660 4512248 4638579 4682667
4125D682667k4549l5979l1282L02562K15810J20360P333J48789j2827J311J44521
$$ 4682667 4658118 4622139 4590857 4893419 5109229 5229589 5236922 5385711 5372884 5374195 5518716
4114E518716J10487o236K48466K47817K11110J10466j33292K87993L75291L0144
$$ 5518716 5629203 5622967 5871433 6119250 6330360 6440826 6307534 6595527 6970818 7000962
4104G000962J53693p1510K6287K83347K65866K87676J4476K65857L22697J59535
$$ 7000962 7154655 7083145 7109432 7392779 7658645 7946321 7960797 8226654 8549351 8708886
4094H708886K69220L89024K41358J36124Q5989J18550K01461K79517J55462R5058
$$ 8708886 8978106 9367130 9608488 9744612 9830601 9949151 10150612 10430129 10585591 10680649
4084A0680649J62189K98170K10095J14913L33024M29717J11915M6208K66478J03157
$$ 10680649 10842838 11141008 11351103 11466016 11799040 12228757 12340672 12386880 12653358 12756515
4074A2756515J97282K60061M28187K81342K73688L13198J71333J52263J15305
$$ 12756515 12953797 13213858 13642045 13923387 14197075 14510273 14681606 14833869 14949174
4065A4949174M08693K46802K28300K14087Q3823J65648J81684L83321M80084K50802
$$ 14949174 15357867 15604669 15832969 16047056 16130879 16296527 16478211 16861532 17341616 17592418
4055A7592418P0041J63706O15035K87247r4931L59762M38871M02217J95399M06563
$$ 17592418 17662459 17826165 18441200 18728447 18633516 18993278 19432149 19834366 20029765 20436328
4045B0436328M20315M49110N87962P07737N66423N38468Q16380N12737O70956
$$ 20436328 20856643 21305753 21893715 22601452 23167875 23706343 24522723 25035460 25706416
4036B5706416P69022Q42217R09032J106784J238268J210581J282923J341001J237279
$$ 25706416 26475438 27317655 28226687 29333471 30571739 31782320 33065243 34406244 35643523
4027C5643523J289100J512547J429078J769560J692900J779980K020249J682162
$$ 35643523 36932623 38445170 39874248 41643808 43336708 45116688 47136937 48819099
4019D8819099J727426K234908K114996K192111K385068K212347K218938K348369
$$ 48819099 50546525 52781433 54896429 57088540 59473608 61685955 63904893 66253262
4011F6253262K309327K671398K571054K466896K481764K694984K601206K008351
$$ 66253262 68562589 71233987 73805041 76271937 78753701 81448685 84049891 86058242
4003H6058242K075691K139283K141172J834975K145362K023455J462853J770393
$$ 86058242 88133933 90273216 92414388 94249363 96394725 98418180 99881033 101651426
3995A01651426J692690J282764R58728P94875Q48883O13927N83523K26410j20100
$$ 101651426 103344116 104626880 105585608 106380483 107229366 107843293 108426816 108653226 108533126
3986A08533126j57219m99421o06971o99914p00956q52122j230360j265840j403293
$$ 108533126 108375907 107876486 107269515 106569601 105868645 105016523 103786163 102520323 101117030
3977A01117030j705717j875392j973068j604757j875035k402949k485288k212573
$$ 101117030 99411313 97535921 95562853 93958096 92083061 89680112 87194824 84982251
3969H4982251k222127k353826k197219k310422k350676k237122k188522k344927
$$ 84982251 82760124 80406298 78209079 75898657 73547981 71310859 69122337 66777410
3961F6777410k311033k151155k185816j895858j799038k259176j957563k128717
$$ 66777410 64466377 62315222 60129406 58233548 56434510 54175334 52217771 50089054
3953E0089054j868601j733987j620217j535577j622538j417839j317887j633154
$$ 50089054 48220453 46486466 44866249 43330672 41708134 40290295 38972408 37339254
3945C7339254j368517q61406j248390j231577r79035j073111r48867j028937o46261
$$ 37339254 35970737 35109331 33860941 32629364 31650329 30577218 29628351 28599414 27953153
3936B7953153r15098r23474q11486r11803o89674m83364p34491q53351n90220
$$ 27953153 27038055 26114581 25303095 24391292 23701618 23218254 22483763 21630412 21040192
3927B1040192n35070m04926n23467o64883m08128o32003q60112l79610m71346
$$ 21040192 20505122 20100196 19576729 18911846 18503718 17871715 17011603 16631993 16160647
3918A6160647k89121j69418j91640l38075m47385m62735l74806l48925m09702
$$ 16160647 15871526 15702108 15510468 15172393 14725008 14262273 13887467 13538542 13128840
3909A3128840k45478m0750k13400l11789j83734l06223j71622j32840k61859l16631
$$ 13128840 12883362 12842612 12629212 12317423 12133689 11827466 11655844 11523004 11261145 10944514
3899A0944514k87592j99228J13073j00347l38499l6044k26477P1115r4038q9899
$$ 10944514 10656922 10457694 10570767 10470420 10131921 10095877 9869400 9940515 9846477 9756578
3889I756578q2853j88826n9195K4906j848n7833K5570P8448q6501n9275k0260
$$ 9756578 9673725 9484899 9425704 9450610 9448762 9390929 9416499 9494947 9408446 9349171 9328911
3878I328911j5871J21576k52877p9469q0284o9269k5571p2948O275m9584j0840
$$ 9328911 9313040 9434616 9181739 9102270 9021986 8952717 8927146 8854198 8860473 8810889 8800049
3867H800049j74446j38194j11358j6295j23167j51749L5350J16381r1149k2229
$$ 8800049 8625603 8487409 8376051 8359756 8236589 8084840 8120190 8236571 8145422 8123193
3857H123193k02040k22553o8207l6384J25436j05762l50437M9332J83278r5379
$$ 8123193 7921153 7698600 7630393 7594009 7719445 7613683 7263246 7312578 7495856 7400477
3847G400477K3397q5488j5693K66046k28901j10583q6964K3944l3161K3954K54768
$$ 7400477 7423874 7338386 7322693 7588739 7359838 7249255 7162291 7186235 7153074 7177028 7431796
3836G431796p2436J8561N4827J5013q840N6873J39431J38085j2844P7082Q5831
$$ 7431796 7359360 7377921 7432748 7447761 7438921 7495794 7635225 7773310 7760466 7837548 7923379
3825G923379M858j81399r3795n0448o0698R1257r63N3889K5998k48800k2562N990
$$ 7923379 7928237 7746838 7653043 7602595 7541897 7633154 7632191 7686080 7712078 7463278 7440716 7446706
3813G446706N4368j21811J30200n4547q0136j42111M2294O6655j88375J32967
$$ 7446706 7501074 7379263 7509463 7454916 7374780 7232669 7274963 7341618 7153243 7286210
3803G286210l2219k6286L0489J40237j7897K85362J89739K59584K09825K04898
$$ 7286210 7253991 7227705 7258194 7398431 7380534 7665896 7855635 8115219 8325044 8529942
3793H529942J51709O96200O83967O50140R42315O11328N50839j30128o40814l25541
$$ 8529942 8681651 9377851 10061818 10711958 11654273 12265601 12816440 12686312 12045498 11719957
3783A1719957m22111n01988k70324l39232J21970K8527j06032J75693K12615O9782
$$ 11719957 11297846 10795858 10525534 10186302 10308272 10336799 10230767 10406460 10619075 10688857
3773A0688857P9862o8106Q866J77398J68270l7142M1611M55493K27585M7889N78136
$$ 10688857 10768719 10700613 10709479 10886877 11055147 11018005 11059616 11515109 11742694 11790583 12368719
3762A2368719O01074M49819M25260Q1513N716m53876o46676m96279p83562n50104
$$ 12368719 12969793 13419612 13844872 13926385 13932101 13478225 12831549 12335270 11551708 11001604
3752A1001604m73957l04078k17674k55292m1063k13813j41478j89027k0343q8870
$$ 11001604 10527647 10223569 10005895 9750603 9709540 9495727 9354249 9165222 9144879 9056009
3742I056009p2346K549J04743p6225r1257J59483P1241K5934J68947j2543Q7044
$$ 9056009 8983663 8986212 9090955 9014730 8923473 9082956 9154197 9180131 9349078 9336535 9423579
3731I423579K42627o6682K23822j09954L12023J78259M27082J14862J08344K49554
$$ 9423579 9666206 9599524 9823346 9713392 10025415 10203674 10630756 10745618 10853962 11103516
3721A1103516M7866L38061J09780J04621L59283K49117J70870J63984L41597L89950
$$ 11103516 11151382 11489443 11599223 11703844 12063127 12312244 12483114 12647098 12988695 13378645
3711A3378645K44105J84358J28012K73125K84449K77326K67903L14626L90294
$$ 13378645 13622750 13807108 13935120 14208245 14492694 14770020 15037923 15352549 15742843
3702A5742843L66965M05471K82443K90232M44376N62396L59853M49928M32517
$$ 15742843 16109808 16515279 16797722 17087954 17532330 18094726 18454579 18904507 19337024
3693A9337024M39178M37311L52425M13866M49887O10839M53994N36276L64311
$$ 19337024 19776202 20213513 20565938 20979804 21429691 22040530 22494524 23030800 23395111
3684B3395111P18694L77015O63914P61469K45424M60103P56885M50120M98129
$$ 23395111 24113805 24490820 25154734 25916203 26161627 26621730 27378615 27828735 28326864
3675B8326864P09097M98620N82169P59199N58676P47911P05572P51316O05644
$$ 28326864 29035961 29534581 30116750 30875949 31434625 32182536 32888108 33639424 34245068
3666C4245068J110740J152788J160456J100523J092401J402322J229915J028718
$$ 34245068 35355808 36508596 37669052 38769575 39861976 41264298 42494213 43522931
3658D3522931J345935J008257J116882J199963J077487J404886J141296J399938
$$ 43522931 44868866 45877123 46994005 48193968 49271455 50676341 51817637 53217575
3650E3217575J226935J144121J301998J104876J209024J121762R95012R03612
$$ 53217575 54444510 55588631 56890629 57995505 59204529 60326291 61321303 62224915
3642F2224915Q34197O78255L93092K82977K25986L19913j05386l3204L69884L67872
$$ 62224915 63059112 63737367 64130459 64413436 64639422 64959335 64853949 64820745 65190629 65558501
3632F5558501J836o8741J18033K66137L23352M56346K97948K39184L43208J85184
$$ 65558501 65560337 65491596 65609629 65875766 66199118 66655464 66953412 67192596 67535804 67720988
3622F7720988K58442N65629P18235O18300R18762J256220J149676J401661J625063
$$ 67720988 67979430 68545059 69263294 69881594 70800356 72056576 73206252 74607913 76232976
3613G6232976K148950K421491K482472K601582L171628L304825L607856L602576
$$ 76232976 78381926 80803417 83285889 85887471 89059099 92363924 95971780 99574356
3605I9574356L539883L728517L572488L537865L603031L476199L381450L137684
$$ 99574356 103114239 106842756 110415244 113953109 117556140 121032339 124413789 127551473
3597A27551473L204492L315296L474033L184298K966942K869851K334074K172623
$$ 127551473 130755965 134071261 137545294 140729592 143696534 146566385 148900459 151073082
3589A51073082J735365J227179J001404M36073j12767m03812o27149p27271p24364
$$ 151073082 152808447 154035626 155037030 155473103 155360336 154956524 154329375 153602104 152877740
3580A52877740o00027q02127n20785p24810o90224l98821m68280l29740k33974
$$ 152877740 152277713 151475586 150954801 150229991 149539767 149140946 148672666 148342926 148108952
3571A48108952m42238o1094L73407M07071O57615R05291J211353J256925J570860
$$ 148108952 147666714 147605620 147979027 148386098 149043713 149949004 151160357 152417282 153988142
3562A53988142J432603J570163J652840J517378J440386J602623J847575J723519
$$ 153988142 155420745 156990908 158643748 160161126 161601512 163204135 165051710 166775229
3554A66775229J815172J581178J550893J368259J197127P84116M56202K55677
$$ 166775229 168590401 170171579 171722472 173090731 174287858 175071974 175528176 175783853
3546A75783853m00372p41107j181930j469281k307968k592562k574748k731824
$$ 175783853 175383481 174642374 173460444 171991163 169683195 167090633 164515885 161784061
3538A61784061k817187l032560l062884k924447k745182k717523k616147k809136
$$ 161784061 158966874 155934314 152871430 149946983 147201801 144484278 141868131 139058995
3530A39058995k504673k657168l087976l003570k513875k543134k470366k243537
$$ 139058995 136554322 133897154 130809178 127805608 125291733 122748599 120278233 118034696
3522A18034696j852063j549414j226082j101483n27615j51184M77204Q01662R61987
$$ 118034696 116182633 114633219 113407137 112305654 111778039 111626855 112104059 112905721 113867708
3513A13867708J409305J663266K163286K740073K872859L189390L901888M342566
$$ 113867708 115277013 116940279 119103565 121843638 124716497 127905887 131807775 136150341
3505A36150341N021087N702547O351120P042046Q077491R403102J0439050J1503879
$$ 136150341 141171428 146873975 153225095 160267141 168344632 177747734 188186784 199690663
3497A99690663J3044991J4035039J4642695J5212269J4814521J3732962J2344370
$$ 199690663 212735654 226770693 241413388 256625657 271440178 285173140 297517510
3490B97517510J0150618P606165M944873K426606J58082j402825k282295k601531
$$ 297517510 307668128 315274293 320219166 322645772 322803854 321401029 319118734 316517203
3482C16517203k359710j985262j900887j983594k457899l485880n225414p149786
$$ 316517203 314157493 312172231 310271344 308287750 305829851 302343971 297118557 289968771
3474B89968771r478590j1827467j3882145j5314888j6138377j6130501j5794111
$$ 289968771 280490181 268662714 254780569 239465681 223327304 207196803 191402692
3467A91402692j4727915j3677454j2354808j0697936r668994q598398p523213
$$ 191402692 176674777 162997323 150642515 139944579 130275585 121677187 114153974
3460A14153974o661624n925250n401649n073006m395879l885272l647272l380877
$$ 114153974 107492350 101567100 96165451 91092445 86696566 82811294 79164022 75783145
3452G5783145k952554k772517k373095k346525k227386j964257k001121j896103
$$ 75783145 72830591 70058074 67684979 65338454 63111068 61146811 59145690 57249587
3444E7249587j674440j600065j405777j433107j475361j190661j104553j138151
$$ 57249587 55575147 53975082 52569305 51136198 49660837 48470176 47365623 46227472
3436D6227472r97164q49950j092259j172432q36975q23606q63167p86528o84536
$$ 46227472 45230308 44380358 43288099 42115667 41278692 40455086 39591919 38805391 38120855
3427C8120855p62623m34659n22035o49572o39157o50545k02194n72927o86457
$$ 38120855 37358232 36923573 36401538 35751966 35112809 34462264 34260070 33687143 33000686
3418C3000686l01635l70972k82330m74384n63387m3028k19682O011R3919J88720
$$ 33000686 32699051 32328079 32045749 31571365 31007978 30964950 30745268 30751279 30845198 31033918
3408C1033918J17997J04377J55527k46002o31036o30043p11920o27886o22678
$$ 31033918 31151915 31256292 31411819 31165817 30534781 29904738 29192818 28564932 27942254
3399B7942254n19390j77401m035p7632J80288J23080L28769Q6814l34221r25376
$$ 27942254 27422864 27245463 27241428 27163796 27344084 27467164 27795933 27882747 27548526 26623150
3389B6623150q67709m87732o49636m60413m80516l96336k16609k89916l06181
$$ 26623150 25755441 25267709 24618073 24157660 23677144 23280808 23064199 22774283 22468102
3380B2468102P56l55156l34394k44620Q0141J072n6901k46077j54361P4919p6531
$$ 22468102 22468858 22113702 21779308 21534688 21614829 21615901 21559000 21312923 21158562 21233481 21156950
3369B1156950L1318J31410N4395K508j66874N2693k15114L9238j19327J06683
$$ 21156950 21188268 21319678 21374073 21376581 21209707 21262400 21047286 21086524 20967197 21073880
3359B1073880K35442J00347J24502o0885Q0423N4048J59528L33949K37692J33643
$$ 21073880 21309322 21409669 21534171 21473286 21553709 21607757 21767285 22101234 22338926 22472569
3349B2472569O6991L47652K38852N3625J46688J30355K63977J43483J45224Q2874
$$ 22472569 22539560 22887212 23126064 23179689 23326377 23456732 23720709 23864192 24009416 24092290
3339B4092290M26250K50363K69180N45091M05315M74050N13131K80737K29241
$$ 24092290 24518540 24768903 25038083 25583174 25988489 26462539 26975670 27256407 27485648
3330B7485648N51325O13962L74438N34039M59537O01407N71024Q12737R73613
$$ 27485648 28036973 28650935 29025373 29559412 30018949 30620356 31191380 32004117 32977730
3321C2977730P91258R39129P20117R75295J265091R62586J294899J271797J291872
$$ 32977730 33768988 34708117 35428234 36403529 37668620 38631206 39926105 41197902 42489774
3312D2489774J504726J515430J677038J970665K167071K025163K293667K528568
$$ 42489774 43994500 45509930 47186968 49157633 51324704 53349867 55643534 58172102
3304E8172102K993912L300196L150143L804798M032807M135553M500528M982327
$$ 58172102 61166014 64466210 67616353 71421151 75453958 79589511 84090039 89072366
3296H9072366N415028O655699P892744R800409J2447130J5707325J9712071K3754181
$$ 89072366 94487394 101143093 109035837 118836246 131283376 146990701 166702772 190456953
3288A90456953K4180630J5798389k12737j5326094k2209256k1682607j7204083
$$ 190456953 214637583 230435972 230223235 214897141 192687885 171005278 153801195
3281A53801195j2768894r360396o865086m718476l235063k072691j131896o61698
$$ 153801195 141032301 131671905 124806819 120088343 116853280 114780589 113648693 112986995
3273A12986995j98421K47083N13002J261067J885651K897416L923482N492610
$$ 112986995 112788574 113035657 113548659 114809726 116695377 119592793 123516275 129008885
3265A29008885P430121R529365J2336118J5973593J9886305K2529778J8339901
$$ 129008885 136439006 145968371 158304489 174278082 194164387 216694165 235034066
3258B35034066M659355j1612919k2029203k3788587k0140118j5837378j2083498
$$ 235034066 239693421 228080502 206051299 182262712 162122594 146285216 134201718
3251A34201718r121962p302706n354316m197026l414331k884389k548483k153736
$$ 134201718 125079756 117777050 112422734 108225708 104811377 101926988 99378505 97224769
3243I7224769j703071j339222n89704l10741J56997O14057Q75304R06870Q41398
$$ 97224769 95521698 94182476 93592772 93282031 93439028 94053085 94928389 95835259 96676657
3234I6676657N30381o99802j857560l313309m100214m299400m466258m394164
$$ 96676657 97207038 96507236 94649676 91336367 87236153 82936753 78470495 74076331
3226G4076331l904904l485596l235574l031966k888743k418659k093108j789301
$$ 74076331 70171427 66685831 63450257 60418291 57529548 55110889 53017781 51228480
3218E1228480j705071j638268j426199j430383j239207q81733j222328j297131
$$ 51228480 49523409 47885141 46458942 45028559 43789352 42907619 41685291 40388160
3210D0388160q41328p02864r18014q29389o49525o67658p52772l48401j48510
$$ 40388160 39546832 38843968 37925954 37096565 36447040 35779382 35026610 34678209 34529699
3201C4529699l92107n42060n87215m24508q44632p72485p57096o06112p14728
$$ 34529699 34137592 33595532 33008317 32583809 31739177 30966692 30209596 29603484 28888756
3192B8888756m77667l64317n25659m23594n01127m70214n30017n81843l16398
$$ 28888756 28411089 28046772 27521113 27097519 26596392 26126178 25596161 25014318 24697920
3183B4697920n80749o09987m88670m15713m14454j35735k36341n48879m62045
$$ 24697920 24117171 23507184 23018514 22602801 22188347 22052612 21816271 21267392 20805347
3174B0805347k67592k24667k65086l55513l45374j15471l45285l66816l16531
$$ 20805347 20537755 20313088 20048002 19692489 19347115 19231644 18886359 18519543 18203012
3165A8203012j77468j65839j40977j19582m1691l71018j22300k31540j96656r3847
$$ 18203012 18025544 17859705 17718728 17599146 17557455 17186437 17064137 16832597 16635941 16542094
3155A6542094k8910k26468j67558j81549j26970q2439m8212k17970J71721r425
$$ 16542094 16513184 16286716 16119158 15937609 15810639 15728200 15679988 15462018 15633739 15624314
3145A5624314l60905k66069r3328j60640l40551j77661j64674n3778k39741J4671
$$ 15624314 15263409 14997340 14904012 14743372 14402821 14225160 14060486 14006708 13766967 13781638
3135A3781638K2674j08197k72953j66269q0023j83466l6479k2510r9726n662J0060
$$ 13781638 13804312 13696115 13423162 13256893 13176870 12993404 12956925 12934415 12834689 12829027 12839087
3124A2839087j45743j37631j38501j54650n9457L8887q9942O1866J6586k20503
$$ 12839087 12693344 12555713 12417212 12262562 12203105 12241992 12152050 12213916 12230502 12009999
3114A2009999M787k13998P7444k47133j67293O1591j00463j20891j28194J3667
$$ 12009999 12014786 11800788 11878232 11631099 11463806 11525397 11424934 11304043 11175849 11189516
3104A1189516o4645O002K4011k40530L64R1473q81j00456P5236l1488j23850k2295
$$ 11189516 11124871 11130873 11154884 10914354 10914718 11006191 11005310 10904854 10980090 10948602 10824752 10802457
3092A0802457o2774j95864p5908p3186j42001J79517o1712k72483J43940j03078
$$ 10802457 10739683 10543819 10467911 10394725 10252724 10432241 10370529 10098046 10241986 10138908
3082A0138908j71200Q14q7956r6528j35099k9208j95771p9785o043l8651j83123
$$ 10138908 9967708 9968522 9880566 9784038 9648939 9619731 9423960 9344175 9338132 9299481 9116358
3071I116358j95769Q645j01278m24691j58099J85211J08398M6346j03731k17057
$$ 9116358 8920589 8929234 8827956 8403265 8245166 8430377 8538775 8585121 8481390 8264333
3061H264333r5970q4883k4769j17190k03076j4956j68592n4098j60491o6151J29197
$$ 8264333 8168363 8083480 8058711 7941521 7738445 7723489 7554897 7500799 7340308 7274157 7403354
3050G403354J55679j0934k53047P545K49936O3567q3434k26590j893K17314j23413
$$ 7403354 7559033 7548099 7295052 7302597 7552533 7616100 7532666 7306076 7304183 7521497 7398084
3039G398084o7215j067J05403M6103k27940J79680N6210k69113M4456r4193n2631
$$ 7398084 7330869 7329802 7435205 7481308 7253368 7433048 7489258 7220145 7264601 7170408 7117777
3028G117777K1990J19199j0114r1701p4803R3425J80449j4932k2403j69277N8521
$$ 7117777 7139767 7258966 7248852 7157151 7082348 7175773 7356222 7341290 7318887 7149610 7208131
3017G208131K11924o672N7390j21099M0298J86033J88405j2163J82904L9033M0544
$$ 7208131 7420055 7413383 7470773 7349674 7389972 7576005 7764410 7752247 7935151 7974184 8014728
3006H014728R4554J98113K36720N8070K10311L12710o4339K44984L99101O3940
$$ 8014728 8109282 8307395 8544115 8602185 8812496 9125206 9060867 9305851 9704952 9768892
2996I768892J35629J70674R6812J28057J00953o3943J66396L39238J6573j06285
$$ 9768892 9904521 10075195 10172007 10300064 10401017 10337074 10503470 10842708 10859281 10752996
2986A0752996o2142j52488K2099k20923R6662L3246j99064j92027j18025J07720
$$ 10752996 10690854 10538366 10560465 10339542 10436204 10469450 10270386 10078359 9960334 10068054
2976A0068054O0459J26781K53514L3016J66770J52003n3451K10150J78513J35494
$$ 10068054 10128513 10255294 10508808 10541824 10708594 10860597 10807146 11017296 11195809 11331303
2966A1331303J0600O1449J32491P5081J24589L83803N25485L58042O17740M92299
$$ 11331303 11341903 11403352 11535843 11610924 11735513 12119316 12644801 13002843 13620583 14112882
2956A4112882P45422N12451J80439M9896j4802l86985l39953l37571k99954k71347
$$ 14112882 14858304 15370755 15551194 15601090 15586288 15199303 14859350 14521779 14221825 13950478
2946A3950478k36566m44421j66923l65853l81248p9564j80278K2071k60697P3065
$$ 13950478 13713912 13269491 13102568 12736715 12355467 12275903 12095625 12117696 11856999 11930064
2936A1930064K5367k7160l0230L03996M9647J7012J58661J41581Q3972M57084
$$ 11930064 11955431 11928271 11898041 12202037 12251684 12268696 12427357 12568938 12652910 13109994
2926A3109994K34257K42092L66555K25152L45526K63412L68106L64487K00358
$$ 13109994 13344251 13586343 13952898 14178050 14523576 14786988 15155094 15519581 15719939
2917A5719939M5197j4923l495k63355k31420l00145k29347J01043n4283k76776
$$ 15719939 15765136 15750213 15746718 15483363 15251943 14951798 14722451 14823494 14769211 14492435
2907A4492435k9304j81513k26518J53291P82M8525K80018q5483R9611K70593L16197
$$ 14492435 14463131 14281618 14055100 14208391 14209173 14257698 14537716 14452233 14551844 14822437 15138634
2896A5138634M02185L16949L16098j80820m70715k11753j2590n39331k38598l28661
$$ 15138634 15540819 15857768 16173866 15993046 15522331 15310578 15297988 14758657 14520059 14191398
2886A4191398p6450k0159k21912l5183J83133K74775L93811J95835O4675J56657
$$ 14191398 14114948 14094789 13872877 13837694 14020827 14295602 14689413 14885248 14949923 15106580
2876A5106580M66236M43447L04472L34743K07032N71892N32594M54340M82162
$$ 15106580 15572816 16016263 16320735 16655478 16862510 17434402 17966996 18421336 18903498
2867A8903498N29307M23788k80057n89796m93242r46854p69443n15132o78130
$$ 18903498 19432805 19856593 19576536 18986740 18493498 17546644 16777201 16262069 15583939
2858A5583939n50460l73141n73420j74320l34611n65267l28593l34410j41919
$$ 15583939 15033479 14660338 14086918 13912598 13577987 13012720 12684127 12349717 12207798
2849A2207798j46684k11215j62368j63913n5135j12183k64386k44372l05298j31210
$$ 12207798 12061114 11849899 11687531 11523618 11468483 11356300 11091914 10847542 10542244 10411034
2839A0411034m80102k51564l82031o8069k99176l40750Q335k41077l33999j52698
$$ 10411034 9930932 9679368 9297337 9229268 8930092 8589342 8597677 8356600 8022601 7869903
2829G869903n5972k90687k85590J4001j80484j59905j03844r0137Q5284l98935
$$ 7869903 7813931 7523244 7237654 7251655 7071171 6911266 6807422 6717285 6802569 6403634
2819F403634q2896M0223p2269n5340l5089k28888L1486j48900k02752n9569Q5407
$$ 6403634 6320738 6360961 6288692 6233352 6198263 5969375 6000861 5851961 5649209 5589640 5675047
2808E675047j13778k3172j87991p8126J14812k13458n0838P7130J6400k66900
$$ 5675047 5561269 5538097 5350106 5271980 5386792 5173334 5122496 5199626 5216026 4949126
2798D949126L2082j04295l899R1797k65486J05271l2463j30927p6532r7843J3481
$$ 4949126 4981208 4876913 4873014 4964811 4699325 4804596 4772133 4641206 4564674 4466831 4480312
2787D480312j62298j43885N3398L6964k9377O9161N0950k68149L0356p6516j70731
$$ 4480312 4318014 4174129 4227527 4264491 4235114 4304275 4355225 4087076 4117432 4040916 3870185
2776C870185k4562j57757K30591R0969j73173r7110k5805J20265K8879j66214
$$ 3870185 3845623 3687866 3918457 4009426 3836253 3739143 3713338 3833603 3862482 3696268
2766C696268O4581L2124L7453J02266l44505q2836M5778j31521L47267N8854l38206
$$ 3696268 3760849 3792973 3830426 3932692 3588187 3505351 3551129 3419608 3766875 3825729 3487523
2755C487523n8056k9136n1931N1902n5225j43589N9322l1335J4507M5856q3491
$$ 3487523 3429467 3400331 3348400 3400302 3345077 3201488 3260810 3229475 3243982 3289838 3206347
2744C206347j01302N5367J04945J86780k9373l34133k23753J01582J03272L3900
$$ 3206347 3105045 3160412 3265357 3452137 3422764 3088631 2864878 2966460 3069732 3103632
2734C103632J09318k530j80899j04999J38989j29001j16265j7796O9664p5327
$$ 3103632 3212950 3210420 3029521 2924522 3063511 2934510 2818245 2800449 2870113 2794786
2724B794786j47955O6183J21946j43217n3237K24662j81951r7248J83054q4491
$$ 2794786 2646831 2713014 2834960 2691743 2638506 2863168 2681217 2583969 2767023 2682532
2714B682532J14540M6037Q224j58494L1930l0887o9694j13612Q4557m853J14982
$$ 2682532 2797072 2843109 2851333 2692839 2724769 2693882 2624188 2510576 2595133 2590280 2705262
2703B705262J34223O4562j16375k48281J62273j29751j57278n687K7008o059N8474
$$ 2705262 2839485 2904047 2787672 2539391 2701664 2571913 2414635 2408948 2435956 2429897 2488371
2692B488371o6641L3316r5459J27219Q4496Q060p3309q985o4334k3081O2993j58892
$$ 2488371 2421730 2455046 2359587 2486806 2571302 2579362 2506053 2497068 2432734 2409653 2472646 2313754
2680B313754k7829M8633m7146R75O1322J6410L3134k1064o9080J42138j58974
$$ 2313754 2285925 2334558 2287412 2288387 2349709 2366119 2399253 2378189 2309109 2451247 2292273
2669B292273j40586J17928K29550J06108k98096O2110K20742l1114J40367q6765
$$ 2292273 2151687 2269615 2499165 2605273 2307177 2369287 2590029 2558915 2699282 2612517
2659B612517N2793p5888K3309R0664j18414l5006m739q388l177J91479L2231l5035
$$ 2612517 2665310 2589422 2612731 2703395 2584981 2549975 2545236 2536848 2533671 2725150 2757381 2722346
2647B722346j8432q0327J2469J7989N5021L17773p4543J64069q3564R4153Q6684
$$ 2722346 2703914 2623587 2636056 2654045 2709066 3026839 2952296 3116365 3032801 3126954 3213638
2636C213638n0164j37687m873J04409j36240J08416j46011L2438L46498L3503
$$ 3213638 3163474 3025787 3020914 3125323 2989083 3097499 2951488 2983926 3330424 3363927
2626C363927M146l1259j17611l8860K29970j64795K13005O2834K24535K60568
$$ 3363927 3368073 3336814 3219203 3180343 3410313 3245518 3458523 3521357 3745892 4006460
2616D006460q1592J01823j7755O8831P2265J80980j4061P6245L7k2609O6747K13266
$$ 4006460 3924868 4026691 4008936 4077767 4150032 4331012 4316951 4393196 4393233 4370624 4437371 4650637
2604D650637O1514j16955j45504p015J16478j22018k3154p8500n3749J53145l0421
$$ 4650637 4712151 4595196 4449692 4442677 4559155 4437137 4413983 4335483 4281734 4434879 4404458
2593D404458M4378J1582j27033M0662j1085j75349J44116J09707Q2425O8866k349
$$ 4404458 4448836 4460418 4333385 4374047 4362962 4187613 4331729 4441436 4523861 4592727 4590378
2582D590378J67974J60861q8887K87629J21762K87566K40291j5668l32380j19673
$$ 4590378 4758352 4919213 4830326 5117955 5239717 5527283 5767574 5751906 5419526 5299853
2572E299853n2825j32935J3253j12817j23784l540o9262N8952k19218k28988j40852
$$ 5299853 5247028 5114093 5127346 5014529 4890745 4887205 4817943 4876895 4657677 4428689 4287837
2561D287837j24453J53583j26015M49119N9853n0139o6720l19889j10062r2271
$$ 4287837 4163384 4316967 4190952 4640071 4699924 4649785 4583065 4263176 4153114 4060843
2551D060843M2458R7309k3319o9258M8420J4220J30421O8223J48277N7370m5566
$$ 4060843 4103301 4200610 4177291 4108033 4156453 4170673 4301094 4369317 4517594 4574964 4529398
2540D529398J16063L8775n6537k34933j90989R177j64160l50520n2599j88302
$$ 4529398 4645461 4684236 4627699 4392766 4201777 4210954 4046794 3696274 3643675 3455373
2530C455373p0364o1655j09413r1226j04065N7825M241J6651l9859o7320Q1607
$$ 3455373 3385009 3323354 3213941 3122715 3018650 3076475 3080716 3097367 3057508 2990188 3071795
2519C071795p8779j49568N9477j23141p5682N591o2565K8102k28229J80660N2545
$$ 3071795 2993016 2843448 2902925 2779784 2704102 2709693 2647128 2675230 2447001 2627661 2680206
2508B680206k52610K37074l6845j08441r9117m3362P5990k7524J1913J9887j58830
$$ 2680206 2427596 2664670 2627825 2519384 2420267 2376905 2452895 2425371 2437284 2457171 2298341
2497B298341j0765k18934k39453J01585J7355k26637K9470J0035J47515J12478
$$ 2298341 2287576 2068642 1829189 1930774 1948129 1721492 1750962 1760997 1908512 2020990
2487B020990k7635N3921j03614R3245j75415k027p4524J7710k5847k8365n180
$$ 2020990 1993355 2047276 1943662 2036907 1861492 1859465 1784941 1802651 1776804 1748439 1743259
2476A743259j5032j09970p2367J67702n3550k30739M9213R9563n7947L1655p759
$$ 1743259 1728227 1618257 1545890 1713592 1660042 1429303 1478516 1578079 1520132 1551787 1544028
2465A544028J63938J7917j78516r1738J4944P2412N5957J09346k40443j68638
$$ 1544028 1707966 1725883 1547367 1455629 1470573 1542985 1598942 1708288 1467845 1299207
2455A299207Q4888K7424J28419j70202m4241k3926K1603o5360J18299J6765J9804
$$ 1299207 1384095 1411519 1539938 1369736 1325495 1301569 1323172 1257812 1376111 1392876 1412680
2444A412680N2452o2885k9973K2061J03034j54492N5137K5457o6485p1456Q2154
$$ 1412680 1465132 1402247 1372274 1394335 1497369 1342877 1398014 1423471 1356986 1285530 1367684
2433A367684J65376o0346M4970k19226k79654L04701L481p0902R6715k8261r7389
$$ 1367684 1533060 1472714 1517684 1298458 1018804 1323505 1326986 1256084 1352799 1324538 1227149
2422A227149Q4532j07765q4069O5921J5433J76154n850j61536j30714r9003J78797
$$ 1227149 1311681 1203916 1119847 1185768 1201201 1377355 1371505 1209969 1079255 980252 1159049
2411A159049j209J00106J33179q7397o8131L9336j15939k5629R0943P5061l453
$$ 1159049 1157840 1257946 1391125 1303728 1235597 1274933 1158994 1133365 1224308 1299369 1295916
2400A295916p7705J7531o9653o3374r247K04829R283m9521j35711j22657N5486
$$ 1295916 1218211 1235742 1166089 1102715 1093468 1298297 1307580 1258059 1122348 999691 1055177
2389A055177K53159M796J84197j28023M4734M5673j42394P2504q7761j05710J7893
$$ 1055177 1308336 1313132 1497329 1369306 1414040 1459713 1317319 1389823 1302062 1196352 1214245
2378A214245J21799k43288J78463p5801j04281o3750N6251J88872J41073j73994
$$ 1214245 1336044 1092756 1271219 1195418 1091137 1027387 1083638 1272510 1413583 1239589
2368A239589j06127K79244O1818q9684j3937j0378K80842L6195j86684j53227
$$ 1239589 1133462 1412706 1474524 1384840 1370903 1360525 1641367 1677562 1490878 1337651
2358A337651o5859n1926M1053K8221o6467m6493j07358O3619k9408N7791k46973
$$ 1337651 1271792 1219866 1260919 1289140 1222673 1176180 1068822 1132441 1103033 1160824 913851
2347I13851O0126L6575l4853k5693n01Q2522J32311J4582p9460q7044O8586Q0234
$$ 913851 973977 1010552 975699 950006 949505 1032027 1164338 1178920 1099460 1012416 1081002 1161236
2335A161236m1133n242K61386j31803m4914O5923M3038k42656j4344N9959l4157
$$ 1161236 1120103 1114861 1376247 1244444 1199530 1265453 1308491 1065835 1051491 1111450 1077293
2324A077293J26171j60280k716l5902j6882J86997j05951K937N5676k07683k4829
$$ 1077293 1203464 1043184 1040468 1004566 987684 1174681 1068730 1071667 1127343 919660 894831
2313H94831J14180M938j53988L16165L668j27963R234q6758O8087O1098k3193
$$ 894831 1009011 1013949 859961 1176126 1179794 1051831 1061065 974307 1042394 1103492 1080299
2302A080299J13014j8434k2488J63153J2280j98779j4803O0036r8072Q3959J56721
$$ 1080299 1193313 1174879 1152391 1315544 1327824 1129045 1114242 1174278 1076206 1160165 1316886
2291A316886r2745q3969j95151J79899L1009j67026J40910J18092j76933N2397
$$ 1316886 1224141 1140172 945021 1124920 1155929 988903 1129813 1247905 1070972 1123369
2281A123369P4618j54376l5396k8000j7569r3823M6228Q8455m7007r7174Q3263
$$ 1123369 1197987 1043611 1008215 980215 962646 868823 915051 1003506 956499 859325 942588
2270I42588l0611l1336m9443K59213j958q3088J9668k57068j99339J98878J5742
$$ 942588 911977 880641 831198 1090411 1088453 1005365 1025033 767965 568626 767504 783246
2259G83246K1889K26008K447l0649O4869J11456q4012M1811k6418j51697R8225
$$ 783246 805135 1031143 1033590 1002941 1067810 1179266 1095254 1137065 1110647 958950 1057175
2248A057175l01298L2641L4646l7396L37392j34680j8436j42519N7792j70171
$$ 1057175 755877 788518 823164 785768 1123160 988480 970044 827525 885317 715146
2238G15146j84052O0018K77862K41608k67932K14868J06014K3825q8541k31206
$$ 715146 531094 591112 868974 1110582 842650 1057518 1163532 1187357 1098816 867610
2228H67610J17127R7160J1047M9765j39859j47784J74246m8880L2248J3297j24869
$$ 867610 984737 1081897 1092944 1142709 1002850 855066 1029312 980432 1012680 1025977 901108
2217I01108j85J91032l3875J59108k185m2666O2142o8318q2696J44245L7986o5907
$$ 901108 900923 1091955 1058080 1217188 1215003 1172337 1234479 1166161 1083465 1227710 1265696 1199789
2205A199789l6187j54254n8226J56110j10269J39232k6614M912J09033K83329
$$ 1199789 1163602 1009348 951122 1107232 996963 1136195 1109581 1114493 1223526 1506855
2195A506855j64462k44579J42162P7474J19754n3608j60282Q7137J26577q7620
$$ 1506855 1342393 1097814 1239976 1317450 1437204 1383596 1223314 1310451 1437028 1349408
2185A349408L4113j27031J86399P2543j8196j71191j401J13027K50244m4789K0822
$$ 1349408 1383521 1256490 1442889 1515432 1497236 1326045 1324644 1437671 1687915 1643126 1663948
2174A663948P4727j29961p1715N5848R8107K03853p9024J80110J43774M4369P8578
$$ 1663948 1738675 1608714 1536999 1592847 1690954 1894807 1815783 1995893 2139667 2184036 2262614
2163B262614J17130N3648o4131J17407K45069n2650K0661j74948K9250J05351
$$ 2262614 2379744 2433392 2369261 2486668 2731737 2679087 2699748 2524800 2554050 2659401
2153B659401j99046J24912J15160P3997k47860J11508L0337J06935l9671o7067
$$ 2659401 2460355 2585267 2700427 2774424 2526564 2638072 2668409 2775344 2735673 2668606
2143B668606r7908J80984J12342J84132Q9436J38413R4284j45170n2454J59759
$$ 2668606 2570698 2751682 2864024 3048156 3137592 3276005 3370289 3225119 3172665 3332424
2133C332424K51077J64018N0922O4573K00600L15668J70170M3051J92198J30427
$$ 3332424 3583501 3747519 3798441 3863014 4063614 4379282 4549452 4592503 4784701 4915128
2123D915128M26376K8128K20829J26204M16643O31373L99798L04245J00675M12464
$$ 4915128 5341504 5369632 5590461 5716665 6133308 6764681 7164479 7468724 7569399 7981863
2113G981863Q05207P40763Q31833O85806P67038N64638M38544R03532J310079
$$ 7981863 8787070 9527833 10359666 11045472 11812510 12377148 12815692 13719224 15029303
2104A5029303J352599J872450K477853K968206M298189N581291P598715R897662
$$ 15029303 16381902 18254352 20732205 23700411 27998600 33579891 41178606 51076268
2096E1076268J0195366N599858k626918q447090r750151q098354o084078m600315
$$ 51076268 61271634 66871492 64244574 55797484 46047333 37948979 31864901 27264586
2088B7264586l494106k605078k291679j809695j393055q94900p51319n72761p03746
$$ 27264586 23770480 21165402 18873723 17064028 15670973 14776073 14024754 13451993 12748247
2079A2748247o23817o99337p54275p61528m68701n00759p18482l46880m65188
$$ 12748247 12124430 11425093 10670818 9909290 9440589 8939830 8221348 7874468 7409280
2070G409280k91604l20110k38965k79240k48055k40303l29302j59778l0605k80886
$$ 7409280 7117676 6797566 6558601 6279361 6031306 5791003 5461701 5301923 5271318 4990432
2060D990432j57235j88661K8500j25343p2620n0614j17833j61169K0605j64219
$$ 4990432 4833197 4644536 4673036 4547693 4475073 4424459 4306626 4145457 4166062 4001843
2050D001843k01298j43751p5505k26846l33271K42184j02544N3756k12513Q926
$$ 4001843 3800545 3656794 3581289 3354443 3021172 3263356 3160812 3214568 3002055 3010981
2040C010981j9116k65201J1530l3119N6028Q5088J04179j65757j88917l3681J20300
$$ 3010981 2991865 2726664 2738194 2705075 2761103 2846191 2950370 2784613 2595696 2562015 2682315
2029B682315N2317j88667j92751o3730J30086K62800k19783p188J6898j66867
$$ 2682315 2734632 2545965 2353214 2289484 2419570 2682370 2462587 2455399 2472297 2305430
2019B305430N5082J47742j9725p2926k07771j26235j6163R4332k77795j26426
$$ 2305430 2360512 2508254 2488529 2415603 2207832 2081597 2065434 2159766 1881971 1755545
2009A755545K14873L4536j95334j35242L955R5668J5440o2045j52611J04519k9913
$$ 1755545 1970418 2004954 1809620 1674378 1678333 1774001 1789441 1727396 1574785 1679304 1649391
1998A649391J21668L6946n8125j29663j71261P302J58246j15074q8189L6683p8072
$$ 1649391 1771059 1808005 1749880 1620217 1448956 1456258 1614504 1499430 1411241 1447924 1369852
1987A369852j4196l8155P8685j65332J59187J59879j50034m5198m2145Q7205J92209
$$ 1369852 1355656 1317501 1396186 1230854 1390041 1549920 1399886 1354688 1312543 1399748 1591957
1976A591957j46900j01715O3681r9871k1034J26338o9317j34119N2348N9792o80
$$ 1591957 1445057 1343342 1407023 1307152 1286118 1412456 1343139 1209020 1261368 1321160 1320480
1965A320480K2162j11939j44509j8786Q2767K27406p1811j17902P0621j3580o6467
$$ 1320480 1342642 1230703 1086194 1067408 1150175 1377581 1305770 1187868 1258489 1244909 1178442
1954A178442M6918J23338m0459r298r8455Q7325q1693L804N8373m3938j28896
$$ 1178442 1225360 1348698 1308239 1298941 1200486 1287811 1206118 1209922 1268295 1224357 1095461
1943A095461K17107Q5495l10045o8602P9267J14866j07371k97230J93033J58860
$$ 1095461 1312568 1398063 1088018 1019416 1098683 1213549 1106178 808948 1001981 1160841
1933A160841r2470o0045O1093L724M1777j69237Q300j15844R4689p9790K2930
$$ 1160841 1068371 1008326 1069419 1073143 1114920 945683 953983 838139 932828 853038 875968
1922H75968J50470o0361P064K00118j54249j19146J31406M0853j77944J01055
$$ 875968 1026438 966077 973141 1173259 1019010 899864 1031270 1072123 894179 995234
1912I95234J5094k27058K01015l5599j64717m4310J85112j69182R0778K44591
$$ 995234 1010328 783270 984285 948686 783969 739659 924771 755589 846367 1090958
1902A090958j77753J13293O5737K8448q5534J08385k23766r2356q7214o4358K16504
$$ 1090958 913205 1026498 1092235 1120683 1035149 1143534 919768 827412 740198 675840 892344
1891H92344M7938K2575k22742q1045Q9510R6493j42393K29736j66615l2230M7687
$$ 892344 940282 962857 740115 659070 748580 845073 702680 932416 765801 733571 781258
1880G81258L013R7686Q4779R6417r5215J32632J04750j37411j73784k56366R2559
$$ 781258 784271 881957 966736 1063153 967938 1100570 1205320 1067909 894125 637759 730318
1869G30318j2470j51789J3798M4861K49872n1551p946Q1953j8857Q987k43988
$$ 730318 717848 566059 579857 624718 874590 823039 815093 897046 878189 887176 643188
1858F43188N4503M0356P0704L2972j05567r6235L33766J09925o219j16721L7160
$$ 643188 697691 738047 808751 841723 736156 639921 973687 1083612 1077393 960672 997832
1847I97832P1473k0032j30291j18609L8539L9273P5932p6478N8194m3689o9625
$$ 997832 1069305 1049273 918982 800373 838912 878185 954117 877639 935833 892144 822519
1836H22519Q1368R771n4559K00258K10m30942R1401l8624m1329L23635O9076J53358
$$ 822519 903887 913658 859099 1059357 1059567 628625 720026 681402 640073 963708 1032784 1186142
1824A186142j30783Q0108n4914l3076j07943q2609j08699J09308K54134k48240
$$ 1186142 1055359 1135467 1080553 1047477 939534 856925 748226 857534 1111668 863428
1814H63428p9865l7986J10132p141K2132j81149j48238K3232Q3007r2669o4762
$$ 863428 783563 745577 855709 848568 870700 689551 541313 564545 647552 554883 490121
1803D90121j3515J54183J81102J80304m8159l28820j17655J42874K68857L5235
$$ 490121 476606 630789 811891 992195 944036 615216 497561 640435 909292 944527
1793I44527j69146j71375J57519o0659k17985Q1002J21364m4727j20112J0359
$$ 944527 775381 604006 761525 700866 482881 563883 685247 640520 520408 530767
1783E30767J41901P2299j05964p3593J81463o4942m2910N3582J02994j47434R2708
$$ 530767 672668 744967 639003 565410 746873 681931 639021 692603 795597 648163 740871
1772G40871l5118k09072L7255M6726K08784q5838q2919n1335K3955J2430r7463
$$ 740871 705753 496681 533936 580662 789446 703608 620689 569354 593309 605739 508276
1761E08276L2752N9344j6152Q6477J57335j51713o2411K5328j88J59694J1276
$$ 508276 541028 600372 584220 670697 828032 676319 613908 639236 639048 798742 810018
1750H10018k41545j33498J21975K6646P2373n2705j6135P0408n5771L6571j80271
$$ 810018 568473 434975 556950 583596 655969 603264 587129 657537 601766 638337 458066
1739D58066O2952N2029L1505M8864j3125K8964j47710k7543K17049j65582J7881
$$ 458066 521018 573047 604552 653416 640291 669255 521545 494002 711051 545469 563350
1728E63350j33078j57043K74987P805K2463J04744j03009j942o0502P9849J68701
$$ 563350 430272 273229 548216 556021 578484 683228 580219 578277 517775 597624 766325
1717G66325k1679j33964L7624k2590k17944Q7967K46341K3913p7752n1354j88151
$$ 766325 744646 610682 648306 625716 407772 495739 742080 765993 688241 636887 448736
1706D48736M3881j1649N9931J21376k1374M0290k655p7170j06533k3780K3465
$$ 448736 492617 480968 540899 662275 640901 681191 678536 601366 494833 471053 494518
1695D94518J3850K33668j39522j64719L8318N3480L7653J92706j47422j09076
$$ 494518 508368 742036 602514 437795 476113 529593 567246 759952 612530 503454
1685E03454O0652M7223o4958O576j53012K8056K31191j5537M1557j05496J17440
$$ 503454 564106 611329 546371 552947 399935 427991 659182 643645 685202 579706 697146
1674F97146o9385j20480j89455J820J61441L6302J07529O7524k01483J6328o1273
$$ 697146 627761 507281 317826 319646 481087 517389 624918 692442 490959 507287 446014
1663D46014o3041Q803J49298K350J6882m9774J14236k60448q3550J50576L0089
$$ 446014 382973 391776 541074 543424 560306 510532 624768 364320 280770 431346 461435
1652D61435P3662l3522k8404O7159J45213q9533J8568o4273k0037j63049J77456
$$ 461435 535097 501575 473171 540330 685543 596010 614578 550305 530268 367219 544675
1641E44675M9700j51347N9857O6560m4711k8500M2361J02585j05357r1261n9168
$$ 544675 594375 443028 502885 569445 524734 496234 538595 641180 535823 444562 385394
1630C85394Q7372J0887j4940j20600m3232j26646k0096K12432j852K6139J47786
$$ 385394 472766 483653 468713 348113 304881 178235 158139 370571 368719 394858 542644
1619E42644J09179l16368k0248K6099J44135K10652N8735l3695j96696j10541
$$ 542644 651823 335455 315207 341306 485441 696093 754828 721133 524437 413896
1609D13896N3542k1076K0295P8663m0573M9945M2432k7137k60895M5256N1395
$$ 413896 467438 446362 466657 545320 504747 554692 597124 569987 309092 354348 405743
1598D05743J44606j46943O4368P1536k18525P4443K02766Q2047j38476k9127J733
$$ 405743 550349 403406 467774 539310 320785 395228 597994 680041 541565 512438 514171
1587E14171k5403q1541n9708J45889q8680J34796m1253J817O5614l9345N3691
$$ 514171 488768 407227 347519 493408 404728 539524 498271 500088 565702 526357 580048
1576E80048k0355l7934J93409p8989j16178P2189k52441R4126M5697K29305j10587
$$ 580048 559693 521759 715168 636179 520001 592190 339749 433875 479572 708877 598290
1565E98290j71898O9634R5269k60980q6418J52488J72807k5548j13306P743J2105
$$ 598290 426392 496026 591295 330315 243897 396385 569192 543644 430338 438081 450186
1554D50186j35830R5812k0352l5682Q9356j53776J32474R9033K18293J06897l56971
$$ 450186 314356 410168 389816 354134 443490 289714 422188 521221 739514 846411 489440
1543D89440n5443j51557P5796P7871k0900J30124k10397R199N4524J36176j10501
$$ 489440 433997 282440 358236 436107 415207 545331 334934 344133 398657 534833 424332
1532D24332o3079J2882P2166n1720m2585L19134q7097k12070O5459K2513O1873
$$ 424332 361253 374135 446301 394581 351996 671130 584033 371963 437422 459935 521808
1521E21808K3122L6835r9728j29370j00947L4067J95545q2228j32877O4094J87481
$$ 521808 544930 581765 482037 352667 251720 285787 481332 399104 266227 330321 517802
1510E17802p9540p9116k23628p4542K15445J9491P5338M264J28457j40052n2502
$$ 517802 438262 359146 135518 60976 276421 295912 371250 375514 503971 363919 311417
1499C11417J94731j78491l0626Q6537j25606o1527J92332L1648r7744L0361j10873
$$ 311417 506148 327657 297031 383568 257962 196435 388767 420415 322671 353032 242159
1488B42159P2943M0766j94860J63144n3860J9432j07638R7560N9513j47996l8348
$$ 242159 315102 355868 161008 324152 270292 289724 182086 279646 339159 191163 152815
1477A52815n3139J71702R017K6839J15398m4288j35992J14800M8579k1897j44667
$$ 152815 99676 271378 280395 307234 422632 378344 242352 357152 405731 383834 239167
1466B39167J19468J30014J04796j77536k09999P2353q2442O7992O5395r9583j9424
$$ 239167 358635 488649 593445 415909 205910 278263 195821 263813 329208 229625 210201
1455B10201J08040M8948l1194R5642K2590m2853j30861j18943J98994J89010k00625
$$ 210201 318241 367189 335995 431637 454227 411374 280513 161570 360564 549574 348949
1444C48949o8179O7733K0727m6651j442j7216j21995J98437L07160o3756l0822
$$ 348949 280770 348503 369230 322579 321137 303921 181926 380363 687523 623767 592945
1433E92945L1265k88606K83668l7470j92105j23079J00505M3583j6224l3630Q1443
$$ 592945 624210 335604 619272 581802 389697 266618 367123 410706 394482 360852 442295
1422D42295J08698l6551q8193Q0520m8093J64225r014j18581j73945j36092J38192
$$ 442295 550993 514442 426249 506769 458676 622901 613887 495306 321361 185269 323461
1411C23461j41264J31131j18012j38060J422Q2894L5951P3819J01952K5864M2693
$$ 323461 182197 313328 195316 57256 58678 141572 177523 251342 353294 379158 421851
1400D21851L6898k43343J8605J07394N3567j04086r4502J44619p3925K6080L1704
$$ 421851 458749 215406 234011 341405 394972 290886 196384 341003 267078 293158 324862
1389C24862k0295k2343k5758J0711O4406n4266J8975J0976j92096m1180J8461
$$ 324862 304567 282224 256466 267177 331583 277317 296292 307268 115172 73992 92453
1378I2453J50408K67505K2957k71762J19683j65463k919O7708J64093R8547J3290
$$ 92453 242861 510366 533323 261561 381244 215781 212862 280570 444663 543210 556500
1367E56500R9662j98813k13117m0414l7490q6090L4919J14865J30674m8390J06047
$$ 556500 656162 457349 244232 203818 166328 80238 115157 230022 360696 312306 418353
1356D18353J7679j86472J34849m2684l9371L5980N4697K618p4721K7454j57277
$$ 418353 436032 249560 384409 341725 302354 338334 393031 395649 320928 348382 191105
1345A91105K3840O8211j15381P4885k08453N3877K74871N3492J26680j97479O0190
$$ 191105 214945 283156 167775 242660 34207 88084 362955 416447 543127 345648 405838
1334D05838j8271p6023j4539m7648j17471L4926Q7282J8911M5890N5137j31461
$$ 405838 387567 311544 297005 249357 131886 166812 254094 273005 318895 374032 242571
1323B42571j21206j61859P7443R107J69208k1035K334J70391m6379k242o7039
$$ 242571 121365 -40494 36949 46056 215264 194229 196563 366954 320575 318333 251294
1312B51294r9712q696j2788J9574J53937q3630n8831r6785J35708M0694K2218
$$ 251294 151582 142886 130098 149672 303609 219979 161148 64363 200071 240765 262983
1301B62983L0356L9479j65283j04345M3791j20974K9209M1443p544N6714o1294
$$ 262983 293339 332818 167535 63190 106981 -13993 15216 56659 49115 105829 44535
1290D4535K92131k104k0067L6324n9876j80061j49817j9018j17423P4482J76190
$$ 44535 336666 334562 314495 350819 290943 110882 -38935 -57953 -175376 -100894 75296
1279G5296Q5952J05342R1878q425j84557J6631J31884j6078J3165j28138l2936
$$ 75296 161248 266590 358468 350043 165486 182117 314001 297923 311088 182950 150014
1268A50014O0807r3830J08436J05135n3887j66246j18761J07961N341k3757k70114
$$ 150014 210821 116991 225427 330562 276675 110429 -8332 99629 104970 81213 -188901
1257a88901K14563J02608o9524J53770j25658K024P6505O2121R7815p8627m3253
$$ -188901 25662 128270 58746 212516 86858 88882 165387 227508 325323 246696 203443
1246B03443j16537J55927M0029N8236k05901m8337J44778j3212p025l5408j24925
$$ 203443 86906 242833 282862 341098 135197 86860 231638 218426 211401 175993 51068
1235E1068j21799J05516N9527J95427o7325k5034L5695M9178r0886J04538J69085
$$ 51068 -70731 34785 94312 289739 222414 197380 233075 282253 191367 295905 464990
1224D64990K5977K3343j14208j09235K9004K53264j46388J20314k05849o0601
$$ 464990 490967 514310 400102 290867 319871 573135 426747 547061 341212 280611
1214B80611m1897q7244J05965q5551J45835k6620m2496p7827q0649P9466J24254
$$ 280611 238714 151470 257435 171884 317719 291099 248603 170776 90127 169593 293847
1203B93847q4816p4303k7295j62890J78253m6770j44651J038J27810K63j17918
$$ 293847 209031 134728 107433 -55457 122796 76026 -68625 -67587 60223 60486 -57432
1192e7432p0357L11233m2135k8128N5643j88974R3219J15190k01007P7216J40820
$$ -57432 -127789 183444 141309 113181 168824 -20150 73069 188259 -12748 64468 205288
1181B05288o3701J9382m8008j04923K5942o8471l9658K20959l1780q7851j53125
$$ 205288 141587 160969 112961 8038 33980 -34491 -74149 146810 115030 27179 -125946
1170a25946K22407J10328N9163K32777j17295k50298r3009l4002j0947P7986J32756
$$ -125946 96461 206789 265952 498729 381434 131136 38127 4125 -6822 71164 203920
1159B03920l3829k40826n555L12385m1797j31419j76058J71351J5575P4422J04459
$$ 203920 170091 -70735 -76290 236095 194298 62879 -113179 58172 73747 148169 252628
1148B52628l074N9269n6030q477K8109m7966R4541j84015J35862n6801m7075j241
$$ 252628 249554 308823 252793 244316 272425 224459 319000 134985 270847 214046 166971 165730
1136A65730m7013Q6334k8941n0634j28441N3675j9307k15116j7056o5130L33256
$$ 165730 118717 205051 176110 125476 -2965 50710 31403 -183713 -200769 -265899 67357
1125F7357J5886q3278p1949J59002l9862J16620J59160p1294J13616p8270r8475
$$ 67357 83243 -35 -71984 87018 47156 163776 322936 251642 365258 286988 188513
1114A88513J3905m5682J2691j1737j12069K9602K0896j44702R9225P8268j01809
$$ 188513 202418 156736 169427 157690 45621 75223 96119 -48583 50642 128910 27101
1103B7101M1887M6808L0570j4664J81735n4094q1372j0810P2704n2679o1527J51090
$$ 27101 68988 115796 146366 131702 313437 259343 177971 167161 239865 187186 125659 276749
1091B76749p135k73323J16785J45964Q7014q4944k50622p9086K40218J38764L5207
$$ 276749 269614 -3709 113076 259040 346054 261110 10488 -68598 171620 310384 345591
1080C45591j50167j32424l2862K03581q5971O9377q0356J93965J28546k17790
$$ 345591 195424 63000 30138 233719 147748 217125 136769 330734 459280 241490
1070B41490j53901Q686J91206o0400j37954n0978l1289K78534l8071J9378O8556
$$ 241490 87589 96275 287481 227081 89127 38149 6860 285394 247323 266701 335257
1059C35257j29912m53j64705m7520O8228Q4807j79811j04917K35071j1053J01726
$$ 335257 205345 204892 40187 -7333 60895 145702 -34109 -139026 96045 84992 186718
1048A86718O8627r2851M2576o2965j92851j6034p1849K7796P7002J83564J03882
$$ 186718 255345 162494 205070 142105 -50746 -66780 -138629 -110833 -33831 149733 253615
1037B53615p3952j01391r200l5757J90321k41066O5848m1081m9355J24412n1022
$$ 253615 179663 78272 69072 33315 223636 -17430 48418 7337 -42018 82394 31372
1026C1372J50612j52511J3656j658r6600N274P8247K07409n3124j32051k34590
$$ 31372 181984 29473 43129 41471 -55129 -49855 28392 235801 182677 50626 -183964
1015a83964J08283J79996l02694J25301J52204k4745l94j1308k10877p4982R996
$$ -183964 -75681 104315 -198379 -73078 79126 54381 53987 42679 -168198 -243180 -233184
1004b33184J70708J97324o0066m1449P1964j47962K02396j18665p0757Q0421j18778
$$ -233184 -62476 134848 74782 33333 105297 -42665 159731 41066 -29691 50730 -68048
993f8048m0315l47K15556N3123l0666l9177r3261o3405L0583n879k56135K20247
$$ -68048 -108363 -108710 106846 159969 129303 90126 -3135 -66540 -35957 -41836 -297971 -77724
981g7724J6437N2911j34130P0365Q6450J63995R0966q3565k26008k3349N398j2495
$$ -77724 -61287 -8376 -142506 -72141 14309 178304 269270 185705 -40303 -63652 -58254 -70749
969g0749O7786O3014k01116J12485O6466P3938R350j29115o6106J85457K59726
$$ -70749 -2963 60051 -141065 -28580 37886 111824 121174 -7941 -74047 111410 371136
958C71136l3890k24627p4178N2684l6693p9812j7224n217R4074K20497m2627j33799
$$ 371136 337246 112619 38441 91125 54432 -25380 -42604 -47821 46253 266750 224123 90324
946I0324m5009l9019j80813P1782M3761J80475j7777J7819j09406j46951p0056
$$ 90324 45315 6296 -174517 -102735 -58974 121501 103724 121543 12137 -134814 -204870
935b04870J82255m7117N457J97630j92396l1888j522q8755J29350O4914k4680
$$ -204870 -22615 -69732 -64275 133355 -59041 -90929 -92451 -181206 -51856 13058 -11622
924a1622J26176K3755k05297N2620J58216J9366j73372k41477P0468M2470n1858
$$ -11622 114554 138309 -66988 -14368 143848 163214 -10158 -251635 -181167 -138697 -190555
913a90555J2347l745K05198K8100J43484J33903p7145j51242p3293O2414o5491
$$ -190555 -178208 -181953 23245 51345 194829 328732 251587 100345 27052 89466 23975
902B3975M7820J96239k50385J1169l4434P0027k66047k1203J44583R4086J9739
$$ 23975 71795 268034 17649 28818 -5616 64411 -201636 -222839 -78256 15830 35569
891C5569l5749K56683l5415k36623n8471q8479O7368J20471j9195J52947O0715
$$ 35569 -180 256503 221088 -15535 -74006 -162485 -95117 25354 6159 159106 219821
880B19821k20334j00911J30553P0597j68752n3275R5943n8749k7796K5783L8597
$$ 219821 -513 -101424 29129 99726 -69026 -122301 -26358 -85107 -112903 -87120 -48523
869d8523L1751N5555q0453n4661j10428K8206R3074R8054R3488P183O8336J3948
$$ -48523 -16772 38783 -41670 -96331 -206759 -178553 -85479 12575 106063 113246 181582 195530
857A95530n9182j56156l04223J78960Q8739M9861J59511l9245N105j39820k06636
$$ 195530 136348 -19808 -324031 -145071 -56332 -6471 153040 113795 118900 -20920 -227556
846b27556R5844K2765Q483J91297k19397j87134K5313J83649K03646O0313J03232
$$ -227556 -131712 -108947 -100464 90833 -128564 -315698 -290385 -106736 96910 157223 260455
835B60455R120j36453m0644o1958J09772j57511j57285k2303k4406o9420R3388
$$ 260455 269575 133122 92478 30520 140292 -17219 -174504 -196807 -221213 -290633 -197245
824a97245K83111P137j42329O6927J54896M2627K6261r0521k19931j10453J26695
$$ -197245 85866 93003 -49326 17601 172497 215124 241385 150864 -69067 -179520 -52825
813e2825J4783J6155j17320J28291j14598Q7804K00971J2488k01570J44886K4342
$$ -52825 -38042 -21887 -139207 -10916 -125514 -37710 163261 175749 -25821 119065 143407
802A43407l9856j16713k6924J19308Q7487R7455j29310j28807P5424j08715M1012
$$ 143407 103551 -13162 -40086 79222 166709 264164 134854 6047 81471 -27244 13768
791A3768P6128j03853q1632j9441J22853k6878J444O3419K0629j09230o715O9217
$$ 13768 89896 -13957 -95589 -115030 7823 -19055 -17611 45808 66437 -42793 -49508 19709
779A9709N8334R6112l62315L1621J50132k05592L4460J03264J66727k91101l9581
$$ 19709 78043 174155 -188160 -156539 -6407 -211999 -177539 -74275 92452 -198649 -238230
768b38230J66242m3184R4449J0637o8925J1684J75075r1085j16422j00310J02200
$$ -238230 -71988 -115172 -20723 -10086 -79011 -67327 107748 16663 -99759 -200069 -97869
757i7869J49567p0077j54746J13731J02728o6795n4201q8819J08062K37060o6372
$$ -97869 51698 -18379 -173125 -59394 43334 -23461 -77662 -166481 -58419 178641 112269
746A12269j50624j19029j23649N411K32011J17906k24430P4820M9501l8499M2455
$$ 112269 -38355 -157384 -281033 -275622 -43611 74295 -150135 -75315 -25814 -64313 -21858
735b1858P7660j27159J05154j63045j52034L2484K10987J03065j6600k33513K1128
$$ -21858 55802 -71357 33797 -129248 -281282 -248798 -37811 65254 48654 -184859 -163731
724a63731J23423K9420L7706m8436j0199r9138r6865Q7861j19939q712J03482
$$ -163731 -40308 -10888 26818 -21618 -31817 -130955 -227820 -139959 -259898 -268610 -165128
713a65128J75803k9025J18875j62627R0349J06738j22326J46630j02173j39915
$$ -165128 10675 -18350 100525 -62102 28247 134985 12659 159289 57116 -82799
703h2799N083p1140m4535J8299r315j19721J15331R0274j24219J58839p7129K5882
$$ -82799 -77716 -148856 -193391 -175092 -184407 -304128 -188797 -98523 -222742 -63903 -141032 -115150
691a15150K8151m9483l6929j37304K59272L4017J9820j07275l9114k9794j58903
$$ -115150 -86999 -136482 -173411 -310715 -51443 -17426 2394 -104881 -143995 -173789 -332692
680c32692M8514o078J57828J51094n7922M1910n6365q4905R6029r2143k7261J6279
$$ -332692 -284178 -290256 -132428 18666 -39256 2654 -53711 -138616 -42587 -134730 -161991 -145712
668a45712n690k06813K04067K6647N6714L7704J0538j27092K0485P6904Q7889
$$ -145712 -151402 -358215 -154148 -127501 -70787 -33083 -22545 -149637 -129152 -52248 35641
657C5641m073N0715k6918j33861q0830q1421N2189Q9509M8116r5983j99745J01826
$$ 35641 31568 82283 55365 -78496 -159326 -240747 -188558 -99049 -50933 -146916 -346661 -244835
645b44835J12563j529R875j13118Q534J25008j02798J17793J40573j9627l38712
$$ -244835 -132272 -133801 -123926 -237044 -228510 -103502 -206300 -88507 52066 32439 -306273
634c06273L6720K1438J87347m3286l7294L2304k12401J23136O148J24200P6055
$$ -306273 -269553 -248115 -60768 -104054 -141348 -109044 -321445 -198309 -192161 -67961 8094
623H094o7179r9439l3686N0036P4646k7354n117o9386j22550J5883J95021J00881
$$ 8094 -59085 -158524 -192210 -142174 -67528 -94882 -99999 -169385 -291935 -276052 -81031 19850
611A9850j18860j32450n9509P295K55197J87671q6040r8019n9683k52777K58444
$$ 19850 -99010 -231460 -290969 -283674 -28477 159194 73154 -24865 -84548 -337325 -78881
600g8881J12608k52266L583L9076o3428L7107N7849k20568J27303Q4888Q0320
$$ -78881 33727 -218539 -214956 -175880 -239308 -202201 -144352 -364920 -237617 -152729 -72409
589g2409J61541j46613R5665j61932p3803K32952J34652k22612j00773q6684j73192
$$ -72409 89132 -57481 38184 -123748 -197551 35401 170053 -52559 -153332 -240016 -413208
578d13208M9538J18106J16260J06650m5662R1962j32774j48590J20216k8674l2180
$$ -413208 -363670 -245564 -129304 -22654 -68316 23646 -109128 -257718 -137502 -166176 -198356
567a98356J23266j50022K6804n5654K37275k8624j69648o3152j1475J55157n6773
$$ -198356 -75090 -225112 -198308 -253962 -16687 -45311 -214959 -278111 -289586 -134429 -191202
556a91202r7933P352Q271J17394K31689k51367k8020J25614N1391j21753o7625
$$ -191202 -289135 -281783 -273512 -156118 75571 -175796 -203816 -78202 -26811 -148564 -216189
545b16189m0397m8061Q7673o9379k5976K28494J00863j02335O2137N0386q9588
$$ -216189 -256586 -304647 -216974 -286353 -312329 -83835 17028 -85307 -23170 27216 -62372
534f2372l4502j41953J33369K35682o5750q4064n2144j12840Q6290j08330N1903
$$ -62372 -96874 -238827 -105458 130224 64474 -19590 -71734 -184574 -98284 -206614 -154711
523a54711j13638Q5212m2107J1294n6690J71958k224k18208R7080Q2005J13048
$$ -154711 -268349 -183137 -225244 -213950 -270640 -98682 -100906 -319114 -222034 -140029 -26981
512b6981j21265Q6042J719r4683N7226J07683j4169k4883j54553p1153l3737N5735
$$ -26981 -148246 -62204 -60485 -155168 -97942 9741 -4428 -29311 -183864 -255017 -288754 -233019
500b33019P1509o8931N3118j07195k3804O04P0519J49905J05053q6691k11863
$$ -233019 -161510 -230441 -177323 -284518 -308322 -307718 -237199 -87294 17759 -68932 -280795
$$ [...]
##END NTUPLES=NMR SPECTRUM
##END=
