##TITLE=1H_CA-9052
 CDCl3
 8 sc, 
 22.08.2022
##JCAMPDX= 6.0         $$ Bruker NMR JCAMP-DX V2.0
##DATA TYPE= NMR SPECTRUM
##DATA CLASS= NTUPLES
##ORIGIN= UXNMR, Bruker Analytische Messtechnik GmbH
##OWNER= root
$$ XWIN-NMR		Version 3.5
$$ Mon Aug 22 09:54:17 2022 Russian Standard Time (UT+4h)  she@DPX200
##.OBSERVE FREQUENCY= 200.1313499994
##.OBSERVE NUCLEUS= ^1H
##.ACQUISITION MODE= SIMULTANEOUS
##.ACQUISITION SCHEME= undefined
##.AVERAGES= 8
##.DIGITISER RES= 18
##SPECTROMETER/DATA SYSTEM= spect
##.PULSE SEQUENCE= zg30
##.SOLVENT NAME= CDCl3
##.SHIFT REFERENCE= (INTERNAL, CDCl3, 0, 15.7524)
##AUDIT TRAIL= $$ (NUMBER, WHEN, WHO, WHERE, WHAT)
$$ ##TITLE= Audit trail, XWIN-NMR		Version 3.5
$$ ##JCAMPDX= 5.01
$$ ##ORIGIN= Bruker BioSpin GmbH
$$ ##OWNER= she
$$ F:/spectra/data/she/nmr/H-F/1/pdata/1/auditp.txt
$$ ##AUDIT TRAIL=  $$ (NUMBER, WHEN, WHO, WHERE, WHAT)
(   1,<2022-08-22 09:52:20.00 +0400>,<she>,<DPX200>,
      <created by zg, POWCHK disabled, PULCHK disabled
       configuration hash MD5:
       00 E9 B6 7A A2 85 ED C7 34 08 36 98 17 FE 4E 26
       data hash MD5: 16K
       37 3D 96 96 2D 8F 54 4E 75 86 5F D2 C6 B8 4F 18>)
(   2,<2022-08-22 09:52:28.23 +0400>,<she>,<DPX200>,
      <Start of raw data processing
       efp BC_mod = 2 LB = 0.24 FT_mod = 6 PKNL = 1 PHC0 = -18041.84 PHC1 = 12.20068 SI = 16K 
       data hash MD5: 16K
       54 38 41 1F 93 B4 7E 77 11 AD C7 36 35 52 DC 35>)
(   3,<2022-08-22 09:52:49.56 +0400>,<she>,<DPX200>,
      <pk PHC0 = 0.8128697 PHC1 = 5.2 
       data hash MD5: 16K
       EA 97 1C 00 7D 54 1E 8D C6 BB 0D 7A 14 DB F3 CD>)
(   4,<2022-08-22 09:52:53.03 +0400>,<she>,<DPX200>,
      <abs ABSG = 5 
       data hash MD5: 16K
       BF 01 AE 40 45 F0 10 ED 02 82 F8 53 65 4D 60 D3>)
$$ ##END=
$$ 
$$ hash MD5
$$ A6 82 88 03 19 4F 88 F0 46 41 B1 D6 6C D0 42 7C
##$RELAX= 
##$RELAX= 
##$RELAX= 
##$RELAX= 
##$RELAX= 
##$RELAX= 
$$ Bruker specific parameters
$$ --------------------------
##$DU= <F:/spectra>
##$EXPNO= 1
##$NAME= <H-F>
##$PROCNO= 1
##$TYPE= <nmr>
##$USER= <she>
##$AMP= (0..31)
100 100 100 100 100 100 100 100 100 100 100 100 100 100 100 100 100 100 
100 100 100 100 100 100 100 100 100 100 100 100 100 100 
##$AQSEQ= 0
##$AQ_mod= 1
##$AUNM= <au_zg>
##$AUTOPOS= <>
##$BF1= 200.13
##$BF2= 200.13
##$BF3= 200.13
##$BF4= 200.13
##$BF5= 200.13
##$BF6= 200.13
##$BF7= 200.13
##$BF8= 200.13
##$BYTORDA= 1
##$CFDGTYP= 0
##$CFRGTYP= 5
##$CHEMSTR= <none>
##$CNST= (0..31)
1 1 145 1 1 1 1 1 1 1 1 1 1 1 1 1 1 1 1 1 1 1 1 1 1 1 1 1 1 1 1 1 
##$CPDPRG= <>
##$CPDPRG1= <>
##$CPDPRG2= <>
##$CPDPRG3= <>
##$CPDPRG4= <mlev>
##$CPDPRG5= <mlev>
##$CPDPRG6= <mlev>
##$CPDPRG7= <mlev>
##$CPDPRG8= <mlev>
##$CPDPRGB= <>
##$CPDPRGT= <>
##$D= (0..31)
0 1.2 0 0 0 0 0 0 0 0.06 0 0.03 0 0 0 0 0.0002 0 0 0 0 0 0 0 0 0 0 0 0 
0 0 0 
##$DATE= 1661147539
##$DBL= (0..7)
120 120 120 120 120 120 120 120 
##$DBP= (0..7)
150 150 150 150 150 150 150 150 
##$DBP07= 0
##$DBPNAM0= <>
##$DBPNAM1= <>
##$DBPNAM2= <>
##$DBPNAM3= <>
##$DBPNAM4= <>
$$ [...]
##$SUBNAM2= <"">
##$SUBNAM3= <"">
##$SUBNAM4= <"">
##$SUBNAM5= <"">
##$SUBNAM6= <"">
##$SUBNAM7= <"">
##$SUBNAM8= <"">
##$SUBNAM9= <"">
##$SW= 18.0517283424941
##$SWIBOX= (0..15)
0 0 2 0 0 0 0 0 0 0 0 0 0 0 0 0 
##$SW_h= 3612.71676300578
##$TD= 16384
##$TD0= 1
##$TE= 0
##$TE2= 300
##$TE3= 300
##$TEG= 300
##$TL= (0..7)
0 120 120 120 120 120 120 120 
##$TP= (0..7)
150 150 150 150 150 150 150 150 
##$TP07= 0
##$TPNAME0= <>
##$TPNAME1= <>
##$TPNAME2= <>
##$TPNAME3= <>
##$TPNAME4= <>
##$TPNAME5= <>
##$TPNAME6= <>
##$TPNAME7= <>
##$TPOAL= (0..7)
0.5 0.5 0.5 0.5 0.5 0.5 0.5 0.5 
##$TPOFFS= (0..7)
0 0 0 0 0 0 0 0 
##$TUNHIN= 0
##$TUNHOUT= 0
##$TUNXOUT= 0
##$USERA1= <user>
##$USERA2= <user>
##$USERA3= <user>
##$USERA4= <user>
##$USERA5= <user>
##$V9= 5
##$VALIST= <valist>
##$VCLIST= <CCCCCCCCCCCCCCC>
##$VD= 0
##$VDLIST= <DDDDDDDDDDDDDDD>
##$VPLIST= <PPPPPPPPPPPPPPP>
##$VTLIST= <TTTTTTTTTTTTTTT>
##$WBST= 1024
##$WBSW= 4
##$XGAIN= (0..3)
0 0 0 0 
##$XL= 0
##$YL= 0
##$YMAX_a= 174134
##$YMIN_a= -313300
##$ZGOPTNS= <>
##$ZL1= 120
##$ZL2= 120
##$ZL3= 120
##$ZL4= 120
##$ABSF1= 15.73257
##$ABSF2= -2.31928
##$ABSG= 5
##$ABSL= 3
##$ALPHA= 0
##$AQORDER= 0
##$ASSFAC= 0
##$ASSFACI= 0
##$ASSFACX= 0
##$ASSWID= 0
##$AUNMP= <proc_1d>
##$AZFE= 0.1
##$AZFW= 0.1
##$BCFW= 0
##$BC_mod= 2
##$BYTORDP= 0
##$COROFFS= 0
##$CY= -3
##$DATMOD= 1
##$DC= 0
##$DFILT= <>
##$DTYPP= 0
##$F1P= 0
##$F2P= 0
##$FCOR= 1
##$FTSIZE= 16384
##$FT_mod= 6
##$GAMMA= 0
##$GB= 0
##$INTBC= 1
##$INTSCL= 0
##$ISEN= 128
##$LB= 0.24
##$LEV0= 0
##$LPBIN= 0
##$MAXI= 10000
##$MC2= 0
##$MEAN= 0
##$ME_mod= 0
##$MI= 1.114404
##$NCOEF= 0
##$NC_proc= -7
##$NLEV= 6
##$NOISF1= 3.799351
##$NOISF2= 2.8
##$NSP= 0
##$NTH_PI= 0
##$NZP= 0
##$OFFSET= 15.7524
##$PC= 1
##$PHC0= -18041.03
##$PHC1= 17.40068
##$PH_mod= 1
##$PKNL= yes
##$PPARMOD= 0
##$PSCAL= 0
##$PSIGN= 0
##$REVERSE= no
##$SF= 200.130003830298
##$SI= 16384
##$SIGF1= 3
##$SIGF2= 2
##$SINO= 5.538805
##$SIOLD= 16384
##$SREGLST= <1H.CDCl3>
##$SSB= 0
##$STSI= 16384
##$STSR= 0
##$SW_p= 3612.71676300578
##$SYMM= 0
##$S_DEV= 0
##$TDeff= 16384
##$TDoff= 0
##$TI= <>
##$TILT= no
##$TM1= 0
##$TM2= 0
##$TOPLEV= 0
##$USERP1= <user>
##$USERP2= <user>
##$USERP3= <user>
##$USERP4= <user>
##$USERP5= <user>
##$WDW= 1
##$XDIM= 16384
##$YMAX_p= 358609308
##$YMIN_p= -501336
$$ End of Bruker specific parameters
$$ ---------------------------------
##NTUPLES= NMR SPECTRUM
##VAR_NAME=  FREQUENCY,     SPECTRUM/REAL,   SPECTRUM/IMAG
##SYMBOL=    X,             R,               I
##VAR_TYPE=  INDEPENDENT,   DEPENDENT,       DEPENDENT
##VAR_FORM=  AFFN,          ASDF,            ASDF
##VAR_DIM=   16384,         16384,           16384
##UNITS=     HZ,            ARBITRARY UNITS, ARBITRARY UNITS
##FACTOR=    0.220516191357247, 1,           1
##FIRST=     3152.52795203904, 0,            0
##LAST=      -460.188810966741, 0,           0
##MIN=       -460.188810966741, -501336,     0
##MAX=       3152.52795203904, 358609308,    0
$$ Real data points
##PAGE= N=1
##DATA TABLE= (X++(R..R)), XYDATA
$$ [...]
$$ plain form
6260 3985366 4205029 4089664 4094722 4036224 4205470 4472397 4496893 4695247 4641725 4691731 4782369
6249 4782369 4711322 4701007 4774395 4727308 4539479 4489126 4261708 4259436 4343637 4377018 4338661
6238 4338661 4274619 4194171 4252284 4212601 4339017 4461941 4577928 4564298 4699804 4900501
6228 4900501 5009057 4989188 5046488 5264266 5151987 5116476 4961133 4933741 4982498 4708284
6218 4708284 4633369 4597219 4679147 4634477 4477281 4570739 4424810 4567436 4701198 4700537 4713586
6207 4713586 4964110 4900272 4918966 5147221 5323276 5089213 5058369 5336443 5471067 5509148
6197 5509148 5514642 5634546 5712471 5656392 5783903 5733754 5666823 5724496 5805465 5787590 5689691
6186 5689691 5699593 5666095 5465890 5596881 5825721 5738397 5789855 5891808 5826198 5830895 5827277
$$ packed form
6260C985366K19663j15365N058n8498J69246K66927K4496J98354n3522N0006R0638
6249D782369p1047j0315P3388m7087j87829n0353k27418k272Q4201L3381l8357
6238D338661o4042q0448N8113l9683J26416J22924J15987j3630J35506K00697
6228D900501J08556j9869N7300K17778j12279l5511j55343k7392M8757k74214
6218D708284p4915l6150Q1928m4670j57196R3458j45929J42626J33762o61J3049
6207D713586K50524o3838J8694K28255J76055k34063l0844K78074J34624L8081
6197E509148N494J19904P7925n6079J27511n0149o6931N7673Q0969j7875r7899
6186E689691R902l3498k00205J30991K28840q7324N1458J01953o5610M697l618
$$ plain form
6175 5827277 5985664 6199475 6176796 6047912 6068316 5957770 6023512 6062418 6201863 6077980
6165 6077980 5957930 6003116 5942580 6006005 6011979 5925949 5825879 5909049 5868597 5718227 5692398
6154 5692398 5815347 5678191 5706103 5645184 5777577 5735405 5662922 5638206 5827158 5854461 5690065
6143 5690065 5656577 5814574 5923051 5807170 5633429 5614405 5819617 5681304 5652211 5583469
6133 5583469 5561574 5824861 5627918 5424269 5325639 5388143 5422209 5450034 5311157 5083784
6123 5083784 5127158 5178094 5300382 5099286 4924739 4757567 4762537 4931849 4870934 4693239
6113 4693239 4663202 4632822 4684306 4657000 4616081 4437226 4431143 4402735 4374586 4582165 4381688
6102 4381688 4277555 4480418 4390828 4284471 4261808 4199969 4080524 3934174 3899412 3964267
$$ packed form
6175E827277J58387K13811k2679j28884K0404j10546O5742L8906J39445j23883
6165F077980j20050M5186o0536O3425N974q6030j00070Q3170m0452j50370k5829
6154E692398J22949j37156K7912o0919J32393m2172p2483k4716J88952K7303j64396
6143E690065l3488J57997J08477j15881j73741j9024K05212j38313k9093o8742
6133E583469k1895K63287j96943k03649r8630O2504L4066K7825j38877k27373
6123E083784M3374N0936J22288k01096j74547j67172M970J69312o0915j77695
6113D693239l0037l0380N1484k7306m0919j78855o083k8408k8149K07579k00477
6102D381688j04133K02863q9590j06357k2663o1839j19445j46350l4762O4855
$$ plain form
6092 3964267 3892567 3788410 3649837 3608946 3611675 3631355 3577994 3544640 3167613 3099031 3213595
6081 3213595 3252736 3368933 3331493 3318280 3363729 3358583 3379624 3488514 3613192 3522700 3433619
6070 3433619 3325941 3125968 3252386 3307019 3411827 3360859 3325335 3212497 3079068 3032715
6060 3032715 3023424 2989193 2996830 2966251 3023016 3027979 2997785 3038925 2906279 2739434 2918490
6049 2918490 2850037 2689367 2875209 2885980 2764089 2889170 2796779 2554317 2430270 2609123
6039 2609123 2803809 2687012 2612005 2622042 2584361 2851233 2648328 2737933 2782979 2698126 2519299
6028 2519299 2552396 2573572 2507985 2578726 2591187 2675102 2628541 2576646 2553152 2461496 2618127
6017 2618127 2780693 2896741 2667654 2590463 2647502 2577048 2566674 2392332 2333834 2429792 2656643
$$ packed form
6092C964267p1700j04157j38573m0891K729J9680n3361l3354l77027o8582J14564
6081C213595L9141J16197l7440j3213M5449n146K1041J08890J24678r0492q9081
6070C433619j07678j99973J26418N4633J04808n0968l5524j12838j33429m6353
6060C032715r291l4231P637l0579N6765M963l0194M1140j32646j66845J79056
6049B918490o8453j60670J85842J0771j21891J25081r2391k42462j24047J78853
6039B609123J94686j16797p5007J0037l7681K66872k02905Q9605M5046q4853j78827
6028B519299L3097K1176o5587P0741J2461Q3915m6561n1895k3494r1656J56631
6017B618127J62566J16048k29087p7191N7039p0454j0374j74342n8498R5958K26851
$$ plain form
6006 2656643 2605290 2501089 2527959 2300494 2250518 2382521 2273751 2242402 2272627 2303430 2402275
5995 2402275 2288635 2181573 2187524 2233857 2492449 2286998 1991943 1993618 2046943 1988834 2049655
5984 2049655 1899191 1822861 1948220 2071546 1974667 1780223 1937340 1935717 1870731 1939001 1972406
5973 1972406 2051051 1911883 2089509 2038936 2037068 2011030 1988779 1941926 1990131 1977569 1908049
5962 1908049 1820405 1788790 1795574 1812879 1764121 1891398 1919230 1948215 1880463 1947505 1905247
5951 1905247 1931806 1937110 1897971 1857013 1933469 2037836 2072049 2120501 2001780 2104945 2102532
5940 2102532 2133517 2199764 2165834 1932511 1814733 1911032 1767013 1658755 1746433 1720642 1763248
5929 1763248 1867861 1892789 1995665 1856191 2021678 1920964 1806545 1707842 1791252 1697057
$$ packed form
6006B656643n1353j04201K6870k27465m9976J32003j08770l1349L0225L0803R8845
5995B402275j13640j07062N951M6333K58592k05451k95055J675N3325n8109O0821
5984B049655j50464p6330J25359J23326r6879j94444J57117j623o4986O8270L3405
5973A972406P8645j39168J77626n0573j868k6038k2251m6853M8205j2562o9520
5962A908049q7644l1615O784J7305m8758J27277K7832K8985o7752O7042m2258
5951A905247K6559N304l9139m0958P6456J04367L4213M8452j18721J03165k413
5940B102532L0985O6247l3930k33323j17778R6299j44019j08258Q7678k5791M2606
5929A763248J04613K4928J02876j39474J65487j00714j14419r8703Q3410r4195
$$ plain form
5919 1697057 1625774 1740806 1814861 1682699 1624855 1744916 1751395 1663996 1771056 1827398 1827646
5908 1827646 1997165 1940956 2023710 2136540 2292538 2101794 2236122 2355177 2493030 2455674
5898 2455674 2461072 2421235 2441186 2469093 2638893 2576326 2536790 2501144 2218269 2296603 2342185
5887 2342185 2163741 1906446 1848330 1915537 1919245 2021484 1902795 2305661 2161769 1956185
5877 1956185 2085977 2350720 2503206 2322685 2268440 2475147 2267467 2289260 2279382 2355814
5867 2355814 2388050 2283271 2413052 2518512 2299896 2114512 2205689 2129706 2237521 2148075
5857 2148075 1977582 1779473 1593428 1710622 1824331 1819012 1907583 1925885 2068071 2145493
5847 2145493 1930738 2113881 2178401 2201375 2222380 2265955 2330534 2248526 2429673 2657409 2556765
$$ packed form
5919A697057p1283J15032P4055j32162n7844J20061O479q7399J07060N6342K48
5908A827646J69519n6209Q2754J12830J55998j90744J34328J19055J37853l7356
5898B455674N398l9837J9951K7907J69800o2567l9536l5646k82875P8334M5582
5887B342185j78444k57295n8116O7207L708J02239j18689M02866j43892k05584
5877A956185J29792K64743J52486j80521n4245K06707k07680K1793r878P6432
5867B355814L2236j04779J29781J05460k18616j85384R1177p5983J07815q9446
5857B148075j70493j98109j86045J17194J13709n319Q8571J8302J42186P7422
5847B145493k14755J83143O4520K2974K1005M3575O4579q2008J81147K27736j00644
$$ plain form
5836 2556765 2306202 2081216 2286074 2382037 2446479 2277306 2200948 2041341 2021076 2218625
5826 2218625 2087414 2139811 2158245 2077961 2046562 2002100 1863797 2116869 2157493 2192633 2374797
5815 2374797 2326236 2384666 2371029 2310404 2432267 2500464 2542786 2292227 2283637 2368561 2361953
5804 2361953 2420215 2649991 2448325 2482503 2391295 2354301 2276695 2225960 2115156 2049695 2059550
5793 2059550 2307460 2400146 2484620 2259144 2010640 1929244 2008068 1963356 1886555 1860435 1745324
5782 1745324 2021009 2078202 1901910 1926492 1867742 1785466 1662395 1686025 1713713 1678095 1692622
5771 1692622 1707153 1824370 1900802 1958765 2008564 1953066 1916027 2026898 2063403 1857713 1904874
5760 1904874 2162519 2172913 2078045 1956834 1923398 2014075 1894936 1948351 1758092 1380267
$$ packed form
5836B556765k50563k24986K04858R5963O4442j69173p6358j59607k0265J97549
5826B218625j31211N2397J8434q0284l1399m4462j38303K53072M0624L5140J82164
5815B374797m8561N8430j3637o0625J21863O8197M2322k50559q590Q4924o608
5804B361953N8262K29776k01666L4178r1208l6994p7606n0735j10804o5461R855
5793B059550K47910R2686Q4474k25476k48504q1396P8824m4712p6801k6120j15111
5782A745324K75685N7193j76292K4582n8750q2276j23071K3630K7688l5618J4527
5771A692622J4531J17217P6432N7963M9799n5498l7039J10871L6505k05690M7161
5760A904874K57645J0394r4868j21211l3436R0677j19139N3415j90259l77825
$$ plain form
5750 1380267 1602543 1505104 1497555 1513971 1674834 1522489 1417448 1552216 1543128 1516835 1397203
5739 1397203 1405874 1372786 1307675 1558901 1727838 1491490 1488580 1741018 1613474 1625885 1561072
5728 1561072 1534308 1512101 1329422 1616067 1674990 1468760 1496402 1545504 1609678 1660979 1576224
5717 1576224 1482486 1547806 1573475 1625253 1711312 1869117 1738578 1797546 1732628 1755009 1869180
5706 1869180 1744549 1533513 1718615 1772462 1592612 1501225 1638502 1751093 1583043 1587233
5696 1587233 1381480 1397787 1591164 1551783 1635823 1680878 1533525 1588513 1670114 1575044 1562269
5685 1562269 1774792 2003328 1909220 1919769 2220709 2196485 1992875 1910332 1911649 1885612 1984974
5674 1984974 1882340 2086619 2089485 2060143 2128220 2064214 2168521 2111366 2077084 2090300 2099211
$$ packed form
5750A380267K22276r7439p549J6416J60863j52345j05041J34768r088k6293j19632
5739A397203Q671l3088o5111K51226J68937k36348k910K52438j27544J2411o4813
5728A561072k6764k2207j82679K86645N8923k06230K7642M9102O4174N1301q4755
5717A576224r3738O5320K5669N1778Q6059J57805j30539N8968o4918K2381J14171
5706A869180j24631k11036J85102N3847j79850r1387J37277J12591j68050M190
5696A587233k05753J6307J93377l9381Q4040M5055j47353N4988Q1601r5070j2775
5685A562269K12523K28536r4108J0549L00940k4224k03610q2543J317k6037R9362
5674A984974j02634K04279K866k9342O8077o4006J04307n7155l4282J3216Q911
$$ plain form
5663 2099211 2063752 2086701 2237765 2250392 2321330 2483828 2352103 2621342 2699577 2460813
5653 2460813 2741961 2825326 2877281 2803996 2721677 2715193 2861194 2724073 2659025 2753630 2830345
5642 2830345 3007843 3162219 3046244 2973085 2886411 2940783 3075683 3027671 3348520 3293464
5632 3293464 3362958 3547477 3512951 3646695 3748938 3776884 3970434 3949986 3962806 4153247
5622 4153247 4283801 4312521 4371357 4748366 4965424 5040546 5286195 5233406 5267033 5464498
5612 5464498 5865703 6063194 6551576 6897521 6967987 7311847 7602835 7756115 8128403 8260544
5602 8260544 8318957 8358692 8254077 8180700 7971594 7965657 7677981 7431484 7317111 7208159
5592 7208159 7358551 7169605 7138494 7012441 7045504 7188318 7240734 7451610 7544206 7535531 7734993
$$ packed form
5663B099211l5459K2949J51064J2627P0938J62498j31725K69239P8235k38764
5653B460813K81148Q3365N1955p3285q2319o484J46001j37121o5048R4605P6715
5642B830345J77498J54376j15975p3159q6674N4372J34900m8012L20849n5056
5632C293464O9494J84519l4526J33744J02243K7946J93550k0448J2820J90441
5622D153247J30554K8720N8836L77009K17058P5122K45649n2789L3627J97465
5612E464498M01205J97491M88382L45945P0466L43860K90988J53280L72288J32141
5602H260544N8413L9735j04615p3377k09106n937k87676k46497j14373j08952
5592G208159J50392j88946l1111j26053L3063J42814N2416K10876R2596q675J99462
$$ plain form
5581 7734993 8130229 8468680 8546812 8463996 8687544 9029918 9343143 9662738 9797878 10114299
5571 10114299 10573733 10931367 11095067 11372198 11794192 12018637 12008742 11884098 12294625 12377813
5561 12377813 12363810 12648116 12619689 12453022 12468948 12553324 12154501 11575385 11337214 11097166
5551 11097166 10723170 10424316 10060605 9438372 9094228 9032575 8969350 8690864 8762365 8802451
5541 8802451 8636815 8604517 8628716 8466749 8710897 8774935 8960913 9126582 9554075 9586753
5531 9586753 9793851 10112732 10319684 10558840 10707272 10831343 10825898 10802280 10649115 10386711
5521 10386711 10130404 9887592 9725314 9081248 8499954 8331234 8134015 7992158 7668940
5512 7668940 7627049 7569599 7366371 7251369 7027822 6850581 6672066 6601738 6593359 6610562 6791517
$$ packed form
5581G734993L95236L38451P8132q2816K23548L42374L13225L19595J35140L16421
5571A0114299M59434L57634J63700K77131M21994K24445r895j24644M10527Q3188
5561A2377813j4003K84306k8427j66667J5926Q4376l98823n79116k38171k40048
5551A1097166l73996k98854l63711o22233l44144o1653o3225k78486P1501M0086
5541H802451j65636l2298K4199j61967K44148O4038J85978J65669M27493L2678
5531I586753K07098L18881K06952K39156J48432J24071n445k3618j53165k62404
5521A0386711k56307k42812j62278o44066n81294j68720j97219j41857l23218
5512G668940m1891n7450k03228j15002k23547j77241j78515p0328q379J7203J80955
$$ plain form
5501 6791517 6723163 6835389 6876611 6766175 6800931 6914340 7077093 7263239 7362252 7364794 7190251
5490 7190251 6930959 6946959 7009743 7027809 7070731 7054830 6692276 6617392 6651075 6500472 6588042
5479 6588042 6569247 6574840 6402556 6392262 6293751 6519832 6560839 6701030 6607292 6778709 6824851
5468 6824851 6864276 7082709 7217476 7339876 7307464 7296005 7434792 7538209 7684795 8137580
5458 8137580 8342463 8422084 8707299 9045107 9242520 9125176 9277893 9573456 9756514 9644493
5448 9644493 9539920 9629699 9482401 9402583 9209387 8925359 8829328 8627727 8671145 8638032
5438 8638032 8528465 8408879 8470564 8363934 8252647 8356962 8509006 8570334 8619799 8724669
5428 8724669 8825485 9036283 9325421 9461886 9479510 9760243 10058119 10379768 10651268 10864942
$$ packed form
5501F791517o8354J12226M1222j10436L4756J13409J62753J86146R9013K542j74543
5490G190251k59292J6000O2784J8066M2922j5901l62554p4884L3683j50603Q7570
5479F588042j8795N593j72284j0294r8511K26081M1007J40191r3738J71417M6142
5468F824851L9425K18433J34767J22400l2412j1459J38787J03417J46586M52785
5458H137580K04883P9621K85215L37808J97413j17344J52717K95563J83058j12021
5448I644493j04573Q9779j47298p9818j93196k84028r6031k01601M3418l3113
5438H638032j09567j19586O1685j06630j11287J04315J52044O1328M9465J04870
5428H724669J00816K10798K89138J36465J7624K80733K97876L21649K71500K13674
$$ plain form
5418 10864942 10792383 10859841 10954112 10984018 11128007 11092987 10884342 10971238 11031087 10974269 11131952
5407 11131952 11215784 11275680 11381547 11643415 11784608 12159526 12424097 12536393 12638571 12797542
5397 12797542 13169273 13380363 13306749 13219621 13109054 13260738 13247901 13172899 13291959 13108095
5387 13108095 13069662 13197156 13507981 13625200 13669902 13784892 13869375 13995674 14264176 14640570
5377 14640570 14985043 15249829 15438126 15595749 15924476 16055072 16125861 16275015 16333291 16170247
5367 16170247 16187227 16504954 16658682 16709205 17162318 17359803 17822913 18250358 18949363 19195996
5357 19195996 19673350 19973054 20463559 21153717 22018079 23099109 24107197 25273003 27138617
5348 27138617 28965377 31411358 34664150 37913949 40531080 42096384 42222871 41029713
$$ packed form
5418A0864942p2559O7458R4271K9906J43989l5020k08645Q6896N9849n6818J57683
5407A1131952Q3832N9896J05867K61868J41193L74918K64571J12296J02178J58971
5397A2797542L71731K11090p3614q7128j10567J51684j2837p5002J19060j83864
5387A3108095l8433J27494L10825J17219M4702J14990Q4483J26299K68502L76394
5377A4640570L44473K64786J88297J57623L28727J30596P0789J49154N8276j63044
5367A6170247J6980L17727J53728N0523M53113J97485M63110M27445O99005K46633
5357A9195996M77354K99704M90505O90158Q64362J081030J008088J165806J865614
5348B7138617J826760K445981L252792L249799K617131J565304J26487j193158
$$ plain form
5340 41029713 39323464 37943767 37372061 37207902 37015219 36762786 36613702 36204477 35429270
5331 35429270 34577090 33729143 33257553 32919968 33155888 33961503 34912602 35944951 37213377
5322 37213377 39248263 41443025 44593474 48435887 52770787 57713163 62825254 67257698
5314 67257698 70787011 73320639 74901628 75421795 75221492 74821203 75301235 77369239 80536945
5305 80536945 83631531 85077013 82900572 77551314 70323381 63384922 57484364 53038506
5297 53038506 49794585 47532275 45978414 45032765 44402590 44554435 44864536 45487150 46468296
5288 46468296 48243758 50510185 53149092 55964488 58192064 59302163 59780254 59972798
5280 59972798 60891840 63271038 66182038 68950877 70224853 68969310 65023391 59450005
$$ packed form
5340D1029713j706249j379697n71706j64159j92683k52433j49084m09225p75207
5331C5429270q52180q47947m71590l37585K35920Q05615R51099J032349J268426
5322C7213377K034886K194762L150449L842413M334900M942376N112091M432444
5314F7257698L529313K533628J580989N20167k00303m00289M80032K068004L167706
5305H0536945L094586J445482k176441n349258p227933o938459n900558m445858
5297E3038506l243921k262310j553861r45649o30175J51845L10101O22614R81146
5288D6468296J775462K266427K638907K815396K227576J110099M78091J92544
5280E9972798R19042K379198K911000K768839J273976j255543l945919n573386
$$ plain form
5272 59450005 53831132 48829805 44708570 41560012 39290009 37229280 35868460 34660200
5264 34660200 33781780 32861893 32090888 31433724 31109431 31098901 31109094 31225188 31521239 31856531
5254 31856531 32313124 33037678 33819781 35252726 36877501 38814585 40788449 43572694 46717808
5245 46717808 50752687 55627511 61104225 66329235 70373357 71739614 70321373 66485102
5237 66485102 62050448 58443606 56359412 55355262 54601922 53463337 51510805 48998126
5229 48998126 46366436 44146196 42490620 41848680 41752008 42202066 43186424 44897914 47302650
5220 47302650 50408124 54892151 60136040 65475665 70500821 73583894 74301626 72666887
5212 72666887 70099259 67562997 65677674 64597684 63769232 62686877 60731519 58321306
$$ packed form
5272E9450005n618873n001327m121235l148558k270003k060729j360820j208260
5264C4660200q78420r19887p71005o57164l24293j0530J0193J16094K96051L35292
5254C1856531M56593P24554P82103J432945J624775J937084J973864K784245L145114
5245D6717808M034879M874824N476714N225010M044122J366257j418241l836271
5237F6485102m434654l606842k084194j004150p53340j138585j952532k512679
5229D8998126k631690k220240j655576o41940r6672M50058R84358J711490K404736
5220D7302650L105474M484027N243889N339625N025156L083073P17732j634739
5212G2666887k567628k536262j885323j079990q28452j082355j955358k410213
$$ plain form
5204 58321306 55664596 53988966 53072788 51808806 49350700 46124538 42144808 38152733
5196 38152733 34928886 32603421 30733387 29669431 28864401 28457504 28168713 28066397 28552841
5187 28552841 29241763 29845628 30339274 30650948 30836684 31258278 31665982 32352691 33284737
5178 33284737 34170937 35492553 36177555 35357934 33275032 30250616 27085689 24525727 22240493
5169 22240493 20486856 19289726 18241211 17283354 16619836 16163974 15913456 15552775 15065455
5160 15065455 15092538 14895753 14754534 14605823 14546643 14649933 14691916 14881178 15275719 15645532
5150 15645532 15768127 16217610 16865872 17314459 18074109 18884912 19753996 20800843 22338919
5141 22338919 23724729 25194097 26975121 29381766 31906697 34568355 36034476 35930843
$$ packed form
5204E8321306k656710j675630r16178j263982k458106l226162l979730l992075
5196C8152733l223847k325465j870034j063956q05030m06897k88791j02316M86444
5187B8552841O88922O03865M93646L11674J85736M21594M07704O86709R32046
5178C3284737Q86200J321616O85002q19621k082902l024416l164927k559962k285234
5169B2240493j753637j197130j048515r57857o63518m55862k50518l60681m87320
5160A5065455K7083j96785j41219j48711n9180J03290M1983J89262L94541L69813
5150A5645532J22595M49483O48262M48587P59650Q10803Q69084J046847J538076
5141B2338919J385810J469368J781024K406645K524931K661658J466121j03633
$$ plain form
5133 35930843 34411594 32720252 31678787 31520051 32144916 33559198 36135994 39643684
5125 39643684 44364300 49427868 53238635 53559773 49460023 42924627 36456648 30947323
5117 30947323 26608526 23572509 21131428 18956659 17236363 15890752 14922578 14079243
5109 14079243 13303290 12641862 11972871 11490962 11089330 10589737 10410173 9812207 9514337
5100 9514337 9326837 9101146 8942694 8547451 8412680 8248977 8005081 8018956 8080175 8094243
5090 8094243 7975765 8021999 8149967 8027385 7820612 7418390 7215849 6843237 6486729 6428531
5080 6428531 6424188 6244931 6015918 5859501 5541130 5451466 5436009 5521579 5273727 5014397
5070 5014397 4919241 4782039 4609582 4600762 4767432 4718858 4511990 4310308 4426976 4328590
$$ packed form
5133C5930843j519249j691342j041465j58736O24865J414282K576796L507690
5125C9643684M720616N063568L810767L21138m099750o535396o467979n509325
5117C0947323m338797l036017k441081k174769j720296j345611r68174q43335
5109A4079243p75953o61428o68991m81909m01632m99593j79564n97966k97870
5100I514337j87500k25691j58452l95243j34771j63703k43896J3875O1219J4068
5090H094243j18478M6234J27968j22582k06773m02222k02541l72612l56508n8198
5080F428531m343j79257k29013j56417l18371q9664j5457Q5570k47852k59330
5070E014397r5156j37202j72457q820J66670m8574k06868k01682J16668r8386
$$ plain form
5060 4328590 4256276 4180510 4175631 4354546 4323639 4178109 4389166 4348975 4305457 4397651 4599641
5049 4599641 4737054 4765808 4842044 4798922 4699922 4730849 4640069 4369628 4217979 4102881 4159262
5038 4159262 4319534 4409535 4235071 4462304 4434032 4312898 4464819 4614370 4727699 4474694
5028 4474694 4275788 4248200 4064520 3999008 4179915 4193272 4168896 4024482 3993173 4185681
5018 4185681 4224044 4319217 4433988 4590064 4746586 4835442 4748803 4611260 4628751 4570467 4434593
5007 4434593 4352170 4318900 4465824 4368685 4268648 4361828 4561296 4780677 4865658 4895784 4853060
4996 4853060 4650069 4668195 4892127 4998101 5239511 5315610 5200501 5545748 5742284 5649731
4986 5649731 5604596 5701471 5707501 5429192 5327794 5234439 5247365 5370020 5617637 5529510 5407632
$$ packed form
5060D328590p2314p5766m879J78915l0907j45530K11057m0191m3518R2194K01990
5049D599641J37413K8754P6236m3122r9000L0927r0780k70441j51649j15098N6381
5038D159262J60272R0001j74464K27233k8272j21134J51921J49551J13329k53005
5028D474694j98906k7588j83680o5512J80907J3357k4376j44414l1309J92508
5018D185681L8363R5173J14771J56076J56522Q8856q6639j37543J7491n8284j35874
5007D434593q2423l3270J46924r7139j00037R3180J99468K19381Q4981L0126m2724
4996D853060k02991J8126K23932J05974K41410P6099j15109L45247J96536r2553
4986E649731m5135R6875O030k78309j01398r3355J2926J22655K47617q8127j21878
$$ plain form
4975 5407632 5382164 5461581 5637116 5540078 5363405 5369325 5285668 5276672 5489074 5641223 5762397
4964 5762397 5865235 6015083 5959214 6091801 6170344 6488604 6524833 6477415 6662590 6839602
4954 6839602 6817492 6776943 6828949 7225374 7414632 7643152 7872850 8292116 8744018 8815016
4944 8815016 9074435 9456772 10017621 10403173 10901768 11669764 12217322 12911035 13822075 15000470
4934 15000470 16588985 18144566 19900133 21477802 22495059 22599749 21548757 20261657
4926 20261657 19221762 18567501 18403190 18577843 19167632 20241340 21702255 22738438 22902901
4917 22902901 21755277 19760510 17892486 16377596 14959145 13957106 13265118 12722992
4909 12722992 12460618 12371329 11913573 11796712 11723472 11689120 11634348 11714612 11558396 11648645
$$ packed form
4975E407632k5468P9417J75535r7038j76673N920q3657q996K12402J52149J21174
4964E762397J02838J49848n5869J32587P8543L18260L6229m7418J85175J77012
4954F839602k2110m0549N2006L96425J89258K28520K29698M19266M51902P0998
4944H815016K59419L82337N60849L85552M98595P67996N47558O93713R11040J178395
4934A5000470J588515J555581J755567J577669J017257J04690j050992j287100
4926B0261657j039895o54261j64311J74653N89789J073708J460915J036183J64463
4917B2902901j147624j994767j868024j514890j418451j002039o91988n42126
4909A2722992k62374q9289m57756j16861p3240l4352n4772Q0264j56216R0249
$$ plain form
4899 11648645 11896491 11875018 12034298 12397917 12668372 13102984 13445315 13573371 13693324 13474334
4889 13474334 13302760 13199863 13165981 13181506 13468155 13609163 13655726 13809577 14311058 14372793
4879 14372793 14444567 14607147 14874564 14999734 15311817 15681870 15898944 16357297 16969332 17398879
4869 17398879 17904139 18304952 18817994 19310942 19871594 20432503 21178816 22010010 22662235
4860 22662235 23585553 24685216 25733763 26782046 28205672 29295158 30631280 32146219
4852 32146219 33300819 34619887 36292792 38057019 40098439 42292181 44808399 47523965
4844 47523965 50492202 54269843 58831957 64040465 70252586 77777157 86456385 96321186
4836 96321186 108973802 124423076 144139784 169879226 204728532 249612726 299081088
$$ packed form
4899A1648645K47846k1473J59280L63619K70455M34612L42331J28056J19953k18990
4889A3474334j71574j02897l3882J5525K86649J41008M6563J53851N01481O1735
4879A4372793P1774J62580K67417J25170L12083L70053K17074M58353O12035M29547
4869A7398879N05260M00813N13042M92948N60652N60909P46313Q31194O52225
4860B2662235R23318J099663J048547J048283J423626J089486J336122J514939
4852C2146219J154600J319068J672905J764227K041420K193742K516218K715566
4844D7523965K968237L777641M562114N208508O212121P524571Q679228R864801
4836I6321186J2652616J5449274J9716708K5739442L4849306M4884194M9468362
$$ plain form
4829 299081088 333672241 332826391 289486048 229869251 180594928 145018300 120431762
4822 120431762 102216169 88591260 77211163 68588795 61596663 56138622 51854491 48232323
4814 48232323 45004804 42061133 39266319 36920399 34377465 32580478 30580367 29030086
4806 29030086 27857121 26667294 25431434 24277211 23247524 22378770 21406380 20127039
4798 20127039 19334745 18599664 17736752 17306732 16769430 16083041 15541288 14827687 14476365
4789 14476365 14173239 13620382 13223650 13068831 12568492 12308448 12094586 11604847 11451181
4780 11451181 11144652 10852977 10372918 10040203 9992030 10129089 10140680 9837614 9445830 9432249
4770 9432249 9201446 8898160 8647080 8436912 8211699 7964030 7851613 7789741 7708620 7465575
$$ packed form
4829B99081088L4591153q45850m3340343n9616797m9274323l5576628k4586538
4822A20431762j8215593j3624909j1380097q622368o992132n458041m284131l622168
4814D8232323l227519k943671k794814k345920k542934j796987k000111j550281
4806B9030086j172965j189827j235860j154223j029687q68754r72390j279341
4798B0127039p92294p35081q62912m30020n37302o86389n41753p13601l51322
4789A4476365l03126n52857l96732j54819n00339k60044k13862m89739j53666
4780A1451181l06529k91675m80059l32715m8173J37059J1591l03066l91784j3581
4770I432249k30803l03286k51080k10168k25213k47669j12417o1872q1121k43045
$$ plain form
4760 7465575 7454292 7380649 7323849 7139291 6990540 6754742 6392857 6303682 6306361 6361996 6177034
4749 6177034 6161787 6125352 6004879 5859795 5540638 5532794 5598999 5693823 5563361 5431364 5717760
4738 5717760 5635725 5319015 5267543 5151199 4974524 5144399 5176721 4856623 4933353 4819921
4728 4819921 4634223 4762949 4845230 4924451 4975315 4876927 4651382 4305910 4337860 4445737
4718 4445737 4445401 4175389 4133909 4203325 4124786 4284283 4242849 4267931 4400645 4134552 4223733
4707 4223733 4402231 4321101 4312730 4258559 4170790 4204168 4030903 3865500 4215585 4299800 4048647
4696 4048647 4017457 4044624 4168172 4227043 3950030 3922430 3930821 3994800 4081500 4071026 4049455
4685 4049455 3829361 3924409 4089434 4060337 4121387 4232253 4121099 4195451 4276711 4307755 4436262
$$ packed form
4760G465575j1283p3643n6800j84558j48751k35798l61885q9175K679N5635j84962
4749F177034j5247l6435j20473j45084l19157p844O6205R4824j30462j31997K86396
4738E717760q2035l16710n1472j16344j76675J69875L2322l20098P6730j13432
4728D819921j85698J28726Q2281P9221N0864r8388k25545l45472L1950J07877
4718D445737l36k70012m1480O9416p8539J59497m1434K5082J32714k66093Q9181
4707D223733J78498q1130q371n4171q7769L3378j73265j65403L50085Q4215k51153
4696D048647l1190K7167J23548N8871k77013k7600Q391O3979Q6700j0474k1571
4685D049455k20094R5048J65025k9097O1050J10866j11154P4352Q1260L1044J28507
$$ plain form
4674 4436262 4398650 4462322 4799231 4804421 4792672 4789201 4798674 4788084 4861668 4914614 5271222 5532284
4662 5532284 5263169 5307500 5450300 5408808 5449963 5536773 5525693 5592357 5737727 5972885 5994582
4651 5994582 6010340 6221401 6340222 6290716 6342284 6375949 6352295 6446080 6419791 6285782 6219084
4640 6219084 6564088 6862561 6833515 6828345 6909777 7272756 7443017 7402635 7515979 7694485
4630 7694485 8038941 8333999 8525109 8663234 8928841 9053164 9329687 9942008 10443085 10613384
4620 10613384 10958749 11481698 11913152 12392916 12805772 13638489 14119910 14626940 15250928
4611 15250928 16024174 16935701 17591628 18449058 19413162 20502086 21819826 23584877 25456194
4602 25456194 27609832 30333637 33365473 36724846 41124943 46367718 52716942 60832431
$$ packed form
4674D436262l7612O3672L36909N190j1749l471R473j0590P3584N2946L56608K61062
4662E532284k69115M4331J42800m1492M1155Q6810j1080O6664J45370K35158K1697
4651E994582J5758K11061J18821m9506N1568L3665k3654R3785k6289j34009o6698
4640F219084L45004K98473k9046n170Q1432L62979J70261m0382J13344J78506
4630G694485L44456K95058J91110J38125K65607J24323K76523O12321N01077J70299
4620A0613384L45365N22949M31454M79764M12856Q32717M81421N07030O23988
4611A5250928P73246R11527O55927Q57430R64104J088924J317740J765051J871317
4602B5456194K153638K723805L031836L359373M400097N242775O349224Q115489
$$ plain form
4594 60832431 70977607 84083850 99590715 114349377 122709711 119398748 104348264
4587 104348264 85925967 69949155 57913304 49058578 42092539 36801537 32195074 28802620
4579 28802620 26099276 23910727 22157610 20612587 19124398 17791342 16783940 15715882
4571 15715882 14748496 13931598 13183159 12630106 12171571 11699406 11114979 10604553 10411483
4562 10411483 10112890 9650754 9334065 8980262 8730309 8613990 8250811 7956241 7658825
4553 7658825 7349717 7162125 6858292 6593927 6537912 6541392 6482955 6343794 6170746 6298546
4543 6298546 6235710 6030417 5801139 5547192 5658560 5529692 5394349 5408535 5301612 5120975
4533 5120975 5035800 5159126 5199490 4916703 4899690 4942145 4907413 4841958 4761099 4671776 4544479
$$ packed form
4594F0832431J0145176J3106243J5506865J4758662Q360334l310963j5050484
4587A04348264j8422297j5976812j2035851q854726o966039n291002m606463l392454
4579B8802620k703344k188549j753117j545023j488189j333056j007402j068058
4571A5715882r67386q16898p48439n53053m58535m72165n84427n10426j93070
4562A0411483k98593m62136l16689l53803k49953j16319l63179k94570k97416
4553G658825l09108j87592l03833k64365n6015L480n8437j39161j73048J27800
4543F298546o2836k05293k29278k53947J11368j28868j35343J4186j06923j80637
4533E120975q5175J23326M0364k82787j7013M2455l4732o5455q0859q9323j27297
$$ plain form
4522 4544479 4520924 4573972 4525783 4537287 4683148 4654301 4892874 5088528 5093037 5436734 5638423
4511 5638423 5525420 5093002 4767249 4323209 4220518 4260556 3981075 3706933 3822146 3827493
4501 3827493 3910692 3832703 3634740 3596135 3600940 3705662 3541480 3329039 3272898 3329328 3420530
4490 3420530 3342839 3201977 3050270 3189442 3197486 3165027 3359583 3194616 3012539 2969337
4480 2969337 3026895 3045429 2905703 2919907 2840737 2759394 2896834 2819935 2792957 2754755 2643694
4469 2643694 2506641 2864657 3003808 2962414 2950182 2820572 2596176 2759222 2884582 2976597
4459 2976597 2843841 2781916 2834860 2905763 2740175 2938571 2784160 2785249 2711350 2639658 2678135
4448 2678135 2568466 2631596 2538607 2642382 2717748 2702289 2772262 2687250 2619078 2758948 2567583
$$ packed form
4522D544479k3555N3048m8189J1504J45861k8847K38573J95654M509L43697K01689
4511E638423j13003m32418l25753m44040j02691M0038k79481k74142J15213N347
4501C827493Q3199p7989j97963l8605M805J04722j64182k12441n6141N6430R1202
4490C420530p7691j40862j51707J39172Q044l2459J94556j64967j82077m3202
4480B969337N7558J8534j39726J4204p9170q1343J37440p6899k6978l8202j11061
4469B643694j37053L58016J39151m1394j2232j29610k24396J63046J25360R2015
4459B976597j32756o1925N2944P0903j65588J98396j54411J089p3899p1692L8477
4448B678135j09669O3130r2989J03775P5366j5459O9973q5012o8172J39870j91365
$$ plain form
4437 2567583 2582005 2533329 2547273 2723350 2667618 2628612 2735098 2836070 2886447 2937460 2997525
4426 2997525 2677496 2601921 2707669 2585407 2653961 2724977 2621789 2623831 2546198 2425354 2662014
4415 2662014 2754798 2513389 2502135 2545427 2546326 2648330 2746138 2899469 2869865 2660022 2647130
4404 2647130 2596512 2426821 2474822 2365942 2339548 2303863 2557833 2644507 2544305 2629216 2456255
4393 2456255 2461374 2605752 2608388 2637018 2430858 2391179 2661810 2649292 2653530 2631530 2562564
4382 2562564 2680663 2801551 2857332 2796962 2732187 2601880 2498036 2653823 2868419 2928177
4372 2928177 2725113 2795980 2891682 2970027 2977854 2987195 2891012 2946081 2767408 2868235 3189909
4361 3189909 2929980 2641028 2938221 3374230 3293606 3259843 3358921 3473207 3427717 3427825 3676410
$$ packed form
4437B567583J4422m8676J3944J76077n5732l9006J06486J00972N0377N1013O0065
4426B997525l20029p5575J05748j22262O8554P1016j03188K042p7633j20844K36660
4415B662014R2784k41409j1254M3292Q99J02004R7808J53331k9604k09843j2892
4404B647130n0618j69691M8001j08880k6394l5685K53970Q6674j00202Q4911j72961
4393B456255N119J44378K636K8630k06160l9679K70631j2518M238k2000o8966
4382B562564J18099J20888N5781o0370o4775j30307j03844J55787K14596N9758
4372B928177k03064P0867R5702P8345P827R341r6183N5069j78673J00827L21674
4361C189909k59929k88952K97193M36009q0624l3763R9078J14286m5490J08K48585
$$ plain form
4350 3676410 3554737 3578783 3391071 3413246 3592672 3590882 3487903 3647459 3701539 3691370 3702504
4339 3702504 3893282 3997841 4027212 4081593 4234209 4355354 4313358 4424285 4559834 4690239
4329 4690239 4511523 4790492 4979517 4863692 5100143 5206118 5233694 5307482 5275738 5288766
4319 5288766 5448757 5607714 5765684 5841107 5825199 5789289 5895738 6194420 6371558 6516965
4309 6516965 6573404 6489596 6641512 6931940 6975737 7076159 7182698 7343784 7442435 7657870
4299 7657870 7704767 8035482 8188896 8266161 8567161 8900080 9176431 9392762 9706156 10220514
4289 10220514 10541424 10685959 10972773 11352770 12034138 12215474 12465651 12718353 13143129
4280 13143129 13500952 13848634 14343124 14671273 15278591 15736550 16058881 16541757 17037560
$$ packed form
4350C676410j21673K4046j87712K2175J79426j790j02979J59556N4080j0169J1134
4339C702504J90778J04559K9371N4381J52616J21145m1996J10927J35549J30405
4329D690239j78716K78969J89025j15825K36451J05975K7576P3788l1744J3028
4319E288766J59991J58957J57970P5423j5908l5910J06449K98682J77138J45407
4309F516965N6439q3808J51916K90428M3797J00422J06539J61086R8651K15435
4299G657870M6897L30715J53414P7265L01000L32919K76351K16331L13394N14358
4289A0220514L20910J44535K86814L79997O81368J81336K50177K52702M24776
4280A3143129L57823L47682M94490L28149O07318M57959L22331M82876M95803
$$ plain form
4271 17037560 17745266 18192474 18657363 19355017 19867727 20152954 20575326 21153540 21590763
4262 21590763 22263253 22622428 23098667 23472934 23659297 24167271 24665604 24706037 24962719 25396017
4252 25396017 25555831 25603233 25890173 25851140 25787076 25917208 25664784 25705320 25690208 25667798
4242 25667798 25370324 24869073 24629089 24275523 23926930 23536156 23372747 22959292 22536274
4233 22536274 22309630 21994737 21617522 21201075 20613750 20053829 19716706 19356555 18753778
4224 18753778 18054711 17584643 16940060 16450865 15997097 15506156 14852727 14507607 14180176
4215 14180176 13748777 13284539 12979310 12725036 12137008 11815962 11581889 11339766 11032766
4206 11032766 10746520 10440553 10213740 9914528 9834827 9620239 9159041 8865615 8691475 8647724
$$ packed form
4271A7037560P07706M47208M64889O97654N12710K85227M22372N78214M37223
4262B1590763O72490L59175M76239L74267J86363N07974M98333M0433K56682M33298
4252B5396017J59814M7402K86940l9033o4064J30132k52424M0536j5112k2410
4242B5667798k97474n01251k39984l53566l48593l90774j63409m13455m23018
4233B2536274k26644l14893l77215m16447n87325n59921l37123l60151o02777
4224A8753778o99067m70068o44583m89195m53768m90941o53429l45120l27431
4215A4180176m31399m64238l05229k54274n88028l21046k34073k42123l07000
4206A1032766k86246l05967k26813k99212p9701k14588m61198k93426j74140m3751
$$ plain form
4196 8647724 8348163 8053329 8012650 8018967 7812781 7444335 7277094 6981005 6918393 6848629
4186 6848629 6805789 6558525 6531969 6420145 6534263 6172673 6010951 6017681 5992605 6023344 5873623
4175 5873623 5773533 5577487 5438986 5459341 5740070 5662905 5704900 5564420 5455979 5665876
4165 5665876 5636802 5548929 5497336 5695496 5615357 5448428 5673225 5626513 5623577 5748783 5772181
4154 5772181 5756859 5738475 5660856 5712325 5776583 5850454 5888080 6063552 5752111 5719165 5776105
4143 5776105 6121669 6238943 6542986 6623511 6408602 6443966 6518786 6735518 6743419 6666580 6751330
4132 6751330 6797538 7128912 7254003 7389910 7574134 7698454 7769884 7858694 7908559 8303643
4122 8303643 8407458 8477097 8661317 8688509 8812309 9224947 9521773 9477504 9597324 9923532
$$ packed form
4196H647724k99561k94834m0679O317k06186l68446j67241k96089o2612o9764
4186F848629m2840k47264k6556j11824J14118l61590j61722O730k5076L0739j49721
4175E873623j00090j96046j38501K0355K80729p7165M1995j40480j08441K09897
4165E665876k9074q7873n1593J98160q0139j66929K24797m6712k936J25206K3398
4154E772181j5322j8384p7619N1469O4258P3871L7626J75472l11441l2946N6940
4143E776105L45564J17274L04043Q0525k14909L5364P4820K16732P901p6839Q4750
4132F751330M6208L31374J25091J35907J84224J24320P1430Q8810M9865L95084
4122H303643J03815O9639J84220K7192J23800M12638K96826m4269J19820L26208
$$ plain form
4112 9923532 10206367 10396745 10625881 10893417 11146723 11186237 11385418 11611922 11782701 12061559
4102 12061559 12562735 12822331 12772503 12995580 13436854 13585043 13770716 13816309 14280674 14630102
4092 14630102 14858207 15079947 15100466 15137502 15362625 15502571 15890675 15931189 15944778 16225288
4082 16225288 16300024 16860921 16976819 16946460 17024854 17276021 17332590 17425656 17741509 17673159
4072 17673159 18033277 18284524 18497785 18413689 18685612 19125474 19029187 19235471 19500860 19391610
4062 19391610 19537031 19857210 20098782 20536803 20815389 21051401 21379675 21634190 21903408
4053 21903408 22220663 22679512 22949036 23462766 24073380 24586261 25144232 25736893 26310328
4044 26310328 26964914 27653092 28521027 29656629 30389604 31536024 32805264 33875065 35134978
$$ packed form
4112I923532K82835J90378K29136K67536K53306L9514J99181K26504J70779K78858
4102A2061559N01176K59596m9828K23077M41274J48189J85673M5593M64365L49428
4092A4630102K28105K21740K0519L7036K25123J39946L88104M0514J3589K80510
4082A6225288P4736N60897J15898l0359P8394K51167N6569R3066L15853o8350
4072A7673159L60118K51247K13261q4096K71923M39862r6287K06284K65389j09250
4062A9391610J45421L20179K41572M38021K78586K36012L28274K54515K69218
4053B1903408L17255M58849K69524N13730O10614N12881N57971N92661N73435
4044B6310328O54586O88178Q67935J135602P32975J146420J269240J069801J259913
$$ plain form
4035 35134978 36423390 37998023 39569774 41128423 42893462 44549948 46220350 48107034
4027 48107034 50362435 52699721 54870654 57262203 59570063 62151997 64833069 67369752
4019 67369752 70153970 72942564 75882433 78719141 81388547 84251216 87099823 90284781
4011 90284781 93407501 96221696 99599626 102830460 105639155 108336801 111050278 113705746
4003 113705746 115874086 117967166 120159570 121953621 123459886 125033721 126480464 127929037
3995 127929037 129318455 130406571 131197212 131658091 131948682 132012041 131468441 130460056 129283738
3986 129283738 127889998 126359986 124539361 122800830 121163687 119276594 117253762 115249500
3978 115249500 113018086 110520141 107676612 104572279 101380317 98304639 95052187 91880113
$$ packed form
4035C5134978J288412J574633J571751J558649J765039J656486J670402J886684
4027D8107034K255401K337286K170933K391549K307860K581934K681072K536683
4019F7369752K784218K788594K939869K836708K669406K862669K848607L184958
4011I0284781L122720K814195L377930L230834K808695K697646K713477K655468
4003A13705746K168340K093080K192404J794051J506265J573835J446743J448573
3995A27929037J389418J088116P90641M60879K90591O3359n43600j008385j176318
3986A29283738j393740j530012j820625j738531j637143j887093k022832k004262
3978A15249500k231414k497945k843529l104333l191962l075678l252452l172074
$$ plain form
3970 91880113 88469163 85128651 82088179 78965057 75851155 72887204 70036970 67255580
3962 67255580 64747121 62159309 59598555 57036785 54716546 52153073 49812930 47709476
3954 47709476 45694057 43838163 42140494 40744422 39289462 37928599 36929628 35826471
3946 35826471 34863656 33942441 33308325 32422721 31670752 31196776 31083092 30941133 30638897
3937 30638897 30502374 30546115 30942730 30926778 31146883 31525886 31805621 32042220 32456711 32598884
3927 32598884 32863468 32863361 33081799 32982319 32566382 32535040 32317843 32196575 32167807 31868009
3917 31868009 31475201 31156406 30978846 30659454 30168084 29621745 28940584 28526871 27822778
3908 27822778 27198245 26480444 25883770 25200675 24424766 24025433 23573744 23183677 23059838
$$ packed form
3970I1880113l410950l340512l040472l123122l113902k963951k850234k781390
3962F7255580k508459k587812k560754k561770k320239k563473k340143k103454
3954D7709476k015419j855894j697669j396072j454960j360863r98971j103157
3946C5826471r62815r21215o34116q85604p51969m73976j13684j41959l02236
3937C0638897j36523M3741L96615j5952K20105L79003K79735K36599M14491J42173
3927C2598884K64584j07K18438r9480m15937l1342k17197j21268k8768k99798
3917C1868009l92808l18795j77560l19392m91370n46339o81161m13713p04093
3908B7822778o24533p17801n96674o83095p75909l99333m51689l90067j23839
$$ plain form
3899 23059838 22905504 22525058 22337963 22477034 22219741 22239591 22531360 22802355 23037063 23339440
3889 23339440 23756962 24047539 24681939 25180888 25925006 26898411 27905079 28839626 29903942
3880 29903942 31126861 32598438 34082961 35482793 37056653 38574972 40110656 41677914
3872 41677914 43037472 44098773 44827384 45544187 45897577 46088324 46095958 45894279 45732382
3863 45732382 45666243 45413558 45179550 44859686 44301442 43653822 43031829 42119095 41107142
3854 41107142 39631280 38041928 36358299 34460284 32937716 31217830 29432756 27952971
3846 27952971 26579873 25254771 24166897 23076681 21962506 21225275 20739493 19977244 19434250
3837 19434250 18966581 18429173 18139014 17874944 17527147 17417004 17112625 16993021 16967305 16882045
$$ packed form
3899B3059838j54334l80446j87095J39071k57293J9850K91769K70995K34708L02377
3889B3339440M17522K90577O34400M98949P44118R73405J006668R34547J064316
3880B9903942J222919J471577J484523J399832J573860J518319J535684J567258
3872D1677914J359558J061301P28611P16803L53390J90747P634k01679j61897
3863D5732382o6139k52685k34008l19864n58244o47620o21993r12734j011953
3854D1107142j475862j589352j683629j898015j522568j719886j785074j479785
3846B7952971j373098j325102j087874j090216j114175p37231m85782p62249n42994
3837A9434250m67669n37408k90159k64070l47797j10143l04379j19604k5716q5260
$$ plain form
3827 16882045 16814204 16628916 16650183 16658344 16687670 16477834 16845313 16888690 16472717 16170718
3817 16170718 16191697 16209508 16063063 15867264 15693312 15647586 15334087 15264652 15088122 14879601
3807 14879601 14687448 14424312 14032090 13740640 13492703 13227934 12971837 12541427 12270412
3798 12270412 12011219 11897439 11783352 11326232 11238399 11026042 11109507 11085190 11032985 10729734
3788 10729734 10528021 10567274 10601049 10481654 10637149 10589673 10636172 10691246 10530936 10557316
3778 10557316 10479701 10641443 10644094 10477114 10552256 10669533 10756349 10908721 10978741 11144361
3768 11144361 11363279 11303281 11462591 11731945 11632943 11841092 12029104 12218035 12416003 12459333
3758 12459333 12663017 12709752 12621919 12870159 12930885 13047197 13157960 13346935 13452879 13432922
$$ packed form
3827A6882045o7841j85288K1267Q161K9326k09836L67479M3377m15973l01999
3817A6170718K0979J7811j46445j95799j73952m5726l13499o9435j76530k08521
3807A4879601j92153k63136l92222k91450k47937k64769k56097m30410k71015
3798A2270412k59193j13780j14087m57120q7833k12357Q3465k4317n2205l03251
3788A0729734k01713L9253L3775j19395J55495m7476M6499N5074j60310K6380
3778A0557316p7615J61742K651j66980P5142J17277Q6816J52372P0020J65620
3768A1144361K18918n9998J59310K69354r9002K08149J88012J88931J97968M3330
3758A2459333K03684M6735q7833K48240O0726J16312J10763J88975J05944j9957
$$ plain form
3748 13432922 13719935 14019059 14136098 14148035 14190595 14403474 14649197 14877167 15014241 15034626
3738 15034626 15107893 15459254 15753273 15816226 16068922 16326587 16663782 17001545 17383884 17725026
3728 17725026 18097207 18427070 18730405 19096276 19546126 19917878 20255026 20505933 20812718
3719 20812718 21141697 21682987 22113856 22340025 22632357 23045261 23526033 23928339 24039599
3710 24039599 24361488 24934804 25229975 25681987 25986103 26648315 27430483 28098561 28642971
3701 28642971 29158215 29717708 30369744 31243307 31955395 32690825 33510519 34231511 34963823
3692 34963823 35766267 36348715 37116504 37859472 38940405 39894330 40739709 41502392 42321980
3683 42321980 43456323 44634415 45808418 47166826 48494250 49635043 50919936 52262192
$$ packed form
3748A3432922K87013K99124J17039J1937M2560K12879K45723K27970J37074K0385
3738A5034626P3267L51361K94019O2953K52696K57665L37195L37763L82339L41142
3728A7725026L72181L29863L03335L65871M49850L71752L37148K50907L06785
3719B0812718L28979N41290M30869K26169K92332M12904M80772M02306J11260
3710B4039599L21889N73316K95171M52012L04116O62212P82168O68078N44410
3701B8642971N15244N59493O52036Q73563P12088P35430Q19694P20992P32312
3692C4963823Q02444N82448P67789P42968J080933R53925Q45379P62683Q19588
3683D2321980J134343J178092J174003J358408J327424J140793J284893J342256
$$ plain form
3675 52262192 53811492 55367489 57032629 58730464 60518524 62247907 64369711 66772180
3667 66772180 69188153 71711134 74247144 76637193 79327289 81886198 84334530 86819919
3659 86819919 89318756 91835436 94341805 96379927 98480746 100536628 102508146 104079857
3651 104079857 105805611 107232466 108345385 109287745 110192730 111001623 111402126 111822153 112250663
3642 112250663 112050582 111765325 111454563 111025886 110388884 109612314 108793992 107967779 107122398
3633 107122398 106226607 105267804 104531806 103561738 102706937 102088217 101276524 100700656 100177051
3624 100177051 99828262 99649443 99659543 99773090 99974751 100427630 101006640 101750545 102694667
3615 102694667 103839311 105178821 106682443 108349224 110328753 112704724 115246072 118108874
$$ packed form
3675E2262192J549300J555997J665140J697835J788060J729383K121804K402469
3667F6772180K415973K522981K536010K390049K690096K558909K448332K485389
3659H6819919K498837K516680K506369K038122K100819K055882J971518J571711
3651A04079857J725754J426855J112919R42360R04985Q08893M00503M20027M28510
3642A12250663k00081k85257l10762m28677o37002p76570q18322q26213q45381
3633A07122398q95791r58803p35998r70068q54801o18720q11693n75868n23605
3624A00177051l48789j78819J0100J13547K01661M52879N79010P43905R44122
3615A02694667J144644J339510J503622J666781J979529K375971K541348K862802
$$ plain form
3607 118108874 120917919 124201297 127896760 131619707 134957563 138198237 141485513 144727510
3599 144727510 147766672 150736741 153749181 156364174 158540312 161126883 163491392 165860798
3591 165860798 168037324 170076470 171555142 172535546 172938314 172802426 172222932 171122718 169772945
3582 169772945 167955095 165626920 163440236 161211230 158992214 157015625 154759027 152407349
3574 152407349 150303304 148274326 146241006 144106724 142086958 140255466 138775173 137662585
3566 137662585 137232816 136985641 137037352 137769991 138760545 140120740 141731989 143761188 146059017
3557 146059017 148517049 151095031 153442915 155991430 158371573 160743200 163154179 165475636
3549 165475636 167865513 170248439 172301255 174317954 176355984 178018424 179538885 180525213
$$ packed form
3607A18108874K809045L283378L695463L722947L337856L240674L287276L241997
3599A44727510L039162K970069L012440K614993K176138K586571K364509K369406
3591A65860798K176526K039146J478672R80404M02768j35888n79494j100214j349773
3582A69772945j817850k328175k186684k229006k219016j976589k256598k351678
3574A52407349k104045k028978k033320k134282k019766j831492j480293j112588
3566A37662585m29769k47175N1711P32639R90554J360195J611249K029199K297829
3557A46059017K458032K577982K347884K548515K380143K371627K410979K321457
3549A65475636K389877K382926K052816K016699K038030J662440J520461R86328
$$ plain form
3541 180525213 180848484 180717007 179752325 178752358 177084163 174824102 172520755 169696174 166311457
3532 166311457 162803016 159141216 155343181 151840009 148268310 144909499 141621108 138605847
3524 138605847 135655774 132586966 129220718 125783694 122446179 119337844 116581956 114196156
3516 114196156 111945487 110167742 109018188 108309297 107977892 108321403 109128052 110602232 112314070
3507 112314070 114264590 116662132 119670360 123021270 126726424 130699972 134994024 139078816
3499 139078816 143235113 147700824 152021537 156259743 160426960 164831665 169351290 174004760
3491 174004760 178769735 184282857 190197345 196186848 202767476 210085105 217904335 226688825
3483 226688825 236188241 246270171 257792177 270735056 284432681 298822265 313168236
$$ packed form
3541A80525213L23271j31477r64682r99967j668195k260061k303347k824581l384717
3532A66311457l508441l661800l798035l503172l571699l358811l288391l015261
3524A38605847k950073l068808l366248l437024l337515l108335k755888k385800
3516A14196156k250669j777745j149554p08891l31405L43511Q06649J474180J711838
3507A12314070J950520K397542L008228L350910L705154L973548M294052M084792
3499A39078816M156297M465711M320713M238206M167217M404705M519625M653470
3491A74004760M764975N513122N914488N989503O580628P317629P819230Q784490
3483B26688825R499416J0081930J1522006J2942879J3697625J4389584J4345971
$$ plain form
3476 313168236 326767726 338788017 348378334 355097857 358238732 358609308 355939270 350904075
3468 350904075 345149895 339402148 334075144 329516548 325885428 322810024 319861333 316328566
3460 316328566 311502354 304199049 294014771 280782801 264551908 246319401 226733029
3453 226733029 207095299 188127628 170188439 154351323 140505165 128331003 117734397
3446 117734397 108491152 100640608 93726896 87597771 82121379 77368466 72868834 68847745
3438 68847745 65226336 62063063 59035506 56328285 53763153 51511563 49417586 47401738
3430 47401738 45618611 44039057 42384463 40651666 39372961 38280818 37016774 35679041
3422 35679041 34534850 33545848 32474696 31380370 30631077 29858871 29116731 28391914 27581556
$$ packed form
3476C13168236J3599490J2020291R590317O719523L140875L70576k670038n035195
3468C50904075n754180n747747n327004m558596l631120l075404k948691l532767
3460C16328566m826212p303305j0184278j3231970j6230893j8232507j9586372
3453B26733029j9637730j8967671j7939189j5837116j3846158j2174162j0596606
3446A17734397r243245p850544o913712o129125n476392m752913m499632m021089
3438F8847745l621409l163273l027557k707221k565132k251590k093977k015848
3430D7401738j783127j579554j654594j732797j278705j092143j264044j337733
3422C5679041j144191r89002j071152j094326p49293p72206p42140p24817q10358
$$ plain form
3413 27581556 26674352 25995905 25523929 24808046 24304252 23574016 22952842 22345607 21640113
3404 21640113 21116475 20503324 20114917 19724329 19468946 19024231 18402103 17922201 17590912
3395 17590912 17336140 16817365 16593572 16527687 16043796 15570612 15153682 14851797 14575854 14167204
3385 14167204 13986339 13778508 13426729 13170536 13030171 12643962 12431761 12207867 12009679
3376 12009679 12037484 11718750 11426123 11059689 11002808 10932648 10793828 10536171 10222536 9991916
3366 9991916 10046711 9946376 9794181 9526122 9486140 9398471 9416118 9194423 8793681 8741426
3356 8741426 8675815 8404879 8413227 8296716 8173649 7773076 7807343 7749234 7526165 7560945 7352539
3345 7352539 7165086 7241570 7053251 7000452 6933605 6691637 6569398 6672104 6530603 6213641
$$ packed form
3413B7581556r07204o78447m71976p15883n03794p30236o21174o07235p05494
3404B1640113n23638o13151l88407l90588k55383m44715o22128m79902l31289
3395A7590912k54772n18775k23793o5885m83891m73184m16930l01885k75943m08650
3385A4167204j80865k07831l51779k56193j40365l86209k12201k23894j98188
3376A2009679K7805l18734k92627l66434n6881p0160j38820k57657l13635k30620
3366I991916N4795j00335j52195k68059l9982q7669J7647k21695m00742n2255
3356H741426o5611k70936Q348j16511j23067m00573L4267n8109k23069L4780k08406
3345G352539j87453P6484j88319n2799o6847k41968j22239J02706j41501l16962
$$ plain form
3335 6213641 6158582 6088181 6031739 5898243 5707881 5676150 5724127 5548638 5491288 5489737 5646325
3324 5646325 5527453 5562294 5320074 5206120 5327202 5324674 5096581 4900567 4931314 5028336
3314 5028336 5059301 5029709 4982302 4956087 4920275 5004585 5030743 4915761 4694776 4670415 4847745
3303 4847745 4874930 4829476 4640997 4748366 4631430 4809655 4852970 4717533 4569018 4516873
3293 4516873 4434236 4116869 4018868 4055748 4138224 4109593 4028425 3903559 3928735 3801656 3903151
3282 3903151 3859841 3994233 3719067 3523102 3412152 3295718 3234948 3225769 3323029 3423341
3272 3423341 3389635 3212798 3248595 3318625 3077197 3158917 3103646 3079414 3214516 3226753 3142772
3261 3142772 3312122 3306480 3212747 3137904 3153986 3241175 2902407 2909551 2891068 2974566 2885141
$$ packed form
3335F213641n5059p0401n6442j33496j90362l1731M7977j75489n7350j551J56588
3324E646325j18872L4841k42220j13954J21082k528k28093j96014L0747R7022
3314E028336L0965k9592m7407k6215l5812Q4310K6158j14982k20985k4361J77330
3303D847745K7185m5454j88479J07369j16936J78225M3315j35437j48515n2145
3293D516873q2637l17367r8001L6880Q2476k8631q1168j24866K5176j27079J01495
3282C903151m3310J34392k75166j95965j10950j16434o0770r179R7260J00312
3272C423341l3706j76837L5797P0030k41428Q1720n5271k4232J35102J2237q3981
3261C142772J69350n642r3733p4843J6082Q7189l38768P144j8483Q3498q9425
$$ plain form
3250 2885141 2801640 2729614 2648158 2592697 2660008 2585502 2622956 2750556 2561824 2775160 2754987
3239 2754987 2774577 2488445 2495745 2661844 2645640 2678850 2740971 2753712 2622349 2582810 2483167
3228 2483167 2450715 2211481 2342954 2420888 2419818 2436298 2413741 2266659 2275861 2276687 2209884 2273705
3216 2273705 2166426 2279317 2285896 2277890 2244437 2383980 2345506 2195365 2244818 1983524 2246278
3205 2246278 2118364 2164465 2310134 2367145 2174253 2204872 2513273 2478645 2426955 2398537 2424278
3194 2424278 2427421 2538401 2437758 2501681 2794068 2964618 2710028 2696971 2682021 2923048
3184 2923048 2957394 2673430 2690287 2774753 2850707 2631021 2624872 2584478 2405290 2435559 2428856
3173 2428856 2557442 2597661 2668801 2611466 2559202 2623200 2294255 2070681 2048243 1791034 1785832
$$ packed form
3250B885141q3501p2026q1456n5461O7311p4506L7454J27600j88732K13336k0173
3239B754987J9590k86132P300J66099j6204L3210O2121J2741j31363l9539r9643
3228B483167l2452k39234J31473P7934j070J6480k2557j47082R202Q26o6803O3821
3216B273705j07279J12891O579q006l3453J39543l8474j50141M9453k61294K62754
3205B246278j27914M6101J45669N7011j92892L0619L08401l4628n1690k8418K5741
3194B424278L143J10980j00643O3923K92387J70550k54590j3057j4950K41027
3184B923048L4346k83964J6857Q4466P5954k19686o149m0394j79188L0269o703
3173B428856J28586M0219P1140n7335n2264O3998l28945k23574k2438k57209n202
$$ plain form
3162 1785832 1736535 1652264 1588570 1521243 1526926 1408738 1284588 1273585 1281677 1272369 1230826 1180315
3150 1180315 1189619 1305911 1228641 1297067 1248500 1115401 1134875 913453 1146623 1057915 971748
3139 971748 959582 1002322 881021 840294 990194 1119669 935901 805645 959467 742534
3129 742534 673060 519160 484247 831731 815307 806939 879033 910682 619443 647825 647011 592658
3117 592658 761364 845837 817415 547352 460029 489277 628244 715169 565487 448942 335230
3106 335230 251636 299812 394465 637805 658214 795450 778378 676311 583069 458826 391753
3095 391753 429061 533967 475424 580449 510725 484866 655584 581962 478000 508686 436485
3084 436485 410582 381852 513636 417629 453688 615137 481518 376518 451220 262696 451935
$$ packed form
3162A785832m9297q4271o3694o7327N683j18188j24150j1003Q092r308m1543n0511
3150A180315R304J16292p7270O8426m8567j33099J9474k21422K33170q8708q6167
3139I71748j2166M2740j21301m0727J49900J29475j83768j30256J53822k16933
3129G42534o9474j53900l4913L47484j6424q368P2094L1649k91239K8382q14n4353
3117E92658J68706Q4473k8422k70063q7323K9248J38967Q6925j49682j16545j13712
3106C35230q3594M8176R4653K43340K0409J37236j7072j02067r3242j24243o7073
3095C91753L7308J04906n8543J05025o9724k5859J70718p3622j03962L0686p2201
3084D36485k5903k8730J31784r6007L6059J61449j33619j05000P4702j88524J89239
$$ plain form
3073 451935 484130 448798 416354 265165 265736 382148 466911 376347 195187 335320 340261
3062 340261 241202 377508 220987 277608 442908 424964 383040 276583 379920 562844
3052 562844 480147 433333 233774 220259 361644 325419 228699 419874 440869 477641 267859
3041 267859 352215 372482 249463 218648 195124 174556 266932 374956 404897 399384 601447
3030 601447 271870 -40437 67173 165492 93362 196285 155697 186919 364273 432440 389019
3019 389019 172082 461888 535479 219566 243540 343803 347233 197555 56128 80865 383404
3008 383404 305440 74629 102346 153980 234073 347546 376462 419642 245191 69021 261805
2997 261805 394033 200595 243687 432858 143380 149192 338576 267165 226367 409151 401673
$$ packed form
3073D51935L2195l5332l2444j51189N71J16412Q4763r0564j81160J40133M941
3062C40261r9059J36306j56521N6621J65300j7944m1924j06457J03337J82924
3052E62844q2697m6814j99559j3515J41385l6225r6720J91175K0995L6772k09782
3041B67859Q4356K0267j23019l0815k3524k0568R2376J08024K9941n513K02063
3030F01447l29577l12307J07610R8319p2130J02923m0588L1222J77354O8167m3421
3019C89019k16937K89806P3591l15913K3974J00263L430j49678j41427K4737L02539
3008C83404p7964k30811K7717N1634Q0093J13473K8916M3180j74451j76170J92784
2997B61805J32228j93438M3092J89171k89478N812J89384p1411m0798J82784p478
$$ plain form
2986 401673 345817 115235 10285 90086 330103 269447 244669 194275 40389 9696 157546
2975 157546 255173 154862 484172 543475 315479 148202 119961 108966 391152 511810
2965 511810 461052 359736 464277 445448 416744 209195 239290 418277 120944 28709 93760
2954 93760 270640 193062 156096 414505 363841 437989 458609 319929 399833 403694 325442
2943 325442 114109 317452 352219 327966 324699 544932 240947 99290 191237 162760 101417
2932 101417 283929 418845 339620 87484 98966 23763 58920 -30125 101205 162190 -100057
2921 -100057 109617 173315 189505 48910 -142781 156792 375218 430574 514965 330395
2911 330395 373709 447934 384982 230336 205002 -1873 -84041 35127 112548 121624 200740
$$ packed form
2986D01673n5856k30582j04950P9801K40017o0656k4778n0394j53886l0693J47850
2975A57546R7627j00311L29310N9303k27996j67277k8241j0995K82186J20658
2965E11810n0758j01316J04541j8829k8704k07549L0095J78987k97333r2235O5051
2954I3760J76880p7578l6966K58409n0664P4148K0620j38680P9904L861p8252
2943C25442k11333K03343L4767k4253l267K20233l03985j41657R1947k8477o1343
2932A01417J82512J34916p9225k52136J1482p5203L5157q9045J31330O0985k62247
2921a00057K09674O3698J6190j40595j91691K99573K18426N5356Q4391j84570
2911C30395M3314P4225o2952j54646k5334k06875q2168J19168P7421R076P9116
$$ plain form
2900 200740 185837 313397 261559 168830 541907 483713 153170 250601 288644 209647 347641
2889 347641 352261 56729 -10442 -52727 -15338 253910 157469 180829 61729 -44681 -1907
2878 -1907 253460 332651 156863 212058 262357 408257 251242 104777 282788 27782 94520
2867 94520 35164 106400 173647 74085 261365 323122 225202 155272 67424 325884 389337
2856 389337 102908 263353 406748 424313 198587 154426 65894 -10818 -139200 8857
2846 8857 -143297 7259 -13624 167211 376599 115345 16101 -12247 526 228738 348295
2835 348295 280750 121715 103053 196453 -47346 -93258 31470 54116 -81650 -26399 -53432
2824 -53432 64554 140068 53926 -112640 -27766 227375 280821 88130 -5764 -50778 -40230
$$ packed form
2900B00740j4903J27560n1838r2729L73077n8194l30543R7431L8043p8997J37994
2889C47641M620k95532o7171m2285L7389K69248r6441K3360j19100j06410M2774
2878a907K55367P9191j75788N5195N0299J45900j57015j46465J78011k55006O6738
2867I4520n9356P1236O7247r9562J87280O1757r7920o9930q7848K58460O3453
2856C89337k86429J60445J43395J7565k25726m4161q8532p6712j28382J48057
2846H857j52154J50556k0883J80835K09388k61254r9244k8348J2773K28212J19557
2835C48295o7545j59035j8662R3400k43799m5912J24728K2646j35766N5251k7033
2824e3432J17986P5514q6142j66566Q4874K55141N3446j92691r3894m5014J0548
$$ plain form
2813 -40230 119705 194169 150109 92997 140729 69224 323284 41124 -62613 -35383 -205790
2802 -205790 -121954 -282244 -116840 30043 155521 226491 113275 17154 -133203 -27075
2792 -27075 130990 4893 13434 -117929 4761 128335 90515 -7835 -11294 181605 105464
2781 105464 79576 -45844 136897 236279 179322 92877 96577 162282 86981 -96541 -4297
2770 -4297 -223326 -144743 -2829 -177254 -129118 117493 95642 -163166 -121046 -39737 -149
2759 -149 192653 158477 106744 103387 -212429 -106982 123668 -138442 88320 -147319 -245114
2748 -245114 -184240 -243070 -68386 -177166 -232235 -46571 -12038 -150777 2969 176775
2738 176775 248034 21145 -4147 -140262 -124067 -72579 -125512 -310833 -162022 -48968 -71516
$$ packed form
2813d0230J59935P4464m4060n7112M7732p1505K54060k82160j03737K7230j70407
2802b05790Q3836j60290J65404J46883J25478P0970j13216r6121j50357J06128
2792b7075J58065j26097Q541j31363J22690J23574l7820r8350l459J92899p6141
2781A05464k5888j25420J82741R9382n6957q6445L700O5705p5301j83522R2244
2770d297k19029P8583J41914j74425M8136K46611k1851k58808M2120Q1309L9588
2759a49J92802l4176n1733l357l15816J05447K30650k62110K26762k35639r7795
2748b45114O0874n8830J74684j08780n5069J85664L4533j38739J53746J73806
2738A76775P1259k26889k5292j36115J6195N1488n2933j85321J48811J13054k2548
$$ plain form
2727 -71516 -86230 -1381 63899 111213 -17367 -119056 111480 -35695 -207354 -249671 -207222
2716 -207222 -133075 26187 133563 -66533 39720 57347 76553 292272 421431 281481
2706 281481 413999 416926 240662 -9608 53276 -17385 -74273 -57191 137853 137053 165193
2695 165193 211565 233332 79796 -26499 43062 -141273 -225344 -182431 27562 219963 136446
2684 136446 96397 185412 -3647 -15290 -145580 -188230 78427 119241 28875 39105 -174171
2673 -174171 -98838 -200947 -210272 -304132 -168818 28944 42665 -2702 -21999 95499 25737
2662 25737 144479 -40488 134855 295484 141958 125886 43121 -260122 -369864 -221276
2652 -221276 -87343 -8485 -71979 -173922 -153531 -16568 -54701 127339 249624 17182
$$ packed form
2727g1516j4714Q4849O5280M7314j28580j01689K30536j47175j71659m2317M2449
2716b07222P4147J59262J07376k00096J06253J7627J9206K15719J29159j39950
2706B81481J32518K927j76264k50270O2884p0661n6888J7082J95044q00K8140
2695A65193M6372K1767j53536j06295O9561j84335q4071M2913K09993J92401q3517
2684A36446m0049Q9015j89059j1643j30290m2650K66657M0814r0366J0230k13276
2673a74171P5333j02109r325r3860J35314J97762J3721m5367j9297J17498o9762
2662B5737J18742j84967J75343J60629j53526j6072q2765l03243j09742J48588
2652b21276J33933P8858o3494j01943K0391J36963l8133J82040J22285k32442
$$ plain form
2642 17182 -101449 -28335 -60691 -80082 -96193 -41357 55735 -24379 -23099 101171 199699 169473
2630 169473 256612 88243 -179935 -35685 -119715 -198091 -197440 -34708 148876 140322 89422
2619 89422 141978 157369 16518 -138471 -156549 -207313 -184946 -158307 -110184 -138826 -192017
2608 -192017 -52253 161725 227149 -22027 95574 284083 120286 -57619 -201120 -156765
2598 -156765 -253907 21546 -116167 -59892 -5112 -56536 -184586 -202085 -49614 71100 159432
2587 159432 -23224 -133776 -4121 257139 78033 80240 17719 -17652 -66257 67038 99851
2576 99851 -45665 -61582 82125 149427 -14088 -139515 -111377 24654 3141 -146585 -183728
2565 -183728 -19907 -82563 -14188 -31013 9011 -31504 107381 232588 67162 53031 10701
$$ packed form
2642A7182j18631P3114l2356j9391j6111N4836R7092q0114J280J24270R8528l0226
2630A69473Q7139j68369k68178J44250q4030p8376O51J62732J83584q554n0900
2619H9422N2556J5391j40851j54989j8078n0764K2367K6639M8123k8642n3191
2608a92017J39764K13978O5424k49176J17601J88509j63797j77905j43501M4355
2598a56765r7142K75453j37713N6275N4780n1424j28050j7499J52471J20714Q8332
2587A59432j82656j10552J29655K61260j79106K207o2521l5371m8605J33295L2813
2576I9851j45516j5917J43707O7302j63515j25427K8138J36031k1513j49726l7143
2565a83728J63821o2656O8375j6825M0024m0515J38885J25207j65426j4131m2330
$$ plain form
2554 10701 -10817 -84958 -67776 -312769 -154069 -84111 11556 -32653 -22032 74627 213
2543 213 22285 -179937 81057 62356 -149458 112300 -1870 20847 179397 69900 155287
2532 155287 329831 159332 117691 102113 38110 63764 -52317 -83880 -72285 -147287 -41088
2521 -41088 135949 154591 145422 192706 102647 49288 -113028 -30078 79954 -21893 -56236
2510 -56236 70490 44596 -71341 -81337 -152493 -38921 -14531 67266 5050 -166091 -212498
2499 -212498 99371 56360 -13628 -75392 119613 376122 260729 107756 -86990 -10468
2489 -10468 18498 -26930 -86987 -179053 -38259 -90390 16504 45809 87629 -35015 -5700
2478 -5700 136500 113534 -16600 27774 48881 -58042 96464 -200560 -40631 82958 30025
$$ packed form
2554A0701k1518p4141J7182k44993J58700O9958R5667m4209J0621R6659p4414
2543B13K2072k02222K60994j8701k11814K61758j14170K2717J58550j09497Q5387
2532A55287J74544j70499m1641j5578o4003K5654j16081l1563J1595p5002J06199
2521d1088J77037J8642r169M7284r0059n3359j62316Q2950J10032j01847l4343
2510e6236J26726k5894j15937r996p1156J13572K4390Q1797o2216j71141m6407
2499b12498L11869m3011o9988o1764J95005K56509j15393j52973j94746P6522
2489a0468K8966m5428o0057r2066J40794n2131J06894K9305M1820j22644K9315
2478e700J42200k2966j30134M4374K1107j06923J54506k97024J59929J23589n2933
$$ plain form
2467 30025 -137321 -226109 -297757 -273366 -106136 49344 -76903 -285495 -249275 -117925 -133606
2456 -133606 -23204 35984 188883 219791 -40993 158052 139719 17884 14066 157165 12919
2445 12919 -98668 -67055 -152019 -73269 -190083 -83759 -224044 -172454 12058 155992 34079
2434 34079 -92867 60268 186395 230477 -75510 -192015 -240224 -47968 -90993 -159522 -96648
2423 -96648 -31919 -15131 -191800 -146082 -132227 104948 129140 41505 65321 -5324 25698
2412 25698 -25900 -89988 124277 187639 150046 21298 72671 -53493 -73414 -11727 -38966
2401 -38966 86348 674 66596 138161 120289 174818 -8501 77348 186829 104588 40524
2390 40524 -36961 -9181 -83279 10609 77796 167880 38813 91018 86447 106725 -29619 1009
$$ packed form
2467C0025j67346q8788p1648K4391J67230J55480j26247k08592L6220J31350j5681
2456a33606J10402N9188J52899L0908k60784J99045j8333j21835l818J43099j44246
2445A2919j11587L1613q4964P8750j16814J06324j40285N1590J84512J43934j21913
2434C4079j26946J53135J26127M4082l05987j16505m8209J92256m3025o8529O2874
2423i6648O4729J6788j76669M5718J3855K37175K4192q7635K3816p0645L1022
2412B5698n1598o4088K14265O3362l7593j28748N1373j26164j9921O1687k7239
2401c8966J25314q5674O5922P1565j7872N4529j83319Q5849J09481q2241o4064
2390D0524p7485K7780p4098R3888O7187R0084j29067N2205m571K0278j36344L0628
$$ plain form
2378 1009 175588 156065 121871 162714 110018 -3669 15193 55704 75407 183638 166962
2367 166962 35163 -78328 2545 154615 116876 -18730 -47064 3560 171949 216414 271520
2356 271520 269372 373243 580907 587004 429259 313545 210672 416677 190958 142051 311482
2345 311482 301334 192438 232504 341963 274509 367777 251130 232830 -73992 42860 120890
2334 120890 9251 -18262 -58741 135263 95405 114471 201811 -39942 -121041 -71481 -39639
2323 -39639 -29558 60343 90133 137653 -52915 -94412 50278 144184 120476 -30153 20136
2312 20136 -47838 49819 60955 206127 253201 248648 238824 235692 219128 117879 189428 111801
2300 111801 97444 171834 55725 52749 95886 61155 -100955 -40956 56389 -21197 71224
$$ packed form
2378A009J74579j9523l4194M0843n2696j13687J8862M0511J9703J08231j6676
2367A66962j31799j13491Q0873J52070l7739j35606k8334N0624J68389M4465N5106
2356B71520k148J03871K07664O097j57745j15714j02873K06005k25719m8907J69431
2345C11482j0148j08896M0066J09459o7454R3268j16647j8300l06822J16852P8030
2334A20890j11639k7513m0479J94004l9858J9066Q7340k41753q1099M9560L1842
2323c9639J0081Q9901K9790M7520j90568m1497J44690R3906k3708j50629N0289
2312B0136o7974R7657J1136J45172M7074m553r824l132j6564j01249P1549p7627
2300A11801j4357P4390j16109k976M3137l4731j62110N9999R7345p7586R2421
$$ plain form
2289 71224 12542 -112313 -188568 -130784 -3129 151544 157350 303877 198901 22306 -112112
2278 -112112 57461 178070 132738 229691 201571 151259 167604 212748 306814 226270 105068
2267 105068 40481 -104619 -230279 -99511 -84466 14541 135553 203139 175603 150386 160633
2256 160633 130312 130658 134066 198470 218319 246508 268131 173847 60905 160462 67273 157733
2244 157733 4213 -17816 37327 175702 246431 81882 -1404 91979 53971 72268 202953
2233 202953 343403 487605 409798 496812 480435 460299 459003 463548 451487 331906 437718
2222 437718 387861 75679 270947 399221 394892 349063 343910 231755 222172 154740 301830
2211 301830 388259 386722 335990 387324 442891 488992 373591 393826 374839 270742 243773
$$ packed form
2289G1224n8682j24855p6255N7784J27655J54673N806J46527j04976j76595j34418
2278a12112J69573J20609m5332R6953k8120n0312J6345M5144R4066q0544j21202
2267A05068o4587j45100j25660J30768J5045R9007J21012O7586k7536k5217J0247
2256A60633l0321L46L408O4404J9849K8189K1623r4284j12942R9557r3189R0460
2244A57733j53520k2029N5143J38375P0729j64549q3286R3383l8008J8297J30685
2233B02953J40450J44202p7807Q7014j6377k0136j296M545j2061j19581J05812
2222D37718m9857l12182J95268J28274m329m5829n153j12155r583o7432J47090
2211C01830Q6429j537n0732N1334N5567M6101j15401K0235j8987j04097k6969
$$ plain form
2200 243773 342837 551523 551242 557091 575837 696006 452221 463808 483457 483500 576579 481351
2188 481351 435975 517906 769852 733388 668392 797100 619964 832386 831636 638973 638969 884850
2176 884850 973915 940312 798065 805830 874042 990684 1118446 1048390 974844 1045161 1337539
2165 1337539 1196276 1176992 1374078 1333417 1513258 1551063 1584293 1703954 1672043 1506682
2155 1506682 1440031 1437522 1438809 1597553 1796486 1865015 1872624 1795238 1790985 1987783 2037061 2023973
2143 2023973 1976015 2034886 2063598 2247198 2355577 2554515 2493759 2499109 2658857 2804020 2879068
2132 2879068 2913294 2958916 2996391 3269139 3255782 3237236 3456072 3744956 3925820 4050602
2122 4050602 4079566 4125073 4455167 4787217 4979594 5354832 5790944 6007921 6217677 6503542
$$ packed form
2200B43773R9064K08686k81N849J8746J20169k43785J1587J9649M3R3079r5228
2188D81351m5376Q1931K51946l6464o4996J28708j77136K12422p50j92663mK45881
2176H84850Q9065l3603j42247P765O8212J16642J27762p0056p3546P0317K92378
2165A337539j41263j9284J97086m0661J79841L7805L3230J19661l1911j65361
2155A506682o6651k509J287J58744J98933O8529P609p7386m253J96798M9278j3088
2143B023973m7958N8871K8712J83600J08379J98938o0756N350J59748J45163P5048
2132B879068L4226M5622L7475K72748j3357j8546K18836K88884J80864J24782
2122D050602K8964M5507L30094L32050J92377L75238M36112K16977K09756K85865
$$ plain form
2112 6503542 6858429 7076932 7579798 7917158 8318573 9036137 9525148 10425245 11337409 12543613
2102 12543613 13392611 14021629 14819718 16189361 17531769 19199181 21404712 24070222 27188013
2093 27188013 31594983 36953274 44071712 54107459 67372480 79916043 85774288 79431149
2085 79431149 63555052 49271660 39077623 32368997 27435869 23317009 20407429 17904358
2077 17904358 16195084 14819345 13871099 13282669 12760640 12065783 11085542 10212238 9293172
2068 9293172 8589133 7984986 7689553 7143444 6836044 6230991 5855317 5749776 5506985 4899279
2058 4899279 4687802 4576455 4222340 4101647 3866722 3720203 3774526 3641254 3363759 3094133
2048 3094133 2923555 2950072 2720872 2671832 2633379 2673590 2625299 2423787 2321323 1907496
$$ packed form
2112F503542L54887K18503N02866L37360M01415P17564M89011R00097R12164J206204
2102A2543613Q48998O29018P98089J369643J342408J667412K205531K665510L117791
2093B7188013M406970N358291P118438J0035747J3265021J2543563N858245o343139
2085G9431149j5876097j4283392j0194037o708626m933128m118860k909580k503071
2077A7904358j709274j375739r48246n88430n22029o94857r80241q73304r19066
2068I293172p04039o04147k95433n46109l07400o05053l75674j05541k42791o07706
2058D899279k11477j11347l54115j20693k34925j46519N4323j33272k77495k69626
2048C094133j70578K6517k29200m9040l8453M0211m8291k01512j02464m13827
$$ plain form
2038 1907496 2082836 2065415 1799445 1982348 1933436 2081894 1973581 1811622 1667881 1579934
2028 1579934 1669812 1695573 1691824 1483181 1552672 1560868 1578711 1434208 1378934 1354837 1385855
2017 1385855 1534693 1400253 1288788 1391244 1179897 1017617 804539 942754 988050 1176073
2007 1176073 1160028 952418 682859 881963 1046395 914296 954693 909367 790069 770940
1997 770940 801735 590853 761069 764176 802941 772709 756828 596272 437954 663297 860094
1986 860094 647599 605816 652841 749137 708020 740365 610993 328192 336493 415938 304821
1975 304821 438856 459837 489905 544808 797170 752910 505176 478748 552610 601819 634400
1964 634400 597086 451974 375077 441295 342180 417909 484129 396365 366575 340697 528858
$$ packed form
2038A907496J75340j7421k65970J82903m8912J48458j08313j61959j43741q7947
2028A579934Q9878K5761l749k08643O9491Q196J7843j44503n5274k4097L1018
2017A385855J48838j34440j11465J02456k11347j62280k13078J38215M5296J88023
2007A176073j6045k07610k69559J99104J64432j32099M0397m5326j19298j9129
1997G70940L0795k10882J70216L107L8765l0232j5881j60556j58318K25343J96797
1986H60094k12495m1783M7025R6296m1117L2345j29372k82801Q301P9445j11117
1975C04821J34035K0981L0068N4903K52362m4260k47734k6428P3862M9209L2581
1964F34400l7314j45112p6897O6218r9115P5729O6220q7764k9790k5878J88161
$$ plain form
1953 528858 450280 284029 176535 256000 248673 327971 386603 190920 257279 350808 224827
1942 224827 297680 324139 330299 355371 419512 264961 200808 115230 201681 288117 234550 334805
1930 334805 208411 145233 228053 261198 110620 365954 241288 220750 203761 298329 458767
1919 458767 232346 214557 320849 345625 275452 295742 397853 386105 307330 335318 267508
1908 267508 284329 270030 256606 272840 102449 65928 149248 267647 159780 223818 163167
1897 163167 123670 55467 37799 63240 16979 80931 160452 182775 -50542 -43674 -150496
1886 -150496 -75276 111925 119581 145282 118549 212695 169495 121798 56563 26714 191155
1875 191155 189514 105464 -11683 -15665 -19635 -130151 -79126 14109 18762 100274 110809 53805
$$ packed form
1953E28858p8578j66251j07494P9465p327P9298N8632j95683O6359R3529j25981
1942B24827P2853K6459O160K5072O4141j54551o4153q5578Q6451Q6436n3567J00255
1930C34805j26394o3178Q2820L3145j50578K55334j24666k0538j6989R4568J60438
1919D58767k26421j7789J06292K4776p0173K0290J02111j1748p8775K7988o7810
1908B67508J6821j4299j3424J6234j70391l6521Q3320J18399j07867O4038o0651
1897A63167l9497o8203j7668K5441m6261O3952P9521K2323k33317O868j06822
1886a50496P5220J87201P656K5701k6733R4146m3200m7697o5235k9849J64441
1875A91155j641q4050j17147l982l970j10516N1025R3235M653Q1512J0535n7004
$$ plain form
1863 53805 34699 149473 -1193 -27092 142007 108580 -57492 -77103 -5598 6285 194229
1852 194229 145735 156342 226495 234369 354417 55372 52319 77717 -32527 -52495 -270002
1841 -270002 -111181 -108933 -71551 143040 295266 147910 36603 26246 -122151 -50849 -205239
1830 -205239 -14849 199557 215316 90499 116994 208895 317611 352878 238737 421373
1820 421373 492134 484763 417335 424011 506566 419434 396632 234081 410436 261698 360619
1809 360619 343460 175557 292336 249761 234206 97801 287895 442267 105225 -14327
1799 -14327 76529 -119709 -105886 70539 37260 9457 38497 143077 90072 -42872 -124036
1788 -124036 -139033 30491 4658 -112935 -48878 38556 149435 25317 124157 255675 132268
$$ packed form
1863E3805j9106J14774j50666k5899J69099l3427j66072j9611P1505J1883J87944
1852A94229m8494J0607P0153P874J20048k99045l053K5398j10244j9968k17507
1841b70002J58821K248L7382K14591J52226j47356j11307j0357j48397P1302j54390
1830b05239J90390K14406J5759j24817K6495R1901J08716L5267j14141J82636
1820D21373P0761p371o7428O676Q2555q7132k2802j62551J76355j48738R8921
1809C60619j7159j67903J16779m2575j5555j36405J90094J54372l37042j19552
1799a4327R0856j96238J3823J76425l3279k7803K9040J04580n3005j32944q1164
1788a24036j4997J69524k5833j17593O4057Q7434J10879j24118R8840J31518j23407
$$ plain form
1777 132268 -37848 -38098 -17615 -186908 -153454 -134294 1337 121960 -29799 -12112 95740
1766 95740 207205 176694 50878 138232 30405 145321 154080 148172 4852 65300 99714
1755 99714 -61735 -113771 -176743 -103554 -2355 57456 145818 166396 -37539 -55016 11313
1744 11313 61460 -62712 -114796 -161457 -340971 -80004 139549 47077 5807 86513 -33527
1733 -33527 39217 18173 65200 -193005 -210817 -74953 -13294 178312 151576 -32733 -40323
1722 -40323 -184814 -166876 -50423 -132118 23028 26459 106106 75207 95261 31504 -26254
1711 -26254 -126182 -290222 -91022 126430 116895 106534 -50447 -32655 49486 -3585 -10721
1700 -10721 -82676 74208 73059 -112108 -195523 -98202 121968 96637 109800 -2296 -30120
$$ packed form
1777A32268j70116k50K0483j69293L3454J9160J35631J20623j51759J7687J07852
1766I5740J11465l0511j25816Q7354j07827J14916Q759n908j43320O0448L4414
1755I9714j61449n2036o2972P3189J01199N9811Q8362K0578k03935j7477O6329
1744A1313N0147j24172n2084m6661j79514K60967K19553r2472m1270Q0706j20040
1733c3527P2744k1044M7027k58205j7812J35864O1659J91606k6736j84309p590
1722d0323j44491J7938J16453q1695J55146L431P9647l0899K0054o3757n7758
1711b6254r9928j64040J99200K17452r535j0361j56981J7792Q2141n3071p136
1700a0721p1955J56884j149j85167q3415R7321K20170k5331J3163j12096k7824
$$ plain form
1689 -30120 67731 -89250 -133077 -136721 -56539 -91209 -218336 -189031 -48161 175183 106866
1678 106866 38406 3019 -96374 -96159 -209513 -297891 -90517 -44583 -74672 -139522 -162353 -72211
1666 -72211 -70802 -13844 -322986 -293667 -235110 -214987 -130207 -296848 -270316 -257090 -358492
1655 -358492 -216437 -76927 -43116 -126114 110162 83799 -66883 -46282 21237 149623 -6874
1644 -6874 12229 153579 226874 91152 74730 76891 -129701 29925 22942 -63227 -85628 -250923
1632 -250923 -175211 -151229 -143394 26916 57683 219816 218721 58400 246310 162994 265549
1621 265549 335057 334451 289217 135333 -112610 -201865 -70087 52855 -73625 -119842 -184609
1610 -184609 -15224 -67674 -223792 -173226 -253609 -185373 -58914 -86507 -61807 -166441 -126395
$$ packed form
1689c0120R7851j56981m3827l644Q0182l4670j27127K9305J40870K23344o8317
1678A06866o8460l5387r9393K15j13354q8378K07374M5934l0089o4850k2831R0142
1666g2211J409N6958l09142K9319N8557K0123Q4780j66641K6532J3226j01402
1655c58492J42055J39510L3811q2998K36276k6363j50682K0601O7519J28386j56497
1644f874J9103J41350P3295j35722j6422K161k06592J59626o983q6169k2401j65295
1632b50923P5712K3982P835J70310L0767J62133j095j60321J87910q3316J02555
1621B65549O9508o06m5234j53884k47943q9255J31778J22942j26480m6217o4767
1610a84609J69385n2450j56118N0566q0383O8236J26459k7593K4700j04634M0046
$$ plain form
1599 -126395 -26832 10931 159836 243940 47032 17262 -132340 -94710 51045 180154 14702
1588 14702 -210517 -200097 -153744 -263482 -24106 69547 -9092 21296 -163960 -138824 116962
1577 116962 307074 62940 189587 -87760 -222750 46611 21804 -86371 -70412 -101795
1567 -101795 -10817 -117681 -81524 -15069 -54834 -27369 88240 188976 63991 -30797 -189233
1556 -189233 -127744 -27154 3895 -112216 -76012 103369 177263 172946 2061 -40483 -247410
1545 -247410 -56196 173626 -82390 133296 189061 54051 -12050 113939 159097 123896
1535 123896 20988 -44254 47444 73475 111621 120558 136027 -24793 -2371 -75564 -40611
1524 -40611 -45880 81565 48412 95673 81987 -43417 -23406 174894 16402 -38941 -35644
$$ packed form
1599a26395R9563L7763J48905Q4104j96908k9770j49602L7630J45755J29109j65452
1588A4702k25219J0420M6353j09738K39376R3653p8639L0388j85256K5136K55786
1577A16962J90112k44134J26647k77347j34990K69361k4807j08175J5959l1383
1567a01795R0978j06864L6157O6455l9765K7465J15609J00736j24985r4788j58436
1556a89233O1489J00590L1049j16111L6204J79381P3894m317j70885m2544k06927
1545b47410J91214K29822k56016K15686N5765j35010o6101J25989M5158l5201
1535A23896j02908o5242R1698K6031L8146Q937J5469j60820K2422p3193L4953
1524d0611n269J27445l3153M7261j3686j25404K0011J98300j58492n5343L297
$$ plain form
1513 -35644 -79395 31633 123018 223256 31674 -65401 49594 65872 -15703 49603 85979
1502 85979 65003 -8486 -103524 -146369 -34719 36840 76021 -73394 -89776 -42904 -6419
1491 -6419 -3917 -66081 -171458 -250667 13199 -156789 -261618 -273598 -128191 -45823 17943
1480 17943 -13675 43921 199951 137753 -73063 -203720 -327111 -260034 -208720 -214737 -348649
1469 -348649 -317815 -200807 -64375 36145 -54930 -67567 -249724 -255748 -341234 -49941 -96775
1458 -96775 -349795 -303457 -93063 -995 123408 106050 70448 123135 37587 -141243 16723
1447 16723 -12388 11447 118118 -40228 -73979 19397 174933 201409 86831 -60865 -106414
1436 -106414 -17081 -35597 67754 23769 -92588 -23476 -20645 36421 -116898 -48301 69116
$$ packed form
1513c5644m3751J11028R1385J00238j91582r7075J14995J6278q1575O5306L6376
1502H5979k0976p3489r5038m2845J11650P1559L9181j49415j6382M6872L6485
1491f419K502o2164j05377p9209K63866j69988j04829j1980J45407Q2368O3766
1480A7943l1618N7596J56030o2198k10816j30657j23391O7077N1314o017j33912
1469c48649L0834J17008J36432J00520r1075j2637j82157o024q5486K91293m6834
1458i6775k53020M6338K10394R2068J24403j7358l5602N2687q5548j78830J57966
1447A6723k9111K3835J06671j58346l3751R3376J55536K6476j14578j47696m5549
1436a06414Q9333j8516J03351m3985j16357O9112K831N7066j53319O8597J17417
$$ plain form
1425 69116 -34542 -137155 43738 74278 186819 186723 -56278 -123683 -108300 -122750 -53579
1414 -53579 -107291 -193884 -223609 -163318 -94724 -173140 -62834 -122616 -162062 3354 -52125
1403 -52125 -131140 -254975 -156045 -80432 -107656 -127741 -46543 134683 4729 -63768 43941
1392 43941 78827 -2859 43314 -7421 -24771 -253230 -202846 -331735 37420 98660 69378
1381 69378 97285 -409 -68546 -99477 36660 194747 -49717 -29803 -178994 -222202 -166292
1370 -166292 -215113 15413 94423 103907 19668 40034 23994 -67314 -276560 -140153 -171036
1359 -171036 -143157 -67270 88896 87208 49940 -17130 -1053 13247 -72607 85733 -71309
1348 -71309 -110074 -185578 -206236 -156778 -73876 85134 182312 276419 225188 220420 -1525 -271400
$$ packed form
1425F9116j03658j02613J80893L0540J12541r6k43001o7405J5383j4450O9171
1414e3579n3712q6593k9725O0291O8594p8416J10306n9782l9446J65416n5479
1403e2125p9015j23835R8930P5613k7224k0085Q1198J81226j29954o8497J07709
1392D3941L4886q1686M6173n0735j7350k28459N0384j28889L69155O1240k9282
1381F9378K7907r7694o8137l0931J36137J58087k44464J9914j49191m3208N5910
1370a66292m8821K30526P9010R484q4239K0366j6040r1308k09246J36407l0883
1359a71036K7879P5887J56166j688l7268o7070J6077J4300q5854J58340j57042
1348g1309l8765p5504k0658M9458Q2902J59010R7178R4107n1231m768k21945k69875
$$ plain form
1336 -271400 -232596 -30198 -80516 -80292 -298078 -281041 -161937 -31012 -134377 -25731 -6159
1325 -6159 40769 15602 -74909 -132946 -175029 -238839 -290743 -159416 -31249 -88006 -50507 75915
1313 75915 89237 -59388 -116031 -212442 -202444 -133871 -245677 -56028 -201277 -282802 -83699
1302 -83699 -120226 -70977 96037 153359 23000 156106 288955 70957 -18769 -17031 114660
1291 114660 -119896 -203869 -64023 -72840 -164802 -169875 -138556 -141389 -161889 -141533 -138888 -294787
1279 -294787 -190827 109542 10998 -325592 -127130 100641 175413 70590 107944 143003
1269 143003 15995 -70190 -159497 -288627 -193540 -77896 -71782 256650 211187 67436 -170761
1258 -170761 -226330 -159498 -73567 3957 -120315 -85761 -239191 -47457 97574 19706 15423
$$ packed form
1336b71400L8804K02398n0318K24k17786J7037J19104J30925j03365J08646J9572
1325f159M6928k5167r0511n8037m2083o3810n1904J31327J28167n6757L7499J26422
1313G5915J3322j48625n6643r6411R998O8573j11806J89649j45249q1525J99103
1302h3699l6527M9249J67014N7322j30359J33106J32849k17998q9726J738J31691
1291A14660k34556q3973J39846q817r1962n073L1319k833k0500K0356K645j55899
1279b94787J03960L00369r8544l36590J98462K27771P4772j04823L7354L5059
1269A43003j27008q6185q9307j29130R5087J15644O114L28432m5463j43751k38197
1258a70761n5569O6832Q5931P7524j24272L4554j53430J91734J45031p7868m283
$$ plain form
1247 15423 61942 111552 -173502 -272206 16535 -131998 -165432 -112632 -202095 -84740 27474
1236 27474 35123 -6854 -162039 -95679 -232762 -233183 21776 -24077 -159196 -135301 54769
1225 54769 -97964 -93109 -137936 -241488 -249489 -225553 -67828 11432 -63419 106307 188566
1214 188566 191978 141315 189359 -114936 -113662 -70421 -110145 24065 99071 43791 58135 83256
1202 83256 -20357 -28829 37374 -46267 6226 -41554 66413 -64495 -168828 -109856 -151135
1191 -151135 8145 38690 -37257 -86678 77552 30295 27599 28041 109530 122112 21683 -92760
1179 -92760 -252046 -2126 -118166 -376429 -180971 67886 94091 76337 24947 102616 362142
1168 362142 259258 140602 -51445 -247001 -220748 -161821 -49771 121718 100212 10905
$$ packed form
1247A5423M6519M9610k85054r8704K88741j48533l3434N2800q9463J17355J12214
1236B7474P649m1977j55185O6360j37083m21K54959m5853j35119K3895J90070
1225E4769j52733M855m4827j03552q001K3936J57725P9260p4851J69726Q2259
1214A88566L412n0663M8044l04295J274M3241l9724J34210P5006n5280J4344K5121
1202H3256j03613q472O6203q3641N2493m7780J07967j30908j04333N8972m1279
1191a51135J59280L0545p5947m9421J64230m7257k696M42Q1489J2582j00429j14443
1179i2760j59286K49920j16040k58263J95458K48857K6205j7754n1390P7669K59526
1168C62142j02884j18656j92047j95556K6253N8927J12050J71489k1506q9307
$$ plain form
1158 10905 -34962 157635 126615 117367 15573 -84992 -131419 -232626 -39835 -40681 20312
1147 20312 -25601 -13714 156630 69195 82587 -63224 -221003 -198945 -147302 144576 322420
1136 322420 126062 -79326 -213387 -186086 -93316 51471 3465 -209431 -128809 64349
1126 64349 -141399 -99441 60464 -15462 17852 131773 135773 -39881 -108080 7621 91260
1115 91260 40410 -175978 -152972 68337 -31920 -205459 77935 111710 59894 -96165 -141854
1104 -141854 -191494 -167177 -1433 -55360 -144868 -156673 -81592 80744 37381 50324 116210
1093 116210 55458 165696 99748 137620 41594 52235 -74640 -96237 -18293 62254 67163
1082 67163 123980 -64455 -4857 245064 26832 132671 221512 82682 103441 49504 107347
$$ packed form
1158A0905m5867J92597l1020r248j01794j00565m6427j01207J92791q46O0993
1147B0312m5913J1887J70344q7435J3392j45811j57779K2058N1643K91878J77844
1136C22420j96358k05388j34061K7301R2770J44787m8006k12896Q0622J93158
1126F4349k05748M1958J59905p5926L3314J13921M000j75654o8199J15701Q3639
1115I1260n0850k16388K3006K21309j00257j73539K83394L3775n1816j56059m5689
1104a41854m9640K4317J65744n3927q9508j1805P5081J62336m3363J2943O5886
1093A16210o0752J10238o5948L7872r6026J0641j26875k1597P7944Q0547M909
1082F7163N6817j88435N9598K49921k18232J05839Q8841j38830K0759n3937N7843
$$ plain form
1071 107347 -181855 -326907 -56493 -223428 -226732 54018 -33560 -56497 -124102 -147226 -216516
1060 -216516 -384528 -234960 59111 110679 91936 48633 -59885 -50072 -7266 -148949 -133861
1049 -133861 -183375 -426330 -91279 -28330 -80719 -8920 -51279 -27410 53767 166405 -100150
1038 -100150 -168677 5378 -47979 -106235 -34871 103349 -107080 -184432 -117135 134193 73294
1027 73294 31156 -62296 -267401 -55235 -169461 -135648 -110470 -173534 -55114 -157259 64117
1016 64117 201454 117989 50889 67594 12074 26577 209158 290618 47688 13696 70347
1005 70347 -158802 17630 182079 38015 76768 36020 142911 -74046 -183900 50709
995 50709 129015 75319 -55364 30333 54251 94645 -13356 138082 72951 42099 -46286
$$ packed form
1071A07347k89202j45052K70414j66935l304K80750q7578k2937o7605k3124o9290
1060b16516j68012J49568K94071N1568j8743m3303j08518R813M2806j41683J5088
1049a33861m9514k42955L35051O2949n2389P1799m2359K3869Q1177J12638k66555
1038a00150o8527J74055n3357n8256P1364J38220k10429p7352O7297K51328o0899
1027G3294m2138r3452k05105K12166j14226L3813K5178o3064J18420j02145K21376
1016F4117J37337q3465o7100J6705n5520J4503J82581Q1460k42930l3992N6651
1005G0347k29149J76432J64449j44064L8753m0748J06891k16957j09854K34609
995E0709P8306n3696j30683Q5697K3918M0394j08001J51438o5131l0852q8385
$$ plain form
984 -46286 -177858 -1836 195139 279630 99314 132243 -47809 16322 120996 26996 -123634
973 -123634 -226961 -9230 109352 -59180 -14967 -199536 -132886 213565 37800 83901
963 83901 -23639 -27143 57070 -185184 -20440 10543 -130067 -93673 -176163 -5852 250198
952 250198 99218 14701 -37683 -85471 -143656 66654 109272 -14587 10520 -213012 15791
941 15791 77221 5576 -116276 33551 -6472 -23503 -275379 -310692 60857 -124600 -181118
930 -181118 -105746 -100565 -141068 -303068 -168837 -104526 15065 85806 -9091 -120574 -1174
919 -1174 -77974 -11646 -21956 38395 85779 20136 -47843 -74628 28002 42069 1120 -52879
907 -52879 -206965 -14162 104851 178593 187204 114048 32486 73457 186772 123875 289194
$$ packed form
984d6286j31572J76022J96975Q4491j80316L2929j80052O4131J04674r4000j50630
973a23634j03327K17731J18582j68532M4213j84569O6650L46451j75765M6101
963H3901j07540l504Q4213k42254J64744L0983j40610L6394q2490J70311K56050
952B50198j50980q4517n2384m7788n8185K10310M2618j23859K5107k23532K28803
941A5791O1430p1645j21852J49827m0023j7031k51876l5313L71549j85457n6518
930a81118P5372N181m0503j62000J34231O4311J19591P0741r4897j11483J19400
919a174p6800O6328j0310O0351M7384o5643o7979k6785J02630J4067m0949n3999
907e2879j54086J92803J19013P3742Q611p3156q1562M0971J13315o2897J65319
$$ plain form
896 289194 68548 -232848 -221176 -221237 -121028 -116591 -161872 -57264 37727 2572 -88630 -70991
884 -70991 -105426 -11786 -69788 4043 -19703 34549 133281 161332 126415 48194 -133573 -111046
872 -111046 -81955 -40986 35585 61300 -53029 -111068 -137127 -62337 56217 -89550 -95449
861 -95449 -5735 9361 -55325 -128037 -100991 -150775 -75950 -180410 -104874 -177528 -80000 -20191
849 -20191 55426 123666 117123 121524 78819 142650 93152 57560 101204 86943 125952 8170
837 8170 -11938 7879 180358 207528 14635 -25240 15573 98947 -61448 -125824 52246
826 52246 141279 177015 -81163 42091 -116915 -19778 112925 -8511 -88979 -101595 -68433
815 -68433 -88958 -159352 -119130 -202545 -248403 806 18745 113808 69277 51756 -6819 23205
$$ packed form
896B89194k20646l01396J1672o1J00209M437m5281J04608R4991l5155r1202J7639
884g0991l4435R3640n8002P3831k3746N4252R8732K8051l4917p8221j81767K2527
872a11046K9091M0969P6571K5715j14329n8039k6059P4790J18554j45767n899
861i5449Q9714J5096o4686p2712K7046m9784P4825j04460P5536p2654R7528N9809
849b0191P5617O8240o543M401m2705O3831m9498l5592M3644j4261L9009j17782
837H170k0108J9817J72479K7170j92893l9875M0813Q3374j60395o4376J78070
826E2246Q9033L5736k58178J23254j59006R7137J32703j21436q0468j2616L3162
815f8433k0525p0394M0222q3415m5858K49209J7939R5063m4531j7521n8575L0024
$$ plain form
803 23205 -110701 3757 -102549 -126993 -37336 51263 23097 -108166 -106367 -5460 100536
792 100536 90509 -77304 -83546 79447 115322 40628 238043 244495 165498 164741 51200 -32578
780 -32578 102955 229540 345227 299022 194010 104496 30570 -158574 -47131 113303 54424
769 54424 -116147 -263024 -57859 -36928 -120370 61367 71127 -78205 -210031 -167464 -7104
758 -7104 229636 155586 126987 87814 -5930 -11365 203913 259557 172707 139620 70211 154101
746 154101 111654 65448 105448 141738 -113038 -257232 -35308 37667 -42867 100155 90880
735 90880 -168021 -173172 -147518 -2432 -14657 144718 -18092 -3966 -4706 87123 103740 86570
723 86570 102089 -99165 -99024 -6049 -82338 97323 225330 13820 -147689 -114464 124547
$$ packed form
803B3205j33906J14458j06306k4444Q9657Q8599k8166j31263J799J00907J05996
792A00536j0027j67813o242J62993L5875p4694J97415O452p8997p57j13541q3778
780c2578J35533J26585J15687m6205j05012q9514p3926j89144J11443J60434n8879
769E4424j70571j46877K05165K0931q3442J81737R760j49332j31826M2567J60360
758g104K36740p4050k8599l9173r3744n435K15278N5644q6850l3087o9409Q3890
746A54101m2447m6206M0000L6290k54776j44194K21924P2975q0534J43022r275
735I0880k58901n151K5654J45086j2225J59375j62810J4126p40R1829J6617j7170
723H6570J5519k01254J41R2975p6289J79661J28007k11510j61509L3225K39011
$$ plain form
712 124547 -35661 -131118 -18661 -109599 -128654 -77637 -235377 43340 90732 15351 -155535
701 -155535 -46725 -95988 -9799 30565 157442 -94888 -115612 -36933 75144 -225399 -116804
690 -116804 24294 -245142 -291694 -299241 -181316 -108417 2149 45832 198968 87424 -31783
679 -31783 67807 -3125 -11683 -40946 55977 1816 -69878 -55715 22986 48921 76417 -31238
667 -31238 -42045 -155311 -165639 220407 65 -25466 41753 113187 7937 -74155 -182556
656 -182556 -177162 -130121 -84818 -174250 -278425 -215365 -120431 -34307 18823 169493 141380 -152569
644 -152569 33084 117595 -137389 -69580 -45687 -20477 49882 173057 62979 -16541 -163003
633 -163003 -136509 -77080 -116136 124883 29096 -11732 76155 13016 78428 83144 102956 133066
$$ packed form
712A24547j60208r5457J12457r0938j9055N1017j57740K78717M7392p5381j70886
701a55535J08810m9263Q6189M0364J26877k52330k0724P8679J12077l00543J08595
690a16804J41098k69436m6552p547J17925P2899J10566M3683J53136j11544j19207
679c1783R9590p0932q558k9263R6923n4161p1694J4163P8701K5935K7496j07655
667c1238j0807j13266j0328L86046k20342k5531O7219P1434j05250q2092j08401
656a82556N394M7041M5303q9432j04175O3060R4934Q6124N3130J50670k8113k93949
644a52569J85653Q4511k54984O7809K3893K5210P0359J23175j10078p9520j46462
633a63003K6494N9429l9056K41019r5787m0828Q7887o3139O5412M716J9812L0110
$$ plain form
621 133066 2660 -145110 -145985 40293 106280 99445 -84571 -59240 -64444 101150 -7867
610 -7867 -121981 -26695 -9918 -6928 -32155 28149 -116448 -116535 -28899 22702 117484 158862 159690
597 159690 139891 187590 245654 201473 40020 -129113 -86669 81343 -23917 52879 -34133
586 -34133 -178474 -51853 41943 -10221 -338 72424 32920 24110 77460 99169 159886 166364
574 166364 10119 -85093 -35776 39661 -62241 70110 81718 154640 286359 325283 116288
563 116288 101771 95757 47530 -971 -120910 -13072 -7300 51451 100057 -61154 -178821
552 -178821 -106038 18602 118143 26330 118964 292422 298994 274255 131574 -35676 176638
541 176638 258719 187576 162175 100296 387501 144181 -24285 145636 199539 84376 148761
$$ packed form
621A33066j30406j47770q75J86278O5987o835j84016K5331n204J65594j09017
610g867j14114R5286J6777K990k5227O0304j44597q7Q7636N1601R4782M1378Q28
597A59690j9799M7699N8064m4181j61453j69133M2444J68012j05260P6796q7012
586c4133j44341J26621R3796n2164R883P2762l9504q810N3350K1709O0717O478
574A66364j56245r5212M9317P5437j01902J32351J1608P2922J31719L8924k08995
563A16288j4517o014m8227m8501j19939J07838N772N8751M8606j61211j17667
552a78821P2783J24640R9541r1813R2634J73458O572k4739j42681j67250K12314
541A76638Q2081p1143k5401o1879K87205k43320j68466J69921N3903j15163O4385
$$ plain form
530 148761 11918 56221 44809 -114907 84826 154934 187583 38209 76413 118938 179651
519 179651 -9109 60026 97558 11952 -65015 -46957 152318 182867 207226 103537 78937
508 78937 119933 16132 -136034 -92918 -145038 -29046 12845 -56066 -125967 -258123 -189751
497 -189751 -104073 2465 62685 143679 -47971 -65788 -41129 73016 -30363 -129686 -100533
486 -100533 -128601 136972 157177 64841 -299851 -157854 -46373 -127453 -90463 -26689 23419
475 23419 -85651 -184243 -201642 29248 131515 143011 -61203 205891 231227 255842 183199
464 183199 55599 -65126 -124578 46790 -75323 -119661 -168402 -28886 -73665 -82425 13091
453 13091 194878 241258 56619 142308 157262 -3015 79638 -82231 -61721 33307 -51591
$$ packed form
530A48761j36843M4303j1412j59716J99733P0108L2649j49374L8204M2525O0713
519A79651j88760O9135L7532q5606p6967J8058J99275L0549K4359j03689k4600
508G8937M0996j03801j52166M3116n2120J15992M1891o8911o9901j32156O8372
497a89751Q5678J06538O0220Q0994j91650j7817K4659J14145j03379r9323K9153
486a00533k8068K65573K0205r2336l64692J41997J11481q1080L6990O3774N0108
475B3419j09070r8592j7399K30890J02267J1496k04214K67094K5336K4615p2643
464A83199j27600j20725n9452J71368j22113m4338m8741J39516m4779q760R5516
453A3091J81787M6380j84639Q5689J4954j60277Q2653j61869K0510R5028q4898
$$ plain form
442 -51591 -81646 -23192 -167381 -252806 -100399 -110271 -42283 -75003 -101834 82733 159387 4376
430 4376 160628 -72943 -107995 -20715 64322 89544 37607 -32016 -22617 202128 61331 94555
418 94555 132393 57481 55374 63723 -166066 -83183 102127 130168 184758 46186 199300 16632
406 16632 35713 58175 -27462 140871 73431 251036 281195 185445 93627 60310 201627
395 201627 130990 -34420 151459 211720 274262 143670 2813 79022 123977 72406 38991
384 38991 341128 318231 266761 268872 95705 225878 344053 326012 30865 -59633 87600
373 87600 192089 95360 109793 -78214 -39646 59743 85176 -103047 -106999 -14733 68307 170094
361 170094 364518 142093 -95472 61650 77560 112016 337726 261723 220475 293719 229542
$$ packed form
442e1591l0055N8454j44189q5425J52407r872O7988l2720k6831J84567P6654j55011
430D376J56252k33571l5052Q7280Q5037K5222n1937o9623R399K24745j40797L3224
418I4555L7838p4912k107Q349k29789Q2883J85310K8041N4590j38572J53114j82668
406A6632J9081K2462q5637J68333o7440J77605L0159r5750r1818l3317J41317
395B01627p0637j65410J85879O0261O2542j30592j40857P6209M4955n1571l3415
384C8991L02137k2897n1470K111j73167J30173J18175j8041k95147r0498J47233
373H7600J04489r6729J4433j88007L8568R9389K5433j88223l952R2266Q3040J01787
361A70094J94424k22425k37565J57122J5910L4456K25710p6003m1248P3244o4177
$$ plain form
350 229542 223269 1886 -126629 -109760 18469 25727 224857 130623 58125 50344 124593 -35599
338 -35599 123430 186346 -18087 -124104 42239 163327 213358 148158 -113796 -119736 3096
327 3096 332724 230271 342837 289045 110465 43965 24741 115881 97504 151688 -50417
316 -50417 130596 238601 47769 98882 185954 272612 104423 -60300 88631 182209 335653
$$ packed form
350B29542o273k21383j28515J6869J28229P258J99130r4234p2498p781P4249j60192
338c5599J59029O2916k04433j06017J66343J21088N0031o5200k61954n940J22832
327C096L29628j02453J12566n3792j78580o6500j9224R1140j8377N4184k02105
316e0417J81013J08005j90832N1113Q7072Q6658j68189j64723J48931R3578J53444
$$ [...]
##END NTUPLES=NMR SPECTRUM
##END=
