##TITLE=1H_CA-9052-3
 CDCl3
 8 sc, 
 29.08.2022
##JCAMPDX= 6.0         $$ Bruker NMR JCAMP-DX V2.0
##DATA TYPE= NMR SPECTRUM
##DATA CLASS= NTUPLES
##ORIGIN= UXNMR, Bruker Analytische Messtechnik GmbH
##OWNER= root
$$ XWIN-NMR		Version 3.5
$$ Mon Aug 29 10:22:51 2022 Russian Standard Time (UT+4h)  she@DPX200
##.OBSERVE FREQUENCY= 200.1313499994
##.OBSERVE NUCLEUS= ^1H
##.ACQUISITION MODE= SIMULTANEOUS
##.ACQUISITION SCHEME= undefined
##.AVERAGES= 8
##.DIGITISER RES= 18
##SPECTROMETER/DATA SYSTEM= spect
##.PULSE SEQUENCE= zg30
##.SOLVENT NAME= DMSO
##.SHIFT REFERENCE= (INTERNAL, DMSO, 0, 15.7502)
##AUDIT TRAIL= $$ (NUMBER, WHEN, WHO, WHERE, WHAT)
$$ ##TITLE= Audit trail, XWIN-NMR		Version 3.5
$$ ##JCAMPDX= 5.01
$$ ##ORIGIN= Bruker BioSpin GmbH
$$ ##OWNER= she
$$ F:/spectra/data/she/nmr/H-F/1/pdata/1/auditp.txt
$$ ##AUDIT TRAIL=  $$ (NUMBER, WHEN, WHO, WHERE, WHAT)
(   1,<2022-08-29 10:21:32.48 +0400>,<she>,<DPX200>,
      <created by zg, POWCHK disabled, PULCHK disabled
       configuration hash MD5:
       00 E9 B6 7A A2 85 ED C7 34 08 36 98 17 FE 4E 26
       data hash MD5: 16K
       E2 16 4F AB 36 10 14 D5 41 65 E0 1F 4B 07 E2 64>)
(   2,<2022-08-29 10:21:35.12 +0400>,<she>,<DPX200>,
      <Start of raw data processing
       efp BC_mod = 2 LB = 0.24 FT_mod = 6 PKNL = 1 PHC0 = -18038.99 PHC1 = 15.00069 SI = 16K 
       data hash MD5: 16K
       E8 5C 1D 20 39 DC C2 16 9F 71 B5 08 8C 8B 24 2E>)
(   3,<2022-08-29 10:21:57.76 +0400>,<she>,<DPX200>,
      <pk PHC0 = -1.756562 PHC1 = -0.6 
       data hash MD5: 16K
       E9 F0 CD 7E A4 C6 5B AA 86 7A 3C 68 AF 8D 0C F2>)
(   4,<2022-08-29 10:22:01.42 +0400>,<she>,<DPX200>,
      <abs ABSG = 5 
       data hash MD5: 16K
       66 BE BF 8B 94 7D A0 19 0E E1 F8 A1 54 6B 36 6C>)
$$ ##END=
$$ 
$$ hash MD5
$$ A5 95 D1 30 7A 61 84 4B F8 50 B3 CA B0 2A AC 6F
##$RELAX= 
##$RELAX= 
##$RELAX= 
##$RELAX= 
##$RELAX= 
##$RELAX= 
$$ Bruker specific parameters
$$ --------------------------
##$DU= <F:/spectra>
##$EXPNO= 1
##$NAME= <H-F>
##$PROCNO= 1
##$TYPE= <nmr>
##$USER= <she>
##$AMP= (0..31)
100 100 100 100 100 100 100 100 100 100 100 100 100 100 100 100 100 100 
100 100 100 100 100 100 100 100 100 100 100 100 100 100 
##$AQSEQ= 0
##$AQ_mod= 1
##$AUNM= <au_zg>
##$AUTOPOS= <>
##$BF1= 200.13
##$BF2= 200.13
##$BF3= 200.13
##$BF4= 200.13
##$BF5= 200.13
##$BF6= 200.13
##$BF7= 200.13
##$BF8= 200.13
##$BYTORDA= 1
##$CFDGTYP= 0
##$CFRGTYP= 5
##$CHEMSTR= <none>
##$CNST= (0..31)
1 1 145 1 1 1 1 1 1 1 1 1 1 1 1 1 1 1 1 1 1 1 1 1 1 1 1 1 1 1 1 1 
##$CPDPRG= <>
##$CPDPRG1= <>
##$CPDPRG2= <>
##$CPDPRG3= <>
##$CPDPRG4= <mlev>
##$CPDPRG5= <mlev>
##$CPDPRG6= <mlev>
##$CPDPRG7= <mlev>
##$CPDPRG8= <mlev>
##$CPDPRGB= <>
##$CPDPRGT= <>
##$D= (0..31)
0 1.2 0 0 0 0 0 0 0 0.06 0 0.03 0 0 0 0 0.0002 0 0 0 0 0 0 0 0 0 0 0 0 
0 0 0 
##$DATE= 1661754091
##$DBL= (0..7)
120 120 120 120 120 120 120 120 
##$DBP= (0..7)
150 150 150 150 150 150 150 150 
##$DBP07= 0
##$DBPNAM0= <>
##$DBPNAM1= <>
##$DBPNAM2= <>
##$DBPNAM3= <>
##$DBPNAM4= <>
$$ [...]
##$SUBNAM3= <"">
##$SUBNAM4= <"">
##$SUBNAM5= <"">
##$SUBNAM6= <"">
##$SUBNAM7= <"">
##$SUBNAM8= <"">
##$SUBNAM9= <"">
##$SW= 18.0517283424941
##$SWIBOX= (0..15)
0 0 2 0 0 0 0 0 0 0 0 0 0 0 0 0 
##$SW_h= 3612.71676300578
##$TD= 16384
##$TD0= 1
##$TE= 0
##$TE2= 300
##$TE3= 300
##$TEG= 300
##$TL= (0..7)
0 120 120 120 120 120 120 120 
##$TP= (0..7)
150 150 150 150 150 150 150 150 
##$TP07= 0
##$TPNAME0= <>
##$TPNAME1= <>
##$TPNAME2= <>
##$TPNAME3= <>
##$TPNAME4= <>
##$TPNAME5= <>
##$TPNAME6= <>
##$TPNAME7= <>
##$TPOAL= (0..7)
0.5 0.5 0.5 0.5 0.5 0.5 0.5 0.5 
##$TPOFFS= (0..7)
0 0 0 0 0 0 0 0 
##$TUNHIN= 0
##$TUNHOUT= 0
##$TUNXOUT= 0
##$USERA1= <user>
##$USERA2= <user>
##$USERA3= <user>
##$USERA4= <user>
##$USERA5= <user>
##$V9= 5
##$VALIST= <valist>
##$VCLIST= <CCCCCCCCCCCCCCC>
##$VD= 0
##$VDLIST= <DDDDDDDDDDDDDDD>
##$VPLIST= <PPPPPPPPPPPPPPP>
##$VTLIST= <TTTTTTTTTTTTTTT>
##$WBST= 1024
##$WBSW= 4
##$XGAIN= (0..3)
0 0 0 0 
##$XL= 0
##$YL= 0
##$YMAX_a= 201543
##$YMIN_a= -345504
##$ZGOPTNS= <>
##$ZL1= 120
##$ZL2= 120
##$ZL3= 120
##$ZL4= 120
##$ABSF1= 15.7513
##$ABSF2= -2.30055
##$ABSG= 5
##$ABSL= 3
##$ALPHA= 0
##$AQORDER= 0
##$ASSFAC= 0
##$ASSFACI= 0
##$ASSFACX= 0
##$ASSWID= 0
##$AUNMP= <proc_1d>
##$AZFE= 0.1
##$AZFW= 0.1
##$BCFW= 0
##$BC_mod= 2
##$BYTORDP= 0
##$COROFFS= 0
##$CY= -3
##$DATMOD= 1
##$DC= 0
##$DFILT= <>
##$DTYPP= 0
##$F1P= 0
##$F2P= 0
##$FCOR= 1
##$FTSIZE= 16384
##$FT_mod= 6
##$GAMMA= 0
##$GB= 0
##$INTBC= 1
##$INTSCL= 1.705223e-09
##$ISEN= 128
##$LB= 0.24
##$LEV0= 0
##$LPBIN= 0
##$MAXI= 10000
##$MC2= 0
##$MEAN= 0
##$ME_mod= 0
##$MI= 1.114404
##$NCOEF= 0
##$NC_proc= -7
##$NLEV= 6
##$NOISF1= 3.799351
##$NOISF2= 2.8
##$NSP= 0
##$NTH_PI= 0
##$NZP= 0
##$OFFSET= 15.75019
##$PC= 1
##$PHC0= -18040.75
##$PHC1= 14.40069
##$PH_mod= 1
##$PKNL= yes
##$PPARMOD= 0
##$PSCAL= 0
##$PSIGN= 0
##$REVERSE= no
##$SF= 200.130004271968
##$SI= 16384
##$SIGF1= 3
##$SIGF2= 2
##$SINO= 5.538805
##$SIOLD= 16384
##$SREGLST= <1H.CDCl3>
##$SSB= 0
##$STSI= 16384
##$STSR= 0
##$SW_p= 3612.71676300578
##$SYMM= 0
##$S_DEV= 0
##$TDeff= 16384
##$TDoff= 0
##$TI= <>
##$TILT= no
##$TM1= 0
##$TM2= 0
##$TOPLEV= 0
##$USERP1= <user>
##$USERP2= <user>
##$USERP3= <user>
##$USERP4= <user>
##$USERP5= <user>
##$WDW= 1
##$XDIM= 16384
##$YMAX_p= 526256321
##$YMIN_p= -816582
$$ End of Bruker specific parameters
$$ ---------------------------------
##NTUPLES= NMR SPECTRUM
##VAR_NAME=  FREQUENCY,     SPECTRUM/REAL,   SPECTRUM/IMAG
##SYMBOL=    X,             R,               I
##VAR_TYPE=  INDEPENDENT,   DEPENDENT,       DEPENDENT
##VAR_FORM=  AFFN,          ASDF,            ASDF
##VAR_DIM=   16384,         16384,           16384
##UNITS=     HZ,            ARBITRARY UNITS, ARBITRARY UNITS
##FACTOR=    0.220516191357247, 1,           1
##FIRST=     3152.08554819365, 0,            0
##LAST=      -460.631214812126, 0,           0
##MIN=       -460.631214812126, -816582,     0
##MAX=       3152.08554819365, 526256321,    0
$$ Real data points
##PAGE= N=1
##DATA TABLE= (X++(R..R)), XYDATA
$$ [...]
$$ plain form
6338 1735617 1717433 1586754 1535975 1615421 1622749 1550744 1312669 1357655 1541159 1404675 1290810
6327 1290810 1227952 1390149 1338675 1300948 1220283 1190472 1277660 1281679 1257961 988841 1095605
6316 1095605 1087733 1033101 895245 754293 836918 927822 961213 1087258 1178802 952289 875256
6305 875256 973793 1034791 886888 1026007 1056650 1333842 1160354 831968 833793 977939 933055
6294 933055 736097 959072 909331 1035148 877508 981160 876952 909238 1037398 1097958
6284 1097958 1045903 1057791 1017368 917638 769921 823563 801229 969780 907299 941132 876349
6273 876349 929875 1040602 1032531 977659 1025005 960106 989312 1253012 987358 687819 900547
6262 900547 992774 962034 1173686 1080172 970956 863268 891640 601999 516902 619544 692771
$$ packed form
6338A735617j8184j30679n0779P9446P328p2005k38075M4986J83504j36484j13865
6327A290810o2858J62197n1474l7727q0665k9811Q7188M019k3718k69120J06764
6316A095605p872n4632j37856j40952Q2625R0904L3391J26045R1544k26513p7033
6305H75256R8537O0998j47903J39119L0643K77192j73488l28386J825J44146m4884
6294I33055j96958K22975m9741J25817j57640J03652j04208L2286J28160O0560
6284A097958n2055J1888m0423r9730j47717N3642k2334J68551o2481L3833o4783
6273H76349N3526J10727q071n4872M7346o4899K9206K63700k65654k99539K12728
6262I00547R2227l0740K11652r3514j09216j07688K8372k89641q5097J02642P3227
$$ plain form
6251 692771 726231 725989 807735 925207 779164 709498 776957 875981 987969 774464 855222
6240 855222 984615 780353 855365 921959 1152504 1158152 1141944 1125372 1143273 1070614 1054467
6229 1054467 1013664 1133787 1015905 869415 669063 644188 719390 865003 908413 912578 862532
6218 862532 813005 718097 669642 691167 706511 927498 909674 809406 846346 781868 661364
6207 661364 890944 915222 940430 999262 916212 688754 766515 887585 769204 742387 784134
6196 784134 775931 881614 857834 700698 766024 878405 898316 809170 818956 822383 887556 787828
6184 787828 798804 725103 906819 889414 878537 1059964 1006174 980609 1015681 988837 987894 1065696
6172 1065696 1039681 1155004 949966 927038 1061068 1367213 1269287 1100416 1064781 1068254 1090678
$$ packed form
6251F92771L3460k42Q1746J17472j46043o9666O7459R9024J11988k13505Q0758
6240H55222J29393k04262P5012O6594K30545N648j6208j6572J7901p2659j6147
6229A054467m0803J20123j17882j46490k00352k4875P5202J45613M3410M165n0046
6218H62532m9527r4908m8455K1525J5344K20987j7824j00268L6940o4478j20504
6207F61364K29580K4278K5208N8832q3050k27458P7761J21070j18381k6817M1747
6196G84134q203J05683k3780j57136O5326J12381J9911q9146R786L427O5173r9728
6184G87828J0976p3701J81716j7405j0877J81427n3790k5565L5072k6844r43P7802
6172A065696k6015J15323k05038k2928J34030L06145r7926j68871l5635L473K2424
$$ plain form
6161 1090678 1208972 1224673 1167109 1235680 1113115 1123685 1123440 1121401 1131087 1043446 1136111 1154176
6149 1154176 1078335 1014507 1086052 1318436 1198752 1166054 1190450 1144422 1158288 1106010 1110922
6138 1110922 1164475 1241268 1083160 785456 828854 1315263 1221875 944471 969306 1137907
6128 1137907 1161005 1020743 826520 969816 1107262 1088861 1057513 1022760 926691 1156353
6118 1156353 1096658 1061304 1203371 1229952 1060320 872290 948968 1055764 1046959 1008222 889195
6107 889195 894177 621523 674456 911379 826481 745816 773400 906947 916469 761548 668673
6096 668673 695290 649299 806577 701226 759310 691020 583919 702499 792224 881017 953866
6085 953866 804952 871915 842158 856495 900866 799170 719951 653655 610106 612406 652387
$$ packed form
6161A090678J18294J5701n7564O8571j22565J0570k45k039R686q7641R2665J8065
6149A154176p5841o3828P1545K32384j19684l2698K4396m6028J3866n2278M912
6138A110922N3553P6793j58108k97704M3398M86409r3388k77404K4835J68601
6128A137907K3098j40262j94223J43296J37446j8401l1348l4753r6069K29662
6118A156353n9695l5354J42067K6581j69632j88030P6678J06796q805l8737j19027
6107H89195M982k72654N2933K36923q4898q0665K7584J33547R522j54921r2875
6096F68673K6617m5991J57278j05351N8084o8290j07101J18580Q9725Q8793P2849
6085I53866j48914O6963k9757J4337M4371j01696p9219o6296m3549K300L9981
$$ plain form
6074 652387 898239 705111 569447 467174 625731 761572 647800 594703 660556 576641
6064 576641 670060 744637 610566 528090 560316 451613 499613 593647 550808 653058 538784
6053 538784 421950 545143 697313 692393 584006 451277 413766 358087 285043 299352 535819
6042 535819 704946 624791 607977 598267 607674 415116 454731 542338 698399 728198 522074
6031 522074 567634 575138 568002 552294 536753 631203 670902 682336 838851 583689 445898
6020 445898 458315 546962 557510 617327 423493 471239 566271 564224 485086 334247 298001
6009 298001 522539 497681 474310 507485 443294 473207 475385 685068 707139 533162 681968
5998 681968 574498 506592 483671 344294 536126 563207 511076 525754 567841 586531 660277
$$ packed form
6074F52387K45852j93128j35664j02273J58557J35841j13772n3097O5853q3915
6064E76641R3419P4577j34071q2476L2226j08703M8000R4034m2839J02250j14274
6053E38784j16834J23193J52170m920j08387j32729l7511n5679p3044J4309K36467
6042E35819J69127q0155j6814r710R407j92558L9615Q7607J56061K9799k06124
6031E22074M5560P504p136j5708j5541R4450L9699J1434J56515k55162j37791
6020D45898J2417Q8647J0548N9817j93834M7746R5032k047p9138j50839l6246
6009B98001K24538k4858k3371L3175o4191K9913K178K09683K2071j73977J48806
5998F81968j07470o7906k2921j39377J91832K7081n2131J4678M2087J8690P3746
$$ plain form
5987 660277 468658 487420 558023 555518 590633 684336 703571 755336 556100 446616 421479
5976 421479 470635 539963 562804 544544 706118 613470 511241 397885 266797 152194 399632
5965 399632 564306 365844 489637 638975 458535 543321 688096 549319 596136 537422
5955 537422 678176 489339 365444 363583 522356 682030 573998 413796 493993 597484
5945 597484 590360 548953 550874 566284 825064 530764 471756 586610 547965 601283 479181
5934 479181 434617 540186 666749 747378 724443 788546 753539 917768 823576 596949 520143
5923 520143 615378 687764 627744 392485 434010 485996 459914 343460 501796 444433 411021
5912 411021 534082 498481 503807 390243 481102 522058 591672 587651 557728 589526 585980 533724
$$ packed form
5987F60277j91619J8762P0603k505L5115R3703J9235N1765j99236j09484k5137
5976D21479M9156O9328K2841j8260J61574r2648j02229j13356j31088j14603K47438
5965C99632J64674j98462J23793J49338j80440Q4786J44775j38777M6817n8714
5955E37422J40754j88837j23895j861J58773J59674j08032j60202Q0197J03491
5945E97484p124m1407J921J5410K58780k94300n9008J14854l8645N3318j22102
5934D79181m4564J05569J26563Q0629k2935O4103l5007J64229r4192k26627p6806
5923E20143R5235P2386o0020k35259M1525N1986k6082j16454J58336n7363l3412
5912D11021J23061l5601N326j13564R0859M0956O9614m021k9923L1798l546n2256
$$ plain form
5900 533724 697374 767786 900782 733063 540674 375722 566746 653558 855183 814140
5890 814140 733856 773283 636272 655762 654229 543147 576003 617721 711973 740317 874996
5879 874996 533363 572359 704815 676708 565184 547600 485884 436316 543643 617279 795799
5868 795799 791491 717531 639014 673061 758787 824819 758047 809056 615708 457345 603915
5857 603915 759602 770110 853530 640196 677773 919845 741933 507597 560043 656462 595045
5846 595045 659004 725241 849274 797905 746949 734750 727540 648141 602378 647895 651329 720772
5834 720772 823485 801067 799079 903813 992181 990734 846332 900409 985749 990222 762337
5823 762337 667363 592442 643467 649953 762665 903484 849441 986048 822486 801473 857037
$$ packed form
5900E33724J63650P0412J32996j67719j92389j64952J91024Q6812K01625m1043
5890H14140q0284L9427j37011J9490j533j11082L2856M1718R4252K8344J34679
5879H74996l41633L8996J32456k8107j11524j7584o1716m9568J07327P3636J78520
5868G95799m308p3960p8517L4047Q5726O6032o6772N1009j93348j58363J46570
5857F03915J55687J0508Q3420k13334L7577K42072j77912k34336N2446R6419o1417
5846E95045O3959O6237J24033n1369n0956j2199p210p9399m5763M5517L434O9443
5834G20772J02713k2418j988J04734Q8368j447j44402N4077Q5340M473k27885
5823G62337r4974p4921N1025O486J12712J40819n4043J36607j63562k1013N5564
$$ plain form
5812 857037 939512 989771 819872 871170 901088 704642 754350 723635 502855 458345 488527
5801 488527 697546 811966 840623 797192 733156 711907 787190 816521 749280 698948 766080
5790 766080 792826 1058740 1014968 749639 612685 818323 935390 768680 780270 800340
5780 800340 658420 770196 658534 840444 866416 750954 727629 733080 570396 602432 816998
5769 816998 559532 475825 628564 651627 656714 583791 712403 803114 868164 932394 1002461
5758 1002461 1019654 810087 888000 873022 898315 635392 755223 867045 848849 866036 932185
5747 932185 885934 955567 996667 988569 904906 915935 1064619 980962 774553 810794 790200
5736 790200 838693 1020802 1135574 1073520 1000997 940438 1146901 997219 1009183 849105 919481
$$ packed form
5812H57037Q2475N0259j69899N1298K9918j96446M9708l0715k20780m4510L0182
5801D88527K09019J14420K8657m3431o4036k1249P5283K9331o7241n0332O7132
5790G66080K6746K65914m3772k65329j36954K05638J17067j66710J1590K0070
5780H00340j41920J11776j11662J81910K5972j15462k3325N451j62684L2036K14566
5769H16998k57466q3707J52739K3063N087p2923J28612R0711O5050O4230P0067
5758A002461J7193k09567P7913j4978K5293k62923J19831J11822j8196J7187O6149
5747I32185m6251O9633M1100q098q3663J1029J48684q3657k06409L6241k0594
5736G90200M8493J82109J14772o2054p2523o0559K06463j49682J1964j60078P0376
$$ plain form
5725 919481 866501 654642 895419 961270 902164 847602 800833 1000216 1037789 945235 999178
5714 999178 1219264 1234085 1229706 1289297 1041394 1032044 1058691 1148661 1040742 1055988 1244765
5703 1244765 1085439 891378 1206370 1178091 1048817 1112925 1247623 1232783 1242574 1215418 1468840
5692 1468840 1542128 1517905 1455840 1437121 1327592 1343587 1489529 1473997 1355368 1308252 1613644
5681 1613644 1470684 1380513 1402666 1538147 1817170 1655160 1566954 1469164 1499162 1580848 1538961
5670 1538961 1503505 1347038 1134798 1208871 1381575 1507614 1533946 1553719 1644659 1733856 1493816
5659 1493816 1440977 1323019 1603677 1771076 1858719 2062488 2097421 1842721 1960108 2056369
5649 2056369 2087510 2073901 2033732 1939004 1819303 1999446 1765696 1943630 2018060 1926054 2003490
$$ packed form
5725I19481n2980k11859K40777O5851n9106n4562m6769J99383L7573r2554N3943
5714I99178K20086J4821m379N9591k47903r350K6647Q9970j07919J5246J88777
5703A244765j59326j94061L14992k8279j29274O4108J34698j4840R791k7156K53422
5692A468840P3288k4223o2065j8719j09529J5995J45942j5532j18629m7116L05392
5681A613644j42960r0171K2153J35481K79023j62010q8206r7790K9998Q1686m1887
5670A538961l5456j56467k12240P4073J72704J26039K6332J9773R0940Q9197k40040
5659A493816n2839j17958K80658J67399Q7643K03769L4933k54700J17387R6261
5649B056369L1141j3609m0169r4728j19701J80143k33750J77934P4430r2006P7436
$$ plain form
5638 2003490 1999893 2059727 1929191 1831303 1966699 1959826 2035876 2027691 1822655 1785616 2005796
5627 2005796 1998684 2243953 2106413 2160443 2117339 2198208 2339403 2322700 2291312 2208120 2282463
5616 2282463 2400158 2386560 2428234 2299774 2312318 2389050 2454874 2527884 2627345 2432925 2625834
5605 2625834 2690956 2629262 2556973 2571702 2527647 2483205 2555764 2340252 2404207 2255606 2325292
5594 2325292 2223472 2390349 2531815 2535311 2277615 2471794 2687474 2585849 2582698 2486413
5584 2486413 2453381 2511748 2628247 2691586 2722781 2826324 3014770 2872964 3099705 3227420
5574 3227420 2988368 2973753 3168252 3244672 3531552 3626027 3516571 3603264 3560750 3589785 3749736
5563 3749736 3784429 3793235 3877302 3711998 3614733 3543666 3631947 3557921 3439139 3562106 3477274
$$ packed form
5638B003490l597N9834j30536r7888J35396o873P6050q185k05036l7039K20180
5627B005796p112K45269j37540N4030m3104Q0869J41195j6703l1388q3192P4343
5616B282463J17695j3598M1674j28460J2544P6732O5824P3010R9461j94420J92909
5605B625834O5122o1694p2289J4729m4055m4442P2559k15512O3955j48601O9686
5594B325292j01820J66877J41466L496k57696J94179K15680j01625l151r6285
5584B486413l3032N8367J16499O3339L1195J03543J88446j41806K26741J27715
5574C227420k39052j4615J94499P6420K86880R4475j09456Q6693m2514K9035J59951
5563C749736L4693Q806Q4067j65304r7265p1067Q8281p4026j18782J22967q4832
$$ plain form
5552 3477274 3431368 3441757 3402506 3363858 3360551 3503956 3374539 3246953 3238919 3121318 2951756
5541 2951756 3090955 3171409 3256425 3372609 3473128 3553037 3731434 3678560 3641248 3665434 3897136
5530 3897136 3953089 3848959 3952795 4102717 4076430 4094836 4035410 3998303 4100505 3734766
5520 3734766 3651029 3505492 3597508 3621285 3614071 3506756 3391317 3403114 3365200 3351350 3523386
5509 3523386 3362901 3227769 3371105 3368979 3317830 3308020 3438266 3311194 3386577 3255567 3454529
5498 3454529 3730657 3580348 3723127 3898465 3926858 3861192 4025524 4004650 3760432 3759447 3843392
5487 3843392 3821634 3772026 3784364 3803886 3860466 3875602 3706777 3845120 3943776 4038958 3840845
5476 3840845 3807774 3891225 4000934 3975037 4147109 4278219 4164662 4142317 4113996 4247666
$$ packed form
5552C477274m5906J0389l9251l8648l307J43405j29417j27586q034j17601j69562
5541B951756J39199Q0454Q5016J16184J00519P9909J78397n2874l7312K4186K31702
5530C897136N5953j04130J03836J49922k6287J8406n9426l7107J02202l65739
5520C734766q3737j45537R2016K3777p214j07315j15439J1797l7914j3850J72036
5509C523386j60485j35132J43336k126n1149r810J30246j27072P5383j31010J98962
5498C454529K76128j50309J42779J75338K8393o5666J64332k0874k44218r85Q3945
5487C843392k1758m9608J2338J9522N6580J5136j68825J38343R8656R5182j98113
5476C840845l3071Q3451J09709k5897J72072J31110j13557k2345k8321J33670
$$ plain form
5466 4247666 4089859 4300376 4511197 4470757 4455205 4637136 4442356 4374119 4542457 4429884
5456 4429884 4456420 4691995 4754313 4860836 4923945 4888339 4815435 4790151 5083075 5313756 5197232
5445 5197232 5308152 5468013 5450554 5576772 5492601 5648361 5782465 5542794 5769492 5917006
5435 5917006 5961195 5806410 5925988 6131720 6179485 6206398 6215061 6237026 6353816 6606574 6728666
5424 6728666 6816260 6841793 6883284 7064548 6927458 6914723 7073016 7166895 7567234 7656821 7709629
5413 7709629 7893414 7985482 8087410 8217091 8427441 8451169 8692039 8920641 8986080 9077181
5403 9077181 9240684 9288941 9405043 9511857 9654166 9867093 9830331 10138181 10155885 10349459
5393 10349459 10611617 10726686 10726888 10943359 11111382 11341146 11343564 11596052 11992765 12214512
$$ packed form
5466D247666j57807K10517K10821m0440j5552J81931j94780o8237J68338j12573
5456D429884K6536K35575O2318J06523O3109l5606p2904k5284K92924K30681j16524
5445E197232J10920J59861j7459J26218q4171J55760J34104k39671K26698J47514
5435E917006M4189j54785J19578K05732M7765K6913Q663K1965J16790K52758J22092
5424F728666Q7594K5533M1491J81264j37090j2735J58293R3879M00339Q9587N2808
5413G709629J83785R2068J01928J29681K10350K3728K40870K28602O5439R1101
5403I077181J63503M8257J16102J06814J42309K12927l6762L07850J7704J93574
5393A0349459K62158J15069K02K16471J68023K29764K418K52488L96713K21747
$$ plain form
5383 12214512 12397868 12671445 12950861 13103655 13421699 13786800 14050340 14132819 14457543 14800412
5373 14800412 15333641 15868534 15998295 16359825 16718861 17226718 17633161 17888479 18652310
5364 18652310 19271069 19677429 20314183 21091900 21752261 22480209 23332401 24107560 25021786
5355 25021786 26310137 27789339 29597982 31658051 33481628 35901812 39121563 42606920
5347 42606920 47034542 51725324 56153152 59885371 62018481 62209551 60531936 58506055
5339 58506055 57005335 55946821 55254671 54622245 53973910 53415564 52664462 51554532 50348351
5330 50348351 49507511 48830114 48530459 49124815 50122018 51714805 53711084 56756548 60273756
5321 60273756 64336996 69339077 75198523 81900874 89373523 96723561 103370105 108675172
$$ packed form
5383A2214512J83356K73577K79416J52794L18044L65101K63540Q2479L24724L42869
5373A4800412N33229N34893J29761L61530L59036N07857M06443K55318P63831
5364A8652310O18759M06360O36754P77717O60361P27948Q52192P75159R14226
5355B5021786J288351J479202J808643K060069J823577K420184L219751L485357
5347D2606920M427622M690782M427828L732219K133110J91070j677615k025881
5339E8506055j500720j058514o92150o32426o48335n58346p51102j109930j206181
5330E0348351q40840o77397k99655N94356R97203J592787J996279L045464L517208
5321F0273756M063240N002081N859446O702351P472649P350038O646544N305067
$$ plain form
5313 108675172 112144565 114519487 115745900 116045363 116463970 118501502 121722062 125560056
5305 125560056 128545354 129123420 125386089 117069332 106685792 96510730 87590446 80383316
5297 80383316 75161672 71138842 68411337 66680634 65634405 65332057 65855199 67074078
5289 67074078 68960954 72127893 75960024 80430844 84808616 88709583 91506356 93082860
5281 93082860 94476282 96918988 100370384 104251408 107455799 108060238 105243868 99252897
5273 99252897 91202538 82758128 74817534 68360289 63267689 59050369 55683170 52959737
5265 52959737 51033182 49429614 48196451 47507103 47098025 46773511 46901535 47142455 47718569
5256 47718569 48558709 49520378 50892595 52715844 54747981 57576213 60563577 64262945
$$ packed form
5313A08675172L469393K374922J226413K99463M18607K037532L220560L837994
5305A25560056K985298N78066l737331q316757j0383540j0175062q920284p207130
5297H0383316n221644m022830k727505j730703j046229l02348N23142J218879
5289F7074078J886876L166939L832131M470820M377772L900967K796773J576504
5281I3082860J393422K442706L451396L881024L204391O04439k816370n990971
5273I9252897q050359q444410p940594o457245n092600m217320l367199k723433
5265E2959737j926555j603568j233163o89348m09078l24514J28024K40920N76114
5256D7718569Q40140R61669J372217J823249K032137K828232K987364L699368
$$ plain form
5248 64262945 68975318 74564987 81210038 89067596 97213678 104831987 110377694 112754800
5240 112754800 111175982 106133676 100611619 96033052 93113519 91277529 89498538 87604885
5232 87604885 84579971 80461519 76493561 73311995 71309040 70223100 70322223 71416785
5224 71416785 73437183 76759406 81144618 86855449 93742351 101526475 109391408 116239055
5216 116239055 120616261 121833339 120160709 117134381 113650838 110694610 108772259 106677886
5208 106677886 104361917 101427930 97402193 93417508 90261092 87495812 84344876 80047875
5200 80047875 74578482 68476609 62818831 57875572 54166064 51116556 48870021 47182531
5192 47182531 46125006 45711406 45712682 46188562 47194959 48084701 48699311 49112784 49470909
$$ packed form
5248F4262945M712373N589669O645051P857558Q146082P618309N545707K377106
5240A12754800j578818n042306n522057m578567k919533j835990j778991j893653
5232H7604885l024914m118452l967958l181566k002955j085940R9123J094562
5224G1416785K020398L322223M385212N710831O886902P784124P864933O847647
5216A16239055M377206J217078j672630l026328l483543k956228j922351k094373
5208A06677886k315969k933987m025737l984685l156416k765280l150936m297001
5200H0047875n469393o101873n657778m943259l709508l049508k246535j687490
5192D7182531j057525m13600J276M75880J006397Q89742O14610M13473L58125
$$ plain form
5183 49470909 49924435 50842818 51889654 53109312 54483619 55545496 55347853 53785224 50640576
5174 50640576 46112825 41006780 36610609 33121708 29882961 27598626 25748466 24022563
5166 24022563 22612820 21296555 20141689 19246525 18224321 17467610 16979163 16534744 15985023
5157 15985023 15438510 15175729 14623077 14332820 14172892 13939994 13741859 13321213 13237702 13243063
5147 13243063 13248371 13271699 13529379 13614019 13792450 14090599 14353314 14320674 14064047 13797582
5137 13797582 13252653 12511163 11869893 11424634 11047239 10692227 10260968 10115446 9979852
5128 9979852 9786570 9877560 10205675 10551581 10969076 11609872 12048070 12371123 12798502 13408404
5118 13408404 13350865 12562444 11739736 10726271 9694660 9080427 8363637 7932047 7499080
$$ packed form
5183D9470909M53526R18383J046836J219658J374307J061877j97643j562629l144648
5174E0640576m527751n106045m396171l488901l238747k284335j850160j725903
5166B4022563j409743j316265j154866q95164j022204p56711m88447m44419n49721
5157A5985023n46513k62781n52652k90257j59928k32898j98135m20646q3511N361
5147A3243063N308K3328K57680Q4640J78431K98149K62715l2640k56627k66465
5137A3797582n44929p41490o41270m45259l77395l55012m31259j45522j35594
5128I979852j93282R0990L28115L45906M17495O40796M38198L23053M27379O09902
5118A3408404n7539p88421q22708j013465j031611o14233p16790m31590m32967
$$ plain form
5109 7499080 7183279 6916953 6565277 6355621 6124015 5904747 5848780 5829305 5618316 5517851
5099 5517851 5411313 5411119 5315306 5148115 4837390 4647310 4723909 4664034 4666930 4551591 4476106
5088 4476106 4445179 4332564 4436362 4402714 4270380 4098151 3896739 4022424 3990856 3970131
5078 3970131 3812398 3945456 4023916 3785481 3728883 3712149 3649486 3531856 3783186 3773215 3489514
5067 3489514 3450130 3568289 3558727 3593391 3764490 3868688 3655232 3495450 3564542 3665901
5057 3665901 3581707 3535243 3348763 3451938 3668446 3503650 3433034 3577448 3618155 3513721
5047 3513721 3672231 3566752 3578741 3599189 3516003 3565256 3542073 3605442 3641740 3740474 3671216
5036 3671216 3770978 3733568 3697626 3545001 3311301 3432666 3749144 3820678 3780330 3565676
$$ packed form
5109G499080l15801k66326l51676k09656k31606k19268n5967j9475k10989j00465
5099E517851j06538j94r5813j67191l10725j90080P6599n9875K896j15339p5485
5088D476106l0927j12615J03798l3648j32334j72229k01412J25685l1568k0725
5078C970131j57733J33058P8460k38435n6598j6734o2663j17630K51330r971k83701
5067C489514l9384J18159r562L4664J71099J04198k13456j59782O9092J01359
5057C665901q4194m6464j86480J03175K16508j64796p0616J44414M0707j04434
5047C513721J58510j05479J1989K0448q3186M9253k3183O3369L6298R8734o9258
5036C671216R9762l7410l5942j52625k33700J21365L16478P1534m0348k14654
$$ plain form
5026 3565676 3619766 3571326 3553097 3599846 3366895 3226920 3253690 3461300 3698829 3578776
5016 3578776 3435437 3471113 3541586 3714625 3764903 3770908 3874114 3719574 3677301 3998633 4121144
5005 4121144 3931379 3765222 4068653 4075744 4170526 4177914 3950289 3987653 4006360 3825875 3938775
4994 3938775 4043584 3994307 3933984 4216759 4119784 4216699 4246819 4459511 4363712 4232092 4342234
4983 4342234 4278762 4239967 4310091 4380736 4390043 4383469 4334407 4431829 4305934 4492062 4363666
4972 4363666 4344372 4456724 4728460 4843863 4867272 4736632 4681979 4898378 5038660 5319920
4962 5319920 5403890 5426053 5372285 5403983 5136335 4993768 5278371 5057260 4968386 5184328
4952 5184328 5344648 5594733 5842078 5990074 6100822 6271095 6434767 6421623 6679817 6777876
$$ packed form
5026C565676N4090m8440j8229M6749k32951j39975K6770K07610K37529j20053
5016C578776j43339L5676P0473J73039N0278O005J03206j54540m2273L21332J22511
5005D121144j89765j66157L03431P091R4782P388k27625L7364J8707j80485J12900
4994C938775J04809m9277o0323K82775r6975R6915L0120K12692r5799j31620J10142
4983D342234o3472l8795P0124P0645R307o574m9062R7422j25895J86128j28396
4972D363666j9294J12352K71736J15403K3409j30640n4653K16399J40282K81260
4962E319920Q3970K2163n3768L1698k67648j42567K84603k21111q8874K15942
4952E184328J60320K50085K47345J47996J10748J70273J63672j3144K58194R8059
$$ plain form
4942 6777876 6954330 6856489 6975556 7223191 7329868 7346447 7472949 7453914 7386217 7519492
4932 7519492 7576164 7451105 7425216 7594068 7619410 7896251 8087074 8449826 8681191 8978003
4922 8978003 9155107 9498306 9854841 9993421 10323701 10614118 10841639 11170964 11475542 11808798
4912 11808798 11931370 11906282 11951151 12037518 12017404 12229447 12580214 12772003 13144496 13564672
4902 13564672 13881681 14174149 14370492 14833521 14969821 15219151 15354950 15995128 16372186
4893 16372186 16742182 16893843 17067804 17510632 17873906 18252727 18435511 18580082 19063874
4884 19063874 19486773 19793694 20156212 20600247 21012325 21418266 22078715 22425512 23055128
4875 23055128 23407451 23893964 24552078 25132346 25651004 26501968 27246136 28085963 29051089
$$ packed form
4942F777876J76454r7841J19067K47635J06677J6579J26502j9035o7697J33275
4932G519492N6672j25059k5889J68852K5342K76841J90823L62752K31365K96812
4922H978003J77104L43199L56535J38580L30280K90417K27521L29325L04578L33256
4912A1808798J22572k5088M4869Q6367k0114K12043L50767J91789L72493M20176
4902A3564672L17009K92468J96343M63029J36300K49330J35799O40178L77058
4893A6372186L69996J51661J73961M42828L63274L78821J82784J44571M83792
4884A9063874M22899L06921L62518M44035M12078M05941O60449L46797O29616
4875B3055128L52323M86513O58114N80268N18658Q50964P44168Q39827R65126
$$ plain form
4866 29051089 30251751 31483107 32840561 34200109 35628841 37313925 39087552 40787342
4858 40787342 42423512 44314140 45992846 47849674 49765221 51149056 52944392 55171703
4850 55171703 57939179 61138436 64973810 69188439 74000479 79271836 85293506 91603015
4842 91603015 98750272 106848349 116912369 128464740 142574454 159626583 179635091
4835 179635091 203280245 232372959 268892797 317432786 378677924 442197386 491097479
4828 491097479 518833818 500797274 431663241 354317983 288859189 238901338 201538615
4821 201538615 173309076 150631934 132236598 117117733 104441628 94054445 85336592
4814 85336592 77955199 71994957 66988301 62869032 59562495 57055411 55134907 53004407
$$ packed form
4866B9051089J200662J231356J357454J359548J428732J685084J773627J699790
4858D0787342J636170J890628J678706J856828J915547J383835J795336K227311
4850E5171703K767476L199257L835374M214629M812040N271357O021670O309509
4842I1603015P147257Q098077J0064020J1552371J4109714J7052129K0008508
4835A79635091K3645154K9092714L6519838M8539989O1245138O3519462M8900093
4828D91097479K7736339j8036544o9134033p7345258o5458794m9957851l7362723
4821B01538615k8229539k2677142j8395336j5118865j2676105j0387183q717853
4814H5336592p381393n960242n006656m119269l306537k507084j920504k130500
$$ plain form
4806 53004407 50484703 47965404 45540661 42788312 40656152 38578988 36992561 35282311
4798 35282311 33726388 32304361 30919435 29633319 28336178 27018613 25964623 24809356
4790 24809356 24008221 23071997 22093386 21284030 20418556 19840335 19075118 18274278 17537444
4781 17537444 17011508 16223185 15627864 14975534 14644895 14324973 13878516 13242731 12954418
4772 12954418 12418201 12289833 12075386 11680547 11238323 10783210 10739642 10398777 10268986 10404103
4762 10404103 10177777 10064845 9835754 9764941 9482560 9423666 9229547 8966950 8909050 8946294
4752 8946294 8793013 8815585 8603745 8147683 7907847 7554789 7253509 6867115 6558308 6354193
4742 6354193 6239825 6092530 5980981 5821430 5733896 5809519 5714892 5517880 5728792 5575199
$$ packed form
4806E3004407k519704k519299k424743k752349k132160k077164j586427j710250
4798C5282311j555923j422027j384926j286116j297141j317565j053990j155267
4790B4809356q01135r36224r78611q09356q65474n78221p65217q00840p36834
4781A7537444n25936p88323n95321o52330l30639l19922m46457o35785k88313
4772A2954418n36217j28368k14447l94839m42224m55113m3568l40865j29791J35117
4762A0404103k26326j12932k29091p0813k82381n8894j94119k62597n7900L7244
4752H946294j53281K2572k11840m56062k39836l53058l01280l86394l08807k04115
4742F354193j14368j47295j11549j59551q7534P5623r4627j97012K10912j53593
$$ plain form
4732 5575199 5566306 5435106 5343544 5157914 5042368 4810554 4652634 4576240 4490547 4091112
4722 4091112 3955722 3876002 4050780 3945050 3759681 3707905 3484617 3685094 3652967 3484080
4712 3484080 3463089 3409444 3417343 3507028 3393000 3618794 3555517 3373037 3581240 3518993 3565214
4701 3565214 3708540 3532233 3414428 3208603 3215573 3332004 3149022 2988289 2908623 2960628
4691 2960628 2823955 2849911 3090855 3039469 2976293 3063231 2908931 2821775 2831197 2772965 2666449
4680 2666449 2550915 2472521 2645946 2353165 2246093 2230263 2244870 2266128 2064589 2080809
4670 2080809 2065241 2056998 2216074 2035095 1963910 1973517 2106975 2113426 2124450 2120811 2134337 2110058
4658 2110058 2051664 2231192 2263609 2120813 1941431 1959786 2017052 1960328 2014965 2066105 2018316
$$ packed form
4732E575199q893j31200r1562j85630j15546k31814j57920p6394q5693l99435
4722D091112j35390p9720J74778j05730j85369n1776k23288K00477l2127j68887
4712C484080k0991n3645P899Q9685j14028K25794o3277j82480K08203o2247M6221
4701C565214J43326j76307j17805k05825O970J16431j82982j60733p9666N2005
4691B960628j36673K5956K40944n1386o3176Q6938j54300q7156R422n8232j06516
4680B666449j15534p8394J73425k92781j07072j5830J4607K1258k01539J6220
4670B080809j5568q243J59076j80979p1185R607J33458O451J1024l639J3526k4279
4658B110058n8394J79528L2417j42796j79382J8355N7266n6724N4637N1140m7789
$$ plain form
4647 2018316 2099876 2076984 2056301 2334180 2257527 2305944 2453548 2294432 2234408 2131948 2100943
4636 2100943 2089424 2247078 2305926 2401759 2277501 2523100 2581000 2736528 2882972 2828576
4626 2828576 2907423 2965267 3097625 3093634 3455660 3767942 3925123 3805699 3875061 4290243
4616 4290243 4533595 4811922 5280092 5851518 6407605 7113390 7869673 8887561 10204550
4607 10204550 11789602 13728446 14965747 15387716 15137394 13582586 11680929 10053015
4599 10053015 8608204 7333311 6533504 5751223 5100713 4669871 4413772 4063191 3678577
4590 3678577 3420490 3256653 2961620 2805328 2855626 2923509 2809333 2721237 2562358 2559812
4580 2559812 2346877 2286129 2293364 2216954 2047604 1969683 2046136 2024400 2093587 2058056 1915621
$$ packed form
4647B018316Q1560k2892k0683K77879p6653M8417J47604j59116o0024j02460l1005
4636B100943j1519J57654N8848R5833j24258K45599N7900J55528J46444n4396
4626B828576P8847N7844J32358l991L62026L12282J57181j19424O9362M15182
4616D290243K43352K78327M68170N71426N56087P05785P56283J017888J316989
4607A0204550J585052J938844J237301M21969k50322j554808j901657j627914
4599A0053015j444811j274893p99807p82281o50510m30842k56099l50581l84614
4590C678577k58087j63837k95033j56292N0298O7883j14176q8096j58879k546
4580B559812k12935o0748P235p6410j69350p7921P6453k1736O9187l5531j42435
$$ plain form
4569 1915621 1791907 1901624 1893704 1666458 1708013 1742280 1649994 1644372 1718230 1598625 1759308
4558 1759308 1690945 1577749 1631279 1596727 1525801 1290044 1275760 1366220 1612330 1506016 1360113
4547 1360113 1347792 1442118 1514972 1561691 1315173 1387417 1561163 1547412 1499189 1357095 1321610
4536 1321610 1213061 1294680 1334412 1281574 1322437 1204652 1339742 1555410 1499079 1402029 1525115
4525 1525115 1623614 1518184 1678767 1645228 1764666 1944400 2181407 2368954 2452540 2463342
4515 2463342 2489123 2971017 3383902 3779708 3812559 3716351 3210136 2906449 2717374 2315458
4505 2315458 1934548 1861681 1730605 1537196 1466492 1288056 1177261 1428273 1319644 1050232
4495 1050232 950656 970298 977870 1001670 933613 1153486 1329834 1335664 1095515 927656 980187
$$ packed form
4569A915621j23714J09717p920k27246M1555L4267r2286n622P3858j19605J60683
4558A759308o8363j13196N3530l4552p0926k35757j4284R0460K46110j06314j45903
4547A360113j2321R4326P2854M6719k46518P2244J73746j3751m8223j42094l5485
4536A321610j08549Q1619L9732n2838M0863j17785J35090K15668n6331r7050J23086
4525A525115R8499j05430J60583l3539J19438J79734K37007J87547Q3586J0802
4515B463342K5781M81894M12885L95806L2851r6208n06215l03687j89075m01916
4505B315458l80910p2867j31076j93409p0704j78436j10795K51012j08629k69412
4495A050232r9576J9642P572K3800o8057K19873J76348N830k40149j67859N2531
$$ plain form
4484 980187 1157074 1228932 1287490 1135060 971565 1049816 988443 1016597 1077397 1193769 1191633
4473 1191633 1379474 1261797 1172370 1021194 1124022 1233141 1127058 1181278 1241448 1084799
4463 1084799 1037782 937444 984023 1160589 1038422 888579 850397 1003973 877003 832944
4453 832944 825907 731788 907003 1022376 1248855 1226742 1118047 1114227 943143 875932 1116895
4442 1116895 1063006 1063466 1199349 1088083 1130454 970023 932015 1018698 1125402 1143449 918410
4431 918410 1025749 1083455 1039861 1010702 1038851 1146284 1135714 1046600 1125731 1078958 919811
4420 919811 1079361 1255656 1186686 1115750 1194313 1001051 898876 1081508 1242427 1248548 988147
4409 988147 1080062 1182177 966239 1020048 920807 998049 1055607 1043886 930702 1076081 1195989
$$ packed form
4484I80187J76887P1858N8558j52430j63495P8251o1373K8154O0800J16372k136
4473A191633J87841j17677q9427j51176J02828J09119j06083N4220O0170j56649
4463A084799m7017j00338M6579J76566j22167j49843l8182J53576j26970m4059
4453H32944p037r4119J75215J15373K26479k2113j08695l820j71084o7211K40963
4442A116895n3889M60J35883j11266M2371j60431l8008Q6683J06704J8047k25039
4431I18410J07339N7706m3594k9159K8149J07433j0570q9114P9131m6773j59147
4420I19811J59550J76295o8970p0936P8563j93262j02175J82632J60919O121k60401
4409I88147R1915J02115k15938N3809r9241P7242N7558j1721j13184J45379J19908
$$ plain form
4398 1195989 1153004 1330647 1124979 1160140 1185446 1092988 1089030 1069698 1022851 852589 1151107
4387 1151107 1317711 1431495 1195930 1127416 1333393 1346255 1282812 1239439 1294890 1399147
4377 1399147 1539995 1471869 1319109 1209907 1308255 1326298 1282935 1164909 1192591 1259732 1217116
4366 1217116 1081758 1206372 1332466 1446388 1492762 1549812 1542711 1607574 1455732 1374122 1467920
4355 1467920 1372974 1272721 1296409 1290462 1657425 1606820 1589560 1655458 1711844 1803221 1767572
4344 1767572 1769405 1784864 1839364 1859619 1880432 1874227 1830825 1868961 1712298 1744144 1798984 1918734
4332 1918734 1980286 1887298 2070330 2253767 2176593 2216368 2312630 2229326 2259476 2428454 2418584
4321 2418584 2389937 2326045 2487069 2477989 2562956 2653758 2562270 2669021 2626871 2825519 2726031
$$ packed form
4398A195989m2985J77643k05668L5161K5306r2458l958j9332m6847j70262K98518
4387A151107J66604J13784k35565o8514K05977J2862o3443m3373N5451J04257
4377A399147J40848o8126j52760j09202R8348J8043m3363j18026K7682O7141m2616
4366A217116j35358J24614J26094J13922M6374N7050p101O4863j51842q1610R3798
4355A467920r4946j00253K3688n947L66963n0605j7260O5898N6386R1377l5649
4344A767572J833J5459N4500K0255K0813o205m3402L8136j56663L1846N4840J19750
4332A918734O1552r2988J83032J83437p7174L9775R6262q3304L0150J68978r870
4321B418584k8647o3892J61024r080Q4967R0802r1488J06751m2150J98648r9488
$$ plain form
4310 2726031 2824701 2918224 3021630 3017999 3178573 3062656 3109002 3107978 3292655 3331020 3352780
4299 3352780 3291918 3250814 3429457 3676483 3741953 3774131 3706020 3732535 3913746 3997813 4041147
4288 4041147 3988268 4140411 4247261 4354283 4417658 4585639 4640593 4692970 4816190 4844191
4278 4844191 4688804 4879696 5026037 5142682 5329051 5319678 5250874 5299115 5359488 5263703 5590669
4267 5590669 5669764 5666965 5835856 6159711 6086675 5930898 6042653 5832265 5895922 6061793
4257 6061793 5988964 5979566 6042569 5977123 6179222 6179492 5959295 6106858 6072732 6175321 6184810
4246 6184810 6073803 5982823 5897535 5825084 5748089 5598830 5639511 5757798 5647184 5573884 5414655
4235 5414655 5323623 5298476 5271823 5183682 5164889 5263596 5130556 5039179 5027260 5015089 4991235
$$ packed form
4310B726031R8670R3523J03406l631J60574j15917M6346j024J84677L8365K1760
4299C352780o0862m1104J78643K47026O5470L2178o8111K6515J81211Q4067M3334
4288D041147n2879J52143J06850J07022O3375J67981N4954N2377J23220K8001
4278D844191j55387J90892J46341J16645J86369r373o8804M8241O0373r5785L26966
4267E590669P9095k799J68891L23855p3036j55777J11755k10388O3657J65871
4257F061793p2829r398O3003o5446K02099K70k20197J47563l4126J02589R489
4246F184810j11007r0980q5288p2451p6995j49259M0681J18287j10614p3300j59229
4235E414655r1032k5147k6653q8141j8793R8707j33040r1377j1919j2171k3854
$$ plain form
4224 4991235 5005799 5080169 4922306 4924469 4969772 4978312 4821104 4663818 4603585 4575031 4719850
4213 4719850 4572860 4340583 4391699 4615553 4707574 4542993 4462186 4590121 4819736 4668322
4203 4668322 4608636 4553858 4823993 4879708 4757859 4923995 5017969 4974989 4841828 4907768 4993969
4192 4993969 5006047 5078847 5121370 5025165 5078981 5129740 5078425 5306865 5342555 5348254 5516008
4181 5516008 5641464 5737049 5715356 5521251 5384974 5517675 5801799 5749843 5838906 5974548
4171 5974548 6116236 6228518 6167763 6344731 6302142 6172415 6326650 6448508 6636284 6708517
4161 6708517 6655005 6813442 6795812 6844146 6901428 7104619 7397177 7586935 7628142 7463496
4151 7463496 7467248 7634272 7840281 8028736 8130480 8196374 8318126 8356921 8427050 8573514
$$ packed form
4224D991235J4564P4370j57863K163M5303Q540j57208j57286o0233k8554J44819
4213D719850j46990k32277N1116K23854R2021j64581q0807J27935K29615j51414
4203D668322n9686n4778K70135N5715j21849J66136R3974m2980j33161O5940Q6201
4192D993969J2078P2800M2523r6205N3816N0759n1315K28440L5690N699J67754
4181E516008J25456R5585k1693j94105j36277J32701K84124n1956Q9063J35642
4171E974548J41688J12282o0755J76968m2589j29727J54235J21858J87776P2233
4161F708517n3512J58437j7630M8334N7282K03191K92558J89758M1207j64646
4151G463496L752J67024K06009J88455J01744O5894J21752L8795P0129J46464
$$ plain form
4141 8573514 8921970 8871890 8696001 8741922 8869242 9220659 9395071 9510324 9606935 9735001
4131 9735001 10097271 10189094 10211859 10546063 10735243 10870185 10813047 11042385 11414615 11649828
4121 11649828 11766701 12030690 12162870 12245359 12471980 12650969 12686998 12961653 13410225 13888866
4111 13888866 14299273 14442011 14398060 14538317 14885318 15056148 15304688 15724470 16021629 16218569
4101 16218569 16262944 16448684 16903978 16827587 17121830 17475450 17611248 17802388 17857709 18206847
4091 18206847 18487371 18754506 18879139 19027271 19189275 19305661 19407590 19732803 19972459
4082 19972459 19859830 19929973 20149626 20279038 20240319 20465006 20796336 20916280 20785659 20982795
4072 20982795 21331561 21433251 21480605 21592582 21868957 21918493 21981568 22163024 22402220 22924447
$$ packed form
4141H573514L48456n0080j75889M5921J27320L51417J74412J15253R6611J28066
4131I735001L62270R1823K2765L34204J89180J34942n7138K29338L72230K35213
4121A1649828J16873K63989J32180Q2489K26621J78989L6029K74655M48572M78641
4111A3888866M10407J42738m3951J40257L47001J70830K48540M19782K97159J96940
4101A6218569M4375J85740M55294p6391K94243L53620J35798J91140N5321L49138
4091A8206847K80524K67135J24633J48132J62004J16386J01929L25213K39656
4082A9972459j12629P0143K19653J29412l8719K24687L31330J19944j30621J97136
4072B0982795L48766J01690M7354J11977K76375M9536O3075J81456K39196N22227
$$ plain form
4062 22924447 23225294 23332408 23720564 23946773 24164805 24645195 25041019 25395359 25680079
4053 25680079 26046354 26634590 27103523 27654055 28413000 29049076 29502141 30360109 31441949
4044 31441949 32203082 33165548 34218507 35318857 36512337 37877728 39164615 40540216
4036 40540216 42259853 43969433 45637354 47688809 49628022 51690351 54122512 56575154
4028 56575154 59109520 61951691 64870353 68010446 71128502 74358137 77854983 81286683
4020 81286683 84707715 88237839 91901739 95803692 99817728 103724298 107777898 111969380
4012 111969380 116143779 120454317 124606900 128625538 132840663 136608742 140189811 143568628
4004 143568628 146690633 149769720 152432485 154974989 157598524 160023102 162280692 164147083
$$ packed form
4062B2924447L00847J07114L88156K26209K18032M80390L95824L54340K84720
4053B5680079L66275N88236M68933N50532P58945O36076M53065Q57968J081840
4044C1441949P61133R62466J052959J100350J193480J365391J286887J375601
4036D0540216J719637J709580J667921K051455J939213K062329K432161K452642
4028E6575154K534366K842171K918662L140093L118056L229635L496846L431700
4020H1286683L421032L530124L663900L901953M014036L906570M053600M191482
4012A11969380M174399M310538M152583M018638M215125L768079L581069L378817
4004A43568628L122005L079087K662765K542504K623535K424578K257590J866391
$$ plain form
3996 164147083 166113723 167588810 168750006 169360403 169775256 169589763 168842634 167691949 166251191
3987 166251191 164522910 162607099 160496942 158315797 156111488 153651101 151079951 148165748
3979 148165748 144963424 141562166 137741889 133483967 129077642 124495366 120025014 115668277
3971 115668277 111263993 107056250 102823637 98652504 94739355 90964105 87084884 83027574
3963 83027574 79319704 75495039 71756243 68272633 64950093 61323440 58335985 55340369
3955 55340369 52310768 49782925 47348748 45139784 43206656 41110804 39010564 37209546
3947 37209546 35697337 34058775 32436159 31088846 29735184 28489953 27198639 26147291
3939 26147291 25261120 24392532 23665204 22976984 22355012 21760795 21207811 20667133 20085344
$$ packed form
3996A64147083J966640J475087J161196O10397M14853j85493p47129j150685j440758
3987A66251191j728281j915811k110157k181145k204309k460387k571150k914203
3979A48165748l202324l401258l820277m257922m406325m582276m470352m356737
3971A15668277m404284m207743m232613m171133l913149l775250l879221m057310
3963H3027574l707870l824665l738796l483610l322540l626653k987455k995616
3955E5340369l029601k527843k434177k208964j933128k095852k100240j801018
3947C7209546j512209j638562j622616j347313j353662j245231j291314j051348
3939B6147291q86171q68588p27328o88220o21972n94217n52984n40678n81789
$$ plain form
3930 20085344 19684836 19196537 18798576 18566228 18362266 18036799 17557199 17249246 17157576 16729524
3920 16729524 16384869 16025063 15564323 15376264 15092395 14788350 14815586 14652962 14186054 13903281
3910 13903281 13554219 13431504 13299099 13065468 12900251 12564363 12282449 12310764 12008781 11837252
3900 11837252 11703321 11385650 11085196 11083666 11036861 10975061 10819388 10647778 10723974 10791937
3890 10791937 10729064 10588376 10612206 10622070 10682812 10743187 10793107 10671860 10796617 10965428 11117866
3879 11117866 11185631 11281637 11488292 11665288 12010456 12357025 12435428 12483054 12814002 13147488
3869 13147488 13491012 13435354 13316966 13414732 13563467 13631348 13536791 13395086 13273238 13416593
3859 13416593 13218068 13236589 13022554 12852966 12924035 12856521 12665506 12424411 12417161 12185122
$$ packed form
3930B0085344m00508m88299l97961k32348k03962l25467m79600l07953r1670m28052
3920A6729524l44655l59806m60740j88059k83869l04045K7236j62624m66908k82773
3910A3903281l49062j22715j32405k33631j65217l35888k81914K8315l01983j71529
3900A1837252j33931l17671l00454j530m6805o1800j55673j71610P6196O7963
3890A0791937o2873j40688K3830R864O0742O0375M9920j21247J24757J68811J52438
3879A1117866O7765R6006K06655J76996L45168L46569P8403M7626L30948L33486
3869A3147488L43524n5658j18388R7766J48735O7881r4557j41705j21848J43355
3859A3416593j98525J8521k14035j69588P1069o7514j91015k41095p250k32039
$$ plain form
3849 12185122 11797270 11298318 10874080 10411940 10082255 10023258 9718108 9368106 9178430 9094275
3839 9094275 8918098 8746549 8507477 8401033 8497312 8285001 8204274 8173181 7982327 8047662
3829 8047662 8129875 8049959 7798087 7861858 7779068 7596946 7599651 7831866 7712492 7678260 7784945
3818 7784945 7534328 7537822 7443595 7555500 7466402 7325930 7325332 7329900 7203811 7126576 7135438 7262372
3806 7262372 7399036 7398402 7155810 7066402 6990238 7239156 7422703 7412269 7453431 7189343 7291015
3795 7291015 7482856 7342911 7368094 7339214 7259726 7277029 7448891 7336876 7257285 7562857
3785 7562857 7617721 7611957 7685122 7987736 7996297 7776704 7971255 8279877 8271872 8370373 8593418
3774 8593418 8746422 8575008 8859686 9236621 9329852 9286803 9330831 9686530 9776573 9928566
$$ packed form
3849A2185122l87852m98952m24238m62140l29685n8997l05150l50002j89676q4155
3839I094275j76177j71549k39072j06444R6279k12311q0727l1093j90854O5335
3829H047662Q2213p9916k51872O3771q2790j82122K705K32215j19374l4232J06685
3818G784945k50617L494r4227J11905q9098j40472n98M568j26089p7235Q862J26934
3806G262372J36664o34k42592q9408p6164K48918J83547j0434M1162k64088J01672
3795G291015J91841j39945K5183k8880p9488J7303J71862j12015p9591L05572
3785G562857N4864n764P3165L02614Q561k19593J94551L08622q005R8501K23045
3774H593418J53004j71414K84678L76935R3231m3049M4028L55699R0043J51993
$$ plain form
3764 9928566 10207302 10336348 10568396 10712407 10874997 10985929 11032308 11350068 11358917 11391650
3754 11391650 11349785 11324288 11359373 11439720 11689229 11740017 11961820 11974140 12005265 12140835 12011060
3743 12011060 11957821 11956482 11986859 12141633 12307516 12115159 12045174 12041817 11970045 12191038 12204725
3732 12204725 12221840 12199422 12375137 12444619 12497204 12589984 12666169 12941316 13179954 13226226 13416274
3721 13416274 13852603 13879124 14064180 14158676 14148058 14553851 14749628 15037363 15170496 15311037
3711 15311037 15546191 15652642 15806089 16235008 16482403 16430950 16669460 16897659 17297425 17635292
3701 17635292 18006152 18369921 18656408 18949874 19453538 19608763 19863055 20397561 20979512
3692 20979512 21469838 21894349 22434672 23051311 23411620 23742388 24253584 24748851 25599062
$$ packed form
3764I928566K78736J29046K32048J44011J62590J10932M6379L17760Q849L2733
3754A1391650m1865k5497L5085Q0347K49509N0788K21803J2320L1125J35570j29775
3743A2011060n3239j339L0377J54774J65883j92357o9985l357p1772K20993J3687
3732A2204725J7115k2418J75715O9482N2585R2780P6185K75147K38638M6272J90048
3721A3416274M36329K6521J85056R4496j0618M05793J95777K87735J33133J40541
3711A5311037K35154J06451J53447M28919K47395n1453K38510K28199L99766L37867
3701A7635292L70860L63769K86487K93466N03664J55225K54292N34506N81951
3692B0979512M90326M24511N40323O16639L60309L30768N11196M95267Q50211
$$ plain form
3683 25599062 26398481 27062129 27642514 28537629 29448177 30664257 31467038 32258887 33511035
3674 33511035 34457780 35739523 37261918 38596416 40069703 41812934 43596125 45606542
3666 45606542 47541164 49659013 51872855 54131829 56280027 58434664 60491199 62661785
3658 62661785 64845977 66838294 68580799 70238597 72006592 73581532 75139499 76478154
3650 76478154 77823974 79297833 80478493 81562530 82451472 83086394 83482955 83664032 83504696
3641 83504696 83235660 82748231 82181925 81512915 80620491 79905123 79373667 78901832 78158932
3632 78158932 77620702 77237714 76775732 76354791 75923883 75621104 75357704 75289380 75316831 75825461
3622 75825461 76729527 77533342 78531436 79971944 81952943 84266570 86661546 89487229 92799015
$$ packed form
3683B5599062P99419O63648N80385Q95115R10548J216080Q02781P91849J252148
3674C3511035R46745J281743J522395J334498J473287J743231J783191K010417
3666D5606542J934622K117849K213842K258974K148198K154637K056535K170586
3658F2661785K184192J992317J742505J657798J767995J574940J557967J338655
3650G6478154J345820J473859J180660J084037Q88942O34922L96561J81077j59336
3641H3504696k69036m87429n66306o69010q92424p15368n31456m71835p42900
3632G8158932n38230l82988m61982m20941m30908l02779k63400o8324K7451N08630
3622G5825461R04066Q03815R98094J440508J980999K313627K394976K825683L311786
$$ plain form
3613 92799015 96469343 100635745 105046785 110276212 115631904 121178243 126962540 132838674
3605 132838674 138695789 144522236 150141478 155442930 160506241 165522018 170337742 174995849
3597 174995849 179437106 183961794 188348114 192487035 196324474 199539227 202074372 203878920
3589 203878920 204925746 205016132 204336837 202614007 200355797 197702733 194915960 191801023
3581 191801023 188421201 185447962 182457326 179402377 176292256 173071509 169981286 166829051
3573 166829051 163823284 160932705 158560123 156357230 154795916 153925463 153677542 153722939 154487967
3564 154487967 156021834 158246289 160904135 163935429 167287320 170778651 174461097 177978343
3556 177978343 181781948 185450119 189008033 192358246 195914311 199244619 202803859 206128378
$$ packed form
3613I2799015L670328M166402M411040N229427N355692N546339N784297N876134
3605A32838674N857115N826447N619242N301452N063311N015777M815724M658107
3597A74995849M441257M524688M386320M138921L837439L214753K535145J804548
3589B03878920J046826R0386o79295j722830k258210k653064k786773l114937
3581A91801023l379822k973239k990636l054949l110121l220747l090223l152235
3573A66829051l005767k890579k372582k202893j561314q70453k47921M5397P65028
3564A54487967J533867K224455K657846L031294L351891L491331L682446L517246
3556A77978343L803605L668171L557914L350213L556065L330308L559240L324519
$$ plain form
3548 206128378 209337358 212494612 215123183 217156277 218692878 219481720 219404467 218632397 217271635
3539 217271635 215361849 212663095 209499359 205732981 201530970 197221879 192856673 187881264
3531 187881264 183138573 178777193 174834557 170686068 166376720 162228565 157880259 153462930
3523 153462930 148796454 144389384 139988192 135680086 132162710 128888689 126176141 123958327
3515 123958327 122440101 121563204 121069963 121254912 121707557 122814285 124245720 126318133 128986425
3506 128986425 131925005 134907843 138155399 141714627 145683306 149428595 153516746 157927014
3498 157927014 162672225 168066578 173949322 180513861 187849428 195722863 204369711 213783142
3490 213783142 223869576 235040062 247386730 260924302 276081138 293114504 312014099
$$ packed form
3548B06128378L208980L157254K628571K033094J536601P88842p7253p72070j360762
3539B17271635j909786k698754l163736l766378m202011m309091m365206m975409
3531A87881264m742691m361380l942636m148489m309348m148155m348306m417329
3523A53462930m666476m407070m401192m308106l517376l274021k712548k217814
3515A23958327j518226q76897m93241J84949M52645J106728J431435K072413K668292
3506A28986425K938580K982838L247556L559228L968679L745289M088151M410268
3498A57927014M745211N394353N882744O564539P335567P873435Q646848R413431
3490B13783142J0086434J1170486J2346668J3537572J5156836J7033366J8899595
$$ plain form
3483 312014099 333605367 357138680 382567966 408889479 435148846 460102369 482277539
3476 482277539 500628070 514179611 522637214 526256321 525553005 521802688 516292777 510500174
3468 510500174 505217257 500854770 497487694 494498689 491223267 486412915 479049695 468076010
3460 468076010 452532094 432203637 408132934 380844197 351690890 322297655 293739630
3453 293739630 266794683 242278341 220363855 201373690 184750252 170159191 157643400
3446 157643400 146399541 136500165 127775593 120046854 113196395 107290663 101600399 96523842
3438 96523842 91920330 87957055 83994168 80177244 76820385 73466724 70255483 67623710
3430 67623710 64871513 62208130 59930426 57755425 55710020 53432762 51588958 49946964
$$ packed form
3483C12014099K1591268K3533313K5429286K6321513K6259367K4953523K2175170
3476D82277539J8350531J3551541Q457603L619107p03316l750317n509911n792603
3468E10500174n282917m362487l367076k989005l275422m810352p363220j0973685
3460D68076010j5543916k0328457k4070703k7288737k9153307k9393235k8558025
3453B93739630k6944947k4516342k1914486j8990165j6623438j4591061j2515791
3446A57643400j1243859r899376q724572p728739o850459n905732n690264n076557
3438I6523842m603512l963275l962887l816924l356859l353661l211241k631773
3430F7623710k752197k663383k277704k175001k045405k277258j843804j641994
$$ plain form
3422 49946964 48277225 46812827 45269215 43646873 42440684 41084556 39779896 38393889
3414 38393889 37117276 36164863 35389669 34601644 33680755 32711030 31900625 31263743 30561762
3405 30561762 29721501 28927869 28261455 27749444 27193398 26658822 26080926 25533269 25050634
3396 25050634 24699889 24196695 23604507 23132000 22671017 22435781 21698050 21123103 20816716
3387 20816716 20464902 20355452 19966965 19718720 19548137 18870896 18224071 17770516 17372022
3378 17372022 17040705 16651844 16250830 16017320 15956671 15580802 15254951 15170219 14763477 14105188
3368 14105188 13761627 13622967 13421902 13332930 13125247 12895919 12661309 12471972 12324855 12192593
3358 12192593 12149074 11979260 11789967 11859749 11759238 11550051 11464732 11427176 11441414 11242321
$$ packed form
3422D9946964j669739j464398j543612j622342j206189j356128j304660j386007
3414C8393889j276613r52413p75194p88025r20889r69725q10405o36882p01981
3405C0561762q40261p93632o66414n12011n56046n34576n77896n47657m82635
3396B5050634l50745n03194n92188m72507m60983k35236p37731n74947l06387
3387B0816716l51814j09450l88487k48245j70583o77241o46825m53555l98494
3378A7372022l31317l88861m01014k33510o0649l75869l25851q4732m06742o58289
3368A4105188l43561j38660k01065q8972k07683k29328k34610j89337j47117j32262
3358A2192593m3519j69814j89293O9782j00511k09187q5319l7556J4238j99093
$$ plain form
3348 11242321 11155082 11101377 11000274 10877926 10825205 10800258 10784197 10799475 10798680 10858544 10819148
3337 10819148 10906858 11000621 10978003 10925318 10828247 10892006 10990704 10748237 10806991 10835764 10782044
3326 10782044 10660067 10655220 10764416 10831388 11158055 11364693 11481215 11414833 11380676 11456810
3316 11456810 11537381 11737053 11662684 11590076 11711846 11734302 11813794 11812158 11959227 12234252 12247500
3305 12247500 12218867 12283703 12356583 12474718 12502921 12578042 12801436 13056513 13255919 13473155
3295 13473155 13806184 13916498 14285654 14615258 14788187 14888685 15043519 15400328 15599875
3286 15599875 15728197 16045063 16591086 16920860 17180209 17449569 17592634 17739676 17994567
3277 17994567 18244042 18548112 18769130 19086645 19466830 19820861 20233489 20925739 21425036
$$ packed form
3348A1242321q7239n3705j01103j22348n2721k4947j6061J5278p95N9864l9396
3337A0819148Q7710R3763k2618n2685r7071O3759R8698k42467N8754K8773n3720
3326A0782044j21977m847J09196O6972L26667K06638J16522o6382l4157P6134
3316A1456810Q0571J99672p4369p2608J21770K2456P9492j636J47069K75025J3248
3305A2247500k8633O4836P2880J18135K8203P5121K23394K55077J99406K17236
3295A3473155L33029J10314L69156L29604J72929J00498J54834L56809J99547
3286A5599875J28322L16866N46023L29774K59349K69360J43065J47042K54891
3277A7994567K49475L04070K21018L17515L80185L54031M12628O92250M99297
$$ plain form
3268 21425036 21862956 22258747 22895858 23590682 24364909 24947590 25676457 26341817 27139088
3259 27139088 28075648 28556815 29388613 30234399 31221307 32393719 33384366 34713646 36575360
3250 36575360 38434409 40145672 42212202 44593941 46687561 48789926 50873961 52423100
3242 52423100 53819581 54809731 55256438 54736426 53772730 52447075 50489678 48589515 46770199
3233 46770199 44770400 42918010 41222801 39623527 38327789 37014853 35675317 34212269
3225 34212269 32710796 31187283 29787979 28469621 27058259 25833150 24671166 23358853
3217 23358853 22170983 21182123 20144351 19091038 18207598 17198984 16444072 15870547 15335928
3208 15335928 14589513 14051046 13866632 13390094 12929089 12730617 12276125 11809272 11341769
$$ packed form
3268B1425036M37920L95791O37111O94824P74227N82681P28867O65360P97271
3259B7139088R36560M81167Q31798Q45786R86908J172412R90647J329280J861714
3250C6575360J859049J711263K066530K381739K093620K102365K084035J549139
3242E2423100J396481R90150M46707n20012r63696j325655j957397j900163j819316
3233D6770199j999799j852390j695209j599274j295738j312936j339536j463048
3225C4212269j501473j523513j399304j318358j411362j225109j161984j312313
3217B3358853j187870r88860j037772j053313q83440j008614p54912n73525n34619
3208A5335928p46415n38467j84414m76538m61005j98472m54492m66853m67503
$$ plain form
3199 11341769 11304845 11112043 10760080 10417502 10356693 10189957 9928121 9766179 9477263 9359951
3189 9359951 9239725 9223656 9149801 8898573 8812742 8730005 8479299 8282492 8274403 7962959 7664292
3178 7664292 7371092 7596711 7656712 7393212 7230120 6980186 6907522 6616583 6548030 6265614
3168 6265614 5765080 5561392 5550729 5290039 4938226 4789451 4548065 4284232 4607086 4560249
3158 4560249 4268557 4163218 4049654 3837317 3740475 3651441 3280580 3536877 3335111 3062996
3148 3062996 3186901 3321198 3192022 3003072 2905453 2695756 2534904 2648812 2588678 2375314
3138 2375314 2479264 2372676 2205016 2246796 2218571 1971679 2108004 2147468 2141356 2018168
3128 2018168 2056992 2121036 1991914 1896373 1908368 1853891 1861728 1787339 1858162 1847466 1665977
$$ packed form
3199A1341769l6924j92802l51963l42578o0809j66736k61836j61942k88916j17312
3189I359951j20226j6069p3855k51228q5831q2737k50706j96807q089l11444k98667
3178G664292k93200K25619O0001k63500j63092k49934p2664k90939o8553k82416
3168F265614n00534k03688j0663k60690l51813j48775k41386k63833L22854m6837
3158D560249k91692j05339j13564k12337r6842q9034l70861K56297k01766k72115
3148C062996J23905J34297j29176j88950r7619k09697j60852J13908o0134k13364
3138B375314J03950j06588j67660M1780k8225k46892J36325L9464o112j23188
3128B018168L8824O4044j29122r5541J1995n4477P837p4389P0823j0696j81489
$$ plain form
3117 1665977 1659653 1393904 1196678 1365855 1648851 1493476 1494790 1637440 1707940 1779464 1793496
3106 1793496 1626997 1745895 1984243 1689983 1539460 1559360 1522123 1376235 1262545 1547002
3096 1547002 1592325 1461836 1578785 1309941 1320229 1309984 1256315 1318636 1340647 1420610 1421514
3085 1421514 1451768 1456413 1378436 1247952 1189239 1159089 1165007 1298243 1238985 1340105 1389205
3074 1389205 1274942 1139407 1370451 1240025 1127386 1192821 1329101 1509475 1400995 1190933
3064 1190933 1337893 1211594 1072454 1189060 1056080 1284318 1242714 1101180 1055596 953166
3054 953166 1027838 933902 901603 986903 1128708 1028797 986979 1069376 1150516 1359564 1203964
3043 1203964 1032604 934796 1116248 1181909 1110232 1060189 803064 897134 1088958 1192579
$$ packed form
3117A665977o324k65749j97226J69177K82996j55375J314J42650P0500P1524J4032
3106A793496j66499J18898K38348k94260j50523J9900l7237j45888j13690K84457
3096A547002M5323j30489J16949k68844J0288j0245n3669O2321K2011P9963R04
3085A421514L0254M645p7977j30484n8713l0150N918J33236n9258J01120M9100
3074A389205j14263j35535K31044j30426j12639O5435J36280J80374j08480k10062
3064A190933J46960j26299j39140J16606j32980K28238m1604j41534m5584j02430
3054I53166P4672r3936l2299Q5300J41805r9911m1818Q2397Q1140K09048j55600
3043A203964j71360r7808J81452O5661p1677n0043k57125R4070J91824J03621
$$ plain form
3033 1192579 1115058 1324688 1188040 1264358 1297897 1058980 1202196 1145092 1110167 1235366
3023 1235366 1318995 1102356 1201380 1099527 1157616 1054901 1181422 1146290 1137073 1405516 1577173
3012 1577173 1393624 1279316 1399871 1400948 1471392 1491644 1532320 1442062 1584294 1562325 1586435
3001 1586435 1897161 1889117 1879369 1924238 1690284 1674902 1908536 1885419 1811723 1870674 1924925
2990 1924925 2036607 2192469 2212557 2316113 2352229 2371618 2327224 2404903 2509452 2689499
2980 2689499 2596248 2807887 2931694 3025168 2862624 2876813 3012695 2903238 2985843 3135747
2970 3135747 3198014 3429869 3451277 3479698 3555457 3643741 3680894 3745582 3862216 3972664 3890603
2959 3890603 3956177 4016179 4159559 4408359 4505559 4677791 4820302 4884747 4974314 5199987
$$ packed form
3033A192579p7521K09630j36648P6318L3539k38917J43216n7104l4925J25199
3023A235366Q3629k16639R9024j01853N8089j02715J26521l5132r217K68443J71657
3012A577173j83549j14308J20555J077P0444K0252M0676r0258J42232k1969K4110
3001A586435L10726q044r748M4869k33954j5382K33634k3117p3696N8951N4251
2990A924925J11682J55862K0088J03556L6116J9389m4394P7679J04549J80047
2980B689499r3251K11639J23807R3474j62544J4189J35882j09457Q2605J49904
2970C135747O2267K31855K1408K8421P5759Q8284L7153O4688J16634J10448q2061
2959C890603O5574O0002J43380K48800R7200J72232J42511O4445Q9567K25673
$$ plain form
2949 5199987 5452115 5624169 5650641 5895271 6037958 6125814 6288902 6538119 6737206 7217493
2939 7217493 7441315 7722257 7930559 8534732 9187993 9734858 10116097 10557507 11188281 11790724
2929 11790724 12546625 13329914 14312742 15116904 15889809 16768785 17573997 18460449 18947937
2920 18947937 19466766 20062156 20422361 20384020 20297945 20270553 20261066 20348186 20200725 20562737
2910 20562737 20749208 20867181 21206183 20961793 21090014 21464920 21989165 22480575 22985004
2901 22985004 23575123 24359487 25285415 26566360 27959313 29663801 31661900 34238370 36694583
2892 36694583 38696375 39420850 38296053 35825200 32708918 29497930 26735861 24994788
2884 24994788 23262037 21560270 20440808 19639632 18833344 18047215 17445786 16839553 16448588
$$ packed form
2949E199987K52128J72054K6472K44630J42687Q7856J63088K49217J99087M80287
2939G217493K23822K80942K08302O04173O53261N46865L81239M41410O30774O02443
2929A1790724P55901P83289R82828Q04162P72905Q78976Q05212Q86452M87488
2920A8947937N18829N95390L60205l8341q6075k7392r487Q7120j47461L62012
2910B0562737J86471J17973L39002k44390J28221L74906N24245M91410N04429
2901B2985004N90119P84364R25928J280945J392953J704488J998099K576470K456213
2892C6694583K001792P24475j124797k470853l116282l210988k762069j741073
2884B4994788j732751j701767j119462q01176q06288p86129o01429o06233l90965
$$ plain form
2875 16448588 16023507 15562257 15464182 15447159 15445538 15605288 15746312 15868694 15997290 16145119
2865 16145119 16416928 16698495 17104764 17227820 16986775 16363452 15768808 15103356 14293306
2856 14293306 13328816 12485406 11449929 10745260 9917789 9233171 8559152 7989585 7765184
2847 7765184 7235692 7062734 6769070 6286762 5780884 5625861 5523547 5140264 4779242 4367317
2837 4367317 4045507 3808920 3849206 3725375 3559177 3617810 3672344 3437528 2895344 2727802
2827 2727802 2759588 2884332 2747434 2583974 2550863 2463160 2402332 2261303 2269169 2178684 2000062
2816 2000062 1938916 1860779 1880671 1969042 2125877 2067811 1714461 1536476 1681467 1688819 1551681
2805 1551681 1576206 1405448 1222310 1214131 1227447 1154725 1211260 1079270 1042050 1329391 1311160
$$ packed form
2875A6448588m25081m61250r8075j7023j621J59750J41024J22382J28596J47829
2865A6145119K71809K81567M06269J23056k41045o23323n94644o65452q10050
2856A4293306r64490q43410j035477p04669q27471o84618o74019n69567k24401
2847G765184n29492j72958k93664m82308n05878j55023j02314l83283l61022m11925
2837D367317l21810k36587M0286j23831j66198N8633N4534k34816n42184j67542
2827B727802L1786J24744j36898j63460l3111q7703o0828j41029P866r0485j78622
2816B000062o1146p8137J9892Q8371J56835n8066l53350j77985J44991P352j37138
2805A551681K4525j70758j83138q179J3316p2722N6535j31990l7220K87341j8231
$$ plain form
2794 1311160 1124516 1168047 1116615 1091103 1266741 1184752 891840 994086 988936 801999 644249
2783 644249 840434 907084 730760 737305 890133 876349 891187 908221 854893 720367 688743
2772 688743 681292 691827 636117 451089 549295 603824 725146 679915 676349 671158 622906 566587
2760 566587 720620 573937 440112 264505 256710 546079 502794 387014 286438 405228
2750 405228 421922 431493 219664 279008 237332 -14450 150777 346039 309460 402133 325398
2739 325398 242264 240933 395491 368733 204170 138760 96147 164710 235013 256140 196654
2728 196654 266838 167418 172807 183912 32652 90091 450646 224172 100641 143977 -21465
2717 -21465 30937 96411 258722 274284 117857 1135 232794 366183 159013 171199 125360
$$ packed form
2794A311160j86644M3531n1432k5512J75638q1989k92912J02246n150j86937j57750
2783F44249J96185O6650j76324O545J52828j3784J4838J7034n3328j34526l1624
2772F88743p451J0535n5710j85028R8206N4529J21322m5231l566n191m8252n6319
2760E66587J54033j46683j33825j75607p795K89369m3285j15780j00576J18790
2750D05228J6694R571k11829N9344m1676k51782J65227J95262l6579R2673p6735
2739C25398q3134j331J54558k6758j64563o5410m2613O8563P0303K1127n9486
2728A96654P0184r9420N389J1105j51260N7439L60555k26474j23531M3336j65442
2717b1465N2402O5474J62311J5562j56427j16722K31659J33389k07170J2186m5839
$$ plain form
2706 125360 -4857 36977 131092 265892 159419 127115 213578 160742 125884 185807 141150
2695 141150 -38484 51358 108464 190492 151365 211279 251139 256286 350924 156898 -3689
2684 -3689 129109 161245 47837 9637 129079 110995 7150 2323 104820 -150356 -126314
2673 -126314 -36458 -105759 -140701 -17862 162303 177116 62150 -65562 -226854 -197695 -66386
2662 -66386 49482 60872 -30213 131114 257591 236552 157131 76976 -19916 -22067 -136062
2651 -136062 -75622 34348 206634 232259 126168 204563 278437 238099 182572 165377 83116
2640 83116 115732 20643 -24950 55332 268760 212031 27737 9027 131077 189215 338822
2629 338822 404053 101037 44014 111813 191503 311306 429598 177430 9022 50091 186662
$$ packed form
2706A25360j30217M1834R4115J34800j06473l2304Q6463n2836l4858N9923m4657
2695A41150j79634Q9842N7106Q2028l9127N9914L9860N147R4638j94026j60587
2684c689J32798L2136j13408l8200J19442j8084j03845m827J02497k55176K4042
2673a26314Q9856o9301l4942J22839J80165J4813j14966j27712j61292K9159J31309
2662f6386J15868J1390r1085J61327J26477k1039p9421q0155r6892k151j13995
2651a36062O0440J09970J72286K5625j06091P8395P3874m0338n5527j7195q2261
2640H3116L2616r5089m5593Q0282K13428n6729j84294j8710J22050N8138J49607
2629C38822O5231l03016n7023O7799P9690J19803J18292k52168j68408M1069J36571
$$ plain form
2618 186662 200816 52414 84168 103752 118548 169204 166018 48528 176049 279007 31369
2607 31369 5213 205247 7144 -21175 215258 332013 209645 -101125 18375 139566
2597 139566 29771 26519 90889 -18013 154687 64203 -86644 88415 191171 213196 172462
2586 172462 35361 181043 191517 62826 -1481 227278 362872 234482 249584 212496
2576 212496 209773 132129 199839 56813 9347 21517 97366 190314 35772 -104828 8376
2565 8376 -197834 -238573 -245504 -44612 -69266 -75622 -60287 -172483 -243044 -328161 -65372 -112133
2553 -112133 -24428 -133866 -40206 -40186 39193 -234220 -240308 -135150 -10321 -68344 -267749
2542 -267749 -258166 -183914 -212344 -317459 -309837 -66497 -10 -74781 -43430 38749 26531 26590
$$ packed form
2618A86662J4154j48402L1754J9584J4796N0656l186j17490J27521J02958k47638
2607C1369k6156K00034j98103k8319K36433J16755j22368l10770J19500J21191
2597A39566j09795l252O4370j08902J72700r0484j50847J75059J02756K2025m0734
2586A72462j37101J45682J0474j28691o4307K28759J35594j28390J5102l7088
2576B12496k723p7644O7710j43026m7466J2170P5849R2948j54542j40600J13204
2565H376k06210m0739o931K00892k4654o356J5335j12196p0561q5117K62789m6761
2553a12133Q7705j09438R3660K0P9379k73413o088J05158J24829n8023j99405
2542b67749R583P4252k8430j05115P622K43340O6487p4771L1351Q2179j2218N9
$$ plain form
2530 26590 141865 72191 -203857 -63581 52412 281 -14325 -31212 -210 -58155 -95805
2519 -95805 -63987 174687 63268 -91916 20956 86295 -93892 -205188 -296953 -44172
2509 -44172 -24030 79230 90819 85415 -212630 -341185 -98219 -68807 -46104 96851 141753
2498 141753 -30125 39017 23447 67061 -100721 -158822 -140678 -280047 -342330 -283575 -102951
2487 -102951 -209410 -295987 -251348 120671 -3779 40319 253574 -10064 -8527 24958 -147268
2476 -147268 -127804 -96547 -128243 -40438 -105562 -151237 -75952 8793 -106367 -31682 65217
2465 65217 -23799 -240373 -99129 -54186 -122646 -254120 -265595 -134713 -34682 16792 14379
2454 14379 -54122 -76590 -2178 -93500 -83163 -108779 -107650 -130085 45207 11626 -221181 -187739
$$ packed form
2530B6590J15275o9674k76048J40276J15993n2131j4606j6887L1002n7945l7650
2519i5805L1818K38674j11419j55184J12872O5339j80187j11296r1765K52781
2509d4172K0142J03260J1589n404k98045j28555K42966K9412K2703J42955M4902
2498A41753j71878O9142j5570M3614j67782n8101J8144j39369o2283N8755J80624
2487a02951j06459q6577M4639L72019j24450M4098K13255k63638J537L3485j72226
2476a47268J9464L1257l1696Q7805o5124m5675P5285Q4745j15160P4685R6899
2465F5217q9016k16574J41244M4943o8460j31474j1475J30882J00031N1474k413
2454A4379o8501k2468P4412r1322J0337k5616J129k2435J75292l3581k32807L3442
$$ plain form
2442 -187739 103558 -38924 -72204 -49694 146973 180661 56832 -99401 -116469 97689
2432 97689 279269 73510 21862 -70857 -138635 -116904 -10978 -4371 91749 136848 -54990
2421 -54990 -58585 -146711 -136932 -260874 -212535 -60971 33742 129600 171106 54830 -11896 120976
2409 120976 90417 -17517 -52816 -117822 34053 -28758 -71512 -192642 -231360 -195044 -78936
2398 -78936 -56042 -214362 -119087 34735 -121781 -15303 -19555 94257 94595 -15387 142959
2387 142959 212328 185418 93117 -17526 71535 158874 -71057 -64635 37335 358998 319963
2376 319963 174806 108603 67315 155247 137866 293092 260171 85664 59819 147689 196831
2365 196831 211730 407650 312063 138269 274725 389500 389124 338550 501262 572322 540713
$$ packed form
2442a87739K91297j42482l3280K2510J96667L3688j23829j56233j7068K14158
2432I7689J81580k05759n1648r2719o7778K1731J05926O607R6120M5099j91838
2421e4990l595q8126R779j23942M8339J51564R4713R5858M1506j16276o6726J32872
2409A20976l0559j07934l5299o5006J51875o2811m2754j21130l8718L6316J16108
2398g8936K2894j58320R5275J53822j56516J06478m252J13812L38j09982J58346
2387A42959O9369k6910r2301j10643Q9061Q7339k29931O422J01970L21663l9035
2376C19963j45157o6203m1288Q7932j7381J55226l2921j74507k5845Q7870M9142
2365A96831J4899J95920r5587j73794J36456J14775l76n0574J62712P1060l1609
$$ plain form
2354 540713 515054 310172 121894 211159 276364 192971 87441 14566 -19227 156655 177056
2343 177056 183231 165521 93846 66924 -8703 98737 172537 69103 38699 588 53225
2332 53225 115543 165371 -2201 -199729 -2280 -23991 -101213 106507 221730 252222 115132
2321 115132 -52159 -209328 -66922 98299 159510 23836 -108787 -238674 -132667 -129502
2311 -129502 -11376 339595 250886 173712 210912 95561 42367 268500 93949 -67338
2301 -67338 31533 -120450 -11807 145715 -5054 30959 255114 287107 242511 194445 294053
2290 294053 501297 324078 214067 151124 145798 271854 177220 282124 225498 -14131 -26454
2279 -26454 127208 54441 -18527 195990 233085 309033 356626 96690 78617 365351 221387
$$ packed form
2354E40713k5659k04882j88278Q9265O5205q3393j05530p2875l3793J75882K0401
2343A77056O175j7710p1675k6922p5627J07440P3800j03434l0404l8111N2637
2332E3225O2318M9828j67572j97528J97449k1711p7222K07720J15223L0492j37090
2321A15132j67291j57169J42406J65221O1211j35674j32623j29887J06007L165
2311a29502J18126L50971q8709p7174L7200j15351n3194K26133j74551j61287
2301f7338R8871j51983J08643J57522j50769L6013K24155L1993m4596m8066R9608
2290B94053K07244j77219j10011o2943n326J26056r4634J04904n6626k39629j2323
2279b6454J53662p2767p2968K14517L7095P5948M7593k59936j8073K86734j43964
$$ plain form
2268 221387 357932 432370 320968 156473 205668 237679 284518 180026 44146 6384 261001
2257 261001 241564 219270 252383 265374 151107 119984 256806 126797 282917 210747 250643
2246 250643 186696 73000 254769 242158 338611 429175 358646 185611 151120 188081 249360
2235 249360 307124 326151 215523 113882 173360 102586 129352 42657 68138 170820 322042
2224 322042 463402 533328 313769 231773 438292 366578 505430 572384 492201 597509 511644
2213 511644 627672 614269 422663 470588 585494 435973 448993 649516 575006 569632 800236
2202 800236 936575 745592 677158 792233 910586 833916 811767 605440 509249 800832
2192 800832 883646 943573 953314 739613 810880 732436 772702 883676 956207 1011783 1014291 1047617
$$ packed form
2268B21387J36545P4438j11402j64495M9195L2011M6839j04492j35880l7762K54617
2257B61001j9437k2294L3113J2991j14267l1123J36822j30009J56120p2170L9896
2246B50643o3947j13696J81769j2611R6453R0564p0529j73035l4491L6961O1279
2235B49360N7764J9027j10628j01641N9478p0774K6766q6695K5481J02682J51222
2224C22042J41360O9926k19559q1996K06519p1714J38852O6954q0183J05308q5865
2213E11644J16028j3403j91606M7925J14906j49521J3020K00523p4510n374K30604
2202H00236J36339j90983o8434J15075J18353p6670k2149k06327r6191K91583
2192H00832Q2814N9927R741k13701P1267p8444M0266J10974P2531N5576K508L3326
$$ plain form
2180 1047617 1159894 1187656 1153177 1218095 1291995 1299956 1261217 1439182 1489706 1351901 1286311
2169 1286311 1341892 1512918 1712653 1796923 1800097 1723588 1677279 1569784 1621006 1727856 1834996
2158 1834996 1970460 2083650 2105361 2120353 2384580 2257109 2210709 2240242 2353685 2405463
2148 2405463 2504484 2494125 2386728 2605936 2491541 2660236 2688334 3023490 3008595 3085121
2138 3085121 3174912 3346803 3273637 3318483 3465235 3376288 3485016 3698416 3843273 4020196
2128 4020196 4110632 4342341 4517996 4481280 4773057 5064428 5414517 5631261 5877225 6032768
2118 6032768 6468188 6817819 7108010 7170274 7443700 7708930 8243236 8742092 9288764 10022359
2108 10022359 10892673 12027924 13259895 14093659 14977015 15849040 16762887 18079433 19627371
$$ packed form
2180A047617J12277K7762l4479O4918P3900P961l8739J77965N0524j37805o5590
2169A286311N5581J71026J99735Q4270L174p6509m6309j07495N1222J06850J07140
2158A834996J35464J13190K1711J4992K64227j27471m6400K9533J13443N1778
2148B405463R9021j0359j07397K19208j14395J68695K8098L35156j4895P6526
2138C085121Q9791J71891p3166M4846J46752q8947J08728K13400J44857J76923
2128D020196R0436K31709J75655l6716K91777K91371L50089K16744K45964J55543
2118F032768M35420L49631K90191O2264K73426K65230N34306M98856N46672P33595
2108A0022359Q70314J135251J231971Q33764Q83356Q72025R13847J316546J547938
$$ plain form
2099 19627371 21820482 24176725 27306723 31077187 35768656 42038177 50216763 60273300
2091 60273300 68928122 74929369 76350545 67450089 55174242 44979319 36916273 31207935
2083 31207935 26865527 23557497 20708220 18529589 16591558 15020420 13937193 13106530
2075 13106530 12309347 11494513 10841567 10111403 9316897 8881363 8510670 7951966 7574802
2066 7574802 7146417 6826677 6415797 5966840 5686964 5236117 5041312 4960226 4837991 4574116
2056 4574116 4174149 4051543 3941727 3942155 3772803 3639878 3559819 3294301 3339549 3150822
2046 3150822 3005312 2727816 2692440 2486820 2283007 2133590 2212316 2070862 2035987 2064759
2036 2064759 2047721 1982808 1967145 2027585 1928770 1671329 1660566 1640776 1605379 1457026 1614625
$$ packed form
2099A9627371K193111K356243L129998L770464M691469O269521Q178586J0056537
2091F0273300Q654822O001247J421176q900456j2275847j0194923q063046n708338
2083C1207935m342408l308030k849277k178631j938031j571138j083227q30663
2075A3106530p97183q14834o52946p30164p94506m35534l70693n58704l77164
2066G574802m28385l19740m10880m48957k79876m50847j94805q1086j22235k63875
2056D574116l99967j22606j09816M28j69352j32925q0059k65518M5248j88727
2046C150822j45510k77496l5376k05620k03813j49417P8726j41454l4875K8772
2036B064759j7038o4913j5663O0440r8815k57441j0763j9790l5397j48353J57599
$$ plain form
2025 1614625 1496364 1453563 1428984 1366089 1334056 1501026 1475056 1386227 1527200 1275785 1257374
2014 1257374 1180764 1350518 1362868 1186011 869532 1034322 1146669 886390 959828 1130237
2004 1130237 888740 670271 680403 830497 844209 723211 716665 833263 880002 980255
1994 980255 790136 558671 731775 665470 720001 379636 406671 387993 267865 262257 309557
1983 309557 461489 398292 469257 258229 137800 138169 226314 352827 431313 292418 184596
1972 184596 176486 81157 183717 278228 429545 474628 297294 392009 420073 523750 297459
1961 297459 312402 225715 280544 266671 385383 472072 339162 406193 474442 354119 408915
1950 408915 270191 296222 355888 414895 397728 184681 238543 307675 448515 293316 283293
$$ packed form
2025A614625j18261m2801k4579o2895l2033J66970k5970q8829J40973k51415j8411
2014A257374p6610J69754J2350j76857l16479J64790J12347k60279P3438J70409
2004A130237k41497k18469J0132J50094J3712j20998o546J16598M6739J00253
1994I80255j90119k31465J73104o6305N4531l40365K7035j8678j20128n608M7300
1983C09557J51932o3197P0965k11028j20429L69Q8145J26513P8486j38895j07822
1972A84596q110r5329J02560R4511J51317M5083j77334R4715K8064J03677k26291
1961B97459J4943q6687N4829j3873J18712Q6689j32910O7031O8249j20323N4796
1950D08915j38724K6031N9666N9007j7167k13047N3862O9132J40840j55199j0023
$$ plain form
1939 283293 157362 186698 85268 -28082 -46725 7082 -45736 -188611 -224477 -41598 32318
1928 32318 126977 164220 81371 115030 130419 105063 82825 56460 35869 225654 195865 42798
1916 42798 100937 119906 73249 110358 90345 35267 167896 -12936 -95044 -102733 -93900 -68801
1904 -68801 5434 121074 233420 102657 174974 388303 -12386 -109275 -19009 25044 63037
1893 63037 88855 47966 53689 -17607 -214235 -274882 -83257 -144675 -53124 36877 -18232 -91915
1881 -91915 -153260 -136621 -108151 41637 182520 60055 28229 -101453 -178281 -263750 -249588
1870 -249588 -14755 -42695 -66402 78900 153022 292171 281328 186993 244351 290838 -115677
1859 -115677 -124526 23724 -145299 -170065 -190406 -133297 -23993 -7888 46545 50556 13520
$$ packed form
1939B83293j25931K9336j01430j13350j8643N3807n2818j42875l5866J82879P3916
1928C2318R4659L7243q2849L3659J5389k5356k2238k6365k0591J89785k9789j53067
1916D2798N8139J8969m6657L7109k0013n5078J32629j80832q2108p689Q833K5099
1904f8801P4235J15640J12346j30763P2317K13329m00689r6889R0266M4053L7993
1893F3037K5818m0889N723p1296j96628o0647J91625o1418R1551R0001n5109p3683
1881i1915o1345J6639K8470J49788J40883j22465l1826j29682p6828q5469J4162
1870b49588K34833k7940k3707J45302P4122J39149j0843r4335N7358M6487m06515
1859a15677q849J48250j69023k4766k0341N7109J09304J6105N4433M011l7036
$$ plain form
1848 13520 52465 129198 202199 131394 110921 253260 386527 98822 -226809 -50622 269245
1837 269245 88925 -25717 75892 290393 113208 199728 342591 196644 139561 71304
1827 71304 -20896 77387 202239 384755 305815 342728 381966 350158 539655 455499 453042
1816 453042 339012 306804 273255 96884 55333 108457 23914 32291 66726 6643 225488
1805 225488 123314 21892 -13515 49102 17334 -77986 -102114 -137759 -107822 -105373 -44740
1794 -44740 20873 -117387 -54617 31098 190491 42720 -122662 -73455 -40054 -70886 59760
1783 59760 30135 22442 73540 119326 255099 254272 94368 6825 -95339 -100443 -212196 -89755
1771 -89755 118937 -96681 -182036 -146949 -117685 -127270 -71278 -183961 -7531 30520 -16462
$$ packed form
1848A3520L8945P6733P3001p0805k0473J42339J33267k87705l25631J76187L19867
1837B69245j80320j14642J01609K14501j77185Q6520J42863j45947n7083o8257
1827G1304r2200R8283J24852J82516p8940L6913L9238l1808J89497q4156k457
1816D53042j14030l2208l3549j76371m1551N3124q4543Q377L4435o0083K18845
1805B25488j02174j01422l5407O2617l1768r5320k4128l5645K9937K449O0633
1794d4740O5613j38260O2770Q5715J59393j47771j65382M9207L3401l0832J30646
1783E9760k9625p693N1098M5786J35773q27j59904q7543j02164n104j11753J22441
1771h9755K08692k15618q5355L5087K9264r585N5992j12683J76430L8051m6982
$$ plain form
1760 -16462 4978 55611 -63213 65095 -45053 -128345 6954 232733 26385 -99788
1750 -99788 -351910 -400392 -104881 -74752 14615 -175314 -96972 44030 163690 3915 -226568
1739 -226568 -130109 62142 183287 175607 188586 152067 101179 191623 149893 -7414 -28654
1728 -28654 29340 151336 37400 -103805 32369 183983 156280 5519 -125585 -149203
1718 -149203 -149687 -51504 -27855 12420 128690 90598 -51717 -46075 -16976 -70812 -131794 -120992
1706 -120992 -88475 -133807 -179578 -77392 53158 -71148 -168233 -42543 -84306 -38938 -53753
1695 -53753 -153668 -206463 -107433 -114032 153622 184806 93970 21684 131873 -1721 36555
1684 36555 157706 72958 77658 -123424 -139265 -26402 -100238 -64622 57368 -179790 -153680
$$ packed form
1760a6462K1440N0633j18824J28308j10148q3292J35299K25779k06348j26173
1750i9788k52122m8482K95511L0129Q9367j89929P8342J41002J19660j59775k30483
1739b26568R6459J92251J21145p680J2979l6519n0888R0444m1730j57307k1240
1728b8654N7994J21996j13936j41205J36174J51614k7703j50761j31104k3618
1718a49203m84R8183K3649M0275J16270l8092j42315N642K9099n3836o0982J0802
1706a20992L2517m5332m5771J02186J30550j24306r7085J25690m1763M5368j4815
1695e3753r9915n2795R9030o599K67654L1184r0836p2286J10189j33594L8276
1684C6555J21151q4748M700k01082j5841J12863p3836L5616J21990k37158K6110
$$ plain form
1673 -153680 -124739 -31302 -167698 -169973 -178426 6163 74074 -169811 -144747 78561 -34386
1662 -34386 158230 277916 77507 153091 57450 70041 12466 -21043 81394 196906 208108
1651 208108 2454 -79451 -13595 -76105 -114116 -120015 31680 227455 160808 52105 49348
1640 49348 112097 -156389 -91596 -101422 31303 -15398 -61642 -5230 -184575 -176426 -349090
1629 -349090 -194850 -79373 -64045 -40357 6530 -38543 -113784 -21059 103937 93007 -154080
1618 -154080 -192149 -55716 204442 56766 -49129 28108 -1379 25555 81379 -4567 -88533
1607 -88533 -176423 -218155 -51377 -10495 -122687 -78947 -41144 75703 197717 77041 6105
1596 6105 -167134 -194293 -187456 -219424 -206944 -80473 40390 14447 -211316 -218065 -74749
$$ packed form
1673a53680K8941R3437j36396k275q453J84589O7911k43885K5064K23308j12947
1662c4386J92616J19686k00409P5584r5641J2591n7575l3509J02437J15512J1202
1651B08108k05654q1905O5856o2510l8011n899J51695J95775o6647j08703k757
1640D9348O2749k68486O4793r826J32725m6701m6244N6412j79345Q149j72664
1629c49090J54240J15477J5328K3688M6887m5073p5241R2725J24996j0930k47087
1618a54080l8069J36433K60158j47676j05895P7237k9487K6934N5824q5946q3966
1607h8533q7890m1732J66778M0882j12192M3740L7803J16847J22014j20676p0936
1596F105j73239k7159O837l1968J2480J26471J20863k5943k25763o749J43316
$$ plain form
1585 -74749 -26977 -94579 -113352 -118662 -93801 -166844 -88610 -114790 -234431 47174 141707 174379
1573 174379 12643 -255102 -175112 78680 -6970 -42367 -228218 -196149 100706 52446 115082
1562 115082 236143 53904 85328 20382 66686 -72819 -129184 -151457 -61265 21580 183153
1551 183153 116899 142332 239583 125830 -12664 82310 162118 77363 57120 -186259 -258733
1540 -258733 -298640 -145444 -186486 -203505 -166734 20032 22091 -98264 -356573 -142575 -32306
1529 -32306 40807 59083 -65226 -152494 30405 -27248 -332732 -89496 149062 99724 141977
1518 141977 39256 -19971 -88785 -135381 -146693 9413 -64483 -86355 -195775 -46197 252176
1507 252176 283384 262358 218169 215687 218609 52888 56273 11373 -40624 -61053 -145181 -20208
$$ packed form
1585g4749M7772o7602j8773n310K4861p3043P8234k6180j19641K81605R4533L2672
1573A74379j61736k67745P9990K53792q5650l5397j85851L2069K96855m8260O2636
1562A15082J21061j82239L1424o4946M6304j39505n6365k2273R0192Q2845J61573
1551A83153o6254K5433R7251j13753j38494R4974P9808q4755k0243k43379p2474
1540b58733l9907J53196m1042j7019L6771J86766K059j20355k58309K13998J10269
1529c2306P3113J8276j24309q7268J82899n7653l05484K43236K38558m9338M2253
1518A41977j02721n9227o8814m6596j1312J56106p3896k1872j09420J49578K98373
1507B52176L1208k1026m4189k482K922j65721L385m4900n1997k0429q4128J24973
$$ plain form
1495 -20208 37867 -7592 -118370 -46392 -80591 -53994 -149593 -199346 -240163 -222265 -209907 -70724
1483 -70724 92012 -70218 -21402 -3385 97025 165727 75496 89416 122757 -105792 -117147
1472 -117147 -83262 -162084 -108331 -22310 83481 -104992 -20987 20388 -91441 -228131 -117482
1461 -117482 -91219 -2567 -27706 -49575 -51554 43575 138472 -87873 -156003 -103143 -96545 173232
1449 173232 117286 165837 31041 -42200 -131614 -263853 -125485 -232765 -181367 -126626 768
1438 768 -5307 -21713 12274 52056 -16121 16762 75090 22585 -71883 -160625 -102676 77528
1426 77528 -27954 -44519 274479 154058 59699 89817 95748 118385 49836 13656 -138813
1415 -138813 -241022 16491 -127253 -379704 -295616 -330876 -337577 -56345 206170 182854 81816
$$ packed form
1495b0208N8075m5459j10778P1978l4199K6597r5599m9753m0817J7898J2358J39183
1483g0724J62736j62230M8816J8017J00410O8702r0231J3920L3341k28549j1355
1472a17147L3885p8822N3753Q6021J05791j88473Q4005M1375j11829j36690J10649
1461a17482K6263Q8652k5139k1869j979R5129R4897k26345o8130N2860O598K69777
1449A73232n5946M8551j34796p3241q9414j32239J38368j07280N1398N4741J27394
1438G68o075j6406L3987L9782o8177L2883N8328n2505r4468q8742N7949J80204
1426G7528j05482j6565L18998j20421r4359L0118N931K2637o8549l6180j52469
1415a38813j02209K57513j43744k52451Q4088l5260o701K81232K62515k3316j01038
$$ plain form
1404 81816 35978 -84631 -114283 -126785 81117 -15665 68118 -145111 -274528 -113620 -125151
1393 -125151 -87835 -7586 147611 83372 -50513 -108124 -127627 -284655 -101781 102451 -143198
1382 -143198 -313702 -192967 -166363 -142869 -126270 -40388 51939 180034 127609 -121543 -100975
1371 -100975 -17616 -74939 -126937 11886 115191 -107553 -73973 64356 164017 236387 180823
1360 180823 141234 118261 80221 70414 63601 76993 -76550 -47588 -64509 -32821 -160423 -166473
1348 -166473 -40864 5837 -23281 -63308 -91742 8904 99197 1164 -304227 -125983 43305
1337 43305 -135553 -151105 -3115 151113 117089 32603 93014 -124767 6134 90570 199644
1326 199644 -19296 33247 336805 201860 148873 1484 -95271 -243208 -248821 -213764 -305686
$$ packed form
1404H1816m5838j20609k9652j2502K07902r6782Q3783k13229j29417J60908j1531
1393a25151L7316Q0249J55197o4239j33885n7611j9503j57028J82874K04232k45649
1382a43198j70504J20735K6604K3494J6599Q5882R2327J28095n2425k49152K0568
1371a00975Q3359n7323n1998J38823J03305k22744L3580J38329R9661P2370n5564
1360A80823l9589k2973l8040r807o813J3392j53543K8962j6921L1688j27602o050
1348a66473J25609M6701k9118m0027k8434J00646R0293r8033l05391J78244J69288
1337D3305j78858j5552J47990J54228l4024q4486O0411k17781J30901Q4436J09074
1326A99644k18940N2543L03558j34945n2987j47389r6755j47937n613L5057r1922
$$ plain form
1315 -305686 -330292 -56221 121284 158517 52452 59899 -35303 -7677 92849 -33115 -29242
1304 -29242 104896 157047 145463 73037 94020 -103747 226347 213178 164480 25792 -181574
1293 -181574 -24529 85536 6273 -17666 -264801 -458492 -43327 339186 158079 13147
1283 13147 -65204 -86218 101865 177385 54463 20757 -60195 -86584 -12535 8330 -206854
1272 -206854 -283857 -333295 -138705 -60033 -155244 22670 -69382 -131796 -190516 -253143 -157032
1261 -157032 -24656 4375 43614 -165361 -78612 11001 -21001 -115748 -53387 -48984 126964
1250 126964 -91249 -193363 -31781 19599 -155319 -115084 -146426 27214 44348 -7783 249782
1239 249782 23321 -14281 -14077 125 -37452 -157966 -125336 -17963 1217 -104266 3791
$$ packed form
1315c05686k4606K74071J77505L7233j06065P447r5202K7626J00526j25964L873
1304b9242J34138N2151j1584p2426K0983j97767L30094j3169m8698j38688k07366
1293a81574J57045J10065p9263k3939k47135j93691M15165L82513j81107j44932
1283A3147p8351k1014J88083P5520j22922l3706q0952k6389P4049K0865k15184
1272b06854p7003m9438J94590P8672r5211J77914r2052o2414n8720o2627R6111
1261a57032J32376K9031L9239k08975Q6749Q9613l2002r4747O2361M403J75948
1250A26964k18213j02114J61582N1380j74918M0235l1342J73640J7134n2131K57565
1239B49782k26461l7602K04J4202l7577j20514L2630J07373J9180j05483J08057
$$ plain form
1228 3791 85855 -184183 -264395 34955 -16446 -40759 121519 53882 -137296 -73015 73310
1217 73310 186640 -4107 -88393 216149 106994 -167207 -112079 109474 23330 -131215
1207 -131215 -70265 44169 -32700 -172467 -151290 85620 -41815 -34854 105629 92237 92234 -163896
1195 -163896 -164669 4527 -55378 -145995 -74241 188178 134478 73930 23979 144280 103360
1184 103360 5538 120118 132550 -7953 83837 159578 154368 44098 221667 101082 43448
1173 43448 -15780 245740 181772 -9381 72048 -180613 10247 128430 147290 24735 -81632
1162 -81632 -55263 -178624 -93245 -118663 -106703 -148140 30829 13318 -130445 -154538 -240709
1151 -240709 -196887 -35509 33262 -52491 -77704 87173 198561 39300 217786 306379 195619
$$ packed form
1228C791Q2064k70038q0212K99350n1401k4313J62278o7637j91178O4281J46325
1217G3310J13330j90747q4286L04542j09155k74201N5128K21553q6144j54545
1207a31215O0950J14434p6869j39767K1177K36910j27435O961J40483j3392lk56130
1195a63896p73J69196n9905r0617P1754K62419n3700o0548m9951J20301m0920
1184A03360r7822J14580J2432j40503R1790P5741n210j10270J77569j20585n7634
1173D3448n9228K61520o3968j91153Q1429k52661J90860J18183J8860j22555j06367
1162h1632K6369j23361Q5379k5418J1960m1437J78969j7511j43763k4093q6171
1151b40709M3822J61378O8771q5753k5213J64877J11388j59261J78486Q8593j10760
$$ plain form
1140 195619 166665 13718 -12387 77180 -13373 -8992 -3963 60466 -106853 -161657 -209213 -126444
1128 -126444 10339 218140 203353 17445 107251 168166 63693 127217 242403 358858
1118 358858 205622 139 -247724 -8999 -89677 -160558 -155073 62136 -260705 -446610
1108 -446610 -129019 -20141 -74616 -264440 -280331 -124135 22444 92900 136963 114750 -127910
1097 -127910 -171670 13928 159910 87144 85695 -89150 -236000 -120595 -294967 -237054 -41787
1086 -41787 -32920 76377 133154 53041 61873 124521 17198 -93091 28776 -149208 -124665
1075 -124665 22631 -127966 -109710 200463 163529 145988 38451 -144043 -8184 25624
1065 25624 53376 -167449 -81959 -45029 -104433 78750 57239 160661 174292 226383 135964
$$ packed form
1140A95619k8954j52947k6105Q9567r0553M381N029O4429j67319n4804m7556Q2769
1128a26444J36783K07801j4787j85908Q9806O0915j04473O3524J15186J16455
1118C58858j53236k05483k47863K38725q0678p0881N485K17209l22841j85905
1108d46610L17591J08878n4475j89824j5891J56196J46579P0456M4063k2213k42660
1097a27910m3760J85598J45982p2766j449j74845j46850J15405j74372N7913J95267
1086d1787Q867J09297N6777q0113Q832O2648j07323j10289J21867j77984K4543
1075a24665J47296j50597J8256L10173l6934j7541j07537j82494J35859L3808
1065B5624K7752k20825Q5490L6930n9404J83183k1511J03422J3631N2091r0419
$$ plain form
1054 135964 243234 38919 57446 199948 219035 28802 9593 130275 40198 15820 237590
1043 237590 51911 76374 51548 73678 -27446 -11978 43963 -79581 -28271 -104423 -62720
1032 -62720 -73788 -163742 -102366 -258024 -231954 -114463 -51198 -60098 -55869 -16158 113802 324213
1020 324213 218698 -66044 -97842 -56157 -20466 -103657 -188997 97761 262685 334411 228968
1009 228968 66320 -27058 16035 2513 61270 176048 123805 -56238 -95343 -62201 66261
998 66261 -124834 -120514 -73623 99496 144872 45544 123807 22702 84585 104669 -38908
987 -38908 91377 14356 -148594 96326 203145 275354 81316 -49524 75521 40521 66111
976 66111 7893 -56624 -61589 -50880 22475 130016 153527 147740 99510 17264 -24290 186151
$$ packed form
1054A35964J07270k04315J8527J42502J9087j90233j9209J20682r0077k4378K21770
1043B37590j85679K4463k4826K2130j01124J5468N5941j23544N1310p6152M1703
1032f2720j1068q9954O1376j55658K6070J17491O3265q900M229L9711J29960K10411
1020C24213j05515k84742l1798M1685L5691q3191q5340K86758J64924P1726j05443
1009B28968j62648r3378M3093j3522N8757J14778n2243j80043l9105L3142J28462
998F6261j91095M320M6891J73119M5376r9328P8263j01105O1883K0084j43577
987c8908J30285p7021j62950K44920J06819P2209j94038j30840J25045l5000K5590
976F6111n8218o4517m965J0709P3355J07541K3511n787m8230q2246m1554K10441
$$ plain form
964 186151 256494 -57539 40416 -33340 -16764 -57783 -91633 -503 -137199 -212372 -204469 26562
952 26562 -106405 154106 112611 -17414 -30765 -123599 -326630 -250488 -118850 -4729 99343
941 99343 15040 -182562 -178990 -266136 -176725 -13463 -157437 47087 43077 72248 215962
930 215962 200385 91645 119640 -95711 -126775 -121270 -136244 -98030 -66150 86565 175291
919 175291 90742 111802 112678 70709 69154 17502 126397 28887 -85251 10014 13867 -68020
907 -68020 -49390 138991 199993 237517 96878 130169 -105769 -194229 -188240 -241121 -60799
896 -60799 117688 129958 -59337 130175 335331 158729 -221244 -88467 188474 310117
886 310117 366941 332584 181065 -75672 -152533 -9902 90651 86237 -65021 -341153 -217888
$$ packed form
964A86151P0343l14033R7955p3756J6576m1019l3850R1130j36696p5173P903K31031
952B6562j32967K60511m1495j30025j3351r2834k03031P6142J31638J14121J04072
941I9343q4303j97602L572q7146Q9411J63262j43974K04524m010K9171J43714
930B15962j5577j08740K7995k15351l1064N505j4974L8214L1880J52715Q8726
919A75291q4549K1060Q76m1969j555n1652J08895r7510j14138R5265L853q1887
907f8020J8630J88381O1002L7524j40639L3291k35938q8460N989n2881J80322
896f0799J78487J2270j89295J89512K05156j76602l79973J32777K76941J21643
886C10117N6824l4357j51519k56737p6861J42631J00553m414j51258k76132J23265
$$ plain form
875 -217888 -201378 -230561 -143496 -248251 -182887 -95745 -24325 6448 246561 -34048 -102482
864 -102482 -61679 15894 -23913 -23305 104180 152462 121477 174262 111403 90766 -18528 192505
852 192505 210593 115272 168165 134242 77430 -93473 91270 176610 281601 224282 194477
841 194477 -24714 -120667 -246678 -85315 -54078 163360 80865 65329 233018 225111 53985
830 53985 -40624 -80530 -370662 -315366 -48600 277289 167495 65093 13528 62625 81830
819 81830 -64528 2026 94158 122184 84805 57716 -93985 -49365 -47778 63334 56279 85531
807 85531 28957 42488 67859 90773 63915 4342 101192 37273 -29858 81036 80394 85249
795 85249 139167 -50845 -122325 -77743 -104238 90018 165304 81156 221626 -13865 -46827
$$ packed form
875b17888J6510k9183Q7065j04755O5364Q7142P1420L0773K40113k80609o8434
864a02482M0803P7573l9807O08J27485M8282l0985N2785o2859k0637j09294K11033
852A92505J8088r5321N2893l3923n6812j70903J84743Q5340J04991n7319k9805
841A94477k19191r5953j26011J61363L1237K17438q2495j5536J67689p907j71126
830E3985r4609l9906k90132N5296K66766L25889j09794j02402n1565M9097J9205
819H1830j46358O6554R2132K8026l7379k7089j51701M4620J587J11112p055K9252
807H5531n6574J3531K5371K2914k6858n9573R6850o3919o7131J10894o42M855
795H5249N3918j90012p1480M4582k6495J94256P5286q4148J40470k35491l2962
$$ plain form
784 -46827 69093 49742 10197 -93215 -64536 -135979 -101462 1419 24481 -112023 -74454
773 -74454 -66780 -210905 -292791 -145068 1666 99827 -11068 -50845 -115464 -22060 -8664
762 -8664 -21344 34504 201977 315400 582 -108005 -29576 -46344 -49584 17256 66434 8714
750 8714 -41382 143286 40197 -75230 -84242 -103258 -185446 8207 162743 49342 -73472
739 -73472 -108850 -92334 36597 -152174 -164505 -57412 -82784 -213968 -128092 -118543 -9313
728 -9313 -21282 -54290 -91775 65112 341998 234641 -166245 -75539 172313 223156 23921
717 23921 119268 -79091 -93713 164219 83050 -70191 -88213 109339 98811 -53363 18033
706 18033 307955 245997 75822 111922 37049 -11957 67291 53174 -41449 -119689 -197458 -12738
$$ packed form
784d6827J15920j9351l9545j03412K8679p1443L4517J02881K3062j36504L7569
773g4454P674j44125q1886J47723J46734R8161j10895l9777o4619R3404J3396
762h664j2680N5848J67473J13423l14818j08587P8429j6768l240O6840M9178n7720
750H714n0096J84668j03089j15427r012j9016q2188J93653J54536j13401j22814
739g3472l5378J6516J28931j88771j2331J07093k5372j31184Q5876R549J09230
728i313j1969l3008l7485J56887K76886j07357m00886R0706K47852N0843j99235
717B3921R5347j98359j4622K57932q1169j53241j8022J97552j0528j52174P1396
706A8033K89922o1958j70175L6100p4873m9006P9248j4117r4623p8240p7769J84720
$$ plain form
694 -12738 193451 166704 145535 35352 28514 -63250 116630 91462 119106 115306 -33751 -30869
682 -30869 104596 37172 -38237 38227 -61215 -39057 89435 -16720 -229432 -193250 -206227
671 -206227 -357668 -19984 47749 59774 -65713 -96294 -25678 -99439 -165787 386 97598
660 97598 144979 109049 279246 226635 108876 43419 142822 -46789 -137015 -7556 -72646
649 -72646 24512 38210 22728 18860 76528 -23942 -71241 -184430 133226 238286 -33974
638 -33974 -135755 -123383 -18906 -180003 -121705 -89289 -151290 -59713 -64167 16819 91455 173746
626 173746 145121 153022 -28795 58793 32158 -141749 -182007 -183811 -43860 193428 106585
615 106585 87360 59837 -44217 -79408 91166 -38924 -79813 -1911 55812 67887 54280
$$ packed form
694a2738K06189k6747k1169j10183o838r1764J79880k5168K7644l800j49057K882
682c0869J35465o7424p5409P6464r9442K2158J28492j06155k12712L6182j2977
671b06227j51441L37684O7733J2025j25487l0581P0616p3761o6348J66173R7212
660I7598M7381l5930J70197n2611j17759o5457R9403j89611r0226J29459o5090
649g2646R7158J3698j5482l868N7668j00470m7299j13189L17656J05060k72260
638c3974j01781J2372J04477j61097N8298L2416o2001R1577m454Q0986P4636Q2291
626A73746k8625P901j81817Q7588k6635j73907m0258j804J39951K37288q6843
615A06585j9225k7523j04054l5191J70574j30090m0889P7902N7723J2075j3607
$$ plain form
604 54280 15331 1464 143 89036 44491 -6268 -151021 -131613 -13457 -123154 223851
593 223851 150412 -67534 -5193 120892 265762 350928 418037 451009 387246 332342 225954
582 225954 211504 273095 338485 117037 101721 141916 384841 648 -138527 67987 89795
571 89795 198217 98685 -131496 -22706 -5079 -74751 102098 265764 72489 -122543 -91775
560 -91775 -702 104742 43930 57279 101161 162850 23836 75896 98206 155508 124042 -133317
548 -133317 -159977 -58190 226027 236171 137756 185960 93271 47909 56289 68394 223201
537 223201 214153 70664 33232 21256 127837 30477 -82149 64189 110347 -3177 -91085
526 -91085 -18937 180935 140946 74957 -14307 78868 211549 135180 -41184 -41673 137553 118614
$$ packed form
604E4280l8949j3867j321Q8893m4545n0759j44753J9408J18156j09697L47005
593B23851p3439k17946O2341J26085J44870Q5166O7109L2972o3763n4904j06388
582B25954j4450O1591O5390k21448j5316M0195K42925l84193j39175K06514K1808
571H9795J08422r9532k30181J08790J7627o9672J76849J63666j93275j95032L0768
560i1775R1073J05444o0812J3349M3882O1689j39014N2060K2310N7302l1466k57359
548a33317k6660J01787K84217J0144r8415M8204r2689m5362Q380J2105J54807
537B23201r048j43489l7432j1976J06581r7360j12626J46338M6158j13524q7908
526i1085P2148J99872l9989o5989q9264R3175J32681p6369j76364m89J79226j8939
$$ plain form
514 118614 89210 -151616 43810 105745 38826 114577 124131 46375 96278 150684 79244 -128474
502 -128474 -121040 13411 -68230 140175 90285 174884 224078 171439 -17380 -86131 -75030
491 -75030 138017 -53098 -60973 -143621 -68949 -119531 -37666 -27558 61476 240227 149751 92868
479 92868 64019 277416 180377 107868 224529 187451 127792 32084 -8150 -27676 -3614 86003
467 86003 74947 137156 -16995 89085 161658 183545 25367 -109998 -115305 -130976 -120019
456 -120019 -124657 51894 81066 163756 267523 -29654 -287190 -36106 -185653 -295699 -112299
445 -112299 -55064 -81280 -152200 -102421 -69956 -16562 -46261 29074 109277 -4483 -91567 -73009
433 -73009 -76866 26833 -6044 -24428 -117731 -5873 73752 226823 116419 156555 21603
$$ packed form
514A18614k9404k40826J95426O1935o6919P5751R554p7756M9903N4406p1440k07718
502a28474P434J34451q1641K08405m9890Q4599M9194n2639j88819o8751J1101
491g5030K13047j91115p875q2648P4672n0582Q1865J0108Q9034J78751r0476n6883
479I2868k8849K13397r7039p2509J16661l7078n9659r5708m0234j9526K4062Q9617
467H6003j1056O2209j54151J06080P2573K1887j58178j35365n307j5671J0957
456a20019m638J76551K9172Q2690J03767k97177k57536K51084j49547j10046J83400
445a12299N7235k6216p0920M9779L2465N3394k9699P5335Q0203j13760q7084J8558
433g3009l857J03699l2877j8384r3303J11858P9625J53071j10404M0136j34952
$$ plain form
422 21603 62087 209197 338692 326894 125587 229970 189766 47841 -32798 121218 259457
411 259457 368820 381996 251064 100748 -24881 76404 286338 104928 68398 -20220
401 -20220 -60767 -259113 -256544 -160252 126635 45836 34424 188698 25806 141621 163170
390 163170 -55644 -198788 -33297 16148 146249 41490 191610 134907 76200 191227
380 191227 -25989 -7855 154505 47265 224752 333758 104290 -181310 -197050 -161056
$$ packed form
422B1603M0484J47110J29495j1798k01307J04383m0204j41925q0639J54016J38239
411B59457J09363J3176j30932j50316j25629J01285K09934j81410l6530q8618
401b0220m0547j98346K569R6292K86887q0799j1412J54274j62892J15815K1549
390A63170k18814j43144J65491M9445J30101j04759J50120n6703n8707J15027
380A91227k17216J8134J62360j07240J77487J09006k29468k85600j5740L5994
$$ [...]
##END NTUPLES=NMR SPECTRUM
##END=
