##TITLE=1H_CA-9052-1
 CDCl3
 8 sc, 
 29.08.2022
##JCAMPDX= 6.0         $$ Bruker NMR JCAMP-DX V2.0
##DATA TYPE= NMR SPECTRUM
##DATA CLASS= NTUPLES
##ORIGIN= UXNMR, Bruker Analytische Messtechnik GmbH
##OWNER= root
$$ XWIN-NMR		Version 3.5
$$ Mon Aug 29 10:15:37 2022 Russian Standard Time (UT+4h)  she@DPX200
##.OBSERVE FREQUENCY= 200.1313499994
##.OBSERVE NUCLEUS= ^1H
##.ACQUISITION MODE= SIMULTANEOUS
##.ACQUISITION SCHEME= undefined
##.AVERAGES= 8
##.DIGITISER RES= 18
##SPECTROMETER/DATA SYSTEM= spect
##.PULSE SEQUENCE= zg30
##.SOLVENT NAME= DMSO
##.SHIFT REFERENCE= (INTERNAL, DMSO, 0, 15.7513)
##AUDIT TRAIL= $$ (NUMBER, WHEN, WHO, WHERE, WHAT)
$$ ##TITLE= Audit trail, XWIN-NMR		Version 3.5
$$ ##JCAMPDX= 5.01
$$ ##ORIGIN= Bruker BioSpin GmbH
$$ ##OWNER= she
$$ F:/spectra/data/she/nmr/H-F/1/pdata/1/auditp.txt
$$ ##AUDIT TRAIL=  $$ (NUMBER, WHEN, WHO, WHERE, WHAT)
(   1,<2022-08-29 10:14:12.00 +0400>,<she>,<DPX200>,
      <created by zg, POWCHK disabled, PULCHK disabled
       configuration hash MD5:
       00 E9 B6 7A A2 85 ED C7 34 08 36 98 17 FE 4E 26
       data hash MD5: 16K
       E7 FA 9C D2 35 AF 3F AD C0 95 FA 16 D3 15 76 B0>)
(   2,<2022-08-29 10:14:17.76 +0400>,<she>,<DPX200>,
      <Start of raw data processing
       efp BC_mod = 2 LB = 0.24 FT_mod = 6 PKNL = 1 PHC0 = -18036.02 PHC1 = 10.80069 SI = 16K 
       data hash MD5: 16K
       00 DB A8 0E B3 B6 32 B4 2E A9 9C AD 59 15 FC 6D>)
(   3,<2022-08-29 10:14:41.04 +0400>,<she>,<DPX200>,
      <pk PHC0 = -2.972936 PHC1 = 4.2 
       data hash MD5: 16K
       18 CA EA 3C C2 0F B5 0D 03 D2 EB 6C 3C C4 27 CB>)
(   4,<2022-08-29 10:14:44.20 +0400>,<she>,<DPX200>,
      <abs ABSG = 5 
       data hash MD5: 16K
       D1 13 0F 25 F3 FF 81 87 34 7D 6D BA 9D 31 05 61>)
$$ ##END=
$$ 
$$ hash MD5
$$ 35 B2 DB 6A FC 05 11 C4 F2 5F AC C9 41 76 7C 12
##$RELAX= 
##$RELAX= 
##$RELAX= 
##$RELAX= 
##$RELAX= 
##$RELAX= 
$$ Bruker specific parameters
$$ --------------------------
##$DU= <F:/spectra>
##$EXPNO= 1
##$NAME= <H-F>
##$PROCNO= 1
##$TYPE= <nmr>
##$USER= <she>
##$AMP= (0..31)
100 100 100 100 100 100 100 100 100 100 100 100 100 100 100 100 100 100 
100 100 100 100 100 100 100 100 100 100 100 100 100 100 
##$AQSEQ= 0
##$AQ_mod= 1
##$AUNM= <au_zg>
##$AUTOPOS= <>
##$BF1= 200.13
##$BF2= 200.13
##$BF3= 200.13
##$BF4= 200.13
##$BF5= 200.13
##$BF6= 200.13
##$BF7= 200.13
##$BF8= 200.13
##$BYTORDA= 1
##$CFDGTYP= 0
##$CFRGTYP= 5
##$CHEMSTR= <none>
##$CNST= (0..31)
1 1 145 1 1 1 1 1 1 1 1 1 1 1 1 1 1 1 1 1 1 1 1 1 1 1 1 1 1 1 1 1 
##$CPDPRG= <>
##$CPDPRG1= <>
##$CPDPRG2= <>
##$CPDPRG3= <>
##$CPDPRG4= <mlev>
##$CPDPRG5= <mlev>
##$CPDPRG6= <mlev>
##$CPDPRG7= <mlev>
##$CPDPRG8= <mlev>
##$CPDPRGB= <>
##$CPDPRGT= <>
##$D= (0..31)
0 1.2 0 0 0 0 0 0 0 0.06 0 0.03 0 0 0 0 0.0002 0 0 0 0 0 0 0 0 0 0 0 0 
0 0 0 
##$DATE= 1661753651
##$DBL= (0..7)
120 120 120 120 120 120 120 120 
##$DBP= (0..7)
150 150 150 150 150 150 150 150 
##$DBP07= 0
##$DBPNAM0= <>
##$DBPNAM1= <>
##$DBPNAM2= <>
##$DBPNAM3= <>
##$DBPNAM4= <>
$$ [...]
##$SUBNAM3= <"">
##$SUBNAM4= <"">
##$SUBNAM5= <"">
##$SUBNAM6= <"">
##$SUBNAM7= <"">
##$SUBNAM8= <"">
##$SUBNAM9= <"">
##$SW= 18.0517283424941
##$SWIBOX= (0..15)
0 0 2 0 0 0 0 0 0 0 0 0 0 0 0 0 
##$SW_h= 3612.71676300578
##$TD= 16384
##$TD0= 1
##$TE= 0
##$TE2= 300
##$TE3= 300
##$TEG= 300
##$TL= (0..7)
0 120 120 120 120 120 120 120 
##$TP= (0..7)
150 150 150 150 150 150 150 150 
##$TP07= 0
##$TPNAME0= <>
##$TPNAME1= <>
##$TPNAME2= <>
##$TPNAME3= <>
##$TPNAME4= <>
##$TPNAME5= <>
##$TPNAME6= <>
##$TPNAME7= <>
##$TPOAL= (0..7)
0.5 0.5 0.5 0.5 0.5 0.5 0.5 0.5 
##$TPOFFS= (0..7)
0 0 0 0 0 0 0 0 
##$TUNHIN= 0
##$TUNHOUT= 0
##$TUNXOUT= 0
##$USERA1= <user>
##$USERA2= <user>
##$USERA3= <user>
##$USERA4= <user>
##$USERA5= <user>
##$V9= 5
##$VALIST= <valist>
##$VCLIST= <CCCCCCCCCCCCCCC>
##$VD= 0
##$VDLIST= <DDDDDDDDDDDDDDD>
##$VPLIST= <PPPPPPPPPPPPPPP>
##$VTLIST= <TTTTTTTTTTTTTTT>
##$WBST= 1024
##$WBSW= 4
##$XGAIN= (0..3)
0 0 0 0 
##$XL= 0
##$YL= 0
##$YMAX_a= 217202
##$YMIN_a= -378766
##$ZGOPTNS= <>
##$ZL1= 120
##$ZL2= 120
##$ZL3= 120
##$ZL4= 120
##$ABSF1= 15.74689
##$ABSF2= -2.304959
##$ABSG= 5
##$ABSL= 3
##$ALPHA= 0
##$AQORDER= 0
##$ASSFAC= 0
##$ASSFACI= 0
##$ASSFACX= 0
##$ASSWID= 0
##$AUNMP= <proc_1d>
##$AZFE= 0.1
##$AZFW= 0.1
##$BCFW= 0
##$BC_mod= 2
##$BYTORDP= 0
##$COROFFS= 0
##$CY= -3
##$DATMOD= 1
##$DC= 0
##$DFILT= <>
##$DTYPP= 0
##$F1P= 0
##$F2P= 0
##$FCOR= 1
##$FTSIZE= 16384
##$FT_mod= 6
##$GAMMA= 0
##$GB= 0
##$INTBC= 1
##$INTSCL= 1.705223e-09
##$ISEN= 128
##$LB= 0.24
##$LEV0= 0
##$LPBIN= 0
##$MAXI= 10000
##$MC2= 0
##$MEAN= 0
##$ME_mod= 0
##$MI= 1.114404
##$NCOEF= 0
##$NC_proc= -6
##$NLEV= 6
##$NOISF1= 3.799351
##$NOISF2= 2.8
##$NSP= 0
##$NTH_PI= 0
##$NZP= 0
##$OFFSET= 15.7513
##$PC= 1
##$PHC0= -18038.99
##$PHC1= 15.00069
##$PH_mod= 1
##$PKNL= yes
##$PPARMOD= 0
##$PSCAL= 0
##$PSIGN= 0
##$REVERSE= no
##$SF= 200.130004050819
##$SI= 16384
##$SIGF1= 3
##$SIGF2= 2
##$SINO= 5.538805
##$SIOLD= 16384
##$SREGLST= <1H.CDCl3>
##$SSB= 0
##$STSI= 16384
##$STSR= 0
##$SW_p= 3612.71676300578
##$SYMM= 0
##$S_DEV= 0
##$TDeff= 16384
##$TDoff= 0
##$TI= <>
##$TILT= no
##$TM1= 0
##$TM2= 0
##$TOPLEV= 0
##$USERP1= <user>
##$USERP2= <user>
##$USERP3= <user>
##$USERP4= <user>
##$USERP5= <user>
##$WDW= 1
##$XDIM= 16384
##$YMAX_p= 273608590
##$YMIN_p= -611564
$$ End of Bruker specific parameters
$$ ---------------------------------
##NTUPLES= NMR SPECTRUM
##VAR_NAME=  FREQUENCY,     SPECTRUM/REAL,   SPECTRUM/IMAG
##SYMBOL=    X,             R,               I
##VAR_TYPE=  INDEPENDENT,   DEPENDENT,       DEPENDENT
##VAR_FORM=  AFFN,          ASDF,            ASDF
##VAR_DIM=   16384,         16384,           16384
##UNITS=     HZ,            ARBITRARY UNITS, ARBITRARY UNITS
##FACTOR=    0.220516191357247, 1,           1
##FIRST=     3152.30770440587, 0,            0
##LAST=      -460.409058599911, 0,           0
##MIN=       -460.409058599911, -611564,     0
##MAX=       3152.30770440587, 273608590,    0
$$ Real data points
##PAGE= N=1
##DATA TABLE= (X++(R..R)), XYDATA
$$ [...]
6513A74460N3744m5424K9204p0844N0695l7017K7921p1213M8338M5055J9035q6002
6501A37952j1631O7820L154j3091Q526P3718q1111L4489m0050n4697l1858R6725
6489A89946l5361Q5183O1554r8590o3318j0501k9552R4098J297R661q0830P498
6477A31085O1363j5658J4774r3604L7920M4841k3223M985K6837J139o4577j5842
6465A10040Q8091Q6566j4453l1579N353M58n9672P294m9980m6463J00042j08359
6453H7338r394L8313R1001o2573r4070J7909L4244M2456n1309n279J58185m4606
6441B02215k8146K9333J2117R1156n0785q5080L5755N9673M357R0556K9566p6075
6429C14642P6673j6179l3762J3569J4579K541R2515M5121r8284j3076M8440J04228
$$ y = [174460, 228204, 182780, 211984, 141140, 191835, 154818, 182739, 111526, 159864, 204919, 223954, 137952, 126321, 194141, 197295, 184204, 192730, 266448, 185337, 219826, 179776, 125079, 93221, 189946, 154585, 239768, 301322, 202732, 139414, 128913, 99361, 193459, 194756, 204417, 123587, 131085, 192448, 176790, 191564, 97960, 135880, 180721, 157498, 162483, 189320, 190459, 125882, 110040, 198131, 284697, 270244, 238665, 244018, 244476, 184804, 192098, 142118, 95655, 195697, 87338, 77944, 116257, 207258, 144685, 50615, 68524, 102768, 145224, 93915, 88636, 246821, 202215, 174069, 203402, 215519, 306675, 255890, 170810, 206565, 266238, 270595, 361151, 390717, 314642, 391315, 375136, 341374, 354943, 369522, 372063, 464578, 509699, 411415, 398339, 446779, 551007]
6417E51007P9695O7344j16408J8715K1219q6206M7280K3857P8307K4677q8402
6406F21085M2169k300m7112k377M1886l8833K3901O0441L8178M3443L0028n1104
6394G59405q2391K8154j14604k6346K8451m0901J9217K2096k5197r6717j3872
6383D57295p7503O0269J21104q783j28651k306p077n3501L7535m5365l338j1166
6371C38513M6501M2961k2556M2047J7836j0463p0391P5890r0312j8585Q2554m420
6359D29575Q1508j2103O7232K7229m654K8075k0202J04959N5974K2670q7182l4979
6347F58102R3555m3507l1489j8704J1090n2375l3226K2206j2631P0962R378o016
6335F67345q8638J7557J18374p2827O0643p9417j00663J8808J6119O3658p9919
$$ y = [551007, 630702, 698046, 581638, 600353, 621572, 535366, 582646, 606503, 684810, 709487, 621085, 663254, 660954, 613842, 611465, 653351, 614518, 638419, 698860, 737038, 780481, 810509, 759405, 677014, 705168, 590564, 564218, 592669, 551768, 570985, 593081, 567884, 471167, 457295, 379792, 440061, 561165, 552382, 423731, 421425, 414348, 360847, 398382, 353017, 349679, 338513, 385014, 427975, 405419, 447466, 465302, 454839, 384448, 460338, 370026, 351441, 433995, 429575, 511083, 498980, 566212, 593441, 588787, 616862, 596660, 701619, 757593, 780263, 693081, 658102, 751657, 708150, 676661, 657957, 669047, 616672, 583446, 605652, 593021, 663983, 673361, 667345, 578707, 596264, 714638, 641811, 702454, 623037, 522374, 541182, 557301, 620959, 541040]
6324E41040r2593P4052l2516n7776m5998n442K6299n2671m8571L38J5936M2883
6312C64981r4100M9183J24349Q989j84150l0514O6567p477N9155m6255n893K1060
6300C25895n7925j0266R7211n9310k1164p401l863O4824j1349k4285R622Q6056
6288C88045l4214P74Q53p0392q9633J39417N139l9901L1176j282k9190k9072J24087
6275C95807M4980j41437N4511k9483j9965k0782J3969J5543J440m9071J642p964
6263B59190j04393O890l4573M8965j1970K9577L0670N7523o3114K183j8038l0783
6251A72127L3525m1383L0424j0395k8903n4179Q7769J13044n6213J3921n0917
6240B08820M7376m9018J1556j7969n6786J09167R6004r6562J1409J08574M9707
$$ y = [541040, 448447, 522499, 489983, 432207, 386209, 380767, 407066, 354395, 305824, 306162, 322098, 364981, 270881, 320064, 444413, 453402, 269252, 238738, 305305, 297828, 356983, 310728, 304835, 325895, 267970, 257704, 354915, 295605, 274441, 267040, 263177, 328001, 316652, 292367, 301989, 388045, 353831, 354605, 355458, 285066, 195433, 334850, 339989, 300088, 331264, 329982, 300792, 271720, 395807, 440787, 299350, 353861, 324378, 304413, 283631, 297600, 313143, 314583, 265512, 267154, 259190, 154797, 161687, 127114, 176079, 164109, 193686, 224356, 281879, 218765, 220948, 202910, 172127, 205652, 164269, 194693, 184298, 155395, 101216, 188985, 302029, 245816, 259737, 208820, 256196, 207178, 218734, 200765, 143979, 253146, 349150, 252588, 263997, 372571, 422278]
6229D22278j30915j2692l2998j01823P5967N3651l2348M5741r7169n9012n5585
6218G5095J34464P4048l3592K0925r2588L8482P268J02716n4223J07530q4318
6207B95807K179j3517r8530J05567J7489N8485j1032l8293j19917M6265M2826
6196B87329K8959p2645p412N1940k2534l9258o6423K5121k417j2999K9387K5665
6184B24713L8303O2122L2973p1298k9902P9223P2737r7655L764K1987l1866p656
6172B97445L2920P3233m7965l089r328k4970o4965M7571m7051L2291p3423N5879
6160B68548J01230m9588J4679j9736J33204p6332m2365M7950J2741r8027O780
6149B99084J35843n276m9043O5969L7899m1878n8415j151K1778r246m3376p6311
$$ y = [422278, 291363, 278671, 245673, 143850, 219817, 273468, 241120, 286861, 189692, 130680, 75095, 209559, 283607, 250015, 270940, 178352, 216834, 224102, 326818, 272595, 380125, 295807, 297986, 284469, 185939, 291506, 308995, 367480, 356448, 318155, 198238, 244503, 287329, 316288, 243643, 236231, 288171, 265637, 226379, 159956, 185077, 182660, 169661, 199048, 224713, 263016, 325138, 358111, 286813, 256911, 336134, 408871, 311216, 314980, 336967, 305101, 297445, 330365, 403598, 355633, 352544, 343216, 318246, 253281, 300852, 253801, 286092, 212669, 268548, 369778, 320190, 334869, 315133, 448337, 372005, 329640, 377590, 390331, 292304, 299084, 434927, 429651, 380608, 446577, 484476, 442598, 384183, 383032, 404810, 395564, 352188, 275877]
6137B75877M9250N5300k1256J01640L3707p1704k106J8058L9282q0047k1095k3358
6125C53548R0612r696l1789J700o5673j5419p7677j1570m8982L4472Q5649l5838
6113B69337L3016m9957l1829L7971M7772j0469K6416L3474j09390K31P1230j07867
6101B09935P5745P6362j3978o1284q7562n9691P7594L3041q0251L0683j6818K9012
6089B12788l5990L1842P212q2980J46238J6126m4582n6374j5168o3321L5224j12641
6077C8374r814P8670n5382J21569p485N5306J8995q7950q6033m6994N3992N229
6065G8477R101j2652r614M9622j3434J6906n8468n2983L6114j5416J2260l9530
6053C83K8814P3370J2399k8455J2753j4147l1356J0567l8235j3246k8501J39822
$$ y = [275877, 325127, 380427, 359171, 460811, 494518, 422814, 420708, 438766, 478048, 398001, 376906, 353548, 444160, 434464, 402675, 404375, 338702, 323283, 245606, 234036, 185054, 219526, 305175, 269337, 302353, 252396, 220567, 258538, 306310, 295841, 322257, 355731, 246341, 246572, 317802, 209935, 285680, 362042, 348064, 286780, 199218, 139527, 217121, 250162, 169911, 200594, 183776, 212788, 176798, 208640, 215852, 132872, 279110, 295236, 250654, 194280, 179112, 115791, 151015, 38374, 28560, 107230, 51848, 173417, 165932, 221238, 240233, 152283, 66250, 19256, 73248, 78477, 87578, 74926, 65312, 114934, 101500, 118406, 59938, 6955, 43069, 27653, 39913, 383, 29197, 102567, 114966, 86511, 99264, 85117, 53761, 64328, 26093, 12847, -15654, 124168]
6041A24168m4000o884N4554n2154K1776O0959j3922o2658k5230l0716m4481J9871
6029A283k5522l4216l515K6470r264O6318Q2612O5105L3391r5044k3578p064N3800
6016A30776o0931j11630O0759N5513k3688Q5810l7875N9264o1674j6748K902n9226
6004B3252N2517k4074m3534J2531K5975K5841q1985l5580J00495p468j06792j8521
5992g7343J00462k7688o4272n0838J11456J147M2104l2970J0655l1062n4235J6493
5980e6091K2854o4208P0531J05854j3446j16485P2012P0378j6955n9568j223k0962
5968g309P0349p07m0375l6575M7379k6864q174J8017l5267L5754O1770o3084m7689
5955c2775k1246K5272N2996J3503j40186o630P4817p9378P5602P5350L5748q5479
$$ y = [124168, 80168, 73284, 127838, 75684, 97460, 158419, 144497, 81839, 56609, 25893, -18588, 1283, -24239, -58455, -61970, -35500, -44764, 21554, 104166, 169271, 202662, 107618, 84040, 76976, 130776, 69845, -41785, 18974, 74487, 50799, 136609, 98734, 157998, 96324, 79576, 82478, 23252, 75769, 51695, 8161, 20692, 46667, 72508, -9477, -45057, 55438, 47970, -58822, -77343, 23119, -4569, -68841, -119679, -8223, -7076, 35028, 2058, 12713, -18349, -72584, -56091, -33237, -97445, -26914, 78940, 65494, -50991, 21021, 91399, 74444, 14876, 13653, -7309, 63040, 62333, 21958, -14617, 32762, 5898, -2276, 15741, -19526, 16228, 77998, 14914, -32775, -54021, -28749, 24247, 37750, -102436, -109066, -34249, -113627, -38025, 37325, 73073, -12406]
5943a2406L0775M354J8003l273j02564L4471J37924m6729q2495k2994M3280o1237
5931f2891Q0558P1168N580L0878o9390R563R0449j42134k9669q796K1583J39274
5919A36173m0452j08571J8822o8765N8047j4702M4642K0905n1618n1916O8356
5908A0921K4947N880j4282k5774n8459m862O0804J8173Q2590j25944J2096J43078
5896A29168l9011K0920q7765R275m0291p1885K23732N7341l0276r2417n5890L3021
5884E5922m7377P7539K8023j4362q2521J06j7854l3937N6819p47j9946L2626r032
5871B5259K1554L9286l5932l6897M805P5936O8544m9470n4137P055m1008J25522
5859A50517M0648r0976n6480J5148N6017j6242P192o020o946L8433p9443L195
$$ y = [-12406, 18369, 22723, 40726, 37453, -65111, -30640, 107284, 60555, -21940, -44934, -1654, -62891, 17667, 88835, 94415, 125293, 55903, 65466, 155915, 13781, -15888, -24684, -3101, 136173, 95721, -12850, 5972, -62793, -4746, -19448, 25194, 46099, -5519, -57435, 10921, 35868, 41748, 27466, 1692, -56767, -61629, -825, 17348, 99938, -26006, -13910, 129168, 90157, 111077, 23312, 32587, -7704, -79589, 144143, 201484, 171208, 78791, 22901, 55922, 8545, 86084, 114107, 99745, 17224, 17330, -524, -34461, 22358, 21611, 1665, 34291, 25259, 46813, 86099, 50167, 13270, 18075, 94011, 162555, 113085, 58948, 66003, 24995, 150517, 191165, 100189, 43709, 58857, 114874, 98632, 105824, 99804, 92858, 131291, 51848, 55043]
5847E5043J21844j8235j40444m9491P5073j2393l5954Q3366J02678m7695k9781
5836A04011m8025J11210r807j28845j3905l6139j6530K6798P5454r1785O8224
5825D0661L2116l332M0005j4834l2536J47831m5794k14709P4062J20441o8489
5814G5422p344j03467J03598J1671l458M7387j0213J3951N693n6466k6066n8109
5802g401p114n2569m8450J43051Q7065J5676l6179k0739l4837L4387o3838N1683
5790F0735J8720m7716j5013O5573N4736j17430K143J8004N0290L2292r166p4108
5778C9060k0091M3568l318L8636J6673o7899K8461Q5084R142J9506m4114m7966
5766I6742l484o0799K8986o5827P4873K3818O9504J3527N9044m6269p2011K2773
$$ y = [55043, 176887, 158652, 18208, -31283, 43790, 31397, -4557, 78809, 181487, 133792, 104011, 55986, 167196, 157389, 28544, 14639, -21500, -38030, -11232, 64222, -27563, 40661, 72777, 69445, 109450, 94616, 62080, 209911, 164117, -50592, 23470, 143911, 75422, 68078, -35389, 68209, 79880, 76422, 123809, 113596, 127547, 133240, 76774, 50708, -7401, -14515, -67084, -115534, 27517, 114582, 130258, 94079, 73340, 38503, 72890, 9052, 60735, 79455, 31739, 16726, 82299, 137035, 19605, 21748, 39752, 90042, 122334, 113168, 39060, 18969, 62537, 59219, 97855, 114528, 46629, 75090, 160174, 169316, 188822, 144708, 96742, 93258, 32459, 61445, -4382, 70491, 94309, 163813, 177340, 236384, 190115, 118104, 140877]
5754A40877j9686K2029l0144n421M2683L6883l4830o652k3703n8963j6643k6462
5742A9968N8260N8099J196R9981o7958j9691m4417N8958l2723J3241R1779K0482
5730B57175k2164P9141j03458N455r5354r5476R3533J01660n566j67127P2474
5719A20293j0351J5695K9271m8855K3928J3034N6486P4645j4201m9391J3923j5944
5707B08533n8950J9602Q2332j3395K1073k5996J23P367O3346o6604k6704n9504
5695A51223m6823n4117N3197J28113J0607N9197J22039o6299o7618p796j2680
5684B69043N7857K188O3430r7823N8053M5071j9274Q4039l4217k4176l0877m2970
5672C30344K8678M4623L3220j5782r0258O7631M6800o8538J4665j3404m6815l4534
$$ y = [140877, 121191, 143220, 113076, 107655, 150338, 187221, 152391, 145739, 122036, 63073, 46430, 19968, 78228, 136327, 137523, 237504, 169546, 149855, 105438, 164396, 131673, 144914, 236693, 257175, 235011, 314152, 210694, 216149, 120795, 25319, 118852, 220512, 214946, 47819, 120293, 109942, 125637, 154908, 106053, 129981, 143015, 199501, 274146, 259945, 210554, 224477, 208533, 149583, 169185, 251517, 238122, 259195, 233199, 233322, 240689, 304035, 237431, 210727, 151223, 104400, 50283, 103480, 231593, 242200, 301397, 423436, 357137, 289519, 281723, 269043, 326900, 329088, 392518, 294695, 352748, 397819, 378545, 462584, 428367, 404191, 373314, 330344, 359022, 403645, 436865, 421083, 330825, 398456, 445256, 376718, 391383, 377979, 331164, 296630]
5660B96630J29795J09268k2592k8788M0509j5858q2053k1642O9733R4762M9656
5649F19420J8819p185k572P255L069M5729J132j9607j5393o5253q76J5756K8674
5636F28968J6163k9667j4031j6839o4667R3573M9203J00345q8214p1293N7287
5625F60828Q0642J5279l3204K5801m2301P5921N5986J22866N3847p7588O072N1741
5613I95890m8975j5317Q5311K3674q6011J6558O1375J75276L7572j42247m2596
5602A060510O67l3966P6346o9701N9733L5380l1144L4434n2050o5089m1992K5768
5590I98896q9032k9478R9071Q8856l3914j28783J02363K9193l8045m0648M5923
5579A004402J36844n579l3042O5048Q5442K3940m3519L0245L7190N2013J24433
$$ y = [296630, 426425, 535693, 513101, 484313, 524822, 508964, 426911, 405269, 475002, 569764, 619420, 638239, 631054, 628482, 635737, 638806, 684535, 685667, 666060, 650667, 585414, 584538, 600294, 628968, 645131, 615464, 601433, 584594, 519927, 613500, 662703, 763048, 674834, 603541, 660828, 741470, 756749, 723545, 749346, 707045, 782966, 838952, 961818, 1015665, 938077, 944149, 995890, 946915, 931598, 1016909, 1040583, 954572, 971130, 1032505, 1207781, 1245353, 1103106, 1060510, 1061177, 1027211, 1103557, 1033856, 1093589, 1128969, 1097825, 1132259, 1080209, 1015120, 973128, 998896, 909864, 880386, 979457, 1068313, 1034399, 905616, 1007979, 1037172, 999127, 958479, 1004402, 1141246, 1135667, 1102625, 1167673, 1253115, 1277055, 1233536, 1263781, 1300971, 1352984, 1477417]
5568A477417M8192j13296N1815J23930m7913k2359N8484J2314L4168p3875L9481
5557A588358l4448j6227P3387p168q2351M2467k3861l7347j0985O6200m3949j79410
5545A334666l4351m1619m9272O6172J12247j35045q727Q2861p1713R0380J56781
5534A502380k0068l2276J36337P8984l8643M5385l3911J8089P9780J26826j11452
5523A751431p9388m0878k8117k5602O7158n851n6238n6082r8616j9079j3668M830
5511A399900L6597l2523j04478R6422K0986j17749J15445l8491m4721j0191q2803
5500A238394K1267J44315N325k5081j7270m742J11713l0799j59354J46947N9432
5489A490147k6634N0752P5166n8251M4284r3087J4392k606o8621J6577P1927q202
$$ y = [1477417, 1525609, 1412313, 1464128, 1588058, 1540145, 1517786, 1576270, 1588584, 1622752, 1548877, 1588358, 1553910, 1537683, 1611070, 1603902, 1521551, 1564018, 1540157, 1502810, 1491825, 1558025, 1514076, 1334666, 1300315, 1258696, 1209424, 1275596, 1387843, 1252798, 1244071, 1326932, 1255219, 1345599, 1502380, 1482312, 1450036, 1586373, 1665357, 1626714, 1672099, 1638188, 1656277, 1736057, 1862883, 1751431, 1672043, 1631165, 1603048, 1577446, 1644604, 1638753, 1582515, 1526433, 1427817, 1408738, 1395070, 1399900, 1436497, 1403974, 1299496, 1395918, 1416904, 1299155, 1414600, 1376109, 1331388, 1321197, 1238394, 1259661, 1403976, 1409301, 1384220, 1366950, 1362208, 1473921, 1443122, 1283768, 1430715, 1490147, 1463513, 1514265, 1589431, 1531180, 1575464, 1482377, 1496769, 1494163, 1425542, 1442119, 1514046, 1505844]
5477A505844n9673O7297K9210l2307P4588K3545J3967m9565l8134J65740L0261
5466A730773r3954J4252K4668L0967J22511K5295r0161m1052P0787J60856J30203
5455B085145j54239J7088Q1965l3417l184J86245K1656M5819O7568j3139j7626
5444B283881J55548J22524O326j0433L2813n238O3384M0998l3276q914J555R672
5432B658840Q8158J13758n8630j2593J3599L8817N8158K3940Q4044O1894L6656
5421C106641M9950O9528N3428q687J36772J01341K2082K92181o040p257O3582
5410C873521N4342J21706J35575O7446j6923J531K2236R9712R4029R9N8714L9285
5398D551273M1207J01977L1120L6616Q5471J47642P423M4793J55498P1855J59598
$$ y = [1505844, 1446171, 1513468, 1542678, 1510371, 1584959, 1608504, 1622471, 1572906, 1534772, 1700512, 1730773, 1636819, 1651071, 1675739, 1706706, 1829217, 1854512, 1764351, 1723299, 1794086, 1954942, 2085145, 1930906, 1947994, 2029959, 1996542, 1993358, 2179603, 2201259, 2247078, 2314646, 2301507, 2283881, 2439429, 2561953, 2568279, 2557846, 2590659, 2585421, 2648805, 2689803, 2656527, 2647613, 2649168, 2658840, 2746998, 2860756, 2802126, 2789533, 2803132, 2841949, 2900107, 2924047, 3008091, 3069985, 3106641, 3156591, 3226119, 3279547, 3270860, 3407632, 3508973, 3531055, 3823236, 3817196, 3809939, 3873521, 3927863, 4049569, 4185144, 4252590, 4235667, 4237198, 4259434, 4359146, 4453175, 4453274, 4511988, 4551273, 4592480, 4694457, 4725577, 4762193, 4847664, 4995306, 5002729, 5047522, 5203020, 5274875, 5434473]
5387E434473J54758J40845K12462Q8331M4059K39659J35694J94224J14515J38553
5377F897573K23601J96110P2779J50941K47997J01115J94294J42792J50819L34888
5367H712909K23300J95644L95784K11145J95662L10557K86717L55144L97559L39299
5357A1623720L98158N60382N40059M39871O81278Q00608P90941P89852J100180
5348A7725049J183142J318124J500691J783715J979092J910563J786008J569118
5340C0755502J087324M20926l22380o69552n37423m98675l27587k37274k54686
5331B9416175k45407k77080k41113l34942k59412j16972J00588L80801P17688
5322B9140326R87705J204409J599276J711083K051434K448559K873657L197690
$$ y = [5434473, 5589231, 5730076, 5942538, 6030869, 6074928, 6314587, 6450281, 6644505, 6759020, 6897573, 7121174, 7317284, 7390063, 7541004, 7789001, 7890116, 8084410, 8227202, 8378021, 8712909, 8936209, 9131853, 9527637, 9738782, 9934444, 10245001, 10531718, 10886862, 11284421, 11623720, 12021878, 12582260, 13122319, 13562190, 14243468, 15044076, 15835017, 16624869, 17725049, 18908191, 20226315, 21727006, 23510721, 25489813, 27400376, 29186384, 30755502, 31842826, 32263752, 31941372, 31271820, 30734397, 30235722, 29908135, 29670861, 29416175, 29170768, 28893688, 28652575, 28317633, 28058221, 27941249, 28041837, 28422638, 29140326, 30128031, 31332440, 32931716, 34642799, 36694233, 39142792, 42016449, 45214139]
5314D5214139L244642L294371K952959K361169J721708J130457Q12532O45816
5306F1377793O14467Q13193R54994J061128N60689l63432j647480l191176m322264
5297E5857912m455090l844611l150842k441909j760649j392730r59950m75228
5289C7376903j29332K27050O23179R12894J211839J530479J779689J730800J653925
5280D6917426J543591J042684Q08696R46873J206738J157695P62522j11979j245066
5271E3029180k540591l432625l621761l381816k853829k430826j919669j563478
5263C1284585j274420j053338p35147n43647m03557j58992k5113p196J14252L13463
5253B7510890N29536P16011P90274R53815J221965J449997J663214K095560K393971
$$ y = [45214139, 48458781, 51753152, 54706111, 57067280, 58788988, 59919445, 60731977, 61377793, 61992260, 62805453, 63760447, 64821575, 65382264, 65018832, 63371352, 60180176, 55857912, 51402822, 47558211, 44407369, 41965460, 40204811, 38812081, 37852131, 37376903, 37247571, 37474621, 38097800, 39010694, 40222533, 41753012, 43532701, 45263501, 46917426, 48461017, 49503701, 50312397, 51259270, 52466008, 53623703, 54386225, 54274246, 53029180, 50488589, 47055964, 43434203, 40052387, 37198558, 34767732, 32848063, 31284585, 30010165, 28956827, 28221680, 27678033, 27274476, 27115484, 27090371, 27083175, 27197427, 27510890, 28040426, 28756437, 29546711, 30500526, 31722491, 33172488, 34835702, 36931262, 39325233]
5244C9325233K784224L110961L344054L137505K791750J950454Q58664n89825
5236E6713020j790877j995313j903884j538080r62115q67606j126282j245494
5228D5283369j460551j599617j278437p18539k27959L04655P47656J145685J797756
5219D3994018K043072K701534L070934L026286K897972K475678J587458M38948
5211F2235900o13946j216794j351935j419826j329006j102386j256026j493085
5203E2452896j687422j949583j756736j729156j778437k095614k483882k699243
5195C6272823k572538k182572j940904j433168j025471p13448n55509k63374o402
5186B5579437N1494K98350J81012J23671K24502O2393R9683M83966M02786K28524
$$ y = [39325233, 42109457, 45220418, 48564472, 51701977, 54493727, 56444181, 57302845, 56713020, 54922143, 52926830, 51022946, 49484866, 48522751, 47655145, 46528863, 45283369, 43822818, 42223201, 40944764, 40226225, 39998266, 40302921, 41050577, 42196262, 43994018, 46037090, 48738624, 51809558, 54835844, 57733816, 60209494, 61796952, 62235900, 61621954, 60405160, 59053225, 57633399, 56304393, 55202007, 53945981, 52452896, 50765474, 48815891, 47059155, 45329999, 43551562, 41455948, 38972066, 36272823, 33700285, 31517713, 29576809, 28143641, 27118170, 26404722, 25849213, 25585839, 25579437, 25630931, 25929281, 26110293, 26233964, 26458466, 26520859, 26620542, 27104508, 27507294, 27735818]
5176B7735818J85562R1893m45810j010059j651278j804719k082710j909173j616295
5167A7493229j481227j175216r78393q12552o70883o96329n79237l77307m90069
5158A0232016l74639l74386l21115l02193l35240k01266j72439j34750j39992
5149G875996l3202j39121j37569j8460J4552P4655j02675N8247J12916J02718
5139G808057k8326k2036j40799l10263k16298l15840k78245k83464j22675r5133
5129E994978r7387m7034K1707J7913J24452k696J60142K90870J32167K73518J58510
5118G027140j9042r9422l14184l82109m10436l97591l97117l18671l43996k61360
5108D083212o3613j61780j23192k36752j36576j10099n9022q7968j05575j08066
$$ y = [27735818, 27921380, 28013273, 27567463, 26557404, 24906126, 23101407, 21018697, 19109524, 17493229, 16012002, 14836786, 13858393, 13045841, 12374958, 11678629, 11099392, 10722085, 10232016, 9857377, 9482991, 9161876, 8859683, 8524443, 8323177, 8150738, 8015988, 7875996, 7842794, 7703673, 7566104, 7547644, 7562196, 7636851, 7534176, 7592423, 7705339, 7808057, 7779731, 7757695, 7616896, 7306633, 7090335, 6774495, 6496250, 6212786, 6090111, 5994978, 5897591, 5850557, 5872264, 5890177, 6014629, 6011933, 6172075, 6462945, 6595112, 6868630, 7027140, 7008098, 6908676, 6594492, 6212383, 5801947, 5404356, 5007239, 4688568, 4344572, 4083212, 4019599, 3857819, 3734627, 3497875, 3361299, 3251200, 3192178, 3104210, 2998635, 2890569]
5098B890569j1649N0100p7866k8498j11300o5474j0600n602j06826m0584p759
5087B474511j17864M126m471p1185q8446k5949j9469L1128o7126O5643j17376
5076B063522J9622m026p335k6692N302p5758o6971l6812L5408L9011k0481j9480
5064A905310o8054L9082N7227K2621j18425l5232R5709o1141k7638k5618L8950
5053A822791N8291q3030M6570l794j7156o9021q3224k8482K0751J8223j09860
5042A572059L7717M9121j4470O0357j26409q285J57247O9825n1419K7686m5125
5031A728304r826o7130j3345L4040Q1445O6348m6831k316o24n6434j10403P4921
5019A678149Q3905m0556N3727M2091j5594m9739K3941N190q5654P8137N523r1995
$$ y = [2890569, 2878920, 2929020, 2851154, 2822656, 2711356, 2645882, 2635282, 2629680, 2522854, 2482270, 2474511, 2356647, 2360773, 2356302, 2285117, 2196671, 2170722, 2151253, 2182381, 2115255, 2180898, 2063522, 2083144, 2079118, 2071783, 2045091, 2050393, 1974635, 1907664, 1870852, 1906260, 1945271, 1924790, 1905310, 1837256, 1876338, 1933565, 1956186, 1837761, 1802529, 1898238, 1837097, 1809459, 1783841, 1822791, 1881082, 1798052, 1844622, 1840828, 1823672, 1754651, 1671427, 1642945, 1663696, 1681919, 1572059, 1609776, 1658897, 1644427, 1704784, 1578375, 1570090, 1727337, 1797162, 1745743, 1773429, 1728304, 1718478, 1651348, 1638003, 1672043, 1753488, 1819836, 1773005, 1770689, 1770065, 1713631, 1603228, 1678149, 1762054, 1721498, 1775225, 1817316, 1801722, 1751983, 1775924, 1781114, 1695460, 1773597, 1779120, 1687125]
5007A687125M9394j9617O3008J6931J5540K0421Q2157k0069n9213P8771K6826
4996A941274M5080L9875l7499Q3098m6986m3110j0874j22182O3243J4776m9880
4985A876815K0488Q7341n2720O9036j1706O2375K7361M5025O7917L3114P8475
4974B303521J6857j8451k5241J35612j880J23159j1442l6846M4691J14737J6281
4963B660998n1815N6675J50858k8063J3157M1240J19619k2762m4401R539r738
4952B895307O6602L7470o0352M2572Q4482l4233N6643M1724J00056n1915P6875
4941C255231J18707j022J31585J33691J45310P8506J13164J24242N0204K6222
4931D175840L5391J22299O9845n228L123J8027J36511N6401N8982J32300L0488
$$ y = [1687125, 1736519, 1716902, 1779910, 1796841, 1812381, 1832802, 1914959, 1894890, 1835677, 1914448, 1941274, 1986354, 2026229, 1988730, 2071828, 2024842, 1981732, 1970858, 1848676, 1911919, 1926695, 1876815, 1897303, 1984644, 1931924, 2000960, 1989254, 2051629, 2078990, 2124015, 2191932, 2225046, 2303521, 2320378, 2301927, 2276686, 2412298, 2410418, 2533577, 2522135, 2485289, 2529980, 2644717, 2660998, 2609183, 2665858, 2816716, 2788653, 2801810, 2843050, 2962669, 2939907, 2895506, 2905045, 2895307, 2961909, 2999379, 2939027, 2981599, 3066081, 3031848, 3088491, 3130215, 3230271, 3178356, 3255231, 3373938, 3372916, 3504501, 3638192, 3783502, 3862008, 3975172, 4099414, 4149618, 4175840, 4211231, 4333530, 4403375, 4398147, 4401270, 4419297, 4555808, 4612209, 4671191, 4803491, 4833979]
4920D833979J13371K9762J39346J73207J74005J12493J40587J03736K77865J62823
4910F261174J36666J42094K16864J17373R5732O9166O207J12099K37604J49511
4900G544490J06385J71567J20140K07005L29744K52579O8703J22607J35169J42241
4890I200630J71036Q2805J16076J67525L3739J68334J68576K20531K65820J32131
4880A0727203K71664K01833K88535J88722J41194J39667J64822L28893M33790
4871A2886323L99755L59763N07939P12935P21213P25804Q06127Q53069Q35756
4862A8808684Q97769R67325Q37182Q25134R74422R06632R46725J053777J176490
4853B7394140J280306J401163J538385J720624J782875J692633J994514K066661
$$ y = [4833979, 4947350, 4977112, 5116458, 5289665, 5463670, 5576163, 5716750, 5820486, 6098351, 6261174, 6397840, 6539934, 6756798, 6874171, 6969903, 7039069, 7045276, 7157375, 7394979, 7544490, 7650875, 7822442, 7942582, 8149587, 8479331, 8731910, 8800613, 8923220, 9058389, 9200630, 9371666, 9454471, 9570547, 9738072, 9771811, 9940145, 10108721, 10329252, 10595072, 10727203, 10998867, 11200700, 11489235, 11677957, 11819151, 11958818, 12123640, 12452533, 12886323, 13286078, 13645841, 14153780, 14866715, 15587928, 16313732, 17119859, 17972928, 18808684, 19706453, 20673778, 21510960, 22336094, 23310516, 24217148, 25163873, 26217650, 27394140, 28674446, 30075609, 31613994, 33334618, 35117493, 36810126, 38804640, 40871301]
4845D0871301K297001K632764K887170L159542L411048L877260M578551N461734
4837F9176371O508964P541579Q985367J0446894J2485606J5134416J8682862K1622648
4829A70584707K2325105K0331906J5417709Q578888m030142k2672103l2404604
4822A78131466k9539932k3071336j7400295j3698374j1076274r302054p542121
4815F6501080o180412n445667m739637m113702l607966l270525k784776k331753
4807C4026642j993592j699018j592992j470155j321963j297935j210960j180998
4799B2259029j145066j026342r82145r14414q86409o86782o73873p14422o34485
4790A4595091n75697m76305m29362m27288l16371l00321l46361k20501m18043
$$ y = [40871301, 43168302, 45801066, 48688236, 51847778, 55258826, 59136086, 63714637, 69176371, 75685335, 83226914, 92212281, 102659175, 115144781, 130279197, 148962059, 170584707, 192909812, 213241718, 228659427, 237238315, 233208173, 210536070, 178131466, 148591534, 125520198, 108119903, 94421529, 83345255, 74043201, 66501080, 60320668, 54875001, 50135364, 46021662, 42413696, 39143171, 36358395, 34026642, 32033050, 30334032, 28741040, 27270885, 25948922, 24650987, 23440027, 22259029, 21113963, 20087621, 19105476, 18191062, 17304653, 16617871, 15943998, 15229576, 14595091, 14019394, 13543089, 13113727, 12686439, 12370068, 12069747, 11723386, 11502885, 11084842]
4781A1084842l34429l23625k25084k67648l47327l19059k82788l49916k99433
4772H335533k74529l22973r8200l08917k31045k40661k05795j87592j59595q9022
4762F217204j22688q2055o5383j17701k01588k14727j54226j39466j11859k29026
4752D778485k36176j84986j29746r8814j04562j58294j41256o9997j39079m7547
4742C468028j05660k177j16317j07876r196p9948j1436q5607j50473M351o7247
4731B736442r1305K1699j37145p0218p426n0114n2612n1586o188q4728p2418r2949
4719B041452j58542k7525Q2201J9947k3255N9451q1607j6223N3857o4512j2156
4708A873088J05240j57195L5410J3807k2668j40903l0935P9350l7395m797j01305
$$ y = [11084842, 10750413, 10426788, 10201704, 9934056, 9586729, 9267670, 8984882, 8634966, 8335533, 8061004, 7738031, 7639831, 7330914, 7099869, 6859208, 6653413, 6465821, 6306226, 6217204, 6094516, 6012461, 5947078, 5829377, 5627789, 5413062, 5258836, 5119370, 5007511, 4778485, 4542309, 4357323, 4227577, 4128763, 4024201, 3865907, 3724651, 3654654, 3515575, 3468028, 3362368, 3360191, 3243874, 3135998, 3126802, 3046854, 3035418, 2949811, 2799338, 2803689, 2736442, 2645137, 2666836, 2529691, 2459473, 2452047, 2401933, 2349321, 2297735, 2291547, 2206819, 2134401, 2041452, 1882910, 1855385, 1937586, 1957533, 1934278, 1993729, 1912122, 1895899, 1949756, 1885244, 1873088, 1978328, 1821133, 1856543, 1870350, 1847682, 1706779, 1675844, 1755194, 1717799, 1713002, 1611697]
4697A611697l9759m8553o9275M662p32J12287Q0086o9697j55956O9310J09147
4686A603217l7207m0926p7381O5120m912q0807K7969j09751j5323Q1991p7415
4675A334575K8736O258j21213L091L0328k0949o8037k1453L7494J3082j6355N8141
4663A263698L1623p5626j4758j23422l3521L9671J2968J8288O3457o3093O5346
4652A184631M9504Q1122k5920n3987L7405l6679n7217K3895j22368o982M5234
4641A118638o2896P1817M8818K0038M1882O4523n8948n5579N9369J51294o1764
4630A337192k4052J27111L2431j04314M6840j140q201R8255P556J1402n6175R9468
4618A566373K3347O9227M8192j5388P9392J11541N6998O8705M6398P0582J69547
$$ y = [1611697, 1571938, 1523385, 1454110, 1458772, 1458040, 1570327, 1650413, 1580716, 1424760, 1494070, 1603217, 1566010, 1525084, 1447703, 1512823, 1507911, 1427104, 1455073, 1345322, 1329999, 1411990, 1334575, 1363311, 1369569, 1248356, 1251447, 1281775, 1260826, 1192789, 1171336, 1208830, 1221912, 1205557, 1263698, 1295321, 1219695, 1204937, 1081515, 1047994, 1087665, 1100633, 1118921, 1182378, 1119285, 1184631, 1234135, 1315257, 1289337, 1235350, 1272755, 1236076, 1178859, 1202754, 1080386, 1073404, 1118638, 1055742, 1127559, 1176377, 1196415, 1238297, 1302820, 1243872, 1188293, 1247662, 1398956, 1337192, 1313140, 1440251, 1472682, 1368368, 1415208, 1414068, 1405867, 1504122, 1511678, 1523080, 1466905, 1566373, 1589720, 1658947, 1707139, 1691751, 1771143, 1882684, 1939682, 2008387, 2054785, 2125367, 2294914]
4607B294914J00997K42340J42371K31914L36003K19546K94416L53657N23681N11751
4597E251590M73181O24165L87639M0208j74652m80223p40742q04896n62360m24813
4587C589097l21501m02957k75096j97244j62285j89826j46792l5708j38518j37637
4577A581533n5602m4194j23259r4318p0471o4903o3050k5992P338o8321M4800
4566A023561m1733J2874q0543m7249L5987O6934q9895m6531K8776r593K8362m915
4554H76035J1969m2727M622M687O3442j22677K3753r5539n1498j8382q4770J34396
4542G03311K970r2392O4509j164n4048M7865j2446j00720N899K2570N2867O7391
4530G06612m8952j3827J5846r5347J43137L8765J4471j1156O2705o1873p4452
$$ y = [2294914, 2395911, 2638251, 2780622, 3012536, 3348539, 3568085, 3862501, 4216158, 4739839, 5251590, 5724771, 6348936, 6736575, 6776783, 6602131, 6121908, 5381166, 4576270, 4013910, 3589097, 3267596, 2864639, 2589543, 2392299, 2230014, 2040188, 1893396, 1857688, 1719170, 1581533, 1525931, 1481737, 1358478, 1264160, 1193689, 1128786, 1065736, 1039744, 1047082, 978761, 1023561, 981828, 994702, 914159, 866910, 902897, 969831, 879936, 833405, 862181, 852588, 880950, 876035, 888004, 845277, 849899, 854586, 918028, 795351, 819104, 723565, 672067, 653685, 568915, 703311, 706281, 613889, 678398, 677234, 623186, 671051, 658605, 557885, 563784, 586354, 639221, 706612, 657660, 643833, 659679, 564332, 707469, 746234, 760705, 749549, 812254, 750381, 675929]
4519F75929M0946R3315M3116J27403R5896J31083J79612N1270P2564J21447m600
4508A627981q2022j10392j89100p3985p2557j82344k0340l7769q7527l931r6338
4497F71676k130j27141j01046k134K5599J0931J1330J1202j6769l973J10421o6582
4485E21384p5747k7174k4129L1444O1206l1852j23780j7820R6922l9601o598Q7689
4473D51944k384r6056r788J31404l6595j12882l1293N0105J03273j2589r6667
4462C38472J07924j47466K6312J00591j0515j7315j50043P0322k4296K7386k8092
4451B93280L5463J41965m7480J848J7064j35455q8902M5852J32496q0103K190
4440C18218r2242r023L6472M5416O4082n6534K6556L9356L4019m2479R906p0358
$$ y = [675929, 716875, 810190, 853306, 980709, 1076605, 1207688, 1387300, 1438570, 1511134, 1632581, 1627981, 1545959, 1435567, 1246467, 1172482, 1099925, 917581, 897241, 859472, 771945, 768014, 671676, 669546, 542405, 441359, 439225, 464824, 475755, 487085, 498287, 481518, 477545, 587966, 521384, 445637, 418463, 394334, 425778, 486984, 455132, 331352, 313532, 410454, 370853, 364255, 451944, 449560, 353504, 343716, 475120, 438525, 325643, 294350, 344455, 447728, 435139, 338472, 446396, 298930, 325242, 425833, 415318, 398003, 247960, 318282, 293986, 321372, 293280, 328743, 470708, 423228, 425076, 442140, 306685, 217783, 263635, 396131, 316028, 318218, 225976, 216953, 253425, 298841, 362923, 306389, 332945, 372301, 406320, 363841, 373747, 303389]
4428C03389o486O8892O3623J7288j10091o5342R3017L0322J1307o2129K336R3504
4416D39630o6115p0800P2098j2954j01242j0834L3806M5674q301l1057M1315j8108
4404C13112r5279M0443O1114K3352q3104J6901N9486k3178J3647j3528k0565Q8838
4392C81239m9613j0767P5935O0001r7085Q2438l0807p0151P3043m106j7820K5892
4380D18199K7923j086j9411p20j3719O3139L9267K988L6468j06948l4459K7570
4368D39211j1515j07363L089J9929J16792P234r659P3294M0318j18838P745o6807
4356C93430J02918L2888L1843j5670m7503J5970Q5800L2540j28134j02003N8519
4345D60598J10955j60342N5782P4873N9270O8143K8937r3791N7822O9827k13957
$$ y = [303389, 296903, 365795, 429418, 446706, 336615, 271273, 364290, 394612, 405919, 343790, 346126, 439630, 373515, 302715, 374813, 361859, 260617, 249783, 283589, 329263, 320962, 289905, 331220, 313112, 217833, 258276, 319390, 342742, 259638, 276539, 336025, 312847, 326494, 312966, 292401, 381239, 331626, 320859, 396794, 456795, 359710, 442148, 411341, 341190, 414233, 410127, 392307, 418199, 446122, 445036, 425625, 424905, 411186, 474325, 513592, 516580, 553048, 446100, 411641, 439211, 427696, 320333, 323422, 343351, 460143, 467377, 457718, 531012, 571330, 452492, 460237, 393430, 496348, 529236, 561079, 545409, 497906, 513876, 599676, 632216, 504082, 402079, 460598, 571553, 411211, 466993, 541866, 601136, 669279, 698216, 604425, 662247, 732074, 518117]
4334E18117n5250J07800O4526q8083R9385o063l3473J44382K745O6920K3966K3481
4322H68453l4871L4500P3291K387K0987J2649r649L1158J53975j42975M6270O8626
4310A124801L2007q853r1550O3813Q7135P6130r7348r550O2245J14616L7198Q9864
4298A480508l3256L4445P6027N6295N1527p1689N2720L650k7372m425O3378Q8073
4286A769881O9102m415J79118J34821m9221j9966m0244P7574n4861k8323K6683
4275B060149J64419J90152J3105m904k0797j132J4189R0719J6090M2984M6652
4264B611626M2228n9151k4375J45838J13097j413r612N0075k0634j9963q4659
4253B743057k0630Q283L6525K3641O6035m3883M0530K8516m203j59853j27761
$$ y = [518117, 462867, 570667, 635193, 547110, 646495, 640432, 606959, 751341, 754086, 821006, 844972, 868453, 833582, 868082, 941373, 943760, 964747, 977396, 967747, 998905, 1152880, 1009905, 1056175, 1124801, 1156808, 1147955, 1056405, 1120218, 1207353, 1283483, 1186135, 1176585, 1238830, 1353446, 1390644, 1480508, 1447252, 1481697, 1557724, 1614019, 1665546, 1593857, 1646577, 1650227, 1622855, 1618430, 1681808, 1769881, 1838983, 1834568, 2013686, 2148507, 2099286, 2079320, 2039076, 2116650, 2061789, 2033466, 2060149, 2224568, 2414720, 2427825, 2422921, 2402124, 2400992, 2415181, 2505900, 2521990, 2564974, 2611626, 2653854, 2594703, 2570328, 2716166, 2829263, 2827850, 2818238, 2868313, 2847679, 2827716, 2743057, 2722427, 2730710, 2767235, 2790876, 2856911, 2813028, 2853558, 2882074, 2877871, 2718018, 2590257]
4242B590257k5677P8454k1794n7506M935p3276r5620k8691P1786l3780r2134p8800
4230B238154j3986j31468J35471r568q9247q7012j10292q5116O9178N8519K9985
4219B004618r9550m1538K1170r8117M2748j04869J1393q5530K4066L4482j2548
4208A696325j8621L8661p2840L0162l2593K2892J02376j03620Q0004n704j3768
4197A723274Q7396m127j07717m3445R507m4268N58J12989K6552l0916P950M7627
4185A785380J50K5469j06781k0858R0287l727J8563O9630K7516N2400m1767J18626
4173B014888j9238L2442P4311O712M1730o2229L9704P1110O3023r454o9639M3230
4161B226590P3672J30454j967L0053O4866m0855l3423J08376J35913j8494L226
$$ y = [2590257, 2564580, 2643034, 2621240, 2563734, 2568669, 2495393, 2399773, 2371082, 2442868, 2409088, 2316954, 2238154, 2224168, 2092700, 2228171, 2218603, 2129356, 2042344, 1932052, 1846936, 1916114, 1974633, 2004618, 1905068, 1863530, 1884700, 1786583, 1829331, 1724462, 1735855, 1650325, 1674391, 1708873, 1696325, 1677704, 1716365, 1643525, 1673687, 1641094, 1663986, 1766362, 1662742, 1742746, 1737042, 1723274, 1810670, 1806543, 1698826, 1655381, 1664888, 1620620, 1621178, 1734167, 1760719, 1729803, 1737753, 1785380, 1785530, 1810999, 1704218, 1683360, 1773647, 1769920, 1788483, 1858113, 1885629, 1938029, 1896262, 2014888, 1995650, 2028092, 2102403, 2109115, 2150845, 2088616, 2128320, 2199430, 2262453, 2252999, 2183360, 2226590, 2300262, 2430716, 2428749, 2458802, 2523668, 2482813, 2449390, 2557766, 2693679, 2675185, 2678411]
4150B678411L7634r80M8640N8203K9411J16026M9816k1249K5733l660j9128J46147
4138C145004Q4924L5593l684O6616J73395K18771j3787L4459O2931N3471L1237
4127C888930N7179J02509M3705J18180N9480O5562O8165L5037J97488J60751q3974
4116D713012J99733K38820O8717J33421L0590P6856J10953K31293J59256J45928
4106F108579K49261J31792K1023J36893J62205J19083K80591K71721M3983J53526
4096G678657K97660J97147J85842K38580J73649J93940K87083L13282J97845J15125
4086I878810J91461K61905K61187K65994J97444J34694K35656K55878J63796J94351
4076A2041176J72381J82651J89374R9799J83016J70891J01658j1376J88161R6941
$$ y = [2678411, 2716045, 2715065, 2763705, 2821908, 2851319, 2967345, 3017161, 2995912, 3021645, 3017985, 2998857, 3145004, 3229928, 3265521, 3261837, 3328453, 3501848, 3720619, 3706832, 3741291, 3804222, 3857693, 3888930, 3946109, 4048618, 4092323, 4210503, 4269983, 4335545, 4403710, 4438747, 4636235, 4796986, 4713012, 4912745, 5151565, 5220282, 5353703, 5384293, 5461149, 5572102, 5803395, 5962651, 6108579, 6357840, 6489632, 6510655, 6647548, 6809753, 6928836, 7209427, 7481148, 7525131, 7678657, 7976317, 8173464, 8359306, 8597886, 8771535, 8965475, 9252558, 9565840, 9763685, 9878810, 10070271, 10332176, 10593363, 10859357, 11056801, 11191495, 11427151, 11683029, 11846825, 12041176, 12213557, 12396208, 12585582, 12685381, 12868397, 13039288, 13140946, 13129570, 13317731, 13414672]
4066A3414672J24362J28775J17806Q879N7134R2794N9692n2829J23705J52739
4056A4227729J15044J94889J40919J76622J81467K95206J53261J78963L42141
4047A6006241L27032L31029K89699K79698N90490N08052M99653N17386O25437
4038A9974717O71365P43563Q22247Q04066Q31951Q39390R84987J075856J168707
4029B7916849J296306J156872J329929J362793J433146J624908J656901J643960
4021C9421664J625711J902103J923267J779325J924663J947086J981496J975846
4013E4481161J970657K218896K142163K093354K118950K113990K085197K037089
4005G1261457J970128J907924J716099J504833J510170J378918J292378J206842
$$ y = [13414672, 13539034, 13667809, 13785615, 13794494, 13851628, 13944422, 14004114, 13951285, 14074990, 14227729, 14342773, 14537662, 14678581, 14855203, 15036670, 15331876, 15485137, 15664100, 16006241, 16333273, 16664302, 16954001, 17233699, 17824189, 18332241, 18831894, 19349280, 19974717, 20646082, 21389645, 22211892, 23015958, 23847909, 24687299, 25672286, 26748142, 27916849, 29213155, 30370027, 31699956, 33062749, 34495895, 36120803, 37777704, 39421664, 41047375, 42949478, 44872745, 46652070, 48576733, 50523819, 52505315, 54481161, 56451818, 58670714, 60812877, 62906231, 65025181, 67139171, 69224368, 71261457, 73231585, 75139509, 76855608, 78360441, 79870611, 81249529, 82541907, 83748749]
3997H3748749J208136J061916Q73728Q99191O19041M42640K85441J16287k02316
3988H9052813l41902n54383o94737r41429j030277j078089j209614j236747j339107
3979H0626528j400965j479311j558149j894534k065987k050423k200770k300304
3971F5676085k286788k250859k245714k310900k120241k120513k067705k115604
3963D8157761k126721k021699j945720j973690j864834j766017j707622j758515
3955C2992943j688472j570590j478266j239370j241575j314895j201114j026270
3947B2232391j105622r23725r15926r40156q13016o33761p26592o90939n21501
3938A4961153n48941n68914m56604m37454l57951l76066l79698k52353l19350
$$ y = [83748749, 84956885, 86018801, 86892529, 87791720, 88410761, 88853401, 89138842, 89255129, 89052813, 88710911, 88156528, 87461791, 86520362, 85490085, 84411996, 83202382, 81965635, 80626528, 79225563, 77746252, 76188103, 74293569, 72227582, 70177159, 67976389, 65676085, 63389297, 61138438, 58892724, 56581824, 54461583, 52341070, 50273365, 48157761, 46031040, 44009341, 42063621, 40089931, 38225097, 36459080, 34751458, 32992943, 31304471, 29733881, 28255615, 27016245, 25774670, 24459775, 23258661, 22232391, 21126769, 20203044, 19287118, 18346962, 17533946, 16900185, 16173593, 15482654, 14961153, 14412212, 13843298, 13386694, 12949240, 12591289, 12215223, 11835525, 11583172, 11263822]
3929A1263822k86822k22806k52659j98591k53684k01340k69623k24349m2379j17104
3919I194465k06139k55341j19388k31662j02988k73227j17265j92092j50635p6893
3909G468835j78567j63640j61075j56626p5000j10171j30920Q645j22123j68105
3899F211253j65899j21085j80545q3686M0657l3260j28981p6168L9508P7739P5441
3888E654974o1185r3743M8038p3154l4533R9350J45867P2045J5435j46478N6152
3877E682768J20177J71434J33790J03241Q8273J22031J45646L5379J63932J7028
3867F783699Q7630J07250K8883m6752N6518j1816K5198l9755j01718l0590n4609
3856F803938m5705K7492j26841j73720P8068j61852r1866p3826j41663r5911k05643
$$ y = [11263822, 10977000, 10754194, 10501535, 10302944, 10049260, 9847920, 9578297, 9353948, 9311569, 9194465, 8988326, 8732985, 8613597, 8381935, 8278947, 8005720, 7888455, 7696363, 7545728, 7468835, 7290268, 7126628, 6965553, 6808927, 6733927, 6623756, 6492836, 6501481, 6379358, 6211253, 6045354, 5924269, 5743724, 5660038, 5700695, 5667435, 5538454, 5462286, 5501794, 5579533, 5654974, 5593789, 5500046, 5548084, 5474930, 5440397, 5539747, 5685614, 5757659, 5773094, 5626616, 5682768, 5802945, 5974379, 6108169, 6211410, 6299683, 6421714, 6567360, 6602739, 6766671, 6783699, 6871329, 6978579, 7007462, 6960710, 7017228, 7005412, 7030610, 6990855, 6889137, 6858547, 6803938, 6758233, 6785725, 6658884, 6485164, 6563232, 6401380, 6309514, 6235688, 6094025, 5998114, 5792471]
3845E792471j89333o4847k59953j67186j9424m9744j07320j03294j81596l8120
3835D611654n5973p1297j51586k8743k3986l9476j8036q312n1092j00834K2390
3824D084709p2492L0155j26292l1781l0328J5586q7755K2253L2485j294J4501
3813C849747j6877k0038r5069n0792k5395k909q0004K5489J01143o8514J9726
3802C636507l7697m2421P8128j7202o301m3547n399J8852K6829J9683j0588J1164
3790C628008M3943R3345o4857m3070K6041J12890Q5356k3096K7369Q0932L2758
3779C999619L243Q138j1923r910J03809R8963J08394n3551K9309J23237J35364
3768D534692K04025K762L6689J02415P990N4247J60956J12599R7126q990J13745
$$ y = [5792471, 5603138, 5538291, 5278338, 5111152, 5091728, 5041984, 4934664, 4831370, 4649774, 4611654, 4555681, 4484384, 4332798, 4304055, 4280069, 4240593, 4222557, 4214245, 4163153, 4062319, 4084709, 4012217, 4042372, 3916080, 3884299, 3853971, 3869557, 3781802, 3804055, 3836540, 3835246, 3849747, 3832870, 3812832, 3717763, 3666971, 3641576, 3638667, 3558663, 3584152, 3685295, 3616781, 3636507, 3598810, 3556389, 3634517, 3617315, 3611014, 3567467, 3562068, 3580920, 3607749, 3627432, 3616844, 3628008, 3671951, 3765296, 3700439, 3657369, 3683410, 3796300, 3881656, 3858560, 3885929, 3966861, 3999619, 4002862, 4011000, 3999077, 3989167, 4092976, 4191939, 4300333, 4246782, 4276091, 4399328, 4534692, 4738717, 4741479, 4778168, 4880583, 4888573, 4942820, 5103776, 5216375, 5313501, 5304511, 5418256]
3757E418256M9792J62297j5761m5956M6647J22555l774o1487P1939J0275K5389
3746E780172j4910Q9943R8606j17861P4443Q8199k5798J05845n6245L5318L6824
3735F094536J2656n1246J00877M6421O0497O5660O2379L5581M488R0387J31510
3724F653746N6925J7524K6864N3385K05576J24721K07740J29177Q026P0994N4643
3713G609321Q0826N2728J15706J39939N0785J38563J65469P3788L7373K25733
3703H690231K06037P4199J65188J06615K09818O3026J76502L00462K01518J84549
3693A0378145K32100K39966K29639K51566J47965L15404K54284L71509K97188
3684A2717766K56815L22023L83467M69350M89847L83007M43015O13182O52426
$$ y = [5418256, 5468048, 5630345, 5614584, 5568628, 5615275, 5737830, 5734056, 5672569, 5744508, 5754783, 5780172, 5765262, 5855205, 5953811, 5835950, 5910393, 5998592, 5972794, 6078639, 6022394, 6057712, 6094536, 6107192, 6055946, 6156823, 6203244, 6263741, 6329401, 6391780, 6427361, 6431849, 6522236, 6653746, 6710671, 6728195, 6755059, 6808444, 7014020, 7138741, 7346481, 7475658, 7483684, 7554678, 7609321, 7690147, 7742875, 7858581, 7998520, 8049305, 8187868, 8353337, 8427125, 8464498, 8690231, 8896268, 8970467, 9135655, 9242270, 9452088, 9515114, 9691616, 9992078, 10193596, 10378145, 10610245, 10850211, 11079850, 11331416, 11479381, 11794785, 12049069, 12420578, 12717766, 12974581, 13296604, 13680071, 14149421, 14639268, 15022275, 15465290, 16078472, 16730898]
3675A6730898N05110M91196N13255O56792P32171P99557Q35300P97256Q95578
3666B2957113Q93242J023373J054137J001426J006759J190461J139436J020402
3658C1286349J122506J148302R06275R08341Q61402Q04080Q15935P93661P92857
3649C9439708P33954P22514P26730N06093M50567M40691L13161J61464Q0650M3167
3639D3618699j62907j71082k75611k48799l31874j85941k13109j65294k33018
3630D1631064j39946q0333k36354j8705L6478N8232J44321K49641K83202L84212
3620D2311812M58933O50001P50621R84464J205382J228663J466289J640594J734364
3611E2431123K074296K200462K318732K631651K833617K819490K880026K911192
$$ y = [16730898, 17236008, 17727204, 18240459, 18897251, 19629422, 20428979, 21264279, 22061535, 22957113, 23850355, 24873728, 25927865, 26929291, 27936050, 29126511, 30265947, 31286349, 32408855, 33557157, 34463432, 35371773, 36233175, 37037255, 37853190, 38646851, 39439708, 40173662, 40896176, 41622906, 42128999, 42579566, 43020257, 43333418, 43494882, 43575532, 43618699, 43455792, 43284710, 43009099, 42760300, 42428426, 42242485, 42029376, 41864082, 41631064, 41491118, 41410785, 41174431, 41155726, 41192204, 41250436, 41394757, 41644398, 41927600, 42311812, 42770745, 43420746, 44171367, 45155831, 46361213, 47589876, 49056165, 50696759, 52431123, 54505419, 56705881, 59024613, 61656264, 64489881, 67309371, 70189397, 73100589]
3603G3100589K895835K849227K817562K633443K619268K430964K465747K385801
3595I4198436K238699K124445K119544K004248J669231J424805J181305Q41755
3587A07802468M35222P7603m02033p31367j006918j142355j469292j382116j339890
3578A00841322j371192j504272j535871j457652j355594j329552j363410j339725
3570H9584054j282429j088106q28102p06173l92491j42680K62546N16918P62287
3561H6685824J092728J269784J476315J538425J687212J788522J871342J754897
3553I9165049J796848J686811J611431J721366J678718J622056J546101J488229
3545A12316609J336669J071308Q60085O14521K95235j77369l65855p31738j012533
$$ y = [73100589, 75996424, 78845651, 81663213, 84296656, 86915924, 89346888, 91812635, 94198436, 96437135, 98561580, 100681124, 102685372, 104354603, 105779408, 106960713, 107802468, 108237690, 108315293, 107913260, 107181893, 106174975, 105032620, 103563328, 102181212, 100841322, 99470130, 97965858, 96429987, 94972335, 93616741, 92287189, 90923779, 89584054, 88301625, 87213519, 86385417, 85679244, 85286753, 85144073, 85406619, 85923537, 86685824, 87778552, 89048336, 90524651, 92063076, 93750288, 95538810, 97410152, 99165049, 100961897, 102648708, 104260139, 105981505, 107660223, 109282279, 110828380, 112316609, 113653278, 114724586, 115584671, 116199192, 116494427, 116317058, 115951203, 115219465, 114206932]
3536A14206932j306556j618025j940392k112978k257307k353853k379643k245688
3528I7992490k321208k361881k161257k080324k076763k247905k224761k233497
3520H0284894k097870k014760j956873j738957j545257j073248r07512o26372
3512F8324045k40960L9436L56194L95027P23276J015436J298407J437321J656806
3503G5004988J808230J993849K220188K283071K332675K630371K812211K947460
3495I4033043L179229L439198L665792L941657M319835M594291N094652N424655
3487A27692352N942448O482899P078083P769329Q617882R540847J0246614J1283670
3479A94654124J1763261J2058316J2037834J1343639J0083396Q512995O487478
$$ y = [114206932, 112900376, 111282351, 109341959, 107228981, 104971674, 102617821, 100238178, 97992490, 95671282, 93309401, 91148144, 89067820, 86991057, 84743152, 82518391, 80284894, 78187024, 76172264, 74215391, 72476434, 70931177, 69857929, 68950417, 68324045, 68083085, 68122521, 68478715, 68873742, 69597018, 70612454, 71910861, 73348182, 75004988, 76813218, 78807067, 81027255, 83310326, 85643001, 88273372, 91085583, 94033043, 97212272, 100651470, 104317262, 108258919, 112578754, 117173045, 122267697, 127692352, 133634800, 140117699, 147195782, 154965111, 163582993, 173123840, 183370454, 194654124, 206417385, 218475701, 230513535, 241857174, 251940570, 260453565, 266941043]
3472B66941043M172467K220152K74928j170790k061087k490059k467746k354275
3464B63064633k308389k235919k539273l307510m444215o092454p952609r850447
3456B24333817j1529974j2813347j3671719j4080067j3883025j3210920j2060920
3449A33083845j1041303r816782q698168p764771o874765o081759n461906m828702
3441G2515689m414023l932520l447071l181689k919859k725616k398339k075113
3433D7421459j981445k036727j709804j578551j548904j342063j382051j319311
3425C4522603j123750j068631j162479j013645q15131r69983p86724p97364p84848
3416B6000048p68208p08058o03260o37486o09865n72940n83772n76576n72231
$$ y = [266941043, 271113510, 273333662, 273608590, 272437800, 270376713, 267886654, 265418908, 263064633, 260756244, 258520325, 255981052, 252673542, 248229327, 242136873, 234184264, 224333817, 212803843, 199990496, 186318777, 172238710, 158355685, 145144765, 133083845, 122042542, 112225760, 103527592, 95762821, 88888056, 82806297, 77344391, 72515689, 68101666, 64169146, 60722075, 57540386, 54620527, 51894911, 49496572, 47421459, 45440014, 43403287, 41693483, 40114932, 38566028, 37223965, 35841914, 34522603, 33398853, 32330222, 31167743, 30154098, 29338967, 28368984, 27582260, 26784896, 26000048, 25231840, 24523782, 23920522, 23283036, 22673171, 22100231, 21516459, 20939883, 20367652]
3407B0367652m59795m61640n47864n40159m49469m85838l71937m50275m36245
3398A6164430l79821m32635l60889m79305l01408k52350k55831l48679k79261
3389A3074251l09022k66208k37423k69030k53024k28561k56466k82395j48311
3380A0823811j59015k68735k73658j81550j72914j62528j79918j02024k13991
3371I109478q9195j99185k82193j16995m0530j98741q0738j29368n0329j17833
3361G804371p9272n3879k9190j09489j02610j5976k3491o1210r667j41796o5991
3350G111800k0109j30377k5029K6489l068n0619L266J0458j00503n2936N4344
3339F823716j40833N1670k4217p345o5797l3198m3237M2770R9727p166k6746l7765
$$ y = [20367652, 19907857, 19446217, 18898353, 18358194, 17908725, 17422887, 17050950, 16600675, 16164430, 15784609, 15351974, 14991085, 14511780, 14210372, 13958022, 13702191, 13353512, 13074251, 12765229, 12499021, 12261598, 11992568, 11739544, 11510983, 11254517, 10972122, 10823811, 10664796, 10396061, 10122403, 9940853, 9767939, 9605411, 9425493, 9323469, 9109478, 9020283, 8821098, 8538905, 8421910, 8381380, 8182639, 8101901, 7972533, 7922204, 7804371, 7725099, 7671220, 7642030, 7532541, 7429931, 7413955, 7390464, 7329254, 7319587, 7177791, 7111800, 7091691, 6961314, 6936285, 6962774, 6959706, 6909087, 6912353, 6922811, 6822308, 6769372, 6823716, 6682883, 6734553, 6710336, 6702991, 6637194, 6603996, 6560759, 6603529, 6703256, 6696090, 6669344, 6631579]
3327F631579j7319J8505M6811O1681K0886J04252L3838J00970o794n3552J31306
3316G072163Q5223k1445Q0902J18172P7091L9805m5266N9151N4918K6291r315
3305G537690j6026J6128J01282J97802l571m150N3094Q1938M1352J33008R5686
3294H234233K07240L6568J21460N8986J21341J00563J29866J58990J64953J83398
3284I517598R6955J43763J34955K67291J95011J46308Q3141J02654J82440J80471
3274A1050587J59611K04410J61561K27421K77552K56517J53010K27488M03365
3265A3121522K52594L17262L98002K68409L95251L70162L79218L60295L02471
3256A6165186K86835M32935N14352M21939O05815O58034N94906Q03529P95437
$$ y = [6631579, 6614260, 6632765, 6679576, 6741257, 6762143, 6866395, 6900233, 7001203, 6994409, 6940857, 7072163, 7157386, 7135941, 7216843, 7335015, 7412106, 7451911, 7406645, 7465796, 7520714, 7547005, 7537690, 7521664, 7537792, 7639074, 7836876, 7833305, 7829155, 7882249, 7964187, 8005539, 8138547, 8234233, 8441473, 8478041, 8599501, 8658487, 8779828, 8880391, 9010257, 9169247, 9334200, 9517598, 9614553, 9758316, 9893271, 10160562, 10355573, 10501881, 10585022, 10687676, 10870116, 11050587, 11210198, 11414608, 11576169, 11803590, 12081142, 12337659, 12490669, 12718157, 13121522, 13374116, 13691378, 14089380, 14357789, 14753040, 15123202, 15502420, 15862715, 16165186, 16452021, 16884956, 17399308, 17821247, 18427062, 19085096, 19680002, 20483531, 21278968]
3247B1278968R16073R02902J011104Q69966Q99581P62298N84249N40618M15435
3238B8181194N1143k45509n09230p89348q32625q80638q79209j036166r00641
3229B2158971p72892p57114p94795p59490o50773o76295q23903q09745o15089
3220A5498875n41253o24243o48561o69290n76883n03938m48773m68904m77606
3211A0539424n21508n51028k91419l07801l31084k36348k36181k81215k23551
3202G559289k09358k35309j04337j87211j88914j42469j34504j5705j62808j40383
3192F038291l0673n1858o8620p8992j25758p1321j33450n8204n4412j13569j62390
3181E089044o5277j29875l2939j68017q9114k4571n3167p8009j22113o6728j9562
$$ y = [21278968, 22195041, 23097943, 24109047, 24979013, 25878594, 26640892, 27225141, 27765759, 28181194, 28232337, 27986828, 27477598, 26688250, 25855625, 24974987, 24095778, 23059612, 22158971, 21386079, 20628965, 19834170, 19074680, 18423907, 17747612, 16923709, 16113964, 15498875, 14957622, 14333379, 13684818, 13015528, 12438645, 11934707, 11485934, 11017030, 10539424, 10017916, 9466888, 9175469, 8867668, 8536584, 8300236, 8064055, 7782840, 7559289, 7349931, 7114622, 7010285, 6823074, 6634160, 6491691, 6357187, 6341482, 6178674, 6038291, 6007618, 5955760, 5887140, 5808148, 5682390, 5611069, 5477619, 5419415, 5365003, 5251434, 5089044, 5023767, 4893892, 4860953, 4692936, 4603822, 4579251, 4526084, 4448075, 4325962, 4259234, 4239672]
3170D239672j79373k38726n4218p2809j55120p0379l6258j27465j04133j69962
3160C031229o4866j33617m8771o1966l7058j58419q0422l0985k5623j06940m6364
3149B236198l8291L0217l7201q8812n9343N5742j16932j0557l3685q9942j3372
3138A834022l1102p129j03168L8837k9141J6702J1585L1823K8952q0858r8775
3127A611748m438j9892j0869l0905Q6306L3181r4663r7661p0880N7534p3555M3527
3115A429433l8106j4725j7211P7225J458o6820O3660m7613K189m6211m1687k3678
3103A277914P7793J1735l491l7491P6347q237j56788K3347o2476k316Q0538L6747
3091A313622o4855M2083J2240Q8670m1410j27430O1468K2463m1647l741j2506
$$ y = [4239672, 4060299, 3821573, 3767355, 3694546, 3539426, 3469047, 3432789, 3305324, 3201191, 3031229, 2966363, 2832746, 2783975, 2722009, 2684951, 2526532, 2446110, 2415125, 2389502, 2282562, 2236198, 2197907, 2228124, 2190923, 2102111, 2042768, 2098510, 1981578, 1971021, 1937336, 1847394, 1834022, 1802920, 1795791, 1692623, 1731460, 1702319, 1719021, 1730606, 1762429, 1791381, 1710523, 1611748, 1607310, 1587418, 1576549, 1545644, 1631950, 1665131, 1570468, 1472807, 1401927, 1459461, 1385906, 1429433, 1391327, 1376602, 1359391, 1436616, 1438074, 1371254, 1434914, 1387301, 1389490, 1343279, 1301592, 1277914, 1355707, 1367442, 1363951, 1326460, 1402807, 1394570, 1237782, 1261129, 1198653, 1196337, 1276875, 1313622, 1248767, 1290850, 1303090, 1391760, 1350350, 1222920, 1284388, 1306851, 1265204, 1261463, 1248957]
3080A248957m1725q138k8659N9403j2855k9233J3990k0947q6501O6601Q4895K562
3068A248350k7483o6125l7834l6194M773Q7757k9618l5524J3413j14863j01554
3057I05098J10626L5859o0478O7999k173M2863m5837R3392R5727r3461N0070k0369
3045A179316j45634M4385M883J7364q4104o4891P5523K1829m0838k6568l6785
3034I44480N5561J2811l7427L5701j6017j9590n3741Q0837J6798J69326M7975
3023A236714l8532q4012L6352O5803J987j78365m1959m8067J17055J54382j27142
3012A094216l5608O206N4083Q5823p9268J7458J02386K526m6275l7176J02238
3001A266609Q1893k4082l5652M6510N9855n8006k0946O6285L9939P153o1267N3420
$$ y = [1248957, 1207232, 1199094, 1170435, 1229838, 1216983, 1187750, 1201740, 1180793, 1094292, 1160893, 1245788, 1248350, 1220867, 1154742, 1116908, 1080714, 1085487, 1173244, 1143626, 1108102, 1121515, 1006652, 905098, 1015724, 1051583, 991105, 1059104, 1056931, 1099794, 1053957, 1147349, 1243076, 1149615, 1199685, 1179316, 1033682, 1078067, 1082950, 1100314, 1016210, 951319, 1026842, 1048671, 1007833, 981265, 944480, 1000041, 1012852, 975425, 1011126, 995109, 975519, 921778, 1002615, 1019413, 1188739, 1236714, 1198182, 1114170, 1150522, 1216325, 1218312, 1039947, 997988, 949921, 1066976, 1221358, 1094216, 1058608, 1064814, 1118897, 1204720, 1125452, 1142910, 1245296, 1247822, 1201547, 1164371, 1266609, 1348502, 1324420, 1288768, 1335278, 1395133, 1337127, 1316181, 1382466, 1422405, 1429558, 1368291, 1421711]
2989A421711K6168O592K342L8879J17028J5332k6326K186P4115m3727l5130M4385
2977A643555Q2372P1628P7936O3511k2546n9106J00639R8345o7902J890Q6022
2966B076344J5120L3514L2637M3643Q2855J7285M8039N5421J33139J24784K7041
2955B689822l3384J28165M9735J0602l365J33417J01965m834J31632J28140Q6645
2944C418540J15359J19915R0420N5181K14371J71143L2227K35581J98714J89831
2934D841282J30326K76029K79062K56843L59135K48282L01827L45763L62359M70287
2924G871195N11470L54871M87460K72045L15621K79192K26464K11778J45733M8034
2914A0723863N5497O9844n768R3986J32894L2442J30373O9156J35840K8800M0851
$$ y = [1421711, 1447879, 1454471, 1456813, 1495692, 1612720, 1628052, 1601726, 1603912, 1678027, 1634300, 1599170, 1643555, 1725927, 1797555, 1875491, 1939002, 1916456, 1857350, 1957989, 2056334, 1988432, 1990322, 2076344, 2091464, 2124978, 2157615, 2201258, 2284113, 2301398, 2349437, 2404858, 2537997, 2662781, 2689822, 2656438, 2784603, 2834338, 2844940, 2841575, 2974992, 3076957, 3072123, 3203755, 3331895, 3418540, 3533899, 3653814, 3744234, 3799415, 4013786, 4184929, 4217156, 4452737, 4651451, 4841282, 4971608, 5247637, 5526699, 5783542, 6142677, 6390959, 6692786, 7038549, 7400908, 7871195, 8382665, 8737536, 9224996, 9497041, 9812662, 10091854, 10318318, 10530096, 10675829, 10723863, 10779360, 10849204, 10843436, 10937422, 11070316, 11102758, 11233131, 11302287, 11438127, 11466927, 11507778]
2903A1507778K03067K80917K45774K70222L23983M03457N04228N06918Q19450
2894A5065794P24181Q52119R47388P21255M65945K64565l94694q88889j219801
2885A6537863j290963j169127j004374q03207n63865n72338m87343k95437k90931
2876A0060278l38994l62565j64645k20029j09271p5120l970J3826L9832j4031
2866H825311J27462M7133O1984J43312O6428p0625l1889K0333k23683k66378m02198
2855H297190n21259m56433m09300l06212m00159l18161l29668l77184k97439k24427
2845D656948k64643k65439j77112j80741j85383j82011n7580j42098j33080j40708
2835B928153j92799j06299K035j70093j13381j10755j02466p4887k596q7720p8818
$$ y = [11507778, 11710845, 11991762, 12237536, 12507758, 12831741, 13235198, 13739426, 14246344, 15065794, 15789975, 16642094, 17589482, 18310737, 18776682, 19041247, 18646553, 17757664, 16537863, 15246900, 14077773, 13073399, 12270192, 11706327, 11133989, 10646646, 10351209, 10060278, 9721284, 9358719, 9194074, 8974045, 8864774, 8789654, 8785684, 8799510, 8839342, 8825311, 8952773, 8999906, 9061890, 9205202, 9271630, 9201005, 9169116, 9189449, 8965766, 8699388, 8297190, 7775931, 7319498, 6910198, 6603986, 6203827, 5885666, 5555998, 5178814, 4881375, 4656948, 4392305, 4126866, 3949754, 3769013, 3583630, 3401619, 3344039, 3201941, 3068861, 2928153, 2735354, 2629055, 2631090, 2460997, 2347616, 2236861, 2134395, 2059508, 2056912, 1969192, 1890374]
2824A890374m1423n9560j58509r720r325M4327l0202n2543K535n3163n3609j8717
2812A450465j2477p340r9878j07674j60984k1161p034j2347O5963k8772K3724
2801A082485q247r8378q4352K3748M2699o2050M5061l3092n5456j4419L9925P5727
2789I53651n6397L342q6304k307M8912j81742m6954P6877O2366q9706P0029o549
2777G45218j19233k3196M8107M4796j21768q833P6431k3837k7237K327m6986k9183
2765E16606N708M3306r3119l2067n182O3007M6404k9743l9118M3838q7049k6578
2753D06013j7452K2256m527N2606M0628j4575m0191l6477q3909O1381R5575n6798
2741D24530l3438J7662o3687M1350L4454N3930j5880q3742p6635l2083J4960j3077
$$ y = [1890374, 1848951, 1789391, 1630882, 1621162, 1611837, 1656164, 1625962, 1573419, 1575954, 1522791, 1469182, 1450465, 1437988, 1430648, 1330770, 1223096, 1062112, 1040951, 1033917, 1021570, 1087533, 1058761, 1082485, 1074238, 975860, 891508, 915256, 957955, 895905, 940966, 907874, 852418, 837999, 877924, 953651, 897254, 900596, 814292, 811985, 860897, 679155, 632201, 709078, 771444, 681738, 751767, 745218, 625985, 602789, 650896, 695692, 573924, 565091, 641522, 617685, 590448, 592775, 545789, 516606, 522314, 565620, 472501, 440434, 435252, 498259, 544663, 514920, 475802, 519640, 432591, 406013, 388561, 410817, 406290, 458896, 499524, 484949, 444758, 408281, 324372, 385753, 481328, 424530, 391092, 408754, 345067, 386417, 420871, 474801, 458921, 375179, 298544, 266461, 281421, 268344]
2729B68344m936l3467M7959L333J26139N0454p9530q5606O1449j24335j31622
2718I8182J12899j0023K5272n7197J6670Q5065J0179j1484N83o7844K9705L3786
2706B65793R545j6398l6508m2127m7149P4510J7463j641L0656k3826p070j2993
2694B10255j2667k9658J01412O0769l4097j45638j7549j4814O3849J36595j5165
2683C03292o0907M609m1384j12877Q8959L1174k8348K2393k0139K8373J8100O3059
2671B96304m1946l617j623j0394m6412L4992M802k4250N8900o4742j354j5535
2659A85125J36843r3906n7056o0392R3874r805l0857L3560J05170o079K6466r2522
2647B30421p5511O4297k4238k1539J1260J1045j9525q09M8082J8496l8021Q041
$$ y = [268344, 263408, 229941, 277900, 281233, 407372, 457826, 378296, 292690, 354139, 229804, 98182, 211081, 201058, 226330, 169133, 185803, 270868, 281047, 269563, 270146, 202302, 232007, 265793, 275338, 258940, 222432, 180305, 133156, 207666, 225129, 223488, 254144, 230318, 223248, 210255, 197588, 167930, 269342, 330111, 296014, 150376, 132827, 118013, 181862, 318457, 303292, 242385, 246994, 205610, 92733, 181692, 212866, 184518, 206911, 186772, 215145, 233245, 296304, 254358, 250741, 249118, 238724, 192312, 227304, 232106, 207856, 266756, 202014, 200660, 185125, 321968, 228062, 171006, 110614, 204488, 194683, 163826, 197386, 302556, 296477, 322943, 230421, 154910, 219207, 194969, 173430, 184690, 195735, 176210, 175401, 223483, 241979, 203958, 211999]
2635B11999J16930j06115k2434O5400o6826o5718j1096m3149n4173J34254M9125
2624B08197N8186O5471j08462j40172m7554J06443J6616N342J32972j44659k7393
2613A24987O0603K0361q1057l1837J5828J58434L3752o1408K2759l4721j61663
2602F6038J1400J1472L5027J3522k3175L7166O3045l8770l5161Q1362j7076j32640
2590G2210l9711J52829j43964n5515r53J08614K671m3613L7761M9382K584J9198
2578A61493L0010r8696p8660M0047N2944M0778R712p5641p6642J12546k2209m136
2566I1546k4982j11426q833n5260R4022R0724J5003j8289O8794r069j22008P7633
2554H7855L2199o3164J7856K7571r1223M0486M2605J281L9220M357n4562j3486
$$ y = [211999, 328929, 222814, 200380, 265780, 198954, 133236, 122140, 78991, 24818, 159072, 208197, 266383, 331854, 223392, 83220, 35666, 142109, 158725, 164067, 297039, 152380, 124987, 185590, 205951, 124894, 93057, 108885, 267319, 301071, 239663, 262422, 227701, 66038, 77438, 88910, 123937, 137459, 114284, 151450, 214495, 175725, 140564, 221926, 204850, 72210, 32499, 185328, 41364, -14151, -15104, 93510, 96181, 52568, 90329, 139711, 142295, 161493, 191503, 92807, 14147, 54194, 107138, 147916, 157628, 81987, 5345, 117891, 95682, 91546, 66564, -44862, -53695, -108955, -14933, 75791, 90794, 72505, 141299, 132230, 10222, 87855, 120054, 56890, 74746, 102317, 11094, 51580, 94185, 95466, 134686, 139043, 84481, 70995]
2542G0995P3525M0944m8962L3893O2915o4120m8852j7432n3802q5147N5272K2069
2530D1298P5360J5779l3332R1962j8068n2510k7842J8557j2206P7q8699Q1928
2518I2304n297q4299N6636J9317N4931m7910J4782n6553j9521k1712O8299n7596
2506A3381m3687M6785Q0921q8315O0505k4919k0118M2445K3999K7788M5886q6865
2494G7806j04650O0162J17560n4725r7772k0470M1777o0766K0311J05582Q841
2483I3656p6413L4010N3414R9090l721j84238J8852N4361J1816m1510j8914J15420
2471A55823K799n3778j8694m8088Q8623l4570L213m0583m3549k803l6680Q919
2459a9368J9267L9134l2773Q954o959M4995J05299q9879p9291R736L1387q686
$$ y = [70995, 144520, 185464, 136502, 170395, 233310, 169190, 120338, 102906, 49104, -36043, 19229, 41298, 116658, 132437, 99105, 191067, 172999, 120489, 92647, 111204, 98998, 99075, 10376, 92304, 87007, 2708, 59344, 78661, 133592, 85682, 100464, 43911, 24390, 2678, 70977, 13381, -30306, 16479, 97400, 9085, 69590, 44671, 24553, 66998, 90997, 118785, 164671, 77806, -26844, 33318, 150878, 96153, -1619, -22089, 19688, -41078, -20767, 84815, 93656, 17243, 51253, 104667, 203757, 200036, 15798, 34650, 89011, 100827, 59317, 40403, 155823, 158622, 104844, 86150, 38062, 126685, 92115, 95328, 54745, 11196, 8393, -28287, -19368, -101, 39033, 6260, 15214, 8255, 53250, 158549, 68670, -10621, -885, 30502, 21816]
2447B1816K3703n8659M5074k484j3877n009M882O803J6327j07831M2792Q4275
2435E7812j32871L2522Q4193K7477j1421j01671P4580k915o5107J5672K6610J2124
2423A7005J0729J879k9832L3082j04217M9793J3055k1532J36925p0427K1476n244
2411E2692j01493l8879N2093N8341O2348j3581R5765J6807m5423k3671l3897n8888
2399B2214j06166J11191O1906M351J13986j06549q6256P5839K8501P5498q4585
2388A09930j47707N9541J70L0383M4064j13002k4355Q3216p5752Q6726P8479q0624
2376E1069l2937L1890K0998r2340M3328J1280R5457r5858l6235j4040M8874M9314
2364H0800M0614O9558n7774j1204k0530K4984J7867O1791l9594J2860N3921N1855
$$ y = [21816, 45519, -13140, 31934, 29450, 15573, 10564, 15446, 22249, 38576, -69255, -26463, 57812, -75059, -42537, 41656, 69133, 57712, -43959, 30621, 27706, -37401, -21729, 4881, 17005, 27734, 29613, -219, 32863, -71354, -21561, -8506, -30038, 106887, 36460, 57936, 52692, -48801, -87680, -35587, 22754, 85102, 71521, 167286, 184093, 138670, 114999, 81102, 22214, -83952, 27239, 89145, 93496, 207482, 100933, 14677, 90516, 119017, 194515, 109930, -37777, 21764, 21934, 52317, 96381, -16621, -40976, 42240, -33512, 53214, 131693, 51069, 18132, 50022, 71020, -21320, 22008, 33288, 128745, 32887, -3348, -17388, 31486, 80800, 121414, 190972, 133198, 121994, 101464, 126448, 144315, 206106, 166512, 179372, 233293, 285148]
2352B85148M4412j04642n0266K0543p4488j04990P7694K2225m8331J35851k791
2341B00365r6182p7236M2588m2806j9803m0426Q914R9272N533K3747K1623r833
2329A15756N8349l7650r8927l3501O6498R6273p3297k0812J2093L4331J1951j6473
2317A14591k0504o3101N782Q3476o5320o445n7130M9328O5857L0147n0842N359
2305I1198K445k0739q714J9296J15275p2238n1045l7451L848K8900l9352N2615
2293H4038J2197o5795O8515M5603p154L175n3629o7931J6910N8664o7547P150
2281C4196R3017N4267p3853k6669N6035M8761n4646q0840O1286M6241o1471Q727
2269A05051m2313l2564q967O1870k1502N0760P9954o2928J2200q124K6172R2536
$$ y = [285148, 329560, 224918, 174652, 195195, 120707, 15717, 93411, 115636, 67305, 203156, 200365, 104183, 26947, 69535, 26729, 6926, -33500, -24586, 74686, 80219, 103966, 125589, 115756, 174105, 136455, 37528, 4027, 70525, 166798, 93501, 72689, 84782, 119113, 131064, 114591, 94087, 30986, 36768, 120244, 54924, 48479, -8651, 40677, 106534, 136681, 85839, 91198, 93643, 72904, 64190, 83486, 198761, 126523, 75478, 38027, 41875, 70775, 31423, 84038, 96235, 30440, 98955, 144558, 137404, 140579, 86950, 19019, 35929, 94593, 27046, 34196, 127213, 181480, 107627, 80958, 136993, 185754, 131108, 50268, 111554, 157795, 96324, 105051, 62738, 30174, 21207, 83077, 61575, 112335, 192289, 129361, 141561, 133437, 159609, 252145]
2257B52145q6712L5619j3087k2047N1966j3309j5965M5584J7481n9596J1163q8686
2245A14556Q195N613o789L5542k4888N7880L1511j3514N422j24046p745N8878
2233A40615R379L722K0271M0343l8284m4926M0584J1750L5896K4656l76O4246
2221C07876j0485j44580m6597P8021l7579P1171M8972p2968K0472J05708m1693
2210B78318l0260J8303m6219L2290O2689n9595L6536Q4913j65921N768P6559r998
2198B83383L9876N5396R851P4686r911q0123o551R7562L5818K4022J8426j06262
2186D36173j7377J46240l800K5608j35579N4759K6416N259J6813K6066O7662J23901
2174G72141m8325k6761Q7963k521P5513L1854j997n5512l5091k6841j3244J064
$$ y = [252145, 165433, 201052, 187965, 165918, 217884, 204575, 188610, 234194, 251675, 192079, 203242, 114556, 122751, 128364, 121575, 157117, 132229, 190109, 221620, 208106, 213528, 89482, 81737, 140615, 149994, 153716, 173987, 214330, 176046, 131120, 171704, 183454, 219350, 244006, 243630, 307876, 297391, 152811, 106214, 184235, 146656, 217827, 266799, 193831, 214303, 320011, 278318, 248058, 266361, 220142, 252432, 315121, 255526, 292062, 376975, 211054, 216822, 293381, 283383, 323259, 378655, 388506, 463192, 453281, 373158, 366607, 464169, 499987, 524009, 542435, 436173, 418796, 565036, 561236, 586844, 451265, 506024, 532440, 537699, 554512, 580578, 648240, 772141, 723816, 697055, 785018, 782497, 858010, 889864, 887867, 832355, 797264, 770423, 757179, 758243]
2162G58243R3318M9735j1093N560J08038O9716n6470O2785J4343J0304o8868N2766
2150A088377O4474J6837J8678r552J04055l2462K0793J35276k3512p2683K3638
2139A333919J11498j706M4967O0576k2663L4239J21390N1784K5989Q2683O5267
2128A907943J75473J15043Q6106J9338K45709J40883J00773K8937R1027J44372
2118C055604K13451J27739K15472J81523J53352K16959J90536K73308K95557L15667
2108E239168L60650M74190L62109M32135M61475L33829N04017O04671N07960P52569
2098A0032773R19491J028031J223085J656385J848252K329069K959577L132002
2090B5128665L013879K501184J581025L16561k458967m681114m409104l341237
$$ y = [758243, 851561, 901296, 890203, 895763, 1003801, 1073517, 1017047, 1079832, 1094175, 1104479, 1035611, 1088377, 1152851, 1169688, 1188366, 1178814, 1282869, 1250407, 1271200, 1406476, 1382964, 1310281, 1333919, 1445417, 1443711, 1488678, 1549254, 1526591, 1560830, 1682220, 1734004, 1759993, 1842676, 1907943, 2083416, 2198459, 2284565, 2303903, 2549612, 2690495, 2791268, 2820205, 2911232, 3055604, 3269055, 3396794, 3612266, 3793789, 3947141, 4164100, 4354636, 4627944, 4923501, 5239168, 5599818, 6074008, 6436117, 6868252, 7329727, 7663556, 8167573, 8772244, 9280204, 10032773, 10952264, 11980295, 13203380, 14859765, 16708017, 19037086, 21996663, 25128665, 28142544, 30643728, 32224753, 32541314, 30082347, 25401233, 20992129, 17650892]
2082A7650892k401032j997346j452136j279426r71144p05611o58565o32815o44836
2073F907981n46668m17426m39487l19998m01629k35344k41181k28870j60982k42194
2063C674202k16190k32726q7282j54302k51964j61808j40692j69662o4735K2675
2053B217516j34759j09074m80j82885l7973r7008q4588n058o7389O2014m5347
2042A514969j44792r8393l7772O9874J00711j7999j72384j03458p448k9462p7968
2031I95878n9307K5316q786r6949N5844J1189k0824l992j7751O2859q9639k6392
2019H27446l3205m6562o2784M0666K8854p2647q1998j697k4367j38582P6752Q108
2007E19984J2707P1212O61r2040j9205k7034k0350M1638k899m0806m0243J3549
$$ y = [17650892, 15249860, 13252514, 11800378, 10520952, 9549808, 8844197, 8185632, 7552817, 6907981, 6361313, 5943887, 5504400, 5184402, 4782773, 4547429, 4306248, 4077378, 3916396, 3674202, 3458012, 3225286, 3138004, 2983702, 2731738, 2569930, 2429238, 2259576, 2194841, 2217516, 2082757, 1973683, 1973203, 1790318, 1752345, 1655337, 1570749, 1565691, 1498302, 1560316, 1514969, 1370177, 1271784, 1234012, 1303886, 1404597, 1386598, 1214214, 1110756, 1103308, 1073846, 995878, 936571, 961887, 953101, 856152, 911996, 923185, 902361, 898369, 880618, 943477, 853838, 827446, 794241, 747679, 684895, 725561, 754415, 681768, 599770, 598073, 573706, 435124, 511876, 519984, 532691, 603903, 604564, 512524, 493319, 466285, 445935, 487573, 484674, 443868, 403625, 417174]
1995D17174J0879K3988L7765n075j34760j5772n5907J907j1765L9200o728P457
1983C08363j4199m3051N4561j24397n6719N2403l4091n6951J66620J6741q337
1972B60943R611M3028r1541n5270J5169N934Q7628O3649l957k5082p9260O9097
1960B99949j00213j6649k326r5632n7436O346O2844J5324Q8454M706K676O0022
1948B68065J7224n7326L9810M9439q5085p1483P268K7084P803K2714r9069j6149
1936A10295l1442J35379j22278o2663O3608l852j5830O4422j8002L8793K221l0081
1924A30570O6769m2742N6103K9274m9746l1350M6492n1156l8385j5746K5630l705
1912A22008J2673J8380k6492n027M8890p2990L3797o5070J32523n1410j04491
$$ y = [417174, 428053, 452041, 489806, 484731, 349971, 334199, 278292, 280199, 268434, 307634, 300906, 308363, 294164, 251113, 305674, 181277, 124558, 176961, 142870, 85919, 252539, 269280, 260943, 270554, 313582, 222041, 166771, 181940, 187874, 275502, 339151, 335194, 310112, 230852, 299949, 199736, 183087, 180761, 85129, 27693, 34039, 96883, 112207, 200661, 205367, 208043, 268065, 285289, 227963, 267773, 317212, 232127, 160644, 167912, 194996, 202799, 225513, 126444, 110295, 78853, 214232, 91954, 29291, 92899, 89047, 73217, 137639, 119637, 158430, 160651, 130570, 197339, 154597, 210700, 239974, 190228, 158878, 205370, 154214, 115829, 100083, 125713, 122008, 134681, 153061, 126569, 121542, 170432, 97442, 131239, 66169, 198692, 147282, 42791]
1901D2791K086j02990R4093O0480m307O862k2262k9144n8357j2339O6110j0982
1889C2041J3956M0980k1274r2678m4627J09702q307j0101M426j7676j16977M0383
1877g0152L5775R2391m4535M2525q813K2395M2580j2219L9776j21415n8400M8464
1865H372M1399K1142r6316N0245J09865j5203j23666o1473k8020M988O4562l0296
1853e4401R8496J2748N182M6896M929m5321r2918O3019N2549l6197L474N7620
1841A16076N099Q346O247n639o24n0777j4193k3722J9023K7562M2236N4508m0595
1828A43547Q529k167r7208Q9256K5519q649j0097L0118p2796p7035O4212M7510
1816A40739K3358n9472J7105O7932j02764k7990P7103L9562k4070j08532l5242
$$ y = [42791, 44877, -58113, 35980, 96460, 92153, 99015, 76753, 47609, -10748, -23087, 43023, 32041, 45997, 86977, 65703, -26975, -71602, 38100, 29793, 19692, 24118, 6442, -110535, -70152, -34377, 58014, 13479, 56004, 47191, 69586, 112166, 99947, 139723, 18308, -40092, 8372, 49771, 70913, -25403, 24842, 134707, 119504, -4162, -65635, -93655, -88667, -24105, -54401, 44095, 56843, 62025, 108921, 113850, 68529, -24389, 38630, 91179, 54982, 58456, 116076, 121175, 129521, 135768, 130129, 129505, 78728, 64535, 40813, 59836, 87398, 129634, 184142, 143547, 152076, 149909, 52701, 141957, 167476, 158827, 148730, 178848, 106052, 29017, 93229, 140739, 164097, 104625, 121730, 189662, 86898, 58908, 136011, 175573, 151503, 42971, 7729]
1805G729K9485r7151n0755J05739O6893o4210P9999N3669n5694j11309k3089r405
1793f8099M711Q9811J4323m367n6024M6046K4625o7665m9944j3986J1337L2418
1781c6814J11870Q4132j12594m9210l1810K6110P4829j36680q3937J43475J22906
1770A12277n8551n2186j19068P2301R6290n3010n5534Q862k5588M1966J8666Q5873
1758G2298J3776q8762M5736n7036l4957o0548L0724M7692n773r417N1618J27290
1746A32641j17688m3582L2080J20085k6730o9081K4054K4047j26706l1828N0957
1735c1751K2261l5715O5910J11681q5846q7279l2606J4104K859m5218M3737K30478
1723A72615j26347k9344k9953n4476j2015n7515N1604J52404P848m4236j36421
$$ y = [7729, 37214, -59937, -110692, -4953, 61940, -2270, 77729, 131398, 75704, -35605, -58694, -68099, -63388, 26423, 40746, 36379, -19645, 26401, 51026, -16639, -66583, -80569, -69232, -36814, 75056, 159188, 46594, -2616, -34426, -8316, 66513, -70167, -154104, -10629, 112277, 53726, 1540, -117528, -45227, 51063, -1947, -57481, -48619, -74207, -32241, -13575, 72298, 86074, -2688, 43048, -13988, -48945, -109493, -78769, -31077, -36850, -46267, 5351, 132641, 14953, -28629, 3451, 123536, 96806, 27725, 51779, 75826, -50880, -82708, -31751, -9490, -45205, 20705, 132386, 46540, -40739, -73345, -59241, -56382, -101600, -57863, 172615, 46268, 16924, -13029, -67505, -79520, -137035, -85431, 66973, 74821, 30585, -105836]
1712a05836m0398J02790l5604L073L0513L3809j4748k4959Q4964m3504p3206Q6056
1700B950Q036l2495M9340J660K0946j55972j2213J44636R8017O5347j32987o9493
1688a2228j0319O5156Q5454K13q8536o8038Q2672L0715l5175o2759J4803N0875
1676E2833l7936l0590j13245Q9554l8126k4711P8853n5930l1930j7410M9083j15439
1664a94994M6989O1165N3666N9016q5129M7109k3282p9902L2990N7576K5647k1296
1652b0445l9561L895n9915K1507Q2149j8325l8573P8546J0542p115n593l6659
1640b9547L1411Q472l0231P007K1235K7987j6728j05619O0190j9511L7119L8613
1628C0398k2837l4853l454O8339j44516P9690p327l9626O8851k4706j5760k0936
$$ y = [-105836, -146234, -43444, -79048, -75975, -45462, -11653, -26401, -51360, 33604, -9900, -83106, 2950, 10986, -21509, 27831, 29491, 50437, -105535, -117748, 26888, 124905, 190252, 57265, -12228, -22547, 42609, 128063, 128276, 39740, -28298, 54374, 85089, 49914, -12845, 1958, 52833, 14897, -15693, -128938, -39384, -77510, -102221, -23368, -79298, -111228, -128638, -79555, -194994, -148005, -86840, -33174, 25842, -59287, -12178, -35460, -115362, -82372, -24796, 851, -20445, -60006, -56111, -116026, -94519, -12370, -30695, -69268, 9278, 19820, 12705, 7112, -29547, 1864, 10336, -19895, -12888, 8347, 36334, 19606, -86013, -25823, -45334, -8215, 30398, 7561, -27292, -30746, 37593, -106923, -27233, -34560, -74186, -5335, -30041, -45801, -66737]
1616f6737O425K118K4336n4086m1207O6680n8987K7831O1155J9504M4397K7978
1604E9407j5915m7021k9322k472k1068L6297O0617l9129P4115o9191l5432p491
1592c6605m1395L3108O7275m0885o8746j23722K3292o7265L8541M3263P467J91094
1580B5422J638m9409M3188L1316n940o9372K1035j1804k215J30418k1256k5444
1568F7577j48245l7466P9720j6250P752k3094J6860P4377J5066j8187j3286p1045
1556f6221O4042n516n7343M6920p3612r735O7906O5919M2972P650o5713K807m850
1543A5226l3199J0675M9459n0406J8497O8034j18907J1189k9711l088N9908o1099
1531f3422M3518R0313o7148l7551n6673m3956Q3636J2863J9960K2777l7337L6376
$$ y = [-66737, -60312, -58194, -33858, -87944, -129151, -62471, -121458, -93627, -32472, -12968, 31429, 59407, 43492, -3529, -32851, -35323, -56391, -20094, 40523, 1394, 75509, 6318, -29114, -36605, -78000, -44892, 22383, -18502, -87248, -210970, -187678, -254943, -216402, -173139, -165672, 25422, 27060, -22349, 20839, 52155, 46215, -23157, -2122, -13926, -16141, 114277, 93021, 67577, -80668, -118134, -38414, -54664, -46912, -70006, -53146, 21231, 36297, 18110, 4824, -66221, -2179, -7695, -65038, -18118, -91730, -101465, -33559, 32360, 75332, 82982, 17269, 20076, 15226, -17973, -7298, 42161, -8245, 10252, 78286, -40621, -29432, -59143, -62231, -2323, -63422, -19904, 70409, 3261, -34290, -90963, -134919, -51283, -38420, -18460, 4317, -33020, 3356]
1519C356m9743p813k3961J9987P0391L1291k8874m4725o0548o9542R7475L027
1507e9679m559m7868J9591m2776n7971O6554N882J7494k8215R3443O0374j07121
1495h4851P0380o8390j00818K0676J16093N1113n4397N5597J3338j19909j8864
1484a20032J39807n4493j77678n671J41639J40419o3246M9169K6145m5237j13516
1473h2694o9635O3170R6994j72016K1444J74058r903j6708n7739q885j4226Q7435
1461A1295j1686o7745N3680j34407L1390N7137Q554n0432L9133K1300o3313J2966
1449i2128L2105L1956r4051M8676J19423M898Q823q3664k1344j00549M910k1807
1437a62752R320J00759J02260j308o8510K2154M743L4272o0779M2293K3911l634
$$ y = [3356, -46387, -54200, -78161, -58174, 12217, 43508, 14634, -30091, -90639, -160181, -62706, -59679, -64238, -112106, -92515, -135291, -193262, -126708, -120826, -103332, -131547, -38104, 22270, -84851, -14471, -82861, -183679, -163003, -46910, 4203, -50194, 5403, 18741, -101168, -120032, 19775, -34718, -212396, -218067, -76428, 63991, 745, 49914, 76059, 30822, -82694, -152329, -89159, 7835, -164181, -142737, 31321, 21418, 4710, -53029, -61914, -76140, 11295, -391, -68136, -14456, -148863, -117473, -60336, -51782, -102214, -63081, -41781, -105094, -92128, -60023, -28067, -122118, -73442, 45981, 50879, 59702, -23962, -45306, -145855, -140945, -162752, -153432, -52673, 49587, 48279, -20231, 1923, 6666, 40938, -19841, 22452, 46363, 42729]
1425D2729m4124n6627K99M681L9757l1913P2078m280l2568J01923j46668J4474
1413d0239j10763N9786j3956M3643P9008J527j0568k7765o126L3230m5850K092
1401c5981l7188K6015o8360j2135R5742Q8992p4088R650o697q2062j9353L0638
1389h4827k6946l545j3595l5431P2543P4116L3387j26939k7714M0978m009Q5820
1377a6162q565P566q7473k0291J87841l0369K6473K3930n9409m5257o3432Q0098
1365e050p743K6968j745k5647n7666J4078Q2052n602r1354J34748K3407o9450
1353A6996M1809p6774j00526m0396L8058J5770L3388K2896Q9745j08679n7769
1342a25482J7971J35483p4124n42l6096j4886L2563J127r602l4788L9239J20137
$$ y = [42729, -1395, -58022, -57723, -53042, -13285, -45198, 26880, 22600, -9968, 91955, -54713, -40239, -151002, -91216, -105172, -61529, 17479, 19006, 8438, -19327, -25453, 7777, -38073, -35981, -73169, -47154, -115514, -127649, -31907, 57085, -17003, -7353, -14050, -96112, -115465, -84827, -111773, -115318, -128913, -164344, -91801, -17685, 15702, -111237, -138951, -97973, -101982, -16162, -24727, -17161, -104634, -124925, 62916, 32547, 59020, 82950, 23541, -21716, -85148, -5050, -12793, 14175, 12430, -13217, -70883, -56805, 25247, 19645, -71709, 63039, 86446, 16996, 58805, -17969, -118495, -158891, -120833, -105063, -71675, -48779, 40966, -67713, -125482, -107511, 27972, -46152, -46694, -82790, -97676, -65113, -63986, -73588, -108376, -69137, 51000]
1330E1000j17439n3282R107O1426J7428n8098J20368o6422r0623N2636J4167O9728
1318I996N2176M2198n4873j11349J4223N5264J8155K1973p6603o2563l1221Q3411
1306c9213m3522l5112O1565P2994o6132m4920r304n3316R0420M5103q9315m4471
1294a55223l1643R6811M6175j5169m193P3728l0044n8885M7627N0742K1312n2286
1282a1048K4509O2670L3654j4449l0096o6271L2749q253p5206o2120k0062O8674
1270f5249j8002n6434j0231j1050Q3379M090M4716l0562m1987O6345L2881j61253
1258a63357K7180L8641O2076P7164Q1896j08385o2121R1238l8278k7489n0190
1247g1625R1584q9210R5437N4430j01478j4866p5086R094J9249Q4137J4987k173
$$ y = [51000, -66439, -119721, -110614, -49188, -31760, -89858, 30510, -35912, -126535, -73899, -59732, 9996, 62172, 104370, 49497, -61852, -47629, 7635, 25790, 47763, -28840, -91403, -122624, -39213, -82735, -117847, -56282, 16712, -49420, -94340, -103644, -156960, -66540, -21437, -110752, -155223, -186866, -90055, -43880, -59049, -63242, 10486, -19558, -78443, -30816, 19926, 41238, -11048, 13461, 76131, 109785, 95336, 65240, -1031, 31718, 23465, -51741, -113861, -133923, -65249, -83251, -139685, -149916, -160966, -77587, -73497, -28781, -59343, -101330, -34985, -2104, -163357, -136177, -97536, -35460, 41704, 123600, 15215, -46906, 44332, 6054, -21435, -71625, 19959, -69251, 26186, 80616, -20862, -35728, -110814, -101720, -82471, 1666, 16653, 14480]
1235A4480m4920P7662J6149k0871o6845r1484O1478K7560L4883M341K184j8083
1223c466n5173j1953L191j0747r2949k938P2464O6844K0048Q7895q750p2824N5770
1210D7412N556k3625r0277K9608J5531l0509q9831N0013J1466m783J3654N3579
1198a2206K3554l5552l2043k6516N5794L0055Q100k579k9632m793p5516m1110
1186a42444J2797M6095Q8595k9058L5106r5145n44n77K3139L1684K3012o5106
1174g2446L4475P1682n3728q9207O5931O7203m0253m1772k7381M0326M4316J4003
1162A3149m6341n0629K1197P9371j1251q8065j225M4869L8625k2896M489J4015
1150d692J1945j11077L4090J33217K5814J0207p7937k8787K2018q6301j5037L4896
$$ y = [14480, -30440, 47222, 63371, 42500, -24345, -115829, -54351, -26791, 8092, 12433, 14617, -3466, -58639, -70592, -67401, -78148, -171097, -174035, -101571, -34727, -14679, 73216, 64466, -8358, 47412, 52968, 29343, -60934, -31326, -15795, -46304, -136135, -86122, -74656, -79439, -65785, -12206, 11348, -24204, -56247, -82763, -26969, 3086, 11186, 8607, -21025, -25818, -101334, -142444, -129647, -83552, 5043, -24015, 11091, -84054, -84598, -85175, -62036, -30352, -7340, -72446, -37971, 33711, -20017, -109224, -43293, 23910, -16343, -58115, -85496, -45170, -854, 13149, -33192, -83821, -62624, 16747, 5496, -82569, -83794, -38925, -300, -23196, -18707, -4692, 7253, -103824, -69734, 63483, 89297, 99504, 21567, -7220, 14798, -71503, -86540, -51644]
1138e1644j9041k5815L0850N6992L4141M230j9555R724l000j5832j3699K4096
1126A1447j0731J21305J8311o9789m8670p8629j1521N7903P7313N6911m2179o2913
1114A8758K0612n4024p6277P2267k6854m2867J5925l5237M9870J5618J8663Q3475
1102E9929K6852r4269k1345m5663k1825o6299Q840J71153k4153n3668O9706J3991
1090B3249k0618L0895j0164j2962L6856O0881k9263q759p3440r0461N1364p735
1078e0157r081J20010k142N0180L7342k2164o1266j6382q2613j1997R2002j6608
1066B7124n9848M2895r3863j0734j676O4374j1256J58156K5852q0772l8231J01921
1054A23942p7061j13067K1265Q01P0165R899N1196l3586j9933l7568k8309q699
$$ y = [-51644, -70685, -96500, -65650, -8658, 25483, 29713, 10158, 19882, 16882, 1050, -12649, 11447, 716, 122021, 140332, 70543, 21873, -56756, -68277, -10374, 66939, 123850, 81671, 18758, 39370, -14654, -90931, -18664, -45518, -88385, -72460, -107697, -57827, -42209, -23546, 59929, 86781, -7488, -28833, -74496, -96321, -162620, -153780, 17373, -6780, -60448, 9258, 23249, 2631, 33526, 23362, 10400, 47256, 108137, 78874, 70115, -3325, -93786, -42422, -50157, -59238, 60772, 58630, 108810, 146152, 123988, 62722, 46340, -36273, -48270, 43732, 27124, -32724, 10171, -83692, -94426, -96102, -31728, -42984, 115172, 141024, 60252, 22021, 123942, 46881, -66186, -44921, -44120, 26045, 35944, 87140, 53554, 33621, -3947, -32256, -40955]
1042d0955R5946o5024l7731J22363p3518j35386M9706K2270m9949O7646M4058
1031e74J09571j6862r2839n9447J2604L3137k9905R105p4301J29678J6965O2710
1019I9842N2983r4798l9514k7348k0977j10473K7275Q7695J5257L4243L1750n8441
1007b506j05545J55366J4914j12627K6249m9270M1515R1389k8401j7871k3209
996i996M8641o2110N9033n2792r2081K3686Q9049j0912l2057j7156K6725J9934
984a0036K4277k9875j05133K406R0793n242l1702P1331m6921p2275P3783L1868
972f726M7603P287O278J4302q0128Q776k7640q8329l7713Q0753M728M9205j5671
959c7275n654J735m9297R4950l6624J4948P1980M3909p0876l4948Q9624N952r8915
$$ y = [-40955, 54991, -10033, -47764, 74599, 1081, -134305, -84599, -62329, -112278, -44632, -574, 108997, 92135, -704, -60151, -47547, -14410, -44315, -35210, -109511, 20167, 37132, 99842, 152825, 58027, 18513, -8835, -29812, -140285, -113010, -25315, -10058, 24185, 55935, -2506, -108051, 47315, 62229, -50398, -24149, -73419, -31904, 59485, 31084, 13213, -9996, 38645, -23465, 35568, -17224, -109305, -85619, 3430, -7482, -39539, -56695, -29970, -10036, 14241, -15634, -120767, -118361, -27568, -32810, -64512, 6819, -40102, -112377, -38594, -6726, 40877, 48164, 54442, 68744, -11384, -2608, -30248, -118577, -156290, -75537, -70809, -21604, -37275, -42929, -41194, -90491, 4459, -32165, -17217, 54763, 98672, 27796, -7152, 82472, 88424, -10491]
946a0491L7687m0999O0280p1193j8077Q6261l613k4087l2651P085j04221N7653
934e6366N8391m3131k4397k3811J9802N4327n4437K9462l2049p4330j7022P9472
922h4089L4163o5004L5107J12596j10472m0561O0292O6666R0266j20422K5419
911C961K6816k1704L4966l6024m319r545r1670L1735J05376J1080p7577J58855
899A31950O0592p0996j7372l7050k5935l5265r930M205N4318p6645p7m0883j3184
886g6272O8953K1943o2377O5858l1250j04889O3957O1538p9707M6313K2349N9335
874E5751k39j25403N0897O1962j2606j3782K5401q6966P4934N1130j08574L9545
862A2050J278k6455N5072j5734n5953j5180k7256R2699r4678K9929J7478j6350
$$ y = [-10491, 27196, -13803, 46477, -24716, -42793, 43468, 39855, 15768, -16883, -9798, -114019, -56366, 2025, -41106, -65503, -89314, -69512, -15185, -69622, -40160, -72209, -146539, -163561, -84089, -49926, -114930, -79823, 32773, -77699, -118260, -57968, 8698, 98964, -21458, 3961, 30777, 9073, 44039, 8015, 3696, -5849, -97519, -65784, 39592, 50672, -26905, 131950, 192542, 121546, 104174, 67124, 41189, 5924, -4006, 199, 54517, -22128, -22205, -63088, -76272, -7319, 14624, -47753, 18105, -13145, -118034, -54077, 7461, -72246, -25933, -3584, 55751, 55512, -69891, -18994, 42968, 30362, 16580, 41981, -44985, 29949, 81079, -27495, 12050, 13328, -13127, 41945, 26211, -29742, -44922, -72178, 20521, -74157, -44228, -26750, -43100]
850d3100r9l6882P9832Q9218r449l8031j27369j4971J38696O0695n8608R953l6694
837A3191n4767m8945O9302k981k8860P0633o2756N2082J5210K7274N575p5516
825b0558j6888K0900J41079L1942j03003r0933Q1975n4424m5759Q0422K2934l824
813D3863m9103O1912P7516k0109j63854K0935n0988K6385K9419L1975J3433J0782
801C2166o7993P3645N1553M5108m4080j24337o170L1197J03847k7822K7622O8203
789A62939j06351j35923J5607P6354M9910L9058K4915p7535m9789k3634k2079
778d6528l3155Q82P0360j5763l3788J72817M893j28847J2322k7464l0500L2414
766b2357r696o8871R9510M6191n7370l2177L6989k3320L5752M4957M1195o8603
$$ y = [-43100, -43199, -80081, -249, 88969, 79520, 41489, -85880, -100851, 37845, 98540, 39932, 49885, 13191, -41576, -90521, -21219, -24200, -53060, 17573, -45183, 6899, 22109, 49383, 54958, -20558, -37446, -16546, 124533, 156475, 53472, -37461, 44514, -9910, -55669, 24753, 47687, 43863, -5240, 56672, 134188, 114079, -49775, -28840, -79828, -53443, -24024, 7951, 21384, 32166, -35827, 37818, 89371, 134479, 90399, -33938, -40108, -8911, 94936, 67114, 94736, 162939, 56588, -79335, -63728, 12626, 62536, 101594, 126509, 48974, -815, -24449, -46528, -79683, -78801, -8441, -24204, -57992, 114825, 119718, -9129, 3193, -24271, -54771, -22357, -32053, -100924, -1414, 44777, -12593, -44770, -7781, -31101, 4651, 49608, 90803, 22200]
754B2200j37098q5207L9124P7627J30550j8723r9304J05141J6497R444K3313K2483
742A06047l6754o2452p1030l8849j4028Q1189N8067p6153q3283K0375J06176J22679
730A11984K5799o9875o4029M3734Q033R86M5473o6927M2966M762Q0196l5004q3661
717D4437l7527M0973l7469J74455k0688p1719j8165l8867n3199q2291J30695K4069
705E4704N1347J0884m3789K1680l0975r8386J19420N7223j20737j3972K9990j2131
693B5258m8013m481m8126L0568M1930L4197M7178o6922Q1415j04164O0241M8726
681I7807o9092R2856K6312J9364p0196n4715P199p1316Q753Q71L4722l8428j968
668a7831J839P9221q542k3384L498J3351q2511n2605P8002N799M6239j1876j4778
$$ y = [22200, -114898, -200105, -160981, -83354, 47196, 28473, -70831, 34310, 50807, 60251, 83564, 106047, 69293, 6841, -64189, -103038, -117066, -35877, 22190, -53963, -137246, -116871, -10695, 111984, 137783, 67908, 3879, 47613, 55646, 56632, 102105, 35178, 78144, 82906, 163102, 128098, 44437, 6910, 47883, 10414, 184869, 164181, 92462, 74297, 35430, -17769, -100060, 30635, 54704, 106051, 116935, 73146, 94826, 63851, -34535, 84885, 142108, 21371, 7399, 37389, 25258, -22755, -27236, -75362, -44794, -2864, 31333, 78511, 11589, 93004, -11160, 49081, 97807, 28715, 121571, 147883, 167247, 97051, 42336, 49535, -21781, -13028, -12157, 22565, -15863, -17831, -15992, 63229, 54687, 31303, 34801, 48152, -34359, -86964, -8962, -3163, 43076, 31200, 16422]
655A6422q948j48476O06O4210J6425J2659k2959n5651J03024N1443k6834k5544
643b3623o3622j9883j9016L0146J2754k0428R2313L6582m4853k482J4438J07720
631A00046p8589M4264K6161l9352j29803N4495O7593L6157j8364o1457m8161J06156
619E9146L1413r2433R469j7503L6813K1408k7100L7473M0656p3813M0565j0573
607E5521p6249k583M0097q0595j7986K6707p1003n056R7827p0895J25213j4091
595F907L0901p9556j3141L513N8555M5435o3502n5078M6278K8833Q0415m1291
583D8269K2247k9593l5151l418q8216Q4443j7862O6762n7500n3101L9894N1277
571B8051J9772k9009Q8221O6149o7504q4071q1026q6341Q2657J53820j25710O9856
$$ y = [16422, 7474, -141002, -140396, -76186, -59761, -47102, -70061, -125712, -22688, 28755, 1921, -23623, -87245, -107128, -126144, -95998, -83244, -103672, -11359, 25223, -19630, -22112, -7674, 100046, 21457, 65721, 91882, 52530, -77273, -22778, 44815, 80972, 62608, 1151, -47010, 59146, 90559, -1874, 7595, -9908, 26905, 48313, 21213, 58686, 99342, 25529, 66094, 55521, -20728, -23311, 16786, -63809, -81795, -55088, -126091, -131147, -33320, -104215, 20998, 6907, 37808, -41748, -54889, -51376, 7179, 52614, -10888, -65966, -19688, 9145, 89560, 48269, 70516, 40923, 5772, 2354, -85862, -1419, -19281, 47481, -10019, -63120, -23226, 28051, 47823, 18814, 107035, 173184, 105680, 21609, -59417, -145758, -63101, 90719, -34991, 34865]
559C4865L4080J8850k670k8607r2952Q4415O2421m6384P28J7876k4642q7999j758
546c1777q8580Q065K9074J1582M4208L8411r304J6413j0400m5453N4506p9243
534f2498K8880O8785Q6456n6900n6685k8203L4957N4000M6467j28675n6995n8113
522a28524J43030P4212k5999n1723R4513m576o8652n4010O2531O0497m2242l0357
510B8700o7236J09837P8253l3025l6490n7806r1880Q1581n0655k2921Q3354j9216
498B496J0219L4958m4422l3882K9374L663j7450J28528j9396p8477m2522M7127
486B0216J0525o0794N6258O7107j4436K3194o2215O1570r7425n1242Q0013P6872
474A09643k0090q7063K1970k4062m5707q1045Q0259O5297j3062L5607n5636p106
$$ y = [34865, 68945, 87795, 85125, 56518, -36434, 47981, 110402, 64018, 64746, 82622, 57980, -30019, -31777, -120357, -112292, -83218, -71636, -27428, 10983, 1679, 18092, 7692, -37761, 16745, -62498, -33618, 35167, 121623, 64723, 8038, -20165, 14792, 68792, 115259, -13416, -70411, -128524, 14506, 88718, 62719, 10996, 105509, 100933, 32281, -21729, 40802, 101299, 59057, 28700, -38536, 71301, 149554, 116529, 80039, 22233, -69647, 11934, -38721, -61642, 21712, 2496, 12715, 47673, 3251, -30631, -1257, 2406, -15044, 113484, 94088, 15611, -26911, 20216, 30741, -30053, 26205, 93312, 78876, 102070, 39855, 101425, 4000, -47242, 32771, 109643, 89553, 2490, 24460, 398, -45309, -126354, -46095, 19202, 6140, 41747, -13889, -20995]
462b0995m0323l7462J22839K9398n6962L0216P3336j3169m0219R2955r4628q1097
450c6111O6046Q8118p5956o4084l3457m344J42556k6083q0081P001P1105n841
438D8869J7904K6771o4723J4085J4809M2733r0521r8L0061L203P3282k7741P2752
425A61386Q8127m3080k8267m5361j21060j12973K596Q0370O9608J8467r0641R2577
413G1749n177m9365N3168j3501j5568m6948k7587N6832P5335M2736k2461o0156
401E9057p4868J5834J16573m2979K1318k6898K2598m5438k9296K2984N6070L4613
389A29568q1680p2671M03J4547O8600N146o3189l2886L1929m856J9357L7627j8995
376C2900Q4728o591r0131m6599M0195K8506n1200m3897O15r725K9102L9469M3599
$$ y = [-20995, -61318, -98780, 24059, 53457, -3505, 26711, 100047, 86878, 46659, 139614, 44986, -36111, 29935, 118053, 42097, -21987, -55444, -59788, 82768, 56685, -23396, -16395, 54710, 48869, 66773, 93544, 28821, 42906, 57715, 100448, 9927, 9829, 39890, 43093, 116375, 88634, 161386, 249513, 206433, 178166, 132805, 11745, -101228, -98632, -18262, 51346, 69813, -20828, 71749, 66572, 17207, 70375, 56874, 41306, -5642, -33229, 23603, 98938, 141674, 119213, 59057, -15811, 23, 116596, 73617, 94935, 68037, 90635, 45197, 15901, 38885, 94955, 129568, 47888, -24783, -24380, -9833, 58767, 63913, 724, -32162, -233, -5089, 14268, 51895, 32900, 117628, 111037, 20906, -25693, 14502, 43008, -8192, -52089, -51474, -61199, -32097, 7372, 50971]
363E0971J244J0286K8998n0467N7338n2565Q0292l1267l2673L5324k1334O726
351H2873l4604m8181l2577K6792j5266J590k3419P8643Q3234Q3902p2410j8641
339A11936o1338M4136o7770m4265K8921p419L5081l4272N1801K5430o9057P33
327A3917n4946R8223K5921l9950P2546J39470p0693n8128r322k1390j9237j7798
315E8613l2311K2026L3871J04509k8130o8571o5713j54240P9373K5576k6842M1053
303a0786M8733O5141J0246j8470J19675j46929K7928k1165j43674R2704P6473
292I9876k8200Q98M9666k5025m3168R5426M6362j12244o1062m8011R4636q0020
280a0866M0208m9049q10M099Q4199J47520j20723m3038k4007J2494J0075k7067
$$ y = [50971, 52215, 62501, 91499, 41032, 98370, 45805, 126097, 94830, 62157, 97481, 76147, 82873, 48269, 88, -32489, -5697, -20963, -19373, -42792, 35851, 119085, 202987, 130577, 111936, 50598, 94734, 26964, -17301, 11620, 4201, 39282, 5010, 56811, 82241, 13184, 13917, -41029, 57194, 83115, 43165, 115711, 255181, 184488, 126360, 117038, 95648, 76411, 58613, 26302, 48328, 82199, 186708, 158578, 90007, 24294, -129946, -50573, -24997, -51839, -10786, 37947, 103088, 113334, 94864, 214539, 67610, 95538, 74373, -69301, 23403, 99876, 71676, 72574, 122240, 97215, 54047, 149473, 195835, 83591, 22529, -25482, 69154, -10866, 29342, -19707, -20517, -16418, 67781, 215301, 94578, 51540, 27533, 40027, 50102, 23035]
268B3035l1337j5207L7492O105K4011J3415m9728J4470m8924p370R1344j0912
256D6394J4056l7502P282o7395o9189J36307O4220n8649N1137N2532P85o0028
244G9950p2249K1646j6391P4963M5498m1790l3966N6009l3955J9455j5749N4332
232A37753q8299o2093k8610J20426k9689J3981j8868m6085j3436p4794l0571P6685
220d3600J13472p056l5132k5847J7755o468m1728L2263J41973q1901o4743Q024
208G012M1124L3811l8666K127P4908l6736j26718N1034l253r110L9725k0380p4081
195e9203J14742O3498N2966J5129n9799n4967j00333L1275R4288K7974o9041j3059
183D3470M5168j0809o423l7473P408P3102J9711k4383J6177q9977N6730J0222
$$ y = [23035, -8302, -23509, 13983, 20088, 44099, 57514, 7786, 22256, -26668, -34038, 57306, 46394, 60450, 22948, 30230, -37165, -106354, 29953, 94173, 35524, 86661, 139193, 139978, 79950, 7701, 29347, 12956, 87919, 133417, 91627, 57661, 113670, 79715, 99170, 83421, 137753, 49454, -12639, -41249, 79177, 49488, 63469, 44601, -1484, -14920, -89714, -120285, -43600, 69872, 62816, 27684, 1837, 19592, 13124, -28604, 3659, 145632, 63731, -1012, 7012, 48136, 81947, 43281, 45408, 120316, 83580, -43138, 7896, 4643, -4467, 35258, 14878, -59203, 55539, 119037, 172003, 187132, 127333, 72366, -27967, 3308, 97596, 125570, 56529, 43470, 88638, 77829, 71406, 33933, 41341, 114443, 134154, 109771, 125948, 35971, 92701, 102923]
171A02923l4987N7730m1976q8137q577L9397J8041l4798o191J7681j10253J58559
159F9412K9702m3994O152J7214k8124M0079j4739K3956Q567J3410k0281J6922
$$ y = [102923, 67936, 125666, 83690, -4447, -13024, 26373, 44414, 9616, 3425, 21106, -89147, 69412, 99114, 55120, 61272, 78486, 50362, 90441, 75702, 99658, 108225, 121635, 101354, 118276]
$$ [...]
##END NTUPLES=NMR SPECTRUM
##END=
