##TITLE=1H_CA-9050-3
 CDCl3
 8 sc, 
 18.08.2022
##JCAMPDX= 6.0         $$ Bruker NMR JCAMP-DX V2.0
##DATA TYPE= NMR SPECTRUM
##DATA CLASS= NTUPLES
##ORIGIN= UXNMR, Bruker Analytische Messtechnik GmbH
##OWNER= root
$$ XWIN-NMR		Version 3.5
$$ Thu Aug 18 09:53:45 2022 Russian Standard Time (UT+4h)  she@DPX200
##.OBSERVE FREQUENCY= 200.1313499994
##.OBSERVE NUCLEUS= ^1H
##.ACQUISITION MODE= SIMULTANEOUS
##.ACQUISITION SCHEME= undefined
##.AVERAGES= 8
##.DIGITISER RES= 18
##SPECTROMETER/DATA SYSTEM= spect
##.PULSE SEQUENCE= zg30
##.SOLVENT NAME= CDCl3
##.SHIFT REFERENCE= (INTERNAL, CDCl3, 0, 15.7755)
##AUDIT TRAIL= $$ (NUMBER, WHEN, WHO, WHERE, WHAT)
$$ ##TITLE= Audit trail, XWIN-NMR		Version 3.5
$$ ##JCAMPDX= 5.01
$$ ##ORIGIN= Bruker BioSpin GmbH
$$ ##OWNER= she
$$ F:/spectra/data/she/nmr/H-F/1/pdata/1/auditp.txt
$$ ##AUDIT TRAIL=  $$ (NUMBER, WHEN, WHO, WHERE, WHAT)
(   1,<2022-08-18 09:52:28.50 +0400>,<she>,<DPX200>,
      <created by zg, POWCHK disabled, PULCHK disabled
       configuration hash MD5:
       00 E9 B6 7A A2 85 ED C7 34 08 36 98 17 FE 4E 26
       data hash MD5: 16K
       F8 0B F5 1C A9 37 BD DB 5A FE 3E 81 1D CB 27 CC>)
(   2,<2022-08-18 09:52:30.89 +0400>,<she>,<DPX200>,
      <Start of raw data processing
       efp BC_mod = 2 LB = 0.24 FT_mod = 6 PKNL = 1 PHC0 = -18040.99 PHC1 = 13.20068 SI = 16K 
       data hash MD5: 16K
       BB 84 95 36 51 09 F8 CF D0 C7 F3 93 E8 DE 14 CB>)
(   3,<2022-08-18 09:52:52.29 +0400>,<she>,<DPX200>,
      <pk PHC0 = 0.989039 PHC1 = 0 
       data hash MD5: 16K
       8D E2 72 90 A0 83 9A 5D CB 1D B7 7D 68 5E 51 CE>)
(   4,<2022-08-18 09:52:55.54 +0400>,<she>,<DPX200>,
      <abs ABSG = 5 
       data hash MD5: 16K
       0C 90 E7 CD D9 51 5C 18 A4 AD 67 87 0F F2 13 9A>)
$$ ##END=
$$ 
$$ hash MD5
$$ 31 09 53 04 F9 77 09 30 F8 22 44 98 F7 8F 3C 3D
##$RELAX= 
##$RELAX= 
##$RELAX= 
##$RELAX= 
##$RELAX= 
##$RELAX= 
$$ Bruker specific parameters
$$ --------------------------
##$DU= <F:/spectra>
##$EXPNO= 1
##$NAME= <H-F>
##$PROCNO= 1
##$TYPE= <nmr>
##$USER= <she>
##$AMP= (0..31)
100 100 100 100 100 100 100 100 100 100 100 100 100 100 100 100 100 100 
100 100 100 100 100 100 100 100 100 100 100 100 100 100 
##$AQSEQ= 0
##$AQ_mod= 1
##$AUNM= <au_zg>
##$AUTOPOS= <>
##$BF1= 200.13
##$BF2= 200.13
##$BF3= 200.13
##$BF4= 200.13
##$BF5= 200.13
##$BF6= 200.13
##$BF7= 200.13
##$BF8= 200.13
##$BYTORDA= 1
##$CFDGTYP= 0
##$CFRGTYP= 5
##$CHEMSTR= <none>
##$CNST= (0..31)
1 1 145 1 1 1 1 1 1 1 1 1 1 1 1 1 1 1 1 1 1 1 1 1 1 1 1 1 1 1 1 1 
##$CPDPRG= <>
##$CPDPRG1= <>
##$CPDPRG2= <>
##$CPDPRG3= <>
##$CPDPRG4= <mlev>
##$CPDPRG5= <mlev>
##$CPDPRG6= <mlev>
##$CPDPRG7= <mlev>
##$CPDPRG8= <mlev>
##$CPDPRGB= <>
##$CPDPRGT= <>
##$D= (0..31)
0 1.2 0 0 0 0 0 0 0 0.06 0 0.03 0 0 0 0 0.0002 0 0 0 0 0 0 0 0 0 0 0 0 
0 0 0 
##$DATE= 1660801947
##$DBL= (0..7)
120 120 120 120 120 120 120 120 
##$DBP= (0..7)
150 150 150 150 150 150 150 150 
##$DBP07= 0
##$DBPNAM0= <>
##$DBPNAM1= <>
##$DBPNAM2= <>
##$DBPNAM3= <>
##$DBPNAM4= <>
$$ [...]
##$SUBNAM2= <"">
##$SUBNAM3= <"">
##$SUBNAM4= <"">
##$SUBNAM5= <"">
##$SUBNAM6= <"">
##$SUBNAM7= <"">
##$SUBNAM8= <"">
##$SUBNAM9= <"">
##$SW= 18.0517283424941
##$SWIBOX= (0..15)
0 0 2 0 0 0 0 0 0 0 0 0 0 0 0 0 
##$SW_h= 3612.71676300578
##$TD= 16384
##$TD0= 1
##$TE= 0
##$TE2= 300
##$TE3= 300
##$TEG= 300
##$TL= (0..7)
0 120 120 120 120 120 120 120 
##$TP= (0..7)
150 150 150 150 150 150 150 150 
##$TP07= 0
##$TPNAME0= <>
##$TPNAME1= <>
##$TPNAME2= <>
##$TPNAME3= <>
##$TPNAME4= <>
##$TPNAME5= <>
##$TPNAME6= <>
##$TPNAME7= <>
##$TPOAL= (0..7)
0.5 0.5 0.5 0.5 0.5 0.5 0.5 0.5 
##$TPOFFS= (0..7)
0 0 0 0 0 0 0 0 
##$TUNHIN= 0
##$TUNHOUT= 0
##$TUNXOUT= 0
##$USERA1= <user>
##$USERA2= <user>
##$USERA3= <user>
##$USERA4= <user>
##$USERA5= <user>
##$V9= 5
##$VALIST= <valist>
##$VCLIST= <CCCCCCCCCCCCCCC>
##$VD= 0
##$VDLIST= <DDDDDDDDDDDDDDD>
##$VPLIST= <PPPPPPPPPPPPPPP>
##$VTLIST= <TTTTTTTTTTTTTTT>
##$WBST= 1024
##$WBSW= 4
##$XGAIN= (0..3)
0 0 0 0 
##$XL= 0
##$YL= 0
##$YMAX_a= 327095
##$YMIN_a= -607398
##$ZGOPTNS= <>
##$ZL1= 120
##$ZL2= 120
##$ZL3= 120
##$ZL4= 120
##$ABSF1= 15.74139
##$ABSF2= -2.310459
##$ABSG= 5
##$ABSL= 3
##$ALPHA= 0
##$AQORDER= 0
##$ASSFAC= 0
##$ASSFACI= 0
##$ASSFACX= 0
##$ASSWID= 0
##$AUNMP= <proc_1d>
##$AZFE= 0.1
##$AZFW= 0.1
##$BCFW= 0
##$BC_mod= 2
##$BYTORDP= 0
##$COROFFS= 0
##$CY= -3
##$DATMOD= 1
##$DC= 0
##$DFILT= <>
##$DTYPP= 0
##$F1P= 0
##$F2P= 0
##$FCOR= 1
##$FTSIZE= 16384
##$FT_mod= 6
##$GAMMA= 0
##$GB= 0
##$INTBC= 1
##$INTSCL= 0
##$ISEN= 128
##$LB= 0.24
##$LEV0= 0
##$LPBIN= 0
##$MAXI= 10000
##$MC2= 0
##$MEAN= 0
##$ME_mod= 0
##$MI= 1.114404
##$NCOEF= 0
##$NC_proc= -6
##$NLEV= 6
##$NOISF1= 3.799351
##$NOISF2= 2.8
##$NSP= 0
##$NTH_PI= 0
##$NZP= 0
##$OFFSET= 15.77554
##$PC= 1
##$PHC0= -18040
##$PHC1= 13.20068
##$PH_mod= 1
##$PKNL= yes
##$PPARMOD= 0
##$PSCAL= 0
##$PSIGN= 0
##$REVERSE= no
##$SF= 200.129999200666
##$SI= 16384
##$SIGF1= 3
##$SIGF2= 2
##$SINO= 5.538805
##$SIOLD= 16384
##$SREGLST= <1H.CDCl3>
##$SSB= 0
##$STSI= 16384
##$STSR= 0
##$SW_p= 3612.71676300578
##$SYMM= 0
##$S_DEV= 0
##$TDeff= 16384
##$TDoff= 0
##$TI= <>
##$TILT= no
##$TM1= 0
##$TM2= 0
##$TOPLEV= 0
##$USERP1= <user>
##$USERP2= <user>
##$USERP3= <user>
##$USERP4= <user>
##$USERP5= <user>
##$WDW= 1
##$XDIM= 16384
##$YMAX_p= 316598774
##$YMIN_p= -249440
$$ End of Bruker specific parameters
$$ ---------------------------------
##NTUPLES= NMR SPECTRUM
##VAR_NAME=  FREQUENCY,     SPECTRUM/REAL,   SPECTRUM/IMAG
##SYMBOL=    X,             R,               I
##VAR_TYPE=  INDEPENDENT,   DEPENDENT,       DEPENDENT
##VAR_FORM=  AFFN,          ASDF,            ASDF
##VAR_DIM=   16384,         16384,           16384
##UNITS=     HZ,            ARBITRARY UNITS, ARBITRARY UNITS
##FACTOR=    0.220516191357247, 1,           1
##FIRST=     3157.15887800935, 0,            0
##LAST=      -455.557884996428, 0,           0
##MIN=       -455.557884996428, -249440,     0
##MAX=       3157.15887800935, 316598774,    0
$$ Real data points
##PAGE= N=1
##DATA TABLE= (X++(R..R)), XYDATA
$$ [...]
$$ plain form
6252 5039004 5123775 5167690 5262858 5366389 5306099 5263762 5453417 5422519 5309198 5204679 5161135
6241 5161135 5103263 5053937 4984598 4871345 4828114 4890623 4941896 4863366 4946455 5025401 5030955
6230 5030955 5064478 5049318 5248302 5298480 5397052 5560920 5584725 5671576 5785843 5843499 5906261
6219 5906261 5945849 5987166 5992810 5775645 5594920 5583322 5584520 5591783 5480123 5288196 5242380
6208 5242380 5300307 5239890 5159941 5273028 5402593 5318344 5351913 5414592 5536928 5643088 5771773
6197 5771773 5824820 5784439 5854005 6014145 6230866 6305680 6433438 6604380 6670766 6702355 6866563
6186 6866563 6995854 7138906 7286583 7321069 7530481 7733239 7818213 7845020 7739956 7771066
6176 7771066 7658160 7710962 7679320 7679708 7657123 7642739 7697623 7884533 7973128 8096883 8107385
$$ packed form
6252E039004Q4771M3915R5168J03531o0290m2337J89655l0898j13321j04519m3544
6241E161135n7872m9326o9339j13253m3231O2509N1273p8530Q3089P8946N554
6230E030955L3523j5160J98984N0178R8572J63868K3805Q6851J14267N7656O2762
6219E906261L9588M1317N644k17165j80725j1598J198P263j11660j91927m5816
6208E242380N7927o0417p9949J13087J29565q4249L3569O2679J22336J06160J28685
6197E771773N3047m0381O9566J60140K16721P4814J27758J70942O6386L1589J64208
6186F866563J29291J43052J47677L4486K09412K02758Q4974K6807j05064L1110
6176G771066j12906N2802l1642L88k2585j4384N4884J86910Q8595J23755J0502
$$ plain form
6165 8107385 8312092 8431092 8378864 8428445 8498503 8489628 8576973 8821102 8863973 8907805 8970651
6154 8970651 9247731 9451512 9618242 9800107 9924893 9790104 9485657 9104432 8744255 8403111
6144 8403111 8287802 8206668 8136763 8082364 7933291 7896309 7898254 7879918 7815424 7830394 7803999
6133 7803999 7864641 8078452 8174486 8299777 8383517 8541077 8806441 9067569 9260677 9672231
6123 9672231 10103545 10432359 10542147 10148678 9595004 8968861 8310821 7847643 7613408 7241207
6113 7241207 6811301 6632081 6584152 6612519 6638519 6548900 6477622 6518968 6426258 6365847 6463631
6102 6463631 6499670 6449747 6431830 6485468 6577801 6753467 6917670 7218020 7511275 7689247
6092 7689247 7777902 7650481 7191830 6734045 6318693 5940165 5650780 5428551 5181755 4978619
$$ packed form
6165H107385K04707J19000n2228M9581P0058q875Q7345K44129M2871M3832O2846
6154H970651K77080K03781J66730J81865J24786j34789l04447l81225l60177l41144
6144H403111j15309q1134o9905n4399j49073l6982J945j8336o4494J4970k6395
6133G803999O0642K13811R6034J25291Q3740J57560K65364K61128J93108M11554
6123I672231M31314L28814J09788l93469n53674o26143o58040m63178k34235l72201
6113G241207m29906j79220m7929K8367K6000q9619p1278M1346r2710o0411R7784
6102F463631L6039m9923j7917N3638R2333J75666J64203L00350K93255J77972
6092G689247Q8655j27421m58651m57785m15352l78528k89385k22229k46796k03136
$$ plain form
6082 4978619 4853908 4716033 4558669 4553269 4518626 4441620 4389555 4422238 4314929 4275751 4204695
6071 4204695 4284529 4397046 4384181 4383316 4388641 4477062 4561309 4685187 4636923 4624633 4522846
6060 4522846 4502951 4405767 4154563 3997646 3961412 3867971 3729965 3680037 3662186 3693953 3629182
6049 3629182 3497946 3440102 3405277 3388221 3256524 3237413 3346861 3318301 3234081 3377029 3232009
6038 3232009 3170757 3165030 3050807 3123481 3209080 3188301 3214863 3088707 3102929 3137162 3033392
6027 3033392 3007747 3031603 3091634 3023769 2997517 2900810 2931684 2876809 2899540 2945493 2976547
6016 2976547 2999086 2949969 2889893 2843998 2821970 2764705 2834989 2820029 2825851 2835865 2824947 2738916
6004 2738916 2710235 2810536 2754331 2664762 2627870 2619664 2564818 2491676 2507106 2544275 2477846
$$ packed form
6082D978619j24711j37875j57364n400l4643p7006n2065L2683j07309l9178p1056
6071D204695P9834J12517j2865q65N325Q8421Q4247J23878m8264j2290j01787
6060D522846j9895r7184k51204j56917l6234r3441j38006m9928j7851L1767o4771
6049C629182j31236n7844l4825j7056j31697j9111J09448k8560q4220J42948j45020
6038C232009o1252n727j14223P2674Q5599k0779K6562j26156J4222L4233j03770
6027C033392k5645K3856O0031o7865k6252r6707L0874n4875K2731M5953L1054
6016B976547K2539m9117o0076m5895k2028n7265P0284j4960N822J0014j0918q6031
6004B738916k8681J00301n6205q9569l6892q206n4846p3142J5430L7169o6429
$$ plain form
5993 2477846 2393913 2418721 2459275 2432139 2362737 2383857 2267089 2245627 2247184 2225826 2263960
5982 2263960 2252162 2221265 2117218 2151715 2149900 2111249 2191541 2178292 2182104 2177626 2178406 2096862
5970 2096862 2046436 2076926 2023091 2060023 2044813 2044566 2104576 2038326 2118588 2109080 2088381 2111555
5958 2111555 1989701 2067042 2136531 2060008 2025570 2030239 1904096 1923713 1849159 1804036 1822197
5947 1822197 1844356 1866714 1886137 1910448 1988972 1949952 1832149 1867112 1877900 1836382 1792517
5936 1792517 1871368 1843509 1871994 1989150 1909912 1839089 1882485 1816578 1757563 1705867 1766979
5925 1766979 1815490 1810767 1776341 1699438 1753188 1722169 1664371 1607754 1720511 1823527 1911765
5914 1911765 1822696 1746893 1821844 1744254 1761899 1823014 1728257 1602078 1619663 1685141 1721356
$$ packed form
5993B477846q3933K4808M0554k7136o9402K1120j16768k1462J557k1358L8134
5982B263960j1798l0897j04047L4497j815l8651Q0292j3249L812m478P80q1544
5970B096862n0426L0490n3835L6932j5210k47O0010o6250Q0262r508k0699K3174
5958B111555j21854P7341O9489p6523l4438M669j26143J9617p4554m5123J8161
5947A822197K2159K2358J9423K4311P8524l9020j17803L4963J0788m1518m3865
5936A792517P8851k7859K8485J17156p9238p0823M3396o5907n9015n1696O1112
5925A766979M8511m723l4426p6903N3750l1019n7798n6617J12757J03016Q8238
5914A911765q9069p5803P4951p7590J7645O1115r4757j26179J7585O5478L6215
$$ plain form
5903 1721356 1701196 1695629 1616581 1601521 1704999 1788153 1769683 1733212 1701051 1761510 1777784
5892 1777784 1667530 1727690 1815308 1941015 1932002 1784372 1830943 1818835 1832272 1837459 1859110
5881 1859110 1897327 1952508 1989614 2120120 2315936 2251701 2146738 2048637 2114740 2079094 2106176
5870 2106176 2223801 2192048 2120733 2108040 2016668 2031930 2113580 2043470 1988590 2054089 1991733
5859 1991733 2133863 2126810 2133603 2207274 2274757 2305294 2299567 2349829 2367215 2274189 2249598 2189978
5847 2189978 2168203 2152571 2111227 2258047 2322701 2228267 2167153 2154444 2160552 2197863 2165169
5836 2165169 2277321 2266677 2303037 2291548 2311918 2248458 2232808 2286569 2303754 2256828 2333357
5825 2333357 2435939 2381106 2298539 2345198 2354645 2299889 2325034 2313960 2299537 2446781 2357771
$$ packed form
5903A721356k0160n567p9048j5060J03478Q3154j8470l6471l2161O0459J6274
5892A777784j10254O0160Q7618J25707r013j47630M6571j2108J3437N187K1651
5881A859110L8217N5181L7106J30506J95816o4235j04963r8101O6103l5646K7082
5870B106176J17625l1753p1315j2693r1372J5262Q1650p0110n4880O5499o2356
5859A991733J42130p053O793P3671O7483L0537n727N0262J7386r3026k4591n9620
5847B189978k1775j5632m1344J46820O4654r4434o1114j2709O108L7311l2694
5836B165169J12152j0644L6360j1489K0370o3460j5650N3761J7185m6926P6529
5825B333357J02582n4833q2567M6659R447n4756K5145j1074j4423J47244q9010
$$ plain form
5814 2357771 2251581 2288536 2293886 2311327 2354187 2367669 2429616 2405128 2525263 2522469 2491647
5803 2491647 2555464 2547823 2598494 2660233 2679753 2651467 2748073 2769568 2750180 2779226 2770485 2747528
5791 2747528 2739213 2778712 2779882 2803724 2702993 2594653 2579762 2591030 2580010 2551549 2477850
5780 2477850 2403654 2306472 2184029 2234043 2110460 2061542 1978729 1988940 1973216 2050569 2025910
5769 2025910 2001264 1995228 2011330 2093123 2113733 2222878 2214349 2151351 2150936 2255005 2201334 2104647
5757 2104647 2103811 2188964 2285050 2394172 2424618 2359034 2421856 2326889 2228305 2274963 2285282 2226263
5745 2226263 2153354 2144622 2227606 2222312 2103229 2119284 2100759 2022385 2015697 2110348 1990749 1980751
5733 1980751 2002250 1936992 1948592 1963758 1909627 1942226 1914745 1824612 1884097 1937925 1840954
$$ packed form
5814B357771j06190L6955N350J7441M2860J3482O1947k4488J20135k794l0822
5803B491647O3817p641N0671O1739J9520k8286R6606K1495j9388K9046q741k2957
5791B747528q315L9499J170K3842j00731j08340j4891J1268j1020k8461p3699
5780B477850p4196r7182j22443N0014j23583m8918q2813J0211j5724P7353k4659
5769B025910k4646o036J6102Q1793K0610J09145q529o2998m15J04069n3671r6687
5757B104647q36Q5153R6086J09122L0446o5584O2822r4967r8584M6658J0319n9019
5745B226263p2909q732Q2984n294j19083J6055j8525p8374o688R4651j19599r998
5733A980751K1499o5258J1600J5166n4131L2599k7481r0133N9485N3828r6971
$$ plain form
5722 1840954 1832098 1833392 1878467 1906658 1936724 2009327 2063827 2071288 2022663 1985823 1967034 2053833
5710 2053833 2188597 2273755 2188582 2168079 2209870 2247733 2179003 2197349 2188842 2285402 2386046
5699 2386046 2343863 2374172 2301819 2276399 2225149 2259275 2310971 2222386 2280951 2195366 2197132 2239229
5687 2239229 2262971 2260964 2192499 2219131 2259833 2357899 2337108 2290510 2434245 2446355 2374599
5676 2374599 2327195 2386391 2396220 2455395 2471420 2521009 2516168 2531950 2527983 2596308 2649825 2570570
5664 2570570 2561007 2669029 2735012 2750574 2800402 2787665 2805753 2840501 2833933 2761891 2658100
5653 2658100 2638765 2807464 2796869 2809773 2865670 2845513 2769118 2774515 2843852 2988817 2959606
5642 2959606 2978086 3043929 3059960 3134567 3171668 3202995 3214420 3275169 3399684 3429747 3391413
$$ packed form
5722A840954q856J294M5075K8191L0066P2603N4500P461m8625l6840j8789Q6799
5710B053833J34764Q5158q5173k0503M1791L7863o8730J8346q507R6560J00644
5699B386046m2183L0309p2353k5420n1250L4126N1696q8585N8565q5585J766M2097
5687B239229K3742k007o8465K6632M0702R8066k0791m6598J43735J2110p1756
5676B374599m7404N9196R829N9175J6025M9589m841J5782l967O8325N3517p9255
5664B570570r563J08022O5983J5562M9828j2737J8088L4748o568p2042j03791
5653B658100j9335J68699j0595J2904N5897k0157p6395N397O9337J44965k9211
5642B959606J8480O5843J6031P4607L7101L1327J1425O0749J24515L0063l8334
$$ plain form
5631 3391413 3489949 3557531 3567195 3564370 3551189 3520980 3644540 3654650 3722868 3782957 3821198 3899677
5619 3899677 3948362 3967503 4053383 4069368 4116050 4187826 4375649 4467776 4403397 4571767 4722950
5608 4722950 4747084 4763189 4887398 5043309 5125157 5240008 5314289 5370270 5490395 5653406
5598 5653406 5731091 5722366 5742846 5905547 6078181 6290500 6397007 6494771 6643633 6781814
5588 6781814 7060986 7270429 7525724 7713019 8072958 8384898 8692100 8914526 9348913 9750143
5578 9750143 9942826 10155424 10284051 10311240 10315973 10233641 10078363 9748125 9539113 9439764
5568 9439764 9341081 9210222 9144360 9179089 9153712 9106436 9034044 9086433 9195947 9233678 9337280
5557 9337280 9470469 9690004 9841342 10056722 10298504 10469398 10728319 10996841 11258957 11707664
$$ packed form
5631C391413R8536O7582R664k825j3181l0209J23560J0110O8218O0089L8241P8479
5619C899677M8685J9141Q5880J5985M6682P1776J87823R2127o4379J68370J51183
5608D722950K4134J6105J24209J55911Q1848J14851P4281N5981J20125J63011
5598E653406P7685q725K0480J62701J72634K12319J06507R7764J48862J38181
5588F781814K79172K09443K55295J87295L59939L11940L07202K22426M34387M01230
5578I750143J92683K12598J28627K7189M733q2332j55278l30238k09012r9349
5568I439764r8683j30859o5862L4729k5377m7276p2392N2389J09514L7731J03602
5557I337280J33189K19535J51338K15380K41782J70894K58921K68522K62116M48707
$$ plain form
5547 11707664 12119069 12530266 12913314 13340094 13634165 13908932 14198606 14448875 14657291
5538 14657291 14840029 15037075 15080893 15187991 15205266 15256795 15184702 14995966 14757826 14433672
5528 14433672 14130426 13718121 13258959 12815962 12500558 12209171 12039760 11783087 11479805
5519 11479805 11342407 11209907 11074848 10985831 10933643 11025885 11031072 11054138 11055643 11152414 11253010
5508 11253010 11312710 11608247 11806410 12180132 12429886 12677985 12881129 13071874 13168394 13253755
5498 13253755 13210904 13082102 12979507 12727022 12481180 12203090 11807402 11548632 11268547 11080225
5488 11080225 11095154 11010627 10824494 10729696 10627974 10533789 10385717 10230288 10105567 10016607
5478 10016607 9952475 9869212 9701587 9637435 9552715 9411613 9332394 9217972 9074559 9103927
$$ packed form
5547A1707664M11405M11197L83048M26780K94071K74767K89674K50269K08416
5538A4657291J82738J97046M3818J07098J7275N1529p2093j88736k38140l24154
5528A4433672l03246m12305m59162m42997l15404k91387j69411k56673l03282
5519A1479805j37398j32500j35059q9017n2188R2242N187K3066J505R6771J00596
5508A1253010N9700K95537J98163L73722K49754K48099K03144J90745R6520Q5361
5498A3253755m2851j28802j02595k52485k45842k78090l95688k58770k80085j88322
5488A1080225J4929q4527j86133r4798j01722r4185j48072j55429j24721q8960
5478A0016607o4132q3263j67625o4152q4720j41102p9219j14422j43413K9368
$$ plain form
5468 9103927 9036803 9024880 9054778 9102055 9068199 9019670 9017592 9020168 9026169 9174966 9259055 9325569
5456 9325569 9460529 9524799 9621982 9828789 10040500 10158195 10354314 10526070 10790942 10941523
5446 10941523 11058056 11162614 11293926 11503088 11672196 11721744 11747631 11858549 11762485 11653930
5436 11653930 11570649 11396576 11234693 11204734 11083405 10966897 10872714 10849738 10810853 10792055
5426 10792055 10801057 10812281 10787819 10942871 11053109 11157305 11339749 11382675 11591322 11900029
5416 11900029 12327227 12704762 13118710 13732812 14373772 14941020 15404480 15538693 15413626
5407 15413626 15229042 15124992 14976351 14875077 14773910 14656549 14494524 14171403 13825551
5398 13825551 13577913 13288270 13148079 13037822 13074841 13084094 13224472 13393596 13537785 13757378
$$ packed form
5468I103927o7124j1923K9898M7277l3856m8529k078K576O001J48797Q4089O6514
5456I325569J34960O4270R7183K06807K11711J17695J96119J71756K64872J50581
5446A0941523J16533J04558J31312K09162J69108M9548K5887J10918r6064j08555
5436A1653930q3281j74073j61883k9959j21329j16508r4183k2976l8885j8798
5426A0792055R002J1224k4462J55052J10238J04196J82444M2926K08647L08707
5416A1900029M27198L77535M13948O14102O40960N67248M63460J34213j25067
5407A5413626j84584j04050j48641j01274j01167j17361j62025l23121l45852
5398A3825551k47638k89643j40191j10257L7019R253J40378J69124J44189K19593
$$ plain form
5388 13757378 14049014 14361803 14825851 15393182 16066915 16876953 17759972 18716372 19602147
5379 19602147 20018825 20141261 20151090 20161322 20436695 20922887 21488998 22009866 22207582 21834794
5369 21834794 21071405 20236916 19516348 19069581 18516145 18034234 17759649 17622493 17440312
5360 17440312 17397016 17316360 17413155 17447073 17591234 17835387 18220712 18639277 19047940 19638238
5350 19638238 20120032 20506427 20768921 20987189 21304353 21804640 22119227 22542597 22743559
5341 22743559 22842452 22691168 22245093 21815439 21493113 21299761 21485862 21723594 22134727 22745945
5331 22745945 23560521 24505801 25663254 26996890 28664349 30793343 32891450 34870655
5323 34870655 36129655 36395269 35766604 34611884 33556927 32747899 32196630 31891783 31623164
$$ packed form
5388A3757378K91636L12789M64048N67331O73733Q10038Q83019R56400Q85775
5379A9602147M16678J22436R829J0232K75373M86192N66111N20868J97716l72788
5369B1834794p63389q34489p20568m46767n53436m81911k74585j37156j82181
5360A7440312m3296q0656R6795L3918J44161K44153L85325M18565M08663N90298
5350A9638238M81794L86395K62494K18268L17164N00287L14587M23370K00962
5341B2743559R8893j51284m46075m29654l22326j93352J86101K37732M11133O11218
5331B2745945Q14576R45280J157453J333636J667459K128994K098107J979205
5323C4870655J259000K65614o28665j154720j054957q09028n51269l04847k68619
$$ plain form
5314 31623164 31478660 31099839 30500858 29935612 29402288 28960812 28856040 29143130 29648168
5305 29648168 30428408 31351879 32514684 34024433 35899329 37995992 40726108 43993147
5297 43993147 47783253 51501295 54914236 57789046 59711398 60964093 61573543 61618371 61350444
5288 61350444 61498077 62532288 64338993 66385510 67400161 66400701 63166364 58457722
5280 58457722 53373901 48686214 45085480 42311670 40402903 39028842 38165791 37689566
5272 37689566 37428978 37569440 37881855 38559073 39548923 41065405 42686690 44574228 46299739
5263 46299739 47399888 47990812 48413306 49119984 50474238 52593063 54638801 55656634 55211002
5254 55211002 53086565 49639381 45677400 41913734 38699745 36146600 34057053 32352346
$$ packed form
5314C1623164j44504l78821n98981n65246n33324m41476j04772K87090N05038
5305B9648168P80240R23471J162805J509749J874896K096663K730116L267039
5297D3993147L790106L718042L412941K874810J922352J252695O09450M4828k67927
5288F1350444J47633J034211J806705K046517J014651r99460l234337m708642
5280E8457722n083821m687687l600734k773810j908767j374061q63051m76225
5272C7689566k60588J40462L12415O77218R89850J516482J621285J887538J725511
5263D6299739J100149N90924M22494P06678J354254K118825K045738J017833m45632
5254E5211002k124437l447184l961981l763666l213989k553145k089547j704707
$$ plain form
5246 32352346 30945633 29898213 29102584 28359374 27800756 27301164 26904258 26683111 26526629
5237 26526629 26581983 26759102 27024477 27375464 27945572 28642776 29356685 30297099 31481753
5228 31481753 32933930 34528970 36476378 38872713 41756250 45179465 49014760 52679290
5220 52679290 55422868 56480517 55509908 53109859 50350249 48062684 46741886 46066738
5212 46066738 45751149 45341919 44634579 43336908 41657278 39984756 38648489 37647123 37228311
5203 37228311 37347856 38102583 39411700 41151967 43512685 46348842 49683208 53386708
5195 53386708 56640838 58634050 59174847 58355740 56777344 55119323 53891907 53115658 52598136
5186 52598136 51974174 50919740 49631074 48597322 48052179 47801547 47344003 45988027 43478013
$$ packed form
5246C2352346j406713j047420p95629p43210n58618m99592l96906k21147j56482
5237B6526629N5354J77119K65375L50987N70108O97204P13909R40414J184654
5228C1481753J452177J595040J947408K396335K883537L423215L835295L664530
5220E2679290K743578J057649r70609k400049k759610k287565j320798o75148
5212D6066738l15589m09230p07340j297671j679630j672522j336267j001366m18812
5203C7228311J19545P54727J309117J740267K360718K836157L334366L703500
5195E3386708L254130J993212N40797q19107j578396j658021j227416p76249n17522
5186E2598136o23962j054434j288666j033752n45143k50632m57544j355976k510014
$$ plain form
5177 43478013 40388162 37341461 34786085 32770621 31451720 30653967 30169085 29602002 28957698
5168 28957698 28575104 28147210 28057110 28094198 28123241 28108607 28163355 28385965 28628005 28933211
5158 28933211 29688538 30554030 31312286 31777213 31370454 30176991 28244686 26185197 24596083
5149 24596083 23140452 21890667 21096878 20427453 20106385 19910437 19865667 19889749 19836652 19497123
5139 19497123 19024925 18522347 18127503 17965469 17902463 17973654 18039956 18324527 18753807 19204756
5129 19204756 19769028 20483682 21284581 22201206 23083594 24010498 25115302 26747310 28720759
5120 28720759 31181359 34181058 37835031 42159185 46783216 50914246 54046350 56379194
5112 56379194 58668294 61710744 65384624 68502852 68511357 64659883 57737243 49848038 42616434
$$ packed form
5177D3478013l089851l046701k555376k015464j318901p97753m84882n67083o44304
5168B8957698l82594m27894r0100L7088K9043j4634N4748K22610K42040L05206
5158B8933211P55327Q65492P58256M64927m06759j193463j932305k059489j589114
5149B4596083j455631j249785p93789o69425l21068j95948m4770K4082n3097l39529
5139A9497123m72198n02578l94844j62034o3006P1191O6302K84571M29280M50949
5129A9204756N64272P14654Q00899R16625Q82388R26904J104804J632008J973449
5120B8720759K460600K999699L653973M324154M624031M131030L132104K332844
5112E6379194K289100L042450L673880L118228Q505l851474o922640p889205p231604
$$ plain form
5103 42616434 36631926 31744981 27959044 25025727 22638395 20768449 19241803 18074814
5095 18074814 17091870 16074763 15267690 14625303 13920601 13354793 12769032 12293845 11931136
5086 11931136 11641510 11449112 11228770 11048117 11018881 11065300 11016428 11078733 11204247 11333079
5076 11333079 11577512 11632389 11457497 11022235 10606018 9952331 9266984 8833091 8457951 8104187
5066 8104187 7826609 7587626 7241716 6996772 6825491 6643703 6512845 6358656 6222154 6189402
5056 6189402 6141201 6057395 6052874 5996441 5865514 5936963 5986351 6026064 6092485 6032364 6084116
5045 6084116 6064045 5957888 5868783 5693017 5486273 5401470 5234684 5193034 5191405 5183217 5107271
5034 5107271 5070212 5069308 5086400 5259886 5257860 5326907 5486066 5534261 5487223 5416784 5350745 5212728
$$ packed form
5103D2616434n984508m886945l785937k933317k387332j869946j526646j166989
5095A8074814r82944j017107q07073o42387p04702n65808n85761m75187l62709
5086A1931136k89626j92398k20342j80653k9236M6419m8872O2305J25514J28832
5076A1333079K44433N4877j74892m35262m16217o53687o85347m33893l75140l53764
5066H104187k77578k38983l45910k44944j71281j81788j30858j54189j36502l2752
5056F189402m8201q3806m521n6433j30927P1449M9388L9713O6421o0121N1752
5045F084116k0071j06157q9105j75766k06744q4803j66786m1650j629q188p5946
5034E107271l7059r04J7092J73486k026O9047J59159M8195m7038p0439o6039j38017
$$ plain form
5022 5212728 4961040 4893536 4820112 4809708 4853067 4642669 4499570 4529653 4456591 4463173 4398624
5011 4398624 4357492 4234171 4281524 4303973 4316948 4306793 4419915 4492876 4481341 4532647 4587308
5000 4587308 4641190 4733043 4917184 5116345 5282552 5431744 5499967 5421034 5293954 5221812
4990 5221812 5175185 5154743 5065941 4999327 5014456 4929203 4956899 5018462 5067920 5115191 5167355
4979 5167355 5233979 5364193 5370284 5501454 5676696 5859794 6149639 6386895 6436786 6556979
4969 6556979 6488782 6420955 6280997 6139431 6022305 5796191 5757185 5613759 5487864 5614430
4959 5614430 5628734 5613444 5561352 5500926 5457000 5561139 5582811 5580556 5550270 5512678 5644110
4948 5644110 5781302 5906279 5836240 5945353 5997581 6169266 6244605 6353190 6509655 6466698
$$ packed form
5022E212728k51688o7504p3424j0404M3359k10398j43099L0083p3062O582o4549
5011D398624m1132j23321M7353K2449J2975j0155J13122P2961j1535N1306N4661
5000D587308N3882R1853J84141J99161J66207J49192O8223p8933j27080p2142
4990E221812m6627k0442q8802o6614J5129q5253K7696O1563M9458M7271N2164
4979E167355O6624J30214O091J31170J75242J83098K89845K37256M9891J20193
4969F556979o8197o7827j39958j41566j17126k26114l9006j43426j25895J26566
4959E614430J4304j5290n2092o0426m3926J04139K1672k255l0286l7592J31432
4948E644110J37192J24977p0039J09113N2228J71685P5339J08585J56465m2957
$$ plain form
4938 6466698 6572573 6761250 6957595 7028543 7204466 7433179 7615649 7961432 8228516 8663461
4928 8663461 9131332 9694507 10196038 10657005 11093300 11440733 11877146 12225537 12739862 13338983
4918 13338983 14177697 15167106 16618206 18111633 19403100 20222187 20318282 20132157 19695077
4909 19695077 19424794 19576075 20022272 20484951 20361780 19413524 17955223 16299231 14918842
4900 14918842 13953160 12994540 12213704 11714160 11250590 10895581 10600761 10228099 10054384
4891 10054384 9930543 9870781 9809104 9649454 9543048 9508234 9466030 9484259 9480502 9477309 9474884
4880 9474884 9470941 9410499 9455020 9515472 9506672 9567915 9732244 9929721 9974722 10084836 10212937
4869 10212937 10338192 10410804 10623896 10826100 10928652 11142470 11284701 11518191 11727662 12081414
$$ packed form
4938F466698J05875J88677J96345P0948J75923K28713J82470L45783K67084M34945
4928H663461M67871N63175N01531M60967M36295L47433M36413L48391N14325N99121
4918A3338983Q38714R89409J451100J493427J291467Q19087R6095j86125m37080
4909A9695077k70283J51281M46197M62679j23171r48256j458301j655992j380389
4900A4918842r65682r58620p80836m99544m63570l55009k94820l72662j73715
4891A0054384j23841n9762o1677j59650j06406l4814m2204J8229l757l193k425
4880I474884l943o0442M4521O0452q800O1243J64329J97477M5001J10114J28101
4869A0212937J25255P2612K13092K02204J02552K13818J42231K33490K09471L53752
$$ plain form
4859 12081414 12366457 12634534 12854012 13036256 13355838 13642837 13958968 14448722 14995665
4850 14995665 15502416 16016882 16578835 17095905 17681681 18255930 18832798 19452281 20072759
4841 20072759 20855700 21652852 22473788 23447253 24521261 25592134 26794189 27940916 29236766
4832 29236766 30663153 32098436 33691935 35417518 37645544 40398712 43508549 47326070
4824 47326070 51929803 57398002 63747698 71450690 81082153 93191386 108119719 127864278
4816 127864278 153938028 186225611 218680012 239819655 236963841 210219643 172191783
4809 172191783 136416550 108982741 88888804 74432780 63715410 55521104 49163407
4802 49163407 44335724 40612990 37456106 34618861 32216477 30050452 28145383 26353068
$$ packed form
4859A2081414K85043K68077K19478J82244L19582K86999L16131M89754N46943
4850A4995665N06751N14466N61953N17070N85776N74249N76868O19483O20478
4841B0072759P82941P97152Q20936R73465J074008J070873J202055J146727J295850
4832B9236766J426387J435283J593499J725583K228026K753168L109837L817521
4824D7326070M603733N468199O349696P702992R631463J2109233J4928333J9744559
4816A27864278K6073750L2287583L2454401K1139643k855814k6744198l8027860
4809A72191783l5775233k7433809k0093937j4456024j0717370q194306o357697
4802D9163407m827683l722734l156884k837245k402384k166025j905069j792315
$$ plain form
4794 26353068 24845443 23500996 22291367 21248085 20217732 19356180 18715383 18041247 17390927
4785 17390927 16660425 16014319 15302810 14652396 14032348 13371891 12847310 12390472 11947687
4776 11947687 11532265 11164076 10784163 10598105 10307124 9985797 9658088 9316498 9157880
4767 9157880 8936296 8650099 8355887 8225703 8025703 7753592 7568609 7434255 7384384 7320873
4757 7320873 7118203 7018450 6835889 6758507 6694211 6681763 6639500 6499663 6382973 6274092
4747 6274092 6196673 6107201 5969477 5835345 5623980 5594302 5609028 5518950 5369155 5162407
4737 5162407 5132718 5104453 4986551 5007365 4843503 4619141 4518603 4541282 4462496 4401009 4242381
4726 4242381 4201079 4152237 4066497 4012869 3925368 3878601 3899703 3971937 3910430 3879470 3886347 3826347
$$ packed form
4794B6353068j507625j344447j209629j043282j030353q61552o40797o74136o50320
4785A7390927p30502o46106p11509o50414o20048o60457n24581m56838m42785
4776A1947687m15422l68189l79913j86058k90981l21327l27709l41590j58618
4767I157880k21584k86197k94212j30184k00000k72111j84983j34354m9871o3511
4757G320873k02670r9753j82561p7382o4296j2448m2263j39837j16690j08881
4747F274092p7419q9472j37724j34132k11365k9678J4726r0078j49795k06748
4737E162407k9689k8265j17902K0814j63862k24362j00538K2679p8786o1487j58628
4726D242381m1302m8842q5740n3628q7501m6767K1102P2234o1507l0960O877o0000
$$ plain form
4714 3826347 3768997 3839144 3720007 3735368 3787973 3715711 3708886 3626425 3606373 3581537 3560273
4703 3560273 3493002 3442368 3516620 3568548 3451155 3370290 3455317 3360638 3324320 3323497 3210903
4692 3210903 3200459 3253313 3231697 3222711 3196398 3186094 3198043 3168616 3107207 3050097 3031343 3105447
4680 3105447 3051781 3079768 3168326 3137557 3099442 3124504 3112579 3066005 3026212 2950955 2966513
4669 2966513 2921167 2842847 2946723 3015079 3033905 3055767 3107295 3100752 3160607 3106465 3210464
4658 3210464 3289260 3283176 3311188 3299297 3369827 3470953 3502879 3545912 3739662 3779829 3705357
4647 3705357 3889156 3982643 4041884 4111187 4124004 4252339 4309897 4276364 4305236 4377715 4341527
4636 4341527 4369252 4441070 4504509 4595688 4622455 4682989 4687858 4733092 4828069 4963899 5108435
$$ packed form
4714C826347n7350P0147j19137J5361N2605p2262o825q2461k0052k4836k1264
4703C560273o7271n0634P4252N1928j17393q0865Q5027r4679l6318q23j12594
4692C210903j0444N2854k1616q986k6313j0304J1949k9427o1409n7110j8754P4104
4680C105447n3666K7987Q8558l0769l8115K5062j1925m6574l9793p5257J5558
4669B966513m5346p8320J03876O8356J8826K1862N1528o543N9855n4142J03999
4658C210464P8796o084K8012j1891P0530J01126L1926M3033J93750M0167p4472
4647C705357J83799R3487N9241O9303J2817J28335N7558l3533K8872P2479l6188
4636D341527K7725P1818O3439R1179K6767O0534M869M5234R4977J35830J44536
$$ plain form
4625 5108435 5195133 5253926 5177897 5179701 5196212 5121681 5193220 5410615 5461062 5598306 5675215
4614 5675215 5774233 5838920 5887899 5949527 6116664 6213227 6331709 6455099 6603060 6717193
4604 6717193 6758625 7069789 7179682 7265488 7497273 7713192 8070793 8357128 8508238 8820099
4594 8820099 9039943 9400436 9755297 10127284 10513568 10948449 11353978 11827222 12290057 12633950
4584 12633950 13078400 13577225 14123591 14730816 15398561 16043733 16705574 17652715 18527523
4575 18527523 19147111 20179158 21339715 22598378 24025321 25811151 27868523 30400294
4567 30400294 33387349 36842241 40977672 45925688 52082814 59560474 68576790 80068098
4559 80068098 94996727 112870852 129976374 139297737 135940029 122346230 103874331
$$ packed form
4625E108435Q6698N8793p6029J804J6511p4531P1539K17395N0447J37244P6909
4614E675215R9018O4687M8979O1628J67137R6563J18482J23390J47961J14133
4604F717193M1432L11164J09893Q5806K31785K15919L57601K86335J51110L11861
4594H820099K19844L60493L54861L71987L86284M34881M05529M73244M62835L43893
4584A2633950M44450M98825N46366O07225O67745O45172O61841R47141Q74808
4575A8527523O19588J032047J160557J258663J426943J785830K057372K531771
4567C0400294K987055L454892M135431M948016O157126P477660R016316J1491308
4559H0068098J4928629J7874125J7105522R321363l357708j3593799j8471899
$$ plain form
4552 103874331 85392896 70236816 58307824 49208784 42179374 36719765 32585887 29327855
4544 29327855 26669196 24371330 22465985 20873702 19428753 18052640 16980846 15878661
4536 15878661 14949339 14111644 13378207 12795106 12142946 11720920 11267376 10833333 10432814
4527 10432814 10016794 9531446 9112859 8774172 8373134 8007875 7800520 7613679 7295497
4518 7295497 6991106 6767192 6691436 6418413 6179723 5933748 5740072 5631592 5454598 5305638
4508 5305638 5259900 5251252 5051144 4983790 4952411 4940172 4859875 4881643 4868625 4870431 4997274
4497 4997274 5138150 5216974 5145011 5034472 4843417 4557642 4185154 4043924 4021899 3843463
4487 3843463 3731009 3649782 3636609 3538675 3458063 3275627 3176198 3165511 3151304 3151588 3099474
$$ packed form
4552A03874331j8481435j5156080j1928992r099040p029410n459609m133878l258032
4544B9327855k658659k297866j905345j592283j444949j376113j071794j102185
4536A5878661r29322q37695p33437n83101o52160m22026m53544m34043m00519
4527A0432814m16020m85348m18587l38687m01038l65259k07355j86841l18182
4518G295497l04391k23914p5756k73023k38690k45975j93676j08480j76994j48960
4508E305638m5738q648k00108o7354l1379j2239q0297K1768j3018J806J26843
4497D997274J40876P8824p1963j10539j91055k85775l72488j41230k2025j78436
4487C843463j12454q1227j3173r7934q0612j82436r9429j0687j4207K84n2114
$$ plain form
4476 3099474 2959400 2801473 2789273 2804526 2816714 2697940 2708586 2601975 2565611 2512730 2414341
4465 2414341 2407877 2410446 2451826 2383952 2289560 2329859 2419041 2500877 2361873 2221332 2230669 2197240
4453 2197240 2143257 2204881 2245480 2185925 2274658 2251626 2147184 2151814 2196376 2176092 2170978 2115769
4441 2115769 2077012 1963952 2010828 2001539 2069691 2005131 1914017 2000059 2028284 2023960 1943929 2080799
4429 2080799 2170308 2170232 2095291 2024019 2013722 1976300 1891475 1883037 1847925 1901373 1867755 1907779
4417 1907779 1902409 1942854 1991804 2093849 2018777 1924590 1863994 1868853 1949551 1936706 1854900 1956419
4405 1956419 1922335 1900339 1960766 2009055 2033060 2059276 2088222 2128401 2132017 2012786 2005347 2066915
4393 2066915 2054364 2053722 2259796 2231260 2193273 2085174 2129616 2126170 2101037 2160273 2132044 2121128
$$ packed form
4476C099474j40074j57927j2200J5253J2188j18774J0646j06611l6364n2881r8389
4465B414341o464K569M1380o7874r4392M0299Q9182Q1836j39004j40541R337l3429
4453B197240n3983O1624M0599n9555Q8733k3032j04442M630M4562k0284n114n5209
4441B115769l8757j13060M6876r289O8152o4560r1114Q6042K8225m324q0031J36870
4429B080799Q9509p6p4941p1272j0297l7422q4825q438l5112N3448l3618M0024
4417A907779n370M0445M8950J02045p5072r4187o0596M859Q0698j2845q1806J01519
4405A956419l4084k1996O0427M8289K4005K6216K8946M0179L616j19231p439O1568
4393B066915j2551o42K06074k8536l7987j08099M4442l446k5133N9236k8229j0916
$$ plain form
4381 2121128 2081906 1994606 2073256 2132484 2164204 2109843 2146095 2193939 2229191 2257139 2293990
4370 2293990 2378404 2364972 2355153 2385743 2374496 2389101 2467259 2453504 2419139 2438548 2519061 2519165
4358 2519165 2507297 2536360 2455393 2577072 2696159 2665942 2633513 2632775 2657863 2795690 2768293
4347 2768293 2774959 2789585 2815010 2889393 3038990 3050901 3088725 3154924 3237128 3282268 3204759
4336 3204759 3186979 3349913 3420707 3352766 3466685 3570225 3597642 3700273 3725384 3746744 3875723
4325 3875723 3977638 4071996 4176258 4260638 4208078 4408801 4572170 4655998 4707017 4794269 4966981
4314 4966981 5086863 5139624 5201122 5394742 5639271 5708438 5806311 5913417 6057419 6100105
4304 6100105 6215622 6316420 6501378 6671020 6880749 7036171 7167000 7339113 7452241 7500452
$$ packed form
4381B121128l9222q7300P8650N9228L1720n4361L6252M7844L5252K7948L6851
4370B293990Q4414j3432r819L0590j1247J4605P8158j3755l4365J9409Q0513J04
4358B519165j1868K9063q0967J21679J19087l0217l2429p38K5088J37827k7397
4347B768293O666J4626K5425P4383J49597J1911L7824O6199Q2204M5140p7509
4336C204759j7780J62934P0794o7941J13919J03540K7417J02631K5111K1360J28979
4325C875723J01915R4358J04262Q4380n2560K00723J63369Q3828N1019Q7252J72712
4314D966981J19882N2761O1498J93620K44529O9167R7873J07106J44002M2686
4304F100105J15517J00798J84958J69642K09729J55422J30829J72113J13128M8211
$$ plain form
4294 7500452 7635367 7839443 7985743 8090748 8162873 8307943 8440598 8562069 8785470 8874893
4284 8874893 8990274 9165299 9330559 9468607 9541859 9773109 9907413 10016028 10171152 10379108
4274 10379108 10625102 10848040 10990330 11213363 11560187 11766527 11965177 12236405 12531924
4265 12531924 12904117 13339919 13737601 14040729 14512860 14836128 15314892 15860812 16429795
4256 16429795 16913185 17488688 18102483 18597385 19132751 19869313 20531561 21024532 21686110
4247 21686110 22183038 22669185 23288229 23878042 24481634 25170220 25866043 26475448 27064367
4238 27064367 27715290 28293379 28883087 29424265 29925820 30408016 30868853 31135573 31461990
4229 31461990 31892453 32224576 32413620 32532981 32721315 32893913 32826995 32792681 32611554 32409410
$$ packed form
4294G500452J34915K04076J46300J05005P2125J45070J32655J21471K23401Q9423
4284H874893J15381J75025J65260J38048P3252K31250J34304J08615J55124K07956
4274A0379108K45994K22938J42290K23033L46824K06340J98650K71228K95519
4265A2531924L72193M35802L97682L03128M72131L23268M78764N45920N68983
4256A6429795M83390N75503O13795M94902N35366P36562O62248M92971O61578
4247B1686110M96928M86147O19044N89813O03592O88586O95823O09405N88919
4238B7064367O50923N78089N89708N41178N01555M82196M60837K66720L26417
4229C1461990M30463L32123J89044J19361J88334J72598o6918l4314j81127k02144
$$ plain form
4219 32409410 32247447 31954170 31628861 31259766 30959618 30565798 30089098 29614031 29216686
4210 29216686 28640785 28096471 27556242 26859672 26218212 25599388 24978595 24263782 23607893
4201 23607893 22960771 22272731 21652820 21006834 20311486 19762543 19245552 18673240 17956190
4192 17956190 17427689 16950561 16472769 15963322 15582967 15200170 14615533 14184913 13775452
4183 13775452 13338842 12922400 12517798 12190035 11855182 11672509 11442378 11002899 10758343
4174 10758343 10486252 10181182 9892239 9693725 9478907 9321006 9172074 9050295 8790084
4165 8790084 8596775 8441269 8279391 8169098 7999724 7858114 7741345 7623501 7575462 7449672
4155 7449672 7416419 7435568 7353834 7256485 7235477 7161325 7025113 6923878 6857592 6844938 6808017
$$ packed form
4219C2409410j61963k93277l25309l69095l00148l93820m76700m75067l97345
4210B9216686n75901n44314n40229o96570o41460o18824o20793p14813o55889
4201B3607893o47122o88040o19911o45986o95348n48943n16991n72312p17050
4192A7956190n28501m77128m77792n09447l80355l82797n84637m30620m09461
4183A3775452m36610m16442m04602l27763l34853j82673k30131m39479k44556
4174A0758343k72091l05070k88943j98514k14818j57901j48932j21779k60211
4165H790084j93309j55506j61878j10293j69374j41610j16769j17844m8039j25790
4155G449672l3253J9149q1734r7349k1008p4152j36212j01235o6286j2654l6921
$$ plain form
4144 6808017 6905612 6901843 6864943 6787379 6710512 6719845 6762852 6876788 6912462 6873270 6878571 6961369
4132 6961369 6973367 6901703 6967953 7106706 7112095 7056567 7112822 7230176 7313655 7331003 7415974
4121 7415974 7518540 7599698 7767807 7858554 7818177 7990084 8102061 8130325 8382641 8423765
4111 8423765 8617166 8618050 8723779 8962802 9140967 9291712 9468569 9672510 9803183 9949501
4101 9949501 10231879 10472271 10661077 10973712 11348227 11572548 11766430 12029627 12297698 12640343
4091 12640343 12922595 13209929 13549484 13708864 13924786 14308129 14569848 14922036 15276257
4082 15276257 15537626 15782435 16010780 16191596 16466288 16786130 17042542 17184795 17343118
4073 17343118 17510319 17699013 17819211 17999907 18061694 18274472 18470626 18668536 18715145 18910252
$$ packed form
4144F808017R7595l769l6900p7564p6867R333M3007J13936L5674l9192N301Q2798
4132F961369J1998p1664O6250J38753N389n5528N6255J17354Q3479J7348Q4971
4121G415974J02566Q1158J68109R0747m0377J71907J11977K8264K52316M1124
4111H423765J93401Q84J05729K39023J78165J50745J76857K03941J30673J46318
4101I949501K82378K40392J88806L12635L74515K24321J93882K63197K68071L42645
4091A2640343K82252K87334L39555J59380K15922L83343K61719L52188L54221
4082A5276257K61369K44809K28345J80816K74692L19842K56412J42253J58323
4073A7343118J67201J88694J20198J80696O1787K12778J96154J97910M6609J95107
$$ plain form
4063 18910252 19112638 19113675 19178816 19389549 19541128 19628189 19794855 19902360 20063037 20230059
4053 20230059 20242902 20375299 20445783 20492488 20705402 20889878 21056351 21172844 21263364 21544588
4043 21544588 21837740 22014775 22194828 22465466 22717112 22939649 23225732 23488217 23774359
4034 23774359 24141212 24511069 24869187 25322372 25782633 26272150 26839694 27302846 27822817
4025 27822817 28568387 29140003 29777792 30616560 31402012 32313128 33338633 34315753 35302597
4016 35302597 36457593 37687065 38846700 40218053 41588724 42977337 44531739 46172654
4008 46172654 47915818 49818796 51772222 53786863 55797618 58033556 60217572 62454752
4000 62454752 64875180 67328268 69762631 72204679 74694678 77346651 80020832 82631935
$$ packed form
4063A8910252K02386J037O5141K10733J51579Q7061J66666J07505J60677J67022
4053B0230059J2843J32397P0484M6705K12914J84476J66473J16493R0520K81224
4043B1544588K93152J77035J80053K70638K51646K22537K86083K62485K86142
4034B3774359L66853L69857L58118M53185M60261M89517N67544M63152N19971
4025B7822817P45570N71616O37789Q38768P85452R11116J025505R77120R86844
4016C5302597J154996J229472J159635J371353J370671J388613J554402J640915
4008D6172654J743164J902978J953426K014641K010755K235938K184016K237180
4000F2454752K420428K453088K434363K442048K489999K651973K674181K611103
$$ plain form
3992 82631935 85197049 87860189 90625571 93482773 96362994 99109956 101779745 104362520
3984 104362520 106821841 109122320 111242159 113081329 114837029 116408206 117949275 119323030
3976 119323030 120532848 121765534 122770834 123629727 124281938 124735203 124875259 124707509 124160020
3967 124160020 123261983 122109025 120827770 119439153 117866939 116300363 114582113 112717923
3959 112717923 110808004 108824167 106620426 104285310 101702482 98942055 96242221 93324912
3951 93324912 90234413 87217407 84222755 81275008 78510376 75747589 72969578 70303691
3943 70303691 67815722 65389863 63005634 60621498 58262713 56124023 54041890 52008236
3935 52008236 50057769 48226505 46519531 45052947 43642360 42351014 41219603 40130213
$$ packed form
3992H2631935K565114K663140K765382K857202K880221K746962K669789K582775
3984A04362520K459321K300479K119839J839170J755700J571177J541069J373755
3976A19323030J209818J232686J005300Q58893O52211M53265J40056j67750n47489
3967A24160020q98037j152958j281255j388617j572214j566576j718250j864190
3959A12717923j909919j983837k203741k335116k582828k760427k699834k917309
3951I3324912l090499l017006k994652k947747k764632k762787k778011k665887
3943G0303691k487969k425859k384229k384136k358785k138690k082133k033654
3935E2008236j950467j831264j706974j466584j410587j291346j131411j089390
$$ plain form
3927 40130213 39164378 38417926 37789535 37186024 36746296 36368525 36137118 36062058 36076396 36160186
3917 36160186 36263254 36473486 36791683 37085576 37358311 37689597 38028607 38153186 38301682
3908 38301682 38363468 38346287 38353231 38265517 38170655 37982260 37804034 37570733 37383810 37201283
3898 37201283 36991300 36619352 36283891 35892993 35360308 34848018 34238170 33611552 32994528
3889 32994528 32456336 31870927 31428343 31023927 30737051 30557531 30402677 30195536 30003572
3880 30003572 30098733 30213234 30350031 30526240 30788690 31084724 31530016 32078231 32796783 33567618
3870 33567618 34438817 35297176 36305414 37433640 38663837 40113895 41638398 43241904
3862 43241904 44997721 46530173 48183597 49731800 51231593 52521758 53598989 54488281
$$ packed form
3927D0130213r65835p46452o28391o03511m39728l77771k31407p5060J4338Q3790
3917C6160186J03068K10232L18197K93893K72735L31286L39010J24579J48496
3908C8301682O1786j7181O944q7714r4862j88395j78226k33301j86923j82527
3898C7201283k09983l71948l35461l90898n32685n12290o09848o26618o17024
3889C2994528n38192n85409m42584m04416k86876j79520j54854k07141j91964
3880C0003572R5161J14501J36797J76209K62450K96034M45292N48215P18552P70835
3870C3567618Q71199Q58359J008238J128226J230197J450058J524503J603506
3862D3241904J755817J532452J653424J548203J499793J290165J077231Q89292
$$ plain form
3854 54488281 55001615 55322164 55433749 55614622 55495703 55213463 54913001 54525304 53864128
3845 53864128 53402748 52837606 51939884 50818770 49611132 48163707 46533590 44709155 42749278
3836 42749278 40702709 38784117 36828174 34992039 33279383 31644845 30138742 28716507
3828 28716507 27455946 26230910 25249221 24482439 23598642 22808658 22176815 21536351 20987249
3819 20987249 20661858 20154878 19787171 19476540 19087967 18854103 18734941 18650201 18530338 18499820
3809 18499820 18428580 18320374 18107644 18007182 17801948 17849119 17813751 17576863 17387378 17270871
3799 17270871 17137344 16918580 16771477 16686337 16517258 16322380 16150232 16095702 15890278 15707698
3789 15707698 15472858 15127631 14829356 14498993 14221355 13963070 13881486 13744436 13568766 13372300
$$ packed form
3854E4488281N13334L20549J11585J80873j18919k82240l00462l87697o61176
3845E3864128m61380n65142q97722j121114j207638j447425j630117j824435j959877
3836D2749278k046569j918592j955943j836135j712656j634538j506103j422235
3828B8716507j260561j225036r81689p66782q83797p89984o31843o40464n49102
3819B0987249l25391n06980l67707l10631l88573k33864j19162q4740j19863l0518
3809A8499820p1240j08206k12730j00462k05234M7171l5368k36888j89485j16507
3799A7270871j33527k18764j47103q5140j69079j94878j72148n4530k05424j82580
3789A5707698k34840l45227k98275l30363k77638k58285q1584j37050j75670j96466
$$ plain form
3779 13372300 13248414 13066386 13010391 12837871 12764092 12749415 12685795 12603948 12647591 12714736 12740191
3768 12740191 12671889 12591220 12588613 12710394 12769575 12731658 12789076 12777090 12807142 12956087 12970496
3757 12970496 13017700 13036394 13012808 13252415 13316134 13457752 13504442 13592613 13652391 13774350 13841515
3746 13841515 14025340 14198197 14234366 14296693 14514574 14599562 14803215 14946161 15091025 15152986
3736 15152986 15332337 15498578 15596704 15770224 15918351 16058044 16208088 16290828 16435515 16628964
3726 16628964 16799153 17034322 17235180 17469446 17732749 17985528 18183656 18562943 18698997
3717 18698997 18959464 19169609 19487668 19800549 20178819 20626917 21020156 21431429 21854451
3708 21854451 22232300 22758188 23266999 23673317 24173000 24635450 25126595 25697379 26303538
$$ packed form
3779A3372300j23886j82028n5995j72520p3779j4677o3620q1847M3643O7145K5455
3768A2740191o8302q0669k607J21781N9181l7917N7418j1986L0052J48945J4409
3757A2970496M7204J8694k3586K39607O3719J41618M6690Q8171N9778J21959O7165
3746A3841515J83825J72857L6169O2327K17881Q4988K03653J42946J44864O1961
3736A5152986J79351J66241R8126J73520J48127J39693J50044Q2740J44687J93449
3726A6628964J70189K35169K00858K34266K63303K52779J98128L79287J36054
3717A8698997K60467K10145L18059L12881L78270M48098L93239M11273M23022
3708B1854451L77849N25888N08811M06318M99683M62450M91145N70784O06159
$$ plain form
3699 26303538 26935376 27517849 28154290 28714954 29231075 29891750 30659522 31350822 31891601
3690 31891601 32492473 33057119 33489619 33918118 34420514 34796780 35208103 35593334 35956294
3681 35956294 36411618 36846623 37368257 37783028 38262285 38703521 39109892 39634786 40092216
3672 40092216 40667948 41179467 41622165 42186238 42871477 43382287 44085156 44900200 45736061
3663 45736061 46682096 47821715 48897956 50060455 51333143 52796062 54303055 55930735
3655 55930735 57786252 59612632 61634024 63770702 66067964 68424644 70800798 73337249
3647 73337249 76081661 78912189 81720338 84312724 87161665 89943780 92861653 95673553
3639 95673553 98507015 101136080 103705256 106088268 108315816 110569509 112500381 114439959
$$ packed form
3699B6303538O31838N82473O36441N60664N16121O60675P67772O91300N40779
3690C1891601O00872N64646M32500M28499N02396L76266M11323L85231L62960
3681C5956294M55324M35005N21634M14771M79257M41236M06371N24894M57430
3672D0092216N75732N11519M42698N64073O85239N10810P02869Q15044Q35861
3663D5736061R46035J139619J076241J162499J272688J462919J506993J627680
3655E5930735J855517J826380K021392K136678K297262K356680K376154K536451
3647G3337249K744412K830528K808149K592386K848941K782115K917873K811900
3639I5673553K833462K629065K569176K383012K227548K253693J930872J939578
$$ plain form
3631 114439959 116195726 117727720 119163555 120508837 121533554 122471688 123174936 123562518
3623 123562518 123861723 123920008 123716349 123437127 122925137 122106774 121380275 120509042 119371969
3614 119371969 118382493 117386188 116356177 115278544 114175047 113172843 112160664 111154921
3606 111154921 110228716 109354893 108476605 107609139 106852088 106167792 105587169 105164511 104925961
3597 104925961 104767467 104732498 105059440 105492877 106186501 107189711 108336539 109758246 111354346
3588 111354346 113256961 115458274 117936392 120454956 123045422 125815305 128645054 131319069
3580 131319069 134100247 136822294 139277591 141694252 144288863 146839065 149256010 151648738
3572 151648738 153902144 156055247 157943248 159692965 161100378 162054157 162620922 162747267
$$ packed form
3631A14439959J755767J531994J435835J345282J024717R38134P03248L87582
3623A23562518K99205N8285k03659k79222n11990q18363p26499q71233j137073
3614A19371969r89476r96305j030011j077633j103497j002204j012179j005743
3606A11154921r26205q73823q78288q67466p57051o84296n80623m22658k38550
3597A04925961j58494l4969L26942M33437O93624J003210J146828J421707J596100
3588A11354346J902615K201313K478118K518564K590466K769883K829749K674015
3580A31319069K781178K722047K455297K416661K594611K550202K416945K392728
3572A51648738K253406K153103J888001J749717J407413R53779N66765J26345
$$ plain form
3564 162747267 162418598 161594167 160423500 159045870 157416234 155699496 154046876 152219932
3556 152219932 150449882 148754027 146982624 145136696 143435721 141805744 140217854 138746506
3548 138746506 137397703 136457078 135776412 135283345 135216527 135532683 136204463 137262826 138461307
3539 138461307 139898777 141603846 143486316 145490054 147532803 149559755 151567678 153389527
3531 153389527 155262571 157144431 158922545 160683471 162477706 164122800 165679682 166983516
3523 166983516 167970514 168774481 169053514 168752815 168087761 166909199 165351654 163516899 161203361
3514 161203361 158634748 155908882 152803233 149447418 146231548 142953359 139821516 136733439
3506 136733439 133753480 130913541 128224914 125490443 122736908 119904441 117221125 114628806
$$ packed form
3564A62747267l28669q24431j170667j377630j629636j716738j652620j826944
3556A52219932j770050j695855j771403j845928j700975j629977j587890j471348
3548A38746506j348803r40625o80666m93067o6818L16156O71780J058363J198481
3539A38461307J437470J705069J882470K003738K042749K026952K007923J821849
3531A53389527J873044J881860J778114J760926J794235J645094J556882J303834
3523A66983516R86998Q03967K79033l00699o65054j178562j557545j834755k313538
3514A61203361k568613k725866l105649l355815l215870l278189l131843l088077
3506A36733439k979959k839939k688627k734471k753535k832467k683316k592319
$$ plain form
3498 114628806 112245532 110202826 108321449 107075883 106246560 105906762 106052652 106614939 107784859
3489 107784859 109336907 111298974 113793965 116578144 119845734 123620594 127635615 131743642
3481 131743642 136103026 140462938 144559757 148773203 152940529 156944874 160783076 164689250
3473 164689250 168744958 172943251 177503826 182501948 187901496 193670824 200039773 206834612
3465 206834612 214087892 221860495 230108045 238788620 247957169 257759756 267912318 278104006
3457 278104006 287981436 297040957 304814243 310922197 314862301 316598774 316037506 313481277
3449 313481277 309478904 304617765 299473168 294376467 289552361 285063161 280708564 276137499
3441 276137499 271070871 264792668 256711034 246888165 235047008 221233907 206059230 190110096
$$ packed form
3498A14628806k383274k042706j881377j245566q29323l39798J45890N62287J169920
3489A07784859J552048J962067K494991K784179L267590L774860M015021M108027
3481A31743642M359384M359912M096819M213446M167326M004345L838202L906174
3473A64689250M055708M198293M560575M998122N399548N769328O368949O794839
3465B06834612P253280P772603Q247550Q680575R168549R802587J0152562J0191688
3457B78104006R877430R059521P773286O107954L940104J736473n61268k556229
3449C13481277m002373m861139n144597n096701m824106m489200m354597m571065
3441B76137499n066628o278203q081634r822869j1841157j3813101j5174677j5949134
$$ plain form
3433 190110096 174060189 158581603 143999703 130760045 119062556 109006954 100329744
3426 100329744 92554493 85928766 80061672 74922281 70274796 66021488 62303873 59025026
3418 59025026 56062702 53459189 50967751 48555769 46454529 44525584 42746941 41126347
3410 41126347 39534594 38054918 36668148 35435341 34209084 33025037 31855781 30778899
3402 30778899 29891436 28835020 27961829 27073540 26179776 25607722 24961501 24290796 23676472
3393 23676472 23004837 22289110 21757416 21257699 20760950 20299740 19765280 19309343 18891386
3384 18891386 18412435 17984069 17528812 17050813 16705081 16396739 15946702 15613863 15203768
3375 15203768 14788004 14534181 14345418 14068819 13604612 13276635 12938359 12625861 12381517
$$ packed form
3433A90110096j6049907j5478586j4581900j3239658j1697489j0055602q677210
3426A00329744p775251o625727n867094n139391m647485m253308l717615l278847
3418E9025026k962324k603513k491438k411982k101240j928945j778643j620594
3410D1126347j591753j479676j386770j232807j226257j184047j169256j076882
3402C0778899q87463j056416q73191q88289q93764n72054o46221o70705o14324
3393B3676472o71635p15727n31694m99717m96749m61210n34460m55937m17957
3384A8891386m78951m28366m55257m77999l45732l08342m50037l32839m10095
3375A5203768m15764k53823j88763k76599m64207l27977l38276l12498k44344
$$ plain form
3366 12381517 12096271 11844031 11572928 11448725 11196850 10924255 10746827 10536711 10295104
3357 10295104 10130638 10021125 9817678 9608038 9488162 9223245 9077323 8892586 8855462 8799995
3347 8799995 8547159 8438033 8247817 8171653 8039356 7841819 7798138 7804904 7726687 7588863
3337 7588863 7437606 7301182 7158325 7093770 6987065 6830246 6761034 6769101 6688652 6481503
3327 6481503 6345918 6204354 6155707 6109625 5862353 5819345 5710872 5665752 5599686 5488232
3317 5488232 5478180 5404707 5252995 5206815 5156491 5056874 4917530 4727891 4668588 4768501 4668498
3306 4668498 4581411 4526378 4538172 4526348 4510830 4375231 4315273 4208896 4102123 4109597 4181903
3295 4181903 4075355 4094688 4053582 3995212 3981200 4008424 3974097 4066411 3977838 3750312 3863257
$$ packed form
3366A2381517k85246k52240k71103j24203k51875k72595j77428k10116k41607
3357A0295104j64466j09513k03447k09640j19876k64917j45922j84737l7124n5467
3347H799995k52836j09126j90216p6164j32297j97537m3681O766p8217j37824
3337G588863j51257j36424j42857o4555j06705j56819o9212Q067q0449k07149
3327F481503j35585j41564m8647m6082k47272m3008j08473m5120o6066j11454
3317E488232j0052p3473j51712m6180n0324r9617j39344j89639n9303R9913j00003
3306D668498q7087n5033J1794j1824j5518j35599n9958j06377j06773P474P2306
3295D181903j06548J9333m1106n8370j4012K7224l4327R2314q8573k27526J12945
$$ plain form
3284 3863257 3896458 3872281 3932180 3969288 3880865 3769920 3769761 3907012 3870239 3749124 3643611
3273 3643611 3653936 3616214 3533096 3519968 3487791 3401897 3284669 3221539 3312101 3233182 3151861
3262 3151861 3128762 3110661 3089744 3131165 3145366 3146995 3106894 3044235 3002884 3047624 3053304 2940275
3250 2940275 2828069 2877686 2778426 2735488 2740634 2727535 2801649 2813077 2841497 2867397 2886907
3239 2886907 2789966 2727501 2688280 2697279 2760977 2798742 2821976 2705595 2708194 2723783 2763304 2766282
3227 2766282 2705666 2770441 2810747 2769637 2647637 2690959 2636462 2515492 2582305 2599078 2573646
3216 2573646 2587790 2663786 2612759 2654906 2575514 2587768 2663128 2667945 2610945 2796566 2794422 2906111
3204 2906111 2922147 2828535 2697797 2626500 2675074 2563405 2542726 2389731 2272575 2296101 2378399
$$ packed form
3284C863257L3201k4177N9899L7108q8423j10945j59J37251l6773j21115j05513
3273C643611J0325l7722q3118j3128l2177q5894j17228o3130R0562p8919q1321
3262C151861k3099j8101k0917M1421J4201J629m0101o2659m1351M4740N680j13029
3250B940275j12206M9617r9260m2938N146j3099P4114J1428K8420K5900J9510
3239B886907r6941o2465l9221Q999O3698L7765K3234j16381K599J5589L9521K978
3227B766282o0616O4775M0306m1110j22000M3322n4497j20970O6813J6773k5432
3216B573646J4144P5996n1027M2147p9392J2254P5360M817n7000J85621k144J11689
3204B906111J6036r3612j30738p1297M8574j11669k0679j52995j17156K3526Q2298
$$ plain form
3193 2378399 2370764 2203658 2194690 2244421 2212644 2281075 2224257 2222921 2245978 2203595 2145938 2126175
3181 2126175 2122071 2217270 2317770 2248443 2187133 2328741 2386764 2405195 2534363 2537007 2531912
3170 2531912 2641472 2622206 2648589 2546412 2598515 2674661 2682257 2602984 2488541 2482699 2535507
3159 2535507 2492741 2449434 2454171 2378075 2355896 2307468 2214704 2274117 2280559 2097231 1985554
3148 1985554 1932043 1905212 1800111 1775789 1794442 1707117 1502299 1420484 1412781 1365823 1246205
3137 1246205 1137895 1174502 1089636 1029606 1009167 936416 875058 879109 949784 963204 978850
3126 978850 896736 842555 825241 739884 737589 722408 752564 803790 718438 659737 704075 739076
3114 739076 753215 762370 787301 736854 722348 642747 554986 589426 622079 628303 666647 662900
$$ packed form
3193B378399p635j67106q968M9731l1777O8431n6818j336K3057m2383n7657j9763
3181B126175m104R5199J00500o9327o1310J41608N8023J8431J29168K644n095
3170B531912J09560j9266K6383j02177N2103P6146P596p9273j14443n842N2808
3159B535507m2766m3307M737p6096k2179m8428r2764N9413O442j83328j11677
3148A985554n3511k6831j05101k4322J8653q7325k04818q1815p703m6958j19618
3137A246205j08310L6607q4866o0030k0439p2751o1358M051P0675J3420J5646
3126I78850q2114n4181j7314q5357k295j5181L0156N1226q5352n8701M4338L5001
3114G39076J4139R155K4931n0447j4506p9601q7761L4440L2653O224L8344l747
$$ plain form
3102 662900 721075 623901 507261 553670 596562 643514 487666 492266 497509 514347 559609 457187
3090 457187 449917 461616 392361 441494 465818 318470 309567 372423 484572 540673 446747 393721
3078 393721 398768 318191 405373 386625 487990 409957 255304 241518 350484 414758 433675
3067 433675 437533 361801 406776 373380 464951 478099 491338 426273 506768 540835 437177 396789
3055 396789 265884 318457 401380 356763 342270 276023 250422 331509 355413 337529 239262
3044 239262 272417 322120 354645 355823 404538 336583 357270 344303 349039 346872 396014 382647
3032 382647 328682 309801 293774 340143 315016 194660 198371 315793 253355 312916 327415
3021 327415 363301 243689 188546 255409 407357 314235 274654 195014 274143 316387 239578
$$ packed form
3102F62900N8175r7174j16640M6409M2892M6952j55848M600N243J6838M5262j02422
3090D57187p270J1699o9255M9133K4324j47348q903O2856J12149N6101r3926n3026
3078C93721N047q0577Q7182j8748J01365p8033j54653j3786J08966O4274J8917
3067D33675L858p5732M4975l3396R1571J3148J3239o5065Q0495L4067j03658m0388
3055C96789j30905N2573Q2923m4617j4493o6247k5601Q1087K3904j7884r8267
3044B39262L3155M9703L2525J178M8715o7955K0687j2967M736k167M9142j3367
3032C82647n3965j8881j6027M6369k5127j20356L711J17422o2438N9561J4499
3021C27415L5886j19612n5143O6863J51948r3122l9581p9640P9129M2244p6809
$$ plain form
3010 239578 279880 202207 127721 257695 303412 243433 126388 123980 228693 328903 250750
2999 250750 154788 241751 219961 247802 265925 202898 204341 283878 257058 265491 309628 319971
2987 319971 286041 237277 232035 167557 189544 207072 158852 143331 208651 178314 189090 237532
2975 237532 271142 270200 188952 194008 199181 237082 311120 251367 207820 200989 162820 171189 245058
2962 245058 167564 52601 133295 196715 252376 188925 116644 115843 75425 171678 186728 24197
2950 24197 40287 167024 152471 202401 190220 254821 190013 105307 135201 84470 169659 181965
2938 181965 160689 213257 208858 269395 280443 197195 225342 274109 179965 65567 111738 173583
2926 173583 136127 104980 139532 163724 228228 111976 65427 121900 172285 186146 102125
$$ packed form
3010B39578M0302p7673p4486J29974M5717n9979j17045k408J04713J00210p8153
2999B50750r5962Q6963k1790K7841J8123o3027J443P9537k6820Q433M4137J0343
2987C19971l3930m8764n242o4478K1987J7528m8220j5521O5320l0337J0776M8442
2975B37532L3610r42q1248N056N173L7901P4038n9753m3547o831l8169Q369P3869
2962B45058p7494j14963Q0694O3420N5661o3451p2281q01m0418R6253J5050j62531
2950B4197J6090J26737j4553M9930j2181O4601o4808q4706K9894n0731Q5189J2306
2938A81965k1276N2568m399O0537J1048q3248K8147M8767r4144j14398M6171O1845
2926A73583l7456l1147L4552K4192O4504j16252m6549N6473N0385J3861q4021
$$ plain form
2915 102125 90871 146276 91777 125951 181794 140794 107573 251706 200284 168689 107447
2904 107447 188132 176330 178548 108352 204069 167012 213988 241934 241929 174983 137534 215570 171229
2891 171229 86441 135322 198587 243972 263264 181620 265540 230334 244323 162579 101459 144653
2879 144653 207949 111103 37294 35344 57379 33948 230565 210772 181161 246634 217557 168906
2867 168906 176699 266924 309994 175158 239360 200344 177460 158464 150669 209339 213858 250690
2855 250690 157636 101605 69418 20695 81545 174624 203835 152668 119369 143100 118576 198436
2843 198436 160067 219564 209533 179856 235579 184733 131152 143640 82512 77617 249441 223417
2831 223417 232285 189766 253960 171670 129303 99344 81248 66584 163618 137705 108556 152288
$$ packed form
2915A02125j1254N5405n4499L4174N5843m1000l3221J44133n1422l1595o1242
2904A07447Q0685j1802K218p0196R5717l7057M6976K7946no6946l7449P8036m4341
2891A71229q4788M8881O3265M5385J9292q1644Q3920l5206J3989q1744o1120M3194
2879A44653O3296r6846p3809j950K2035k3431J96617j9793k9611O5473k9077m8651
2867A68906P793R0225M3070j34836O4202l9016k2884j8996p795N8670M519L6832
2855B50690r3054n6031l2187m8723O0850R3079K9211n1167l3299K3731k4524P9860
2843A98436l8369N9497j0031k9677N5723n0846n3581J2488o1128m895J71824k6024
2831B23417Q868m2519O4194q2290m2367k9959j8096j4664R7034k5913k9149M3732
$$ plain form
2819 152288 168025 168822 119960 217090 198625 174175 112832 239869 275420 190489 109042 106756
2807 106756 114316 13752 80741 129630 77609 42575 150731 179354 108522 145553 146867 77591
2795 77591 71578 135029 83334 136496 183387 175221 130299 136214 61576 98703 48894 62309
2783 62309 3137 -109810 -80876 9768 79528 142844 86256 89023 164953 82666 28042 35590
2771 35590 33591 32153 3814 67387 -65388 -120746 -71437 -22262 8051 9 39001 10677
2759 10677 -18402 -21396 -57654 10098 65854 26732 22827 82152 165715 128911 30650 9057
2747 9057 29251 -110337 -2965 21450 72921 46357 81397 14153 86838 85885 32633 33315
2735 33315 77208 54677 12215 -3693 18085 -13521 -74377 12260 10691 78498 64662 -20208
$$ packed form
2819A52288J5737P97m8862R7130j8465k4450o1343J27037L5551q4931q1447k286
2807A06756P560j00564O6989M8889n2021l5034J08156K8623p0832L7031J314o9276
2795G7591o013O3451n1695N3162M6891q166m4922N915p4638L7127m9809J3415
2783F2309n9172j12947K8934R0644O9760O3316n6588K767P5930q2287n4624P548
2771C5590j999j438k8339O3573j32775n5358M9309M9175L0313q042L8992k8324
2759A0677k9079k994l6258O7752N5756l9122l905N9325Q3563l6804r8261k1593
2747I057K0194j39588J07372K4415N1471k6564L5040o7244P2685r53n3252O82
2735C3315M3893k2531m2462j5908K1778l1606o0856Q6637j569O7807j3836q4870
$$ plain form
2723 -20208 14374 81054 147184 86406 22914 95181 138334 49286 -43447 -31907 17767 97447
2711 97447 24671 39707 52290 -9453 7999 25915 -52088 -68258 -20617 -62512 -40293 36951
2699 36951 57559 30470 105567 57853 29095 102771 40831 100344 108645 8474 82263 71921
2687 71921 40932 91290 85998 78475 97096 45080 49938 1789 -58531 65553 47007 80988
2675 80988 45235 -19837 -49035 -29467 -14320 -52865 -3415 -34847 -74312 -69497 3383 8576
2663 8576 42841 67713 75414 62976 41110 -102329 -30120 -41954 -56130 -1872 -79179 -43305
2651 -43305 -11678 99415 110206 3232 7254 19024 -13956 60372 23644 131444 60835
2640 60835 -17644 74154 -40775 -59889 116194 103086 47400 -75679 -65318 -79175 -86304
$$ packed form
2723b0208L4582O6680O6130o0778o3492P2267M3153q9048r2733J1540M9674P9680
2711I7447p2776J5036J2583o1743J7452J7916p8003j6170M7641m1895K2219P7244
2699C6951K0608k7089P5097m7714k8758P3676o1940N9513Q301j00171P3789j0342
2687G1921l0989N0358n292p523J8621n2016M858m8149o0320J24084j8546L3981
2675H0988l5753o5072k9198J9568J5147l8545M9450l1432l9465M815P2880N193
2663H576L4265K4872P701j2438k1866j43439P2209j1834j4176N4258p7307L5874
2651d3305L1627J11093J0791j06974M022J1770l2980P4328l6728J07800p0609
2640F0835p8479R1798j14929j9114J76083j3108n5686j23079J0361j3857p129
$$ plain form
2629 -86304 -96261 -10801 -47696 -25346 -51358 -55403 -59125 -16002 -41240 -100087 -61021 -65396 -131671
2616 -131671 -88167 -98454 -96195 22723 -47177 -149268 -76587 -89379 -161735 -47345 21203
2605 21203 29665 -13742 -94540 -103791 19141 94349 78636 -11153 47867 -37056 -56834 -53614
2593 -53614 -50320 28495 34169 52581 -7521 -82099 -122330 -31155 -65851 -49274 64850 -49370
2581 -49370 1965 -40235 -107638 -156354 -92095 -47628 -133408 -136655 -77003 25295 20450 30456
2569 30456 68779 28132 -64002 -152588 -111475 61235 64013 34072 90673 -2298 5798 -9050
2557 -9050 -107406 -56086 32420 46559 72107 97001 84618 30812 12681 -79063 -71305 -94730
2545 -94730 -85127 -60598 -55895 -148610 -174876 -143086 -158503 -173730 -82553 -57555 -18943 22813
$$ packed form
2629h6304r957Q5460l6895K2350k6012m045l722M3123k5238n8847L9066m375o6275
2616a31671M3504j0287K259J18918o9900j02091P2681j2792p2356J14390O8548
2605B1203Q462m3407q0798r251J22932P5208j5713q9789N9020q4923j9778L220
2593e3614L294P8815N674J8412o0102p4578m0231R1175l4696J6577J14124j14220
2581d9370N1335m2200o7403m8716O4259M4467q5780l247N9652J02298m845J0006
2569C0456L8323m0647r2134q8586M1113J72710K778k9941N6601r2971Q096j4848
2557i050r8356N1320Q8506J4139K5548K4894j2383n3806j8131r1744P758k3425
2545i4730R603K4529M703r2715k6266L1790j5417j5227R1177K4998L8612M1756
$$ plain form
2533 22813 116450 102745 104855 41607 -32942 -135863 -137467 49756 116766 50190 22954 -52955
2521 -52955 -57427 -43952 -25135 -34610 -21594 46021 49895 104714 51678 -31314 -24303 81554
2509 81554 35904 28797 6460 -59746 -64340 -114150 -31159 41285 -76246 23646 -13470 79136
2497 79136 95883 110358 46669 -40629 -14156 65572 -511 52985 61919 -20748 -63356 -65953
2485 -65953 -9871 -33058 -64716 -60983 21218 -21184 -7209 52835 -55099 -77752 -92700 15965
2473 15965 76515 45262 66028 56695 89977 119212 148305 163042 87917 80190 17037 18814
2461 18814 92908 -29106 -61146 -30036 6270 27970 56083 -39358 4065 1912 -83338 -51302
2449 -51302 -2467 -882 -74683 -28062 -7840 -61046 -55844 -130017 -90630 -12074 6384 -36739
$$ packed form
2533B2813R3637j3705K110o3248p4549j02921j604J87223O7010o6576k7236p5909
2521e2955m472J3475J8817r475J3016O7615L874N4819n3036q2992P011J05857
2509H1554m5650p107k2337o6206m594m9810Q2991P2444j17531R9892l7116R2606
2497G9136J6747J4475o3689q7298K6473P9728o6083N3496Q934q2667m2608k597
2485f5953N6082k3187l1658L733Q2201m2402J3975O0044j07934k2653j4948J08665
2473A5965O0550l1253K0766r333L3282K9235K9093J4737p5125p727o3153J777
2461A8814P4094j22014l2040L1110L6306K1700K8113r5441M3423k153q5250L2036
2449e1302M8835J585p3801M6621K0222n3206N202p4173L9387P8556J8458m3123
$$ plain form
2437 -36739 -67037 -148369 -192338 -63247 7859 97817 23410 -81197 -59054 -81969 -106682
2426 -106682 -102619 -11059 -81895 -95787 -13645 -67382 -52877 72376 44000 18484 67806 102547
2414 102547 37096 -69757 -74363 -57793 -30159 -237 11316 -52022 -58915 -33445 70881 47697
2402 47697 -12797 47829 59764 50882 40589 29822 38466 61151 62894 132387 115759 90264
2390 90264 156859 120112 83428 6591 42639 135637 51193 -106 24670 75331 41420 -23658
2378 -23658 58497 12121 27170 12709 -5616 -142 -34335 -12042 22282 -12662 -12045 43161
2366 43161 69587 -43252 -17396 35740 -4988 12194 -53031 24270 89093 83901 156870 188319
2354 188319 193626 127897 105668 101055 66773 17469 44952 28742 10801 112607 72436 120037
$$ packed form
2437c6739l0298q1332m3969J29091P1106Q9958p4407j04607K2143k2915k4713
2426a06682M063R1560p0836j3892Q2142n3737J4505J25253k8376k5516M9322L4741
2414A02547o5451j06853m606J6570K7634K9922J1553o3338o893K5470J04326k3184
2402D7697o0494O0626J1935q882j0293j0767Q644K2685J743O9493j6628k5495
2390I0264O6595l6747l6684p6837L6048R2998q4444n1299K4776N0661l3911o5078
2378b3658Q2155m6376J5049j4461j8325N474l4193K2293L4324l4944O17N5206
2366D3161K6426j12839K5856N3136m0728J7182o5225P7301O4823n192P2969L1449
2354A88319N307o5729k2229m613l4282m9304K7483j6210j7941J01806m0171M7601
$$ plain form
2342 120037 173814 197921 175293 105316 123543 138040 109152 219751 202809 210335 205792 189174
2330 189174 177199 104223 7665 34668 39169 232227 135371 -53261 -81817 23371 74563
2319 74563 102283 69231 118821 160732 14470 26047 63355 69312 25419 -20951 -25342 27099
2307 27099 -53380 31553 28549 22094 52431 51456 164474 128737 81246 91269 -457 -11137
2295 -11137 -3168 147550 127482 122104 95513 48130 66700 213778 154641 116020 100982 6162
2283 6162 56025 29985 62620 -37158 -2845 81792 93709 136670 122092 12593 470 137916
2271 137916 176707 105542 103128 115197 93104 19546 107591 139541 173267 123911 120665 139507
2259 139507 161614 200178 23406 54613 72168 129328 173453 171608 229698 267090 200382 201379
$$ packed form
2342A20037N3777K4107k2628o9977J8227J4497k8888J10599j6942P526m543j6618
2330A89174j1975p2976r6558K7003M501J93058r6856j88632k8556J05188N1192
2319G4563K7720l3052M9590M1911j46262J1577L7308N957m3893m6370m391N2441
2307B7099q0479Q4933l004o455L0337r75J13018l5737m7491J0023r1726j0680
2295a1137P969J50718k0068n378k6591m7383J8570J47078n9137l8621j5038r4820
2283F162M9863k6040L2635r9778L4313Q4637J1917M2961j4578j09499j2123J37446
2271A37916L8791p1165k414J2069k2093p3558Q8045L1950L3726m9356l246J8842
2259A39507K2107L8564j76772L1207J7555N7160M4125j845N8090L7392o6708R97
$$ plain form
2247 201379 225337 190816 180989 196366 66891 203200 279733 155827 41810 50937 74468
2236 74468 93841 160278 140605 95067 131259 58236 91778 144275 153340 222861 219576 174604
2224 174604 124529 149771 225631 276062 303102 305753 266109 268831 128327 234735 294188 300547
2212 300547 277597 302648 230163 253862 293386 244915 313675 362833 327122 329901 308742 345411
2200 345411 357025 305403 324705 354090 307929 321901 238955 281255 276206 167801 165893 197836
2188 197836 244028 307383 343848 419980 491936 412256 361041 352913 272791 251686 320316 309907
2176 309907 262909 334291 446346 497003 552420 554955 516386 488764 535345 427190 451104
2165 451104 466661 541827 549533 540052 673370 612945 660870 663467 681422 748990 729109 739205
$$ packed form
2247B01379K3958l4521r827J5377j29475J36309P6533j23906j14017R127K3531
2236G4468J9373O6437j9673m5538L6192p3023L3542N2497R065O9521l285m4972
2224A74604n0075K5242P5860N0431K7040K651l9644K722j40504J06408N9453O359
2212C00547k2950K5051p2485K3699L9524m8471O8760M9158l5711K779k1159L6669
2200C45411J1614n1622J9302K9385m6161J3972q2946M2300n049j08405j908L1943
2188A97836M6192O3355L6465P6132P1956p9680n1215q128q0122k1105O8630j0409
2176C09907m6998P1382J12055N0657N5417K535l8569k7622M6581j08155K3914
2165D51104J5557P5166P706r481J33318o0425M7925K597J7955O7568j9881J0096
$$ plain form
2153 739205 776837 714369 619650 733203 805180 820692 805651 904409 897337 956199 861838 794357
2141 794357 880610 889085 920216 879559 981176 914369 836554 985004 1026826 1024353 939200 1004851
2129 1004851 1086325 1134664 1147048 1185835 1283829 1286257 1321707 1398636 1344650 1366242 1400753 1416272
2117 1416272 1468710 1511361 1485220 1527535 1578472 1698249 1727895 1690328 1838181 1941378 1968502
2106 1968502 2017441 2148795 2350972 2464443 2554798 2614639 2632122 2767738 2899406 3114719
2096 3114719 3106801 3329858 3462272 3702793 3912623 4079485 4291133 4591471 4881306 5159604
2086 5159604 5520735 5798991 6219388 6626630 7209347 7634254 8038447 8649003 9424076 10328183
2076 10328183 11434808 12805135 14654399 17023857 19791195 23530691 28940542 36111105
$$ packed form
2153G39205L7632o2468r4719J13553P1977J5512j5041R8758p072N8862r4361o7481
2141G94357Q6253Q475L1131m0657J01617o6807p7815J48450M1822k473q5153O5651
2129A004851Q1474M8339J2384L8787R7994K428L5450P6929n3986K1592L4511J5519
2117A416272N2438M2651k6141M2315N0937J19777K9646l7567J47853J03197K7124
2106A968502M8939J31354K02177J13471R0355N9841J7483J35616J31668K15313
2096C114719p918K23057J32414K40521K09830J66862K11648L00338K89835K78298
2086E159604L61131K78256M20397M07242N82717M24907M04193O10556P75073R04107
2076A0328183J106625J370327J849264K369458K767338L739496N409851P170563
$$ plain form
2068 36111105 43060777 46158591 43595283 37038273 29249029 22839563 18303157 14964205
2060 14964205 12654562 10908600 9530418 8587113 7892700 7323898 6964239 6536570 6174606
2051 6174606 5771425 5372862 4870376 4348069 4002958 3661242 3452892 3176161 3019579 2873941
2041 2873941 2684478 2611726 2588162 2419469 2246447 2207832 2037490 2010090 1903860 1829930
2031 1829930 1688205 1655593 1668808 1522529 1471855 1500336 1417371 1307030 1173367 1185489 1191404
2020 1191404 1084836 1163003 1099928 1059414 1100820 1032930 926279 849034 936735 874790 853509
2009 853509 819675 798066 850549 851483 867286 828269 782737 745138 724351 749146 714403 587790
1997 587790 657135 629828 672830 510800 619290 568604 508168 495597 480284 489390 445421
$$ packed form
2068C6111105O949672L097814k563308o557010p789244o409466m536406l338952
2060A4964205k309643j745962j378182r43305o94413n68802l59659m27669l61964
2051F174606m03181l98563n02486n22307l45111l41716k08350k76731j56582j45638
2041B873941j89463p2752k3564j68693j73022l8615j70342k7400j06230p3930
2031A829930j41725l2612J3215j46279n0674K8481q2965j10341j33663J2122N915
2020A191404j06568P8167o3075m0514M1406o7890j06651p7245Q7701o1945k1281
2009H53509l3834k1609N2483R34J5803l9017m5532l7599k0787K4795l4743j26613
1997E87790O9345k7307M3002j62030J08490n0686o0436j2571j5313R106m3969
$$ plain form
1986 445421 475299 428125 451530 452061 375549 320586 257781 364634 324746 317373 327082 304177
1974 304177 264710 358132 468663 286391 229619 282860 338569 310999 341391 270100 268882
1963 268882 287929 247110 295202 295312 299231 291197 340263 289966 289562 218589 144061 288115 311330
1950 311330 319987 214333 183373 288530 198078 176227 243304 296658 256343 230691 204107
1939 204107 217186 161535 90928 173277 52218 105409 61007 141339 136801 45907 136906 188262
1927 188262 131322 110147 146306 192279 108739 61975 63346 167810 103133 48917 78340 168414
1915 168414 148354 132642 -51556 -79417 18183 40243 113106 162353 142380 106780 38531
1904 38531 32892 19503 -46135 28467 117576 98706 152050 124630 17479 4293 41054 18846
$$ packed form
1986D45421K9878m7174K3405N31p6512n4963o2805J06853l9888p373R709k2905
1974C04177l9467R3422J10531j82272n6772N3241N5709k7570L0392p1291j218
1963B68882J9047m0819M8092J10L919q034M9066n0297m04p0973p4528J44054K3215
1950C11330Q657j05654l0960J05157r0452k1851O7077N3354m0315k5652k6584
1939B04107J3079n5651p0607Q2349j21059N3191m4402Q0332m538r0894R0999N1356
1927A88262n6940k1175L6159M5973q3540m6764J371J04464o4677n4216K9423R0074
1915A68414k0060j5712j84198k7861R7600K2060P2863M9247j9973l5600o8249
1904C8531n639j3389o5638P4602Q9109j8870N3344k7420j07151j3186L6761k2208
$$ plain form
1892 18846 1026 121398 112539 129438 43471 -44521 -65063 -30693 -50328 -82852 -69348 -2311
1880 -2311 163588 113589 49293 121875 55705 48320 110614 56182 -42708 8397 67531 95878
1868 95878 107226 55185 25110 -10702 83393 175030 125722 20409 -53098 -29817 57159 -84840
1856 -84840 -175780 -101123 -19404 27207 18017 11494 -71915 78745 5423 -110499 -97781 2133
1844 2133 80448 6867 -28542 -33872 -71555 30287 84540 -2607 -31540 -72215 -16844 -27305
1832 -27305 -14226 16900 38009 97125 25917 33163 -71675 73557 61610 -23501 -41929 -19895
1820 -19895 -60758 -26963 83512 -3426 59314 165468 136379 10180 -20152 -25786 91537
1809 91537 98338 96087 7812 -68744 60443 18839 46350 59994 49711 182246 271801 324766
$$ packed form
1892A8846j7820J20372q859J6899q5967q7992k0542L4370j9635l2524J3504O7037
1880b311J65899m9999o4296P2582o6170p385O2294n4432r8890N1105N9134K8347
1868I5878J1348n2041l0075l5812R4095R1637m9308j05313p3507K3281Q6976j41999
1856h4840r0940P4657Q1719M6611r190o523q3409J50660p3322j15922J2718R9914
1844B133P8315p3581l5409n330l7683J01842N4253q7147k8933m0675N5371j0461
1832b7305J3079L1126K1109N9116p1208P246j04838J45232j1947q5111j8428K2034
1820a9895m0863L3795J10475q6938O2740J06154k9089j26199l0332n634J17323
1809I1537O801k251q8275p6556J29187m1604K7511J3644j0283J32535Q9555N2965
$$ plain form
1797 324766 284513 180150 103182 37750 105492 93290 69719 4368 -22014 18966 85520
1786 85520 129849 108232 113102 70034 6507 26894 23383 39512 -100205 -135197 -39900 49148
1774 49148 22508 7987 42625 20011 -125116 -31892 -84236 -93866 -73945 -79179 -100357 -51514
1762 -51514 11926 50613 132693 85000 45969 70655 31872 19055 -2167 -16762 71094 31327
1750 31327 14947 75442 78819 -22062 81545 114178 25727 -5923 42912 -60863 -32729
1739 -32729 42244 36188 -3056 -78381 -31439 111166 -29823 -41865 -121289 -58853 36968 29910
1727 29910 -22152 -50088 -115614 -126516 -59003 2013 7550 96321 109938 69223 -3733 -5070
1715 -5070 30762 34009 -8281 -131069 -165403 -84988 -18974 -65188 -58342 -12291 -56826 41952
$$ packed form
1797C24766m0253j04363p6968o5432O7742j2202k3571o5351k6382M0980O6554
1786H5520M4329k1617M870m3068o3527K0387l511J6129j39717l4992R5297Q9048
1774D9148k6640j4521L4638k2614j45127R3224n2344r630J9921n234k1178M8843
1762e1514O3440L8687Q2080m7693l9031K4686l8783j2817k1222j4595Q7856l9767
1750C1327j6380O0495L377j00881J03607L2633q8451l1650M8835j03775K8134
1739c2729P4973o056l9244p5325M6942J42605j40989j2042p9424O2436R5821p058
1727B9910n2062k7936o5526j0902O7513O1016N537Q8771J3617m0715p2956j337
1715e070L5832L247m2290j22788l4334Q0415O6014m6214O846M6051m4535R8778
$$ plain form
1703 41952 -14621 -67322 -38307 -56207 -104598 -48194 -161781 -52138 -67883 -12871 -23062
1692 -23062 -44666 14140 -14059 51217 84713 41734 -33965 -33625 -100208 -132159 -70107 -102886
1680 -102886 -83041 -126848 -108949 -78175 -44360 -8001 -41599 -55629 -42190 85134 18011
1669 18011 -13694 -74920 -102882 3773 37246 -29446 15104 3201 -21115 -41245 -50593 -35174
1657 -35174 2090 -5532 81439 73138 124549 17295 -4827 60394 -42003 -70831 -104055 -155478
1645 -155478 -66179 -23657 -56511 -102381 -119820 -67464 16289 -30686 35099 53907 92167 45313
1633 45313 46573 -103180 -41114 83664 31772 -185019 -129643 -14285 27654 38384 -833
1622 -833 -11483 30667 26651 33948 74728 14594 32331 24069 978 93503 140864 22348 -56645
$$ packed form
1703D1952n6573n2701K9015j7900m8391N6404j13587J09643j5745N5012j0191
1692b3062k1604N8806k8199O5276L3496m2979p5699L40o6583l1951O2052l2779
1680a02886J9845m3807J7899L0774L3815L6359l3598j4030J3439J27324o7123
1669A8011l1705o1226k7962J06655L3473o6692M4550j1903k4316k0130r348J5419
1657c5174L7264p622Q6971q301N1411j07254k2122O5221j02397k8828l3224n1423
1645a55478Q9299M2522l2854m5870j7439N2356Q3753m6975O5785J8808L8260m6854
1633D5313J260j49753O2066J24778n1892k16791N5376J15358M1939J0730l9217
1622h33j0650M2150m016P297M0780o0134J7737q262k3091R2525M7361j18516p8993
$$ plain form
1609 -56645 -19420 35712 13991 -46926 -145407 -118781 11043 5786 68859 -1501 -67534 -45289
1597 -45289 37185 16950 56990 18080 -20277 37206 21614 48706 56800 9463 -91281 -78136
1585 -78136 -74138 -106579 -32997 118343 89358 94352 74257 -27296 -119642 -84050 -54074 -66455
1573 -66455 -53106 -66918 -52529 -59487 -80246 -6890 -106632 -64750 -78836 -70921 -34699 21233
1561 21233 58857 -3464 -41004 44352 49619 101529 74379 -24672 -26520 -51111 22643 -23649
1549 -23649 -19497 -81799 -24041 -91437 -124998 38780 43007 24313 -22952 -28183 -9709 9715
1537 9715 31347 -26586 -64217 -34227 -47293 -32127 14840 -20665 -23028 3717 -50387 -21760
1525 -21760 4789 -7452 26332 38696 -90097 -19335 55806 17783 -53771 -25456 7961 76863
$$ packed form
1609e6645L7225N5132k1721o0917r8481K6626J29824n257O3073p0360o6033K2245
1597d5289Q2474k0235M0040l8910l8357N7483j5592K7092Q094m7337j00744J3145
1585g8136L998l2441P3582J51340k8985M994k0095j01553r2346L5592K9976j2381
1573f6455J3349j3812J4389o958k0759P3356r9742M1882j4086P915L6222N5932
1561B1233L7624o2321l7540Q5356N267N1910k7150r9051j848k4591P3754m6292
1549b3649M152o2302N7758o7396l3561J63778M227j8694m7265n231J8474J9424
1537I715K1632n7933l7631K9990j3066J5166M6967l5505k363K6745n4104K8627
1525b1760K6549j2241L3784J2364j28793P0762P5141l8023p1554K8315L3417O8902
$$ plain form
1513 76863 147797 218322 188610 -18166 -30771 97855 78829 17089 -56723 32794 -104527
1502 -104527 -61059 28509 -1927 -96336 27412 88627 720 -12238 43699 32741 -5360
1491 -5360 -35958 -88622 -155660 -203837 -131355 38913 2399 -31464 -132609 -153498 -76246 -86541
1479 -86541 -35592 -50855 -112927 -237600 -176786 -85849 -4202 -1652 -20295 -1709 -70015 -102988
1467 -102988 -87481 -16271 67936 47997 -41961 -139425 -5992 36062 104984 51879 97963
1456 97963 71461 -45557 -20867 -47716 89491 107745 46622 81670 23253 44418 -10632
1445 -10632 49551 7842 -65675 -21608 -13862 -67803 -150311 -153431 -39733 -107144 -62864 -53365
1433 -53365 5007 -47560 -4333 -50434 11322 37793 -29210 22525 1198 53251 -21470 -1111
$$ packed form
1513G6863P0934P0525k9712k06776j2605J28626j9026o1740p3812Q9517j37321
1502a04527M3468Q9568l0436r4409J23748O1215q7907j2958N5937j0958l8101
1491e360l0598n2664o7038m8177P2482J70268l6514l3863j01145k0889P7252j0295
1479h6541N0949j5263o2072j24673O0814R0937Q1647K550j8643J8586o8306l2973
1467a02988J5507P1210Q4207j9939q9958r7464J33433M2054O8922n3105M6084
1456I7963k6502j17018K4690k6849J37207J8254o1123L5048n8417K1165n5050
1445a0632O0183m1709p3517M4067P746n3941q2508l120J13698o7411M4280R499
1433e3365N8372n2567M3227m6101O1756K6471o7003N1735k1327N2053p4721K0359
$$ plain form
1421 -1111 53780 88444 28643 -35675 21967 51467 10861 47910 8866 11024 16028 -31803
1409 -31803 -48647 18705 20661 -115475 -116404 -140060 -94652 50510 15908 -57176 -47308 -104932
1397 -104932 -58189 47117 -36480 -52066 2901 -68872 -119384 -137217 -124088 -81508 -118514
1386 -118514 -181009 -71725 -106512 -63926 -36232 63233 148351 6332 -42227 18860 -38912
1375 -38912 -25178 -10939 -12202 -37388 -48231 -28127 6892 -27099 -7718 34481 -18463 -57216
1363 -57216 -60734 -15495 46500 35982 -113937 -100732 -48549 -41790 -52872 24532 38494 24779
1351 24779 334 7578 8610 -6322 -3836 55429 44678 -60616 -59331 -19131 -99188 -77240
1339 -77240 -46050 -95371 -96654 -60802 -54009 -18326 -8236 9534 -42362 -11071 24951 51829
$$ packed form
1421a111N4891L4664n9801o4318N7642K9500m0606L7049l9044K158N004m7831
1409c1803j6844O7352J956j36136r29k3656M5408J45162l4602p3084R868n7624
1397a04932M6743J05306q3597j5586N4967p1773n0512j7833J3129M2580l7006
1386a18514o2495J09284l4787M2586K7694R9465Q5118j42019m8559O1087n7772
1375c8912J3734J4239j263k5186j0843K0104L5019l3991J9381M2199n2944l8753
1363e7216l518M5239O1995j0518j49919J3205N2183O759j1082P7404J3962j3715
1351B4779k4445P244J032j4932K486N9265j0751j05294J285M0200q0057K1948
1339g7240L1190m9321j283L5852O793L5683J0090J7770n1896L1291L6022K6878
$$ plain form
1327 51829 -52113 34255 58093 9405 -15501 -38687 -96190 -58759 1557 42904 17727 59364
1315 59364 102483 56910 -54801 -18906 -19934 -23836 10174 15589 21790 -55074 -10471 16648
1303 16648 39297 43622 41000 -50592 -136977 -139712 -41536 11953 -13636 -68403 -127952 -185153
1291 -185153 -82023 -47440 -42593 9968 55542 57476 38855 158560 59242 4918 -7484 -45955
1279 -45955 74940 32145 -3819 55908 9202 -26176 538 -24982 -3313 37594 69343 58401
1267 58401 -97603 -76805 44628 -78912 -199890 -184712 -142474 -102453 -115610 -68997 -114331
1256 -114331 -121720 -6087 -17912 13119 75488 37781 -68030 -24614 -86743 -91521 -20457 89327
1244 89327 116276 58383 32644 -15478 -27644 -71873 9653 100174 63016 -12725 -91797 -14380
$$ packed form
1327E1829j03942Q6368K3838m8688k4906k3186n7503L7431O0316M1347k5177M1637
1315E9364M3119m5573j11711L5895j028l902L4010N415O201p6864M4603K7119
1303A6648K2649M325k622r1592q6385k735R8176N3489k5589n4767n9549n7201
1291a85153J03130L4583M847N2561M5574J934j8621J19705r9318n4324j2402l8471
1279d5955J20895m2795l5964N9727m6706l5378K6714k5520K1669M0907L1749j0942
1267E8401j56004K0798J21433j23540j20978J5178M2238M0021j3157M6613m5334
1256a14331p389J15633j1825L1031O2369l7707j05811M3416o2129m778P1064J09784
1244H9327K6949n7893k5739m8122j2166m4229Q1526R0521l7158p5741p9072P7417
$$ plain form
1232 -14380 -6310 21006 33672 -70852 -165207 -135249 -86885 -32045 -99015 -43887 74941 74648
1220 74648 2831 31560 -13036 -52143 29837 -41005 37978 26058 87587 -29180 -105858 -11697
1208 -11697 -4736 -135677 -179720 -40765 -86252 -5809 49822 -35604 -69050 -40091 -55179 -18722
1196 -18722 21073 -3546 -1895 31512 44317 132918 132602 66088 173930 132124 216394 290077
1184 290077 166402 70754 17994 55912 51565 -7813 -6539 29634 -22771 61834 60748 35869
1172 35869 121657 82361 -13264 13376 1418 15659 -10394 -73524 -74454 -43172 27716 21356
1160 21356 -64851 -84442 -46437 -25541 -79843 -67416 -61575 964 -19281 -65876 -122980 -79350
1148 -79350 11624 50976 62298 87101 -16624 20829 36647 -82639 -74309 -95727 -81535 -19815
$$ packed form
1232a4380Q070K7316J2666j04524r4355K9958M8364N4840o6970N5128J18828k93
1220G4648p1817K8729m4596l9107Q1980p0842P8983j1920O1529j16767p6678R4161
1208a1697O961j30941m4043J38955m5487Q0443N5631q5426l3446K8959j5088L6457
1196a8722L9795k4619J651L3407J2805Q8601l16o6514J07842m1806Q4270P3683
1184B90077j23675r5648n2760L7918m347n9378J274L6173n2405Q4605j086k4879
1172C5869Q5788l9296r5625K6640j1958J4241k6053o3130r30L1282P0888o360
1160B1356q6207j9591L8005K0896n4302J2427N841O2539k0245m6595n7104M3630
1148g9350R0974L9352J1322K4803j03725L7453J5818j19286Q330k1418J4192O1720
$$ plain form
1136 -19815 122878 21934 -29173 -100494 -49876 -70053 -110267 -17572 90643 -14957 -21676
1125 -21676 -9383 -108941 -115406 -122757 -45234 61647 92921 117820 46167 -3079 -59096 82390
1113 82390 6317 -35120 -82895 -57330 -25036 -27331 -15241 5329 2731 -30495 20171 82557
1101 82557 119275 86252 112821 26861 8315 -22764 -60713 -64250 -9807 -18686 -8584 81158
1089 81158 102669 10361 16245 75467 83808 22892 33097 -8126 28297 26829 -70442 -97550
1077 -97550 -50449 86275 9270 -78371 -15841 30076 100815 42904 -40976 -120725 -92532 -124159
1065 -124159 -101028 -86055 -5224 -9 -54583 6555 -41436 -61370 -104247 26142 10850 -91546
1053 -91546 -61548 -51867 -150367 -117416 -68380 -117527 -66816 -43803 11608 18069 68905 56329
$$ packed form
1136a9815J42693j00944n1107p1321N0618k0177m0214R2695J08215j05600o719
1125b1676J2293r9558o465p351P7523J06881L1274K4899p1653m9246n6017J41486
1113H2390p6073m1437m7775K5565L2294k295J2090K0570k598l3226N0666O2386
1101H2557L6718l3023K6569q5960j8546l1079l7949l537N4443q879J0102Q9742
1089H1158K1511r2308N884N9222Q341o0916J0205m1223L6423j468r7271k7108
1077i7550M7101J36724p7005q7641O2530M5917P0739n7911q3880p9749K8193l1627
1065a24159K3131J4973Q0831N215n4574O1138m7991j9934m2877J30389j5292j02396
1053i1546K9998R681r8500L2951M9036m9147N0711K3013N5411O461N0836j2576
$$ plain form
1041 56329 55736 100458 28819 -9867 49578 52935 37754 -6252 -63015 -78557 -39900 -58941
1029 -58941 15445 133990 95803 -31666 -31836 57941 -42371 -23091 -34168 -15331 41288 -8730
1017 -8730 -24324 15474 -30142 -19911 -13584 -2009 -28739 -16214 56925 55938 73865 47434 -37689
1004 -37689 -13063 -30197 -55056 4964 -72711 -45643 9863 -49945 -60100 -79692 -18504 -1057
992 -1057 14775 4015 -15391 -14423 -59706 -38530 -29780 7660 -6421 -29708 -34271 -56114 -99037
979 -99037 -83127 -56397 42554 70554 143748 116602 125601 52403 33 -44926 -93752 -68640
967 -68640 -74397 -134020 -162935 -54706 -18485 -20353 -25240 -26294 -54910 8860 -129989 -133285 -5148
954 -5148 51266 16175 -37503 525 -39216 -75760 -55747 -12047 -75313 -18774 6420 -36493
$$ packed form
1041E6329n93M4722p1639l8686N9445L357j5181m4006n6763j5542L8657j9041
1029e8941P4386J18545l8187j27469j70Q9777j00312J9280j1077J8837N6619n0018
1017h730j5594L9798m5616J0231O327J1575k6730J2525P3139r87J7927k6431q5123
1004c7689K4626j7134k4859O0020p7675K7068N5506n9808j0155j9592O1188J7447
992a057J5832j0760j9406R68m5283K1176Q750L7440j4081k3287m563k1843m2923
979i9037J5910K6730R8951K8000P3194k7146Q999p3198n2370m4959m8826K5112
967f8640n757n9623k8915J08229L6221j868m887j054k8616O3770j38849l296J28137
954e148N6414l5091n3678L8028l9741l6544K0013M3700o3266N6539K5194m2913
$$ plain form
942 -36493 -46031 -16967 91248 36851 35163 -24821 -100034 35817 61652 111823 53493 11298
930 11298 -9989 -15006 73266 52579 131602 36877 -17852 -86415 -111722 -77264 -52454 -23222
918 -23222 58137 28205 60262 90409 48047 119122 -26819 -48380 -81124 -119222 -93463 -124862
906 -124862 -74746 -40399 8811 65253 -5123 -103605 -104575 -61600 -43000 -97981 -149692 -36411
894 -36411 2086 11583 -47619 -145734 -48436 -46017 137597 54285 -3893 58634 131051 72726
882 72726 103079 -37900 -150426 -9223 11372 21202 8012 56872 -35893 -29023 -17067 33390
870 33390 34612 25822 -23439 -70728 -158219 -80499 57813 28414 -164408 -61761 -64341 -73677
858 -73677 -3698 41197 -3920 -34403 48305 58482 109762 45995 -13789 -97248 -90982 -34451
$$ packed form
942c6493r538K9064J08215n4397j688n9984p5213J35851K5835N0171n8330m2195
930A1298k1287n017Q8272k0687P9023r4725n4729o8563k5307L4458K4810K9232
918b3222Q1359k9932L2057L0147m2362P1075j45941k1561l2744l8098K5759l1399
906a24862N0116L4347M9210N6442p0376r8482r70M2975J8600n4981n1711J13281
894c6411L8497R497n9202r8115R7298K419J83614q3312n8178O2527P2417n8325
882G2726L0353j40979j12526J41203K0595R830j3190M8860r2765O870J1956N0457
870C3390J222q790m9261m7289q7491P7720J38312k9399j92822J02647k580r336
858g3677O9979M4895m5117l0483Q2708J0177N1280o3767n9784q3459O266N6531
$$ plain form
846 -34451 -81497 4329 10121 4650 60714 163138 62491 60813 49874 -49253 -18853 -30659
834 -30659 24921 9279 19872 25161 -12127 -9445 24854 21139 -41900 -30302 114480 111791 80027
821 80027 74873 -47742 35440 48224 17925 -36415 -58242 14947 15861 66063 92699 -59898
809 -59898 -42594 48192 48870 4384 -55210 -19607 106869 105367 15205 -36319 -63816 -45007
797 -45007 -120136 -40660 -68527 -12726 -80408 -51400 -19305 -27779 11963 21228 -36625 -33972 -6062
784 -6062 76303 -13783 36930 -42476 -63449 92148 102983 50319 17275 -19489 -29889 -2809
772 -2809 -32977 -33256 -58512 -21148 41008 83816 80681 79568 -31347 64322 125596 96105 21623
759 21623 -17690 11861 -11397 -32986 11621 62180 -33537 -29672 -68060 -65616 1624 -12881
$$ packed form
846c4451m7046Q5826N792n471N6064J02424j00647j678j0939r9127L0400j1806
834c0659N5580j5642J0593N289l7288K682L4299l715o3039J1598J44782k689l1764
821H0027n154j22615Q3182J2784l0299n4340k1827P3189R14N0202K6636j52597
809e9898J7304R0786O78m4486n9594L5603J26476j502r0162n1524k7497J8809
797d5007p5129P9476k7867N5801o7682K9008L2095q474L9742R265n7853K653K7910
784f062Q2365r0086N0713p9406k0973J55597J0835n2664l3044l6764j0400K7080
772b809l0168k79k5256L7364O2156M2808l135j113j10915R5669O1274k9491p4482
759B1623l9313K9551k3258k1589M4607N0559r5717L865l8388K444O7240j4505
$$ plain form
747 -12881 -22456 -86307 -178172 -143115 -165873 -61031 -15629 -5137 -61022 -168228 -146555 -74054
735 -74054 -31834 -1113 -49739 -127621 -178759 -116348 -24360 -17807 -60255 -72839 14011 55044
723 55044 91502 27186 15630 34585 26417 -40068 87545 90988 65631 112163 130997 95466
711 95466 69460 -445 64115 87408 60775 -38738 -3830 68139 -8703 -24519 -87578 77616
699 77616 99534 -49304 6013 18621 3566 -22434 -13446 -76683 -87660 -69100 -123749 -80232
687 -80232 -5735 -7838 -25455 -119321 -74554 -107720 -132774 -45408 51658 13685 34769 -32869
675 -32869 -13402 29602 -25608 -105567 -53536 112877 10616 121400 73829 -45821 -42959
664 -42959 38032 101626 140892 107025 58366 42511 18097 -6165 68529 103663 54074 86519
$$ packed form
747a2881r575o3851r1865L5057k2758J04842M5402J0492n5885j07206K1673P2501
735g4054M2220L0721m8626p7882n1138O2411R1988O553m2448j2584Q6850M1033
723E5044L6458o4316j1556J8955q168o6485J27613L443k5357M6532J8834l5531
711I5466k6006o9905O4560K3293k6633r9513L4908P1969p6842j5816o3059J65194
699G7616K1918j48838N5317J2608j5055k6000Q988o3237j0977J8560n4649M3517
687h0232P4497k103j7617r3866M4767l3166k5054Q7366R7066l7973K1084o7638
675c2869J9467M3004n5210p9959N2031J66413j02261J10784m7571j19650K862
664d2959Q0991O3594L9266l3867m8659j5855k4414k4262P4694L5134m9589L2445
$$ plain form
652 86519 -30366 -61370 -79890 -47188 26042 -786 77257 117574 67459 20681 4762 56305
640 56305 59752 69757 -18871 14818 128479 44491 30563 33158 -53264 81196 -2415 -137262
628 -137262 -22530 -54630 -82034 -51188 -62376 -8272 -39046 -66317 -23304 -67860 7396 -3714
616 -3714 92314 25509 28170 20581 59656 78146 21365 3006 24876 -31006 -44102 13273 -55845
603 -55845 -97419 -17889 -55707 -49006 -44743 -31758 47947 45966 -78955 -94744 -81309 -67977
591 -67977 5743 5521 59992 5239 -4583 -72697 -52205 -21755 46476 2483 -45002 -14690 -44802
578 -44802 -15571 -40714 -156873 -39011 9293 -2010 140163 73561 -63577 68269 83800
567 83800 125354 31170 -82764 55901 -40680 -47255 -22023 -122938 -173778 -39401 45022
$$ packed form
652H6519j16885l1004j8520L2702P3230k6828P8043M0317n0115m6778j5919N1543
640E6305L447J0005q8628L3689J13661q3988j3928K595q6422J34460q3611j34847
628a37262J14732l2100k7404L0846j1188N4104l0774k7271M3013m4556P5256j1110
616c714R6028o6805K661p589L9075J8490n6781j8359K1870n5882j3096N7375o9118
603e5845m1574P9530l7818O701M263J2985P9705j981j24921j5789J3435J3332
591f7977P3720k22N4471n4753r822o8114K0492L0450O8231m3993m7485L0312l0112
578d4802K9231k5143j16159J17862M8304j1303J42173o6602j37138J31846J5531
567H3800M1554r4184j13934J38665r6581o575K5232j00915n0840J34377Q4423
$$ plain form
556 45022 69973 65442 34006 -4958 73768 321 34340 -38433 83107 219158 111543 108238
544 108238 90674 -19671 11884 -12448 34737 133487 101574 55960 93480 122018 44833 -16817
532 -16817 4564 -37082 -107732 -12472 55547 -5145 -22512 24112 51936 121196 14345 -86657
520 -86657 -128864 -89446 -92214 -67174 -31678 -52033 -7650 91168 22140 -29004 71441 8387
508 8387 -81590 -134494 -104317 19663 -54703 -87611 -85313 3489 -14541 59207 -21793 -88476
496 -88476 20023 53847 -59537 -69122 -14938 3773 23936 13899 -30092 53626 73991 65976
484 65976 33034 -45821 -47060 12350 -19963 -22900 -84452 -164286 -138122 -96855 -121332 -42990
472 -42990 81719 125308 2187 -65636 28245 59113 89951 113093 21697 36066 54124 -21996
$$ packed form
556D5022K4951m531l1436l8964P8726p3447L4019p2773J21540J36051j07615l305
544A08238j7564j10345L1555k4332M7185R8750l1913m5614L7520K8538p7185o1650
532a6817K1381m1646p0650R5260O8019o0692j7367M6624K7824O9260j06851j01002
520h6657m2207L9418k768K5040L5496k0355M4383R8818o9028n1144J00445o3054
508H387q9977n2904L0177J23980p4366l2908K298Q8802j8030P3748q1000o6683
496h8476J08499L3824j13384r585N4184J8711K0163j0037m3991Q3718K0365q015
484F5976l2942p8855j239N9410l2313k937o1552p9834K6164M1267k4477P8342
472d2990J24709M3589j23121o7823R3881L0868L0838K3142r1396J4369J8058p6120
$$ plain form
460 -21996 72831 -4007 -20095 -43750 15660 -20196 26798 87900 38297 87668 73317 -17265
448 -17265 -49721 -32598 -8791 56416 114196 35257 22323 31587 25974 -10087 -30744 77971
436 77971 42002 -76582 -4522 -123408 -85344 44908 -96271 -167731 -142340 -36268 -12298
425 -12298 21456 -66724 -57132 -15901 -24701 49656 68298 77222 96186 44329 118380 24187 40828
412 40828 82719 14023 19036 -74609 -30460 -2952 -47231 -140994 -98152 -153373 -127403 -121539
400 -121539 -51088 -16480 -74733 -18765 -23307 6630 -21014 54645 -4395 -116565 -103174 -102733
388 -102733 -60108 -75823 -26421 9893 -5082 -16121 -66163 -32305 -45315 25108 79264 45444
376 45444 13822 -73508 -78581 -89530 -9298 -37875 -82752 -185795 -167671 -120405 -43800 -3626
$$ packed form
460b1996R4827p6838j6088k3655N9410l5856M6994O1102m9603M9371j4351r0582
448a7265l2456J7123K3807O5207N7780p8939j2934R264n613l6061k0657J08715
436G7971l5969j18584P2060j18886L8064J30252j41179p1460K5391J06072K3970
425a2298L3754q8180R592M1231q800P4357J8642Q924J8964n1857P4051r4193J6641
412D0828M1891o8696N013r3645M4149K7508m4279r3763M2842n5221K5970N864
400a21539P0451L4608n8253N5968m542K9937k7644P5659n9040j12170J3391M41
388a02733M2625j5715M9402L6314j4975j1039n0042L3858j3010P0423N4156l3820
376D5444l1622q7330n073j0949Q0232k8577m4877j03043J8124M7266P6605M0174
$$ plain form
364 -3626 -32502 -51906 -10891 9514 -44980 -131199 -157209 -127947 -49082 1664 -43143 -31385
352 -31385 -80398 -14225 -12022 6945 5359 59485 123091 2921 22933 -29988 -58129 -47409
340 -47409 -16029 -50338 -119940 -77316 -122061 -91159 -121213 -72833 35012 -98578 -24819 -30774
328 -30774 -37298 52651 13784 -46052 -117408 -70101 21363 7840 -24339 43937 -14122 -98679
316 -98679 -111672 -157215 -107205 63787 -58875 -110993 -129922 -143911 -178843 -127839 -90233 -31019
304 -31019 64248 60769 -53833 -123269 -72840 -45825 -1530 -43844 -42822 35879 43483 -18480
292 -18480 -5945 -63673 -108176 -195289 -288431 -185093 2650 12318 -5197 8044 3853 -28246
280 -28246 -73007 -98625 -61391 4788 -124003 -80123 -38461 -49613 -81153 -67034 -32854 -106800
$$ packed form
364c626k8876j9404M1015K0405n4494q6219k6010K9262P8865N0746m4807J1758
352c1385m9013O6173K203J8967j586N4126O3606j20170K0012n2921k8141J0720
340d7409L1380l4309o9602M2624m4745L0902l0054M8380J07845j33590P3759n955
328c0774o524Q9949l8867n9836p1356M7307R1464j3523l2179O8276n8059q4557
316i8679j2993m5543N0010J70992j22662n2118j8929j3989l4932N1004L7606N9214
304c1019R5267l479j14602o9436N0429K7015M4295m2314J022P8701P604o1963
292a8480J2535n7728m4503q7113r3142J03338J87743R668j7515J3241m191l2099
280b8246m4761k5618L7234O6179j28791M3880M1662j1152l1540J4119L4180p3946
$$ plain form
268 -106800 -143628 -98112 -122675 -145995 -91570 -104954 -194992 -49575 14681 14562 25891 57038
256 57038 130574 12928 42793 -634 -45881 -80969 -46167 -13665 -29163 -131938 -61323 -51121
244 -51121 -74642 -25424 -81483 -43546 -167968 -117163 -44284 -61065 -77753 1882 94169 -11089
232 -11089 -29002 70471 -2445 -82617 -53067 -56555 38275 9105 -103417 -115006 -99912 -105330
220 -105330 -82565 -125995 -100013 -2651 6289 26786 -26509 46911 40639 -84967 -115919 -139776
208 -139776 -198129 -41516 -35898 -35549 -40247 -61889 79084 127211 9655 -40905 23991 100380
196 100380 26565 -111794 -88249 -139930 -89991 -109615 -52807 -79557 -161555 -48192 -69411
185 -69411 -70853 -55799 12256 17793 -66555 -82059 -89140 -8805 15504 78455 -42143 -100661
$$ packed form
268a06800l6828M5516k4563k3320N4425j3384r0038J45417O4256j19J1329L1147
256E7038P3536j17646K9865m3427m5247l5088L4802L2502j5498j02775P0615J0202
244e1121k3521M9218n6059L7937j24422N0805P2879j6781j6688P9635R2287j05258
232a1089j7913R9473p2916q0172K9550l488R4830k9170j12522j1589J5094n418
220a05330K2765m3430K5982R7362Q940K0497n3295P3420o272j25606l0952k3857
208a39776n8353J56613N618L49m698k1642J40973M8127j17556n0560O4896P6389
196A00380p3815j38359K3545n1681M9939j9624N6808k6750q1998J13363k1219
185f9411j442J5054O8055N537q4348j5504p081Q0335K4309O2951j20598n8518
$$ plain form
173 -100661 -168097 -108406 -58698 -42833 -34427 -74206 -113666 -20975 -1103 -54424 -17070 -43240
161 -43240 -24662 -65574 -75745 17035 66299 -54828 -35306 8200 -74471 -48114 16340 -3220
149 -3220 -69946 -58700 26515 5675 -72996 -92309 -108601 -116915 -86916 -47100 -273 -3786 -16450
136 -16450 38985 -22130 -47350 -81627 -74311 6678 1000 28337 31642 2783 -41268 -29048 -72766
123 -72766 -75909 -75578 -108119 -92378 -92783 6238 76797 -62491 -35677 -142940 -153558 -86432 -103640
110 -103640 -79168 -107493 -127197 -90689 -32782 -104951 -90717 -56354 -22348 11857 -35574 -19649
$$ packed form
173a00661o7436N9691M9708J5865Q406l9779l9460R2691J9872n3321L7354k6170
161d3240J8578m0912j0171R2780M9264j21127J9522M3506q2671K6357O4454j9560
149c220o6726J1246Q5215k0840p8671j9313j6292q314K9999L9816M6827l513j2664
136a6450N5435o1115k5220l4277P316Q0989n678K7337L305k8859m4051J2220m3718
123g2766l143L31l2541J5741m05R9021P0559j39288K6814j07263j0618O7126j7208
110a03640K4472k8325j9704L6508N7907p2169J4234L4363L4006L4205m7431J5925
$$ [...]
##END NTUPLES=NMR SPECTRUM
##END=
