##TITLE=1H_CA-9041-2
 CDCl3
 8 sc, 
 28.07.2022
##JCAMPDX= 6.0         $$ Bruker NMR JCAMP-DX V2.0
##DATA TYPE= NMR SPECTRUM
##DATA CLASS= NTUPLES
##ORIGIN= UXNMR, Bruker Analytische Messtechnik GmbH
##OWNER= root
$$ XWIN-NMR		Version 3.5
$$ Thu Jul 28 13:55:45 2022 Russian Standard Time (UT+4h)  she@DPX200
##.OBSERVE FREQUENCY= 200.1313499994
##.OBSERVE NUCLEUS= ^1H
##.ACQUISITION MODE= SIMULTANEOUS
##.ACQUISITION SCHEME= undefined
##.AVERAGES= 8
##.DIGITISER RES= 18
##SPECTROMETER/DATA SYSTEM= spect
##.PULSE SEQUENCE= zg30
##.SOLVENT NAME= CDCl3
##.SHIFT REFERENCE= (INTERNAL, CDCl3, 0, 15.7491)
##AUDIT TRAIL= $$ (NUMBER, WHEN, WHO, WHERE, WHAT)
$$ ##TITLE= Audit trail, XWIN-NMR		Version 3.5
$$ ##JCAMPDX= 5.01
$$ ##ORIGIN= Bruker BioSpin GmbH
$$ ##OWNER= she
$$ F:/spectra/data/she/nmr/H-F/1/pdata/1/auditp.txt
$$ ##AUDIT TRAIL=  $$ (NUMBER, WHEN, WHO, WHERE, WHAT)
(   1,<2022-07-28 13:54:27.67 +0400>,<she>,<DPX200>,
      <created by zg, POWCHK disabled, PULCHK disabled
       configuration hash MD5:
       00 E9 B6 7A A2 85 ED C7 34 08 36 98 17 FE 4E 26
       data hash MD5: 16K
       F6 23 BF FF E6 2D E5 2E 77 6C 7E 5A DE 8E E6 F1>)
(   2,<2022-07-28 13:54:30.04 +0400>,<she>,<DPX200>,
      <Start of raw data processing
       efp BC_mod = 2 LB = 0.24 FT_mod = 6 PKNL = 1 PHC0 = -18038.24 PHC1 = 8.200683 SI = 16K 
       data hash MD5: 16K
       F8 B1 65 94 C9 09 C8 90 23 F5 B4 56 66 50 07 C2>)
(   3,<2022-07-28 13:54:45.39 +0400>,<she>,<DPX200>,
      <pk PHC0 = 2.623742 PHC1 = 0 
       data hash MD5: 16K
       DC 3C EC 74 A7 C0 5D 41 5E 3B 27 D5 1E D3 70 8A>)
(   4,<2022-07-28 13:54:48.56 +0400>,<she>,<DPX200>,
      <abs ABSG = 5 
       data hash MD5: 16K
       04 5F 23 78 A5 A1 C8 71 40 BA C6 CB 19 A0 10 3C>)
$$ ##END=
$$ 
$$ hash MD5
$$ 96 ED CE 0F F0 9E 1B C9 0F 24 22 D9 06 21 71 96
##$RELAX= 
##$RELAX= 
##$RELAX= 
##$RELAX= 
##$RELAX= 
##$RELAX= 
$$ Bruker specific parameters
$$ --------------------------
##$DU= <F:/spectra>
##$EXPNO= 1
##$NAME= <H-F>
##$PROCNO= 1
##$TYPE= <nmr>
##$USER= <she>
##$AMP= (0..31)
100 100 100 100 100 100 100 100 100 100 100 100 100 100 100 100 100 100 
100 100 100 100 100 100 100 100 100 100 100 100 100 100 
##$AQSEQ= 0
##$AQ_mod= 1
##$AUNM= <au_zg>
##$AUTOPOS= <>
##$BF1= 200.13
##$BF2= 200.13
##$BF3= 200.13
##$BF4= 200.13
##$BF5= 200.13
##$BF6= 200.13
##$BF7= 200.13
##$BF8= 200.13
##$BYTORDA= 1
##$CFDGTYP= 0
##$CFRGTYP= 5
##$CHEMSTR= <none>
##$CNST= (0..31)
1 1 145 1 1 1 1 1 1 1 1 1 1 1 1 1 1 1 1 1 1 1 1 1 1 1 1 1 1 1 1 1 
##$CPDPRG= <>
##$CPDPRG1= <>
##$CPDPRG2= <>
##$CPDPRG3= <>
##$CPDPRG4= <mlev>
##$CPDPRG5= <mlev>
##$CPDPRG6= <mlev>
##$CPDPRG7= <mlev>
##$CPDPRG8= <mlev>
##$CPDPRGB= <>
##$CPDPRGT= <>
##$D= (0..31)
0 1.2 0 0 0 0 0 0 0 0.06 0 0.03 0 0 0 0 0.0002 0 0 0 0 0 0 0 0 0 0 0 0 
0 0 0 
##$DATE= 1659002067
##$DBL= (0..7)
120 120 120 120 120 120 120 120 
##$DBP= (0..7)
150 150 150 150 150 150 150 150 
##$DBP07= 0
##$DBPNAM0= <>
##$DBPNAM1= <>
##$DBPNAM2= <>
##$DBPNAM3= <>
##$DBPNAM4= <>
$$ [...]
##$SUBNAM2= <"">
##$SUBNAM3= <"">
##$SUBNAM4= <"">
##$SUBNAM5= <"">
##$SUBNAM6= <"">
##$SUBNAM7= <"">
##$SUBNAM8= <"">
##$SUBNAM9= <"">
##$SW= 18.0517283424941
##$SWIBOX= (0..15)
0 0 2 0 0 0 0 0 0 0 0 0 0 0 0 0 
##$SW_h= 3612.71676300578
##$TD= 16384
##$TD0= 1
##$TE= 0
##$TE2= 300
##$TE3= 300
##$TEG= 300
##$TL= (0..7)
0 120 120 120 120 120 120 120 
##$TP= (0..7)
150 150 150 150 150 150 150 150 
##$TP07= 0
##$TPNAME0= <>
##$TPNAME1= <>
##$TPNAME2= <>
##$TPNAME3= <>
##$TPNAME4= <>
##$TPNAME5= <>
##$TPNAME6= <>
##$TPNAME7= <>
##$TPOAL= (0..7)
0.5 0.5 0.5 0.5 0.5 0.5 0.5 0.5 
##$TPOFFS= (0..7)
0 0 0 0 0 0 0 0 
##$TUNHIN= 0
##$TUNHOUT= 0
##$TUNXOUT= 0
##$USERA1= <user>
##$USERA2= <user>
##$USERA3= <user>
##$USERA4= <user>
##$USERA5= <user>
##$V9= 5
##$VALIST= <valist>
##$VCLIST= <CCCCCCCCCCCCCCC>
##$VD= 0
##$VDLIST= <DDDDDDDDDDDDDDD>
##$VPLIST= <PPPPPPPPPPPPPPP>
##$VTLIST= <TTTTTTTTTTTTTTT>
##$WBST= 1024
##$WBSW= 4
##$XGAIN= (0..3)
0 0 0 0 
##$XL= 0
##$YL= 0
##$YMAX_a= 205639
##$YMIN_a= -323909
##$ZGOPTNS= <>
##$ZL1= 120
##$ZL2= 120
##$ZL3= 120
##$ZL4= 120
##$ABSF1= 15.7513
##$ABSF2= -2.30055
##$ABSG= 5
##$ABSL= 3
##$ALPHA= 0
##$AQORDER= 0
##$ASSFAC= 0
##$ASSFACI= 0
##$ASSFACX= 0
##$ASSWID= 0
##$AUNMP= <proc_1d>
##$AZFE= 0.1
##$AZFW= 0.1
##$BCFW= 0
##$BC_mod= 2
##$BYTORDP= 0
##$COROFFS= 0
##$CY= -3
##$DATMOD= 1
##$DC= 0
##$DFILT= <>
##$DTYPP= 0
##$F1P= 0
##$F2P= 0
##$FCOR= 1
##$FTSIZE= 16384
##$FT_mod= 6
##$GAMMA= 0
##$GB= 0
##$INTBC= 1
##$INTSCL= 0
##$ISEN= 128
##$LB= 0.24
##$LEV0= 0
##$LPBIN= 0
##$MAXI= 10000
##$MC2= 0
##$MEAN= 0
##$ME_mod= 0
##$MI= 1.114404
##$NCOEF= 0
##$NC_proc= -7
##$NLEV= 6
##$NOISF1= 3.799351
##$NOISF2= 2.8
##$NSP= 0
##$NTH_PI= 0
##$NZP= 0
##$OFFSET= 15.74909
##$PC= 1
##$PHC0= -18035.62
##$PHC1= 8.200683
##$PH_mod= 1
##$PKNL= yes
##$PPARMOD= 0
##$PSCAL= 0
##$PSIGN= 0
##$REVERSE= no
##$SF= 200.130004492562
##$SI= 16384
##$SIGF1= 3
##$SIGF2= 2
##$SINO= 5.538805
##$SIOLD= 16384
##$SREGLST= <1H.CDCl3>
##$SSB= 0
##$STSI= 16384
##$STSR= 0
##$SW_p= 3612.71676300578
##$SYMM= 0
##$S_DEV= 0
##$TDeff= 16384
##$TDoff= 0
##$TI= <>
##$TILT= no
##$TM1= 0
##$TM2= 0
##$TOPLEV= 0
##$USERP1= <user>
##$USERP2= <user>
##$USERP3= <user>
##$USERP4= <user>
##$USERP5= <user>
##$WDW= 1
##$XDIM= 16384
##$YMAX_p= 381473668
##$YMIN_p= -517298
$$ End of Bruker specific parameters
$$ ---------------------------------
##NTUPLES= NMR SPECTRUM
##VAR_NAME=  FREQUENCY,     SPECTRUM/REAL,   SPECTRUM/IMAG
##SYMBOL=    X,             R,               I
##VAR_TYPE=  INDEPENDENT,   DEPENDENT,       DEPENDENT
##VAR_FORM=  AFFN,          ASDF,            ASDF
##VAR_DIM=   16384,         16384,           16384
##UNITS=     HZ,            ARBITRARY UNITS, ARBITRARY UNITS
##FACTOR=    0.220516191357247, 1,           1
##FIRST=     3151.8654914195, 0,             0
##LAST=      -460.851271586275, 0,           0
##MIN=       -460.851271586275, -517298,     0
##MAX=       3151.8654914195, 381473668,     0
$$ Real data points
##PAGE= N=1
##DATA TABLE= (X++(R..R)), XYDATA
$$ [...]
7834 1584980 1582507 1610280 1762901 1782663 1780612 1800436 1796704 1792795 1819859 1803011 1969564 1803685
7822 1803685 1777979 1655223 1737067 1850654 1781077 1714510 1701393 1686418 1728388 1809400 2057599
7811 2057599 1851364 2252791 2374282 2133836 2178857 1919195 2156004 2049163 2028115 1936134
7801 1936134 2140197 2139384 1924477 2105384 2011444 2079856 2293582 2442412 2460624 2150512 2017558
7790 2017558 1986436 2015829 2052150 2097806 2159984 2158583 2093526 2205670 2202722 2329986 2312609
7779 2312609 2101104 2156622 2394189 2396346 2398921 2430689 2536141 2550764 2473871 2490495 2496963
7768 2496963 2427105 2500121 2360982 2481009 2529456 2428787 2675095 2672046 2643552 2574202 2465601
7757 2465601 2364009 2638677 2558055 2558033 2738396 2865068 2928243 2909800 2811566 2889320 2767003
7746 2767003 2816491 2741253 2713995 2830828 2942871 3041089 2862392 2849248 2703036 2724681 2862449
7735 2862449 2943220 3095676 3043099 2979009 3124567 3223857 3194312 3118677 3040724 3191241 3477787
7724 3477787 3375164 3233974 3025692 3252318 3555586 3616951 3359940 3258834 3387664 3550335
7714 3550335 3506577 3374822 3532537 3516823 3584378 3386837 3238963 3378615 3394972 3296026
7704 3296026 3451032 3432032 3676785 3899827 3940195 3945257 3976341 4018620 3868571 3709419 3779990
7693 3779990 3678430 3835182 4113035 4119425 4043916 3939675 3969288 3967070 4162835 4305425 4420980
7682 4420980 4567934 4275205 4279886 4581745 4647879 4520480 4326743 4557672 4615693 4446039
7672 4446039 4428302 4675232 4532500 4656840 4786695 4877251 4894572 5021968 4814873 4781432
7662 4781432 4876184 4695311 4746236 4803832 4863880 5108556 5095004 5136463 5151172 5175813 5092854
7651 5092854 5222995 5383534 5469353 5227443 5039679 5346505 5511856 5545945 5788509 5842552
7641 5842552 5808420 5850924 5783115 5739262 5802518 5842075 5852651 6046965 6106734 6087777 6177173
7630 6177173 6325791 6317392 6390780 6606854 6781473 6887947 6984611 6816128 6691584 6655759
7620 6655759 7061866 7107074 7056514 6979341 7172375 7196711 7200433 7209461 7394526 7425284 7511665
7609 7511665 7628277 7656059 7771384 7858639 7894998 7901267 7970132 8113673 8358203 8386862 8215305
7598 8215305 8285169 8439392 8509391 8580159 8480573 8713510 8784496 8842619 8901650 8981809 9014075
7587 9014075 9220594 9173570 9221122 9418113 9579892 9860796 9892047 9815478 9685682 9873746
7577 9873746 9985240 10193660 10355586 10219498 10282565 10392548 10364384 10466989 10799871 10979276
7567 10979276 11079545 10998966 11187491 11373154 11614146 11596700 11591121 11774015 11774234 11759362 11963025
7556 11963025 12221580 12172906 12441179 12549556 12644140 12702628 12991579 13050238 13046737 13195795
7546 13195795 13352694 13266187 13614520 13702686 13608318 13844622 14081886 13979984 14229800 14489837
7536 14489837 14778030 14887694 14846843 14962710 15078137 15189727 15434877 15671133 15929725 16124966
7526 16124966 15942774 16096045 16268588 16361107 16221234 16353780 16625620 16956766 17262048 17358186
7516 17358186 17507468 17594080 17935405 18073905 18056287 18443678 18534844 18867973 18962807 19018416
7506 19018416 19040872 19102350 19312681 19720038 19810308 20018037 20135879 20303569 20283021 20415964
7496 20415964 20624359 20815881 21005603 21157230 21338629 21625845 21708553 21647325 21780333 22003667
7486 22003667 22177583 22223869 22332154 22404354 22526411 22825099 23191897 23210761 23290347 23332218
7476 23332218 23427773 23561608 23620231 23783348 23817264 23974543 24270106 24245007 24436518 24595396
7466 24595396 24600867 24609619 24728433 24933420 24967953 25111010 25174251 25311004 25287309 25398481 25454644
7455 25454644 25292528 25349945 25257616 25328946 25505922 25577565 25760679 25713723 25736015 25752668 25608504
7444 25608504 25679579 25729334 25763337 25857882 25781370 25533685 25650825 25807514 25786346 25466585
7434 25466585 25640037 25573528 25415598 25376768 25564721 25548866 25409482 25222081 25197316 24956835
7424 24956835 25035400 25218380 24987182 24921470 24802679 24632951 24365772 24325111 24178335 24180789
7414 24180789 24078636 23945666 23732241 23528245 23365408 23250151 23139991 23080747 23061975 22785479
7404 22785479 22643401 22546960 22342867 22020714 21974313 22206558 22018379 21769111 21639113 21571006
7394 21571006 21260564 21156654 20812578 20694540 20635647 20564166 20430875 20332467 20142763 19915307
7384 19915307 19633981 19339101 19316859 19224030 19082603 18966243 18851916 18770139 18609795 18348722
7374 18348722 18228273 18186727 17988433 17796149 17665699 17366913 17186517 17194167 17035634 16748918
7364 16748918 16767272 16571992 16463782 16315748 16170890 15986507 15713287 15539204 15502240 15352557
7354 15352557 15130580 14827967 14541690 14505703 14602987 14583375 14395441 14156262 14046257 13968309
7344 13968309 13798119 13703968 13639993 13382519 13264288 13224880 13078541 13012765 12852051 12586477
7334 12586477 12580903 12527286 12404456 12208725 12078306 11861556 11695587 11628763 11494667 11424943
7324 11424943 11471401 11172681 11092195 10888746 10606620 10839198 10742407 10673028 10679017 10522888
7314 10522888 10447272 10272761 10230529 10289246 9930149 9673675 9697311 9739900 9568421 9575079 9640080
7303 9640080 9507987 9424753 9469105 9405528 9281574 9163844 8814144 8998530 9038485 9116662
7293 9116662 8945654 8645766 8554272 8568489 8656100 8444460 8327687 8110145 8044498 8026147
7283 8026147 7933058 7778308 7886497 7885018 7888890 7933278 8010587 7905424 7551697 7452477 7348073
7272 7348073 7235088 7145406 7019153 6842062 6855584 7027120 6882940 6829450 6795570 7021790
7262 7021790 6805714 6751591 6750464 6456150 6362240 6449548 6350919 6429187 6394389 6112378 6191596
7251 6191596 6322051 6307153 6036641 5982017 6055569 6047641 5957010 5913782 5755875 5549293 5755136
7240 5755136 5808826 5685421 5634386 5736982 5574481 5371253 5335902 5219980 5274133 5344575
7230 5344575 5126982 4768971 4855363 5039617 5017384 4945199 5065593 5068253 4943650 4687479
7220 4687479 4840480 4811794 4787715 4907476 4794765 4560269 4517616 4482948 4502236 4704390
7210 4704390 4515915 4443852 4481818 4524271 4377351 4393700 4421873 4514268 4263866 4296661 4167067
7199 4167067 4127327 4262239 4179915 4260341 4284214 4149935 4081585 4153792 4296651 4245600 3984424
7188 3984424 3945738 3973139 3806451 3861686 3842281 3926084 4110772 3831876 3794385 3703846 3656257
7177 3656257 3616890 3602281 3667188 3754002 3680176 3559121 3577595 3504174 3369143 3331944 3339539
7166 3339539 3499499 3389391 3348938 3464408 3532175 3370534 3403037 3360542 3319774 3310521 3232438
7155 3232438 3193404 3124123 3293482 3139320 3046653 3101136 3052201 3006246 2961418 2964549 2944318
7144 2944318 2811039 2866386 3027438 2967067 3098782 3026667 3110159 3006979 2968751 2874058 2987937
7133 2987937 2993269 3075783 2926567 2976949 2896505 3015184 3171712 3003481 3081079 3037240 3052680
7122 3052680 3207201 3049448 3078937 3053314 3077804 3197069 3229478 3414381 3315085 3341871 3241410
7111 3241410 3424947 3835387 4020806 3845749 3872730 3756317 3645139 3852933 3603798 3220304
7101 3220304 3077666 2866969 2852873 2733494 2682631 2622048 2673655 2750161 2672902 2449957 2451992
7090 2451992 2541742 2706621 2639366 2639446 2634896 2501585 2394357 2377737 2212961 2280533 2309622
7079 2309622 2486399 2356891 2199227 2250980 2177918 2156776 2140370 2079778 2104120 2066841 2208331
7068 2208331 2476349 2288926 2057512 1938061 2161560 2245493 2031483 2168737 1920710 1752596
7058 1752596 1828498 2062290 2179752 2291035 2109832 2039954 1974956 2047269 2051646 1987723 1969945
7047 1969945 1949929 2027652 2075812 2158422 1871301 2139933 2067544 2177856 1880782 1822284 1940861
7036 1940861 1933044 1911024 1761890 2011326 2025208 1860981 1918718 1982738 1849298 1907391 1878200
7025 1878200 1750642 1572710 1584533 1824908 1751598 1627739 1560302 1863746 1966184 1812512
7015 1812512 1726569 1735945 1640000 1708083 1673841 1692903 1662955 1654503 1690760 1686048 1741938 1718714
7003 1718714 1722246 1468943 1536373 1609132 1499075 1453830 1327532 1569181 1632926 1552697 1541442
6992 1541442 1541296 1704645 1513043 1491406 1397489 1517280 1685480 1546370 1563805 1555536 1565350
6981 1565350 1532277 1355455 1415582 1420759 1374084 1358219 1337527 1491433 1652393 1616009 1631686
6970 1631686 1663559 1531118 1507961 1383736 1566590 1641035 1573263 1575609 1632403 1663175 1571629
6959 1571629 1539445 1577707 1454243 1531841 1461939 1466147 1345841 1392992 1601756 1564117 1775445
6948 1775445 1526842 1413205 1285425 1334825 1500536 1513366 1510331 1401434 1467733 1418316 1490780
6937 1490780 1575532 1696920 1842458 1769290 1658209 1360617 1266759 1431308 1448632 1570375
6927 1570375 1680592 1634455 1711159 1724753 1611834 1784407 1821422 1818218 1776550 1834408 1836295
6916 1836295 1761718 1812861 1828205 1983101 1944497 2061338 2137537 2045773 2015352 2190459 2306790
6905 2306790 2361881 2344860 2336917 2692831 2814109 2851593 2864375 2866550 3042745 3111243 3200001
6894 3200001 3469925 3470750 3477050 3697996 3765494 3986361 3981311 4020750 4149319 3985393 3975240
6883 3975240 3935896 3915291 3942192 3760021 3760977 3501850 3350362 3184945 3208866 2888272 2638952
6872 2638952 2726071 2549273 2005169 1928906 2137720 2028715 1989073 1929600 1797086 1822590
6862 1822590 1866163 1916110 1780730 1757737 1662999 1498469 1477388 1516864 1577975 1401790 1321774
6851 1321774 1469240 1554162 1332778 1517186 1370576 1401629 1525822 1654417 1482889 1233938
6841 1233938 1355057 1288340 1080939 1153143 1241824 1254538 1108276 1171530 1388942 1238763
6831 1238763 1320313 1328659 1100934 1218483 1085802 894418 1015172 1169717 1099361 982937
6821 982937 1075604 1004587 1021092 954409 1032420 1206489 1107926 976828 1140061 1018211 1001349
6810 1001349 1202252 1421336 1345186 1186930 1095371 1207623 1255381 1042798 1132811 1067137
6800 1067137 1184914 1003762 987315 1237245 1455945 1226577 1059513 1102859 984264 965596
6790 965596 1098379 1196825 1198339 1154206 1091664 1054069 1134676 1021835 1075029 1186969 1221673
6779 1221673 1286264 1142872 1219765 1044845 949865 1059089 1093305 1135580 1083211 1032682 848518
6768 848518 931242 1119382 1204450 1082001 851682 1033450 902973 893906 980629 1031218 1083162
6757 1083162 1130795 1181367 1266549 1168008 1118666 1126549 815372 917354 1019313 1058155 907076
6746 907076 1028048 1012321 1038298 1138832 867500 905686 1160615 1083163 914228 1043430
6736 1043430 1098097 1055723 1306499 1313497 1312912 1579872 1448788 1368020 1591936 1430771 1290575
6725 1290575 1382876 1144873 1270837 1500415 1734079 1785399 1695155 1547264 1326089 1438117
6715 1438117 1577383 1371518 1333347 1423846 1601541 1561074 1340696 1390805 1610569 1616242 1634920
6704 1634920 1540227 1563480 1658452 1740045 1901199 1834152 1905026 2159761 2340255 2414622 2326729
6693 2326729 2398862 2246568 2326672 2298249 2274903 2095886 1922775 1976042 2039149 1975009 1792380
6682 1792380 1787853 1907579 2011356 1924863 2095907 2272267 2256068 2326021 2523435 2639947
6672 2639947 2551282 2622184 2791056 2820712 2863247 3074730 2885444 2899354 2970367 2726116 2808006
6661 2808006 2668022 2689228 2638115 2715176 2536161 2465514 2511278 2374277 2303616 2333885 2360288
6650 2360288 2415762 2583147 2741653 2624779 2788595 2832707 2887454 2928942 2941505 3022193 3008135
6639 3008135 2892444 2907275 2870598 2830237 2799242 2888954 2786912 2682395 2629117 2667355 2844411
6628 2844411 2807087 2905893 2910845 2789456 2668128 2732306 2709279 2854407 2578637 2465544 2364229
6617 2364229 2263045 2315702 2481932 2781851 2682604 2482073 2537929 2588732 2720577 2968903
6607 2968903 3003027 2988816 2953459 3268900 3263653 3022461 2867961 2879638 2868561 2627776 2476876
6596 2476876 2435702 2188301 2382541 2335215 2170388 2168725 2237216 2367599 2481042 2458190 2389522
6585 2389522 2275371 1996494 2186663 2374501 2307863 2371505 2593561 2625190 2498707 2451752
6575 2451752 2450288 2417480 2308843 2258166 2138240 2049192 2114871 2171459 2050506 1893675 1980338
6564 1980338 1956568 1814297 1720689 1731547 1556984 1557081 1840447 1993007 1951689 1910806 1661617
6553 1661617 1617873 1683110 1701748 1421978 1516205 1554573 1524120 1380393 1369721 1391178 1454509
6542 1454509 1231020 1229253 1418530 1368092 1669953 1659757 1624819 1458304 1290981 1386938 1442010
6531 1442010 1497115 1410920 1573962 1692449 1612871 1338190 1491839 1706685 1550801 1599290
6521 1599290 1601253 1525276 1613462 1784362 1633157 1460346 1577911 1495498 1410564 1590905 1536126
6510 1536126 1540692 1587811 1492940 1502040 1560981 1386203 1515854 1546074 1632529 1882518 1675848
6499 1675848 1503453 1803261 1768346 1777041 1654076 1646578 1570522 1741829 1619981 1617868 1817283
6488 1817283 1669567 1686688 1566892 1669977 1759544 1751252 1738305 1454520 1653559 1991643
6478 1991643 1895895 1724584 1726611 1960616 1949346 2052084 2042336 2116311 1839377 1968414 2067794
6467 2067794 1935881 1986318 2055586 1833652 1848735 1956031 1911146 2142649 2106844 2160032 2067154
6456 2067154 2088725 2287913 2567270 2555524 2480359 2297889 2354253 2367598 2382297 2474607 2666864
6445 2666864 2685497 2534389 2501373 2700385 3056890 3069978 3199459 3122841 3243378 3209223
6435 3209223 3157110 3241364 3371854 3336314 3535159 3501535 3642096 4083616 3952115 4077988
6425 4077988 4162156 4439104 4418424 4564621 4721682 4771935 5040500 5381981 5530869 5691486
6415 5691486 5749167 6020752 6156439 6192205 6565108 6661053 6723770 6913579 7153468 7249387
6405 7249387 7483376 7595903 7711163 7701222 7881253 8087943 8230048 8604283 8985734 9116047
6395 9116047 9274168 9616094 10071970 10312040 10660792 11174994 11664432 12127510 12419605 12826658
6385 12826658 13249965 13708060 14010482 14369580 14436421 14822723 14958910 14919298 15116633 14944666
6375 14944666 15011827 15018382 15157631 15028660 15095581 15292856 15286439 15312023 15279468 15663952 16014626
6364 16014626 16322519 16566551 16743456 17171097 17644287 18071797 18565827 19179030 19405974
6355 19405974 19667851 20136108 20412950 20465449 20477043 20374679 20150823 19969449 19767958 19482961
6345 19482961 18855183 18320745 18172382 17892304 17531585 17321030 17287241 17190226 17093921 16878254
6335 16878254 16797683 17068620 17079319 17212466 17391577 17581868 17892881 18145178 18287712 18478287
6325 18478287 18823305 19089234 19300625 19342718 19457217 18938690 18302757 17959120 17283316 16632294
6315 16632294 15850309 15368001 14683770 14052704 13649061 13076278 12552471 11983085 11614369
6306 11614369 11340461 11241083 10811877 10380839 10272874 9995849 9676327 9293259 9146913 9059604
6296 9059604 8823350 8646080 8517892 8502192 8523541 8032394 7626809 7403992 7159308 6856347
6286 6856347 6533122 6313506 6280685 5895189 5597228 5593729 5360446 5166797 5046683 4960346
6276 4960346 5085533 4998756 4730889 4601273 4459172 4517455 4261810 4060221 3931897 3808800
6266 3808800 3808192 3801745 3476898 3587077 3652848 3478422 3328147 3266892 3300969 3227911 3175298
6255 3175298 3031959 2964190 3129946 3148957 3170494 3222351 3127760 3097725 2964511 2925574 3015290
6244 3015290 2874017 2975361 3002969 2876372 2947803 2878459 2921973 3024966 3026756 3097043 3024026
6233 3024026 2870835 2870007 2953713 2839543 2621202 2764874 2771413 2884480 2972650 2996573 2880274
6222 2880274 2882520 3032418 3041424 3030154 2914709 2758096 2945522 2949697 2960336 2868028 2852293
6211 2852293 2951362 2788040 2757620 2624929 2562566 2526225 2563715 2672479 2579980 2652042 2896388
6200 2896388 2863563 2645528 2639984 2637075 2588043 2331188 2262122 2186759 2006707 1829431 1959551
6189 1959551 2004768 1766847 1844080 1875814 1922141 2017198 1950022 1855453 1925268 1986255 1752813
6178 1752813 1677951 1809325 1629938 1550556 1489598 1755972 1773958 1839544 1939510 1936112 1647856
6167 1647856 1676779 1609105 1531507 1564524 1544152 1403043 1331981 1420137 1500374 1533198 1566342
6156 1566342 1730233 1617139 1503623 1534977 1593649 1388413 1322495 1412138 1472780 1359859
6146 1359859 1494066 1624113 1544066 1384064 1530638 1465142 1565263 1611096 1637162 1563611
6136 1563611 1514036 1513925 1398190 1396880 1560086 1625651 1600058 1527707 1433954 1465841 1539835 1533182
6124 1533182 1586299 1524911 1621243 1903270 1865236 1890434 1977766 1912549 1740531 1758135 1562939
6113 1562939 1711798 1895192 1830612 1678982 1596764 1663287 1620402 1773916 1816476 1764897 1823012
6102 1823012 1693615 1732640 1881459 1796530 1789177 1809815 1869644 1854070 1911771 2047892 1806826
6091 1806826 2027862 2006032 1895206 1828301 2138246 2240600 2028823 2007683 2017808 2038192
6081 2038192 2291994 2221720 2018158 2220475 2100571 1979986 1959003 2075402 1851118 1766784
6071 1766784 2007926 2033998 2079023 2135631 2130372 2099843 2079039 2125896 2122426 2428241 2397275
6060 2397275 2434964 2606679 2465645 2548134 2608326 2698657 2545044 2729397 2886485 2725336
6050 2725336 2850843 2972961 3109856 3200251 3247624 3266838 3121023 3320263 3255641 2966985
6040 2966985 2919155 2963027 3187009 3147091 3218539 3039742 3174824 3030113 2838676 2858985
6030 2858985 2892405 3021082 3311212 3512456 3403261 3314481 3305808 3229126 3300740 3413523 3270564
6019 3270564 3074501 3083826 3301855 3190592 3129295 3046261 2936552 3080079 3258771 3290467
6009 3290467 3120828 3188554 3082924 3005713 3134697 3199110 3277748 3205177 3292082 3191206 3074476
5998 3074476 2997634 2843366 2739227 2723702 2616201 2512207 2486878 2600873 2557312 2415108
5988 2415108 2426410 2412469 2408302 2575125 2537215 2437793 2275325 2323444 2397612 2416658 2423061
5977 2423061 2633765 2539661 2405008 2257659 2176712 2360854 2352956 2263730 2251942 2250329 2344914
5966 2344914 2430454 2394704 2316546 2271608 2311303 2305664 2280322 2276433 2308825 2281520 2373001 2254944
5954 2254944 2105455 2069415 2047295 2122310 2020535 1760653 1889117 1979174 1829009 1878010
5944 1878010 1925521 2045071 2156084 2162969 2218682 1998032 1923391 1929677 1981008 1960895 2076358
5933 2076358 2051304 2093969 1955840 1949527 1941713 2108093 1967059 1829129 2110671 2069056 2075700
5922 2075700 2293389 2149947 2062664 2164923 2169699 2434914 2479275 2244863 2307101 2364405 2572723
5911 2572723 2486859 2525578 2420404 2507549 2618246 2583229 2744049 2545420 2783818 2696516
5901 2696516 2692646 2747765 2822922 2954926 2912169 2856436 3107659 3106533 3235352 3472308 3598741
5890 3598741 3677098 3759095 3741348 3754043 3963427 3832008 3734866 3871175 3845313 3900926 4052262
5879 4052262 4196177 4255965 4121516 4257556 4379571 4552952 4590475 4565864 4698873 4909005
5869 4909005 5070339 5042790 4954891 5077871 5408481 5510453 5561049 5759291 5764146 5578265
5859 5578265 5671716 5676462 5974754 5965669 6042851 6156010 6020002 6208475 6547781 6554298 6624655
5848 6624655 6563260 6534240 6492929 6413847 6374935 6350902 6387399 6599561 6615072 6696870 6575477
5837 6575477 6546407 6671195 6584819 6881591 6802045 6881406 7155955 7415707 7386398 7484698 7375532
5826 7375532 7483605 7538057 7347835 7394569 7290897 7028511 6887331 6875804 6789898 6733662
5816 6733662 6613072 6551590 6495647 6570191 6589323 6701151 6624113 6626189 6534113 6583421 6571146
5805 6571146 6667875 6697462 6474526 6372919 6289292 6444053 6368877 6264794 6095137 6206490
5795 6206490 6132788 5985852 5925299 5945751 6016308 5883788 5802607 5901982 5914748 6059742 5982285
5784 5982285 6056670 6023617 5810615 5771148 5871475 5860659 5909766 5789006 5804647 5928681 5860692
5773 5860692 6081668 5875669 5684394 5864065 5846539 6051906 6073750 6181968 6506162 6491507
5763 6491507 6587076 6671811 6609240 6543979 6421157 6739968 6855539 6762662 7009370 7207740
5753 7207740 7304750 7481206 7730898 7809294 7980229 8044490 8340132 8521782 8591015 8597134 8713034
5742 8713034 8851005 8907377 9109575 9452705 9632632 10021131 10398823 10702767 10997669 11188439
5732 11188439 11382152 11688440 12054352 12429267 12913773 13207358 13605847 14086186 14671319
5723 14671319 15074721 15779023 16409198 16794578 17410582 18071683 18754599 19551932 20275709
5714 20275709 21075337 21825097 22571204 23473144 24390214 25337075 26113905 26960469 27462348
5705 27462348 27714312 27946843 28158095 28125553 28181391 28183257 28030344 28012264 27884276 27678715
5695 27678715 27408347 27187881 27187936 27236436 27036605 27140122 27140190 27244938 27539475 28113255 28966586
5684 28966586 29671791 30194845 31010741 31933509 32671240 33526300 34461797 35524181 36517044
5675 36517044 37254816 37787946 38435861 38812365 39155389 39641537 39938784 40218651 40711160
5666 40711160 40993402 41095955 41292277 41517902 41593889 41658210 41678863 41518581 41070630 40508193
5656 40508193 40041083 39296879 38497524 37684981 36604617 35606446 34533214 33612499 32782773
5647 32782773 32068568 31504057 31036438 30852172 30605979 30369235 30250036 30440068 30587950
5638 30587950 30803629 30946963 31107776 31358314 31440763 31542126 31438772 31531699 31271758 30983778
5628 30983778 30754030 30414923 29698785 29021385 27968197 26775736 25658838 24323873 23177202
5619 23177202 22035609 21099399 19934849 19022782 18147548 17116210 16256856 15711148 15066322
5610 15066322 14546885 14009473 13635528 13280716 12768351 12507314 11843491 11623019 11427048
5601 11427048 11198665 11019150 10682067 10425210 10232744 10216406 10088219 9866958 9807460 9560529
5591 9560529 9437106 9505322 9363045 9351055 9180325 9114742 9134489 9059988 9173481 9115819 8742350
5580 8742350 8578924 8646222 8902188 8767625 8720783 8736841 8752868 8750852 8830421 8978442 8653903
5569 8653903 8688818 8758319 8662579 8734822 8555492 8509202 8495717 8523856 8461341 8429965 8485932
5558 8485932 8575415 8534677 8673483 8756009 8690544 8822128 8871886 8993791 9003659 8996880 9092560
5547 9092560 9042062 8961026 8997372 8982492 8901497 8802802 8919347 8945767 9060121 9264294 9088241
5536 9088241 9151358 9371936 9297602 9392893 9694517 9737769 9712929 9819989 9816738 10049715 10179870
5525 10179870 10105779 10238725 10540397 10944855 11240604 11405508 11895897 12375525 12387262 12557153
5515 12557153 12696392 12455767 12330090 12377236 12337347 12534996 12682532 12726779 13042923 13320919
5505 13320919 13590673 13931493 14328007 14788749 15083591 15538935 15995851 16696218 17426403
5496 17426403 18080413 18606811 19156988 19518225 19970153 20606299 20921482 21797035 22937576
5487 22937576 24079070 24913923 25614825 26547331 27493766 28456644 29372336 30492944 31674105
5478 31674105 32778898 34303463 35455917 36443661 37173988 37863903 38267070 38792836 39157254
5469 39157254 39189563 39301911 39384857 39504970 39406089 39528565 39514891 39194678 38804602 38760458
5459 38760458 38886726 38889120 39042013 39528906 40006189 40590247 41506494 42210037 42868728 43527853
5449 43527853 44177471 44843671 45490359 45817807 45916587 46116162 46141884 45974382 45628268 45782659
5439 45782659 45588538 45392174 45227773 44841619 44796150 44771224 44643529 44664810 44755299 44744549
5429 44744549 44625938 44565386 44548556 44603145 44455831 43998640 43777679 43425724 42974757 42757978
5419 42757978 42361030 42061863 41961988 41905728 42119178 42431613 43185309 44043568 45118983 46216724
5409 46216724 47474941 48853541 50403318 51898266 53687507 55780506 57679853 59511444
5401 59511444 61310399 63034815 64270591 65081185 65314087 65008871 63955901 62463355 60473057
5392 60473057 58026894 55237343 52409350 49723392 47072002 44635513 42369329 40490687
5384 40490687 38441066 36705698 35447577 34362023 33228538 32270790 31717438 31260838 31220815
5375 31220815 31077572 30907241 31033190 31251878 31248009 31024541 30870151 30635460 30427576 30138513
5365 30138513 29669897 29178760 29003622 28869168 28584508 28110993 27476400 26806525 26138481
5356 26138481 25687694 25206430 25155618 24906184 24455640 24470149 24407214 24077916 23709797 23528676
5346 23528676 23230073 22831532 22583477 22446063 22296023 22288029 22526552 22849171 22831153 22624231
5336 22624231 22256276 21940776 21626101 20648102 20135840 19730180 19214728 18775146 18402470
5327 18402470 17978150 17603145 16796815 15946784 15301625 14798833 14576506 14451855 14180317
5318 14180317 14158708 14123966 13862973 13868899 13762899 13637063 13623320 13670843 13512684 13655184
5308 13655184 13598873 13358624 13443789 13345293 13100065 12782394 12417448 12365485 12350780 12274888
5298 12274888 11958066 11711192 11295496 10960419 10792993 10669466 10532374 10308248 10207718
5289 10207718 10104595 9846841 9726726 9600473 9304441 8887473 8746769 8724914 8453727 8303982
5279 8303982 7953552 7598181 7441271 7337391 7066960 6843541 6594057 6486893 6357435 6280972
5269 6280972 6122160 6132304 5876938 5980131 5981230 6022601 5969710 5702519 5521639 5405717
5259 5405717 5548724 5376265 5263184 5280237 5195329 5060321 5071488 4984200 4940451 4826624
5249 4826624 4827327 4622290 4680521 4718623 4518174 4413302 4542175 4472983 4455540 4161542 4449041
5238 4449041 4653147 4491769 4486536 4384406 4172299 4051817 4227314 4292256 4180331 3934256
5228 3934256 3983362 4085209 3974701 3977853 3833925 3773279 3769882 3764956 3477912 3560845 3772065
5217 3772065 3653460 3805986 3828429 4021707 3954453 4014196 3904090 3777690 3809026 3823274
5207 3823274 3728114 3866426 4136847 4271533 4175591 3927719 3617892 3655841 3970749 3905591
5197 3905591 3905811 4010640 4008658 4106438 3918630 3865645 3994061 4135827 4185663 3853173 3862479
5186 3862479 3928696 4042393 4122110 4127625 4017906 4019939 3929489 4125666 4054241 3940059 4095460
5175 4095460 4142509 4071634 4012919 4088774 4126386 4204770 4476075 4490890 4497608 4337378 4373518
5164 4373518 4565006 4584835 4505734 4468843 4448175 4465514 4438402 4558871 4707596 4715191 4766072
5153 4766072 4724601 4772073 4788913 4991791 4905704 5238623 4870346 4811628 4832828 4988026 4859152
5142 4859152 4936999 4897440 4757326 4770498 4796226 4838245 4873514 4814668 4710055 4581043 4575432
5131 4575432 4553899 4778097 4672184 4481392 4475944 4607383 4636182 4633343 4518964 4214873 4307422
5120 4307422 4333053 4360769 4498175 4612440 4280074 4522738 4431271 4524037 4562068 4479005 4501011
5109 4501011 4801947 4765856 4829883 4808128 4939937 4969288 5030091 5062605 5085156 5216952 5253176
5098 5253176 5562046 5745280 6178344 6416594 6378993 6526644 6448948 6408601 6533821 6309962
5088 6309962 6336142 6217570 6065164 6083926 5787026 5534413 5267124 5564952 5530353 5385117
5078 5385117 5339555 5237025 5461250 5525347 5783534 5951420 6028123 6287513 6560416 6669165
5068 6669165 6586173 6512792 6592292 6567939 6594682 6529916 6483491 6409178 6331937 6210428 6055234
5057 6055234 5875384 5820060 5872896 5904854 5881146 5823633 5655620 5426222 5372287 5030512 4886369
5046 4886369 4807146 4660357 4416121 4583909 4552642 4642399 4621198 4575190 4765978 4844891 4885415
5035 4885415 4947413 4817951 4958870 5054223 5124772 5238285 5202299 5175325 5141401 4976876 4637278
5024 4637278 4478453 4314888 4357753 4181185 4118415 4115679 4024933 3908371 3963409 3772186 3902061
5013 3902061 4000204 4026290 3886026 3647089 3463465 3532010 3511967 3496126 3541577 3412965 3340471
5002 3340471 3389738 3355012 3462559 3510213 3603428 3591382 3487774 3342843 3264587 3236231 3268878
4991 3268878 3303009 3214716 3219590 3196168 3500977 3595780 3473937 3296127 3103348 3215377 3266147
4980 3266147 3009303 2841512 3055196 3164089 3125992 2963947 2933023 2965278 2892365 2980292
4970 2980292 3093604 2976676 2843815 2834976 2759998 2946402 2945357 2978211 3051494 2834535 2849300
4959 2849300 2889687 2769551 2848907 2914511 2839442 2844065 2830224 3048524 3069684 3110749 3263575
4948 3263575 3227964 3287742 3304681 3367413 3349980 3353234 3237623 3128294 3123408 3280882 3389556
4937 3389556 3520491 3425670 3349587 3252640 3373559 3409231 3375474 3497584 3636078 3595619 3643798
4926 3643798 3656728 3896100 3896465 3873017 3723880 3648657 3924287 3903114 3862350 3741537 3703248
4915 3703248 3968275 4016033 4010019 3981407 3910375 4174905 4271188 4550354 4618021 4451758 4427185
4904 4427185 4637887 4638201 4717815 4718321 4911325 4907712 4920636 4949200 4944936 5081869 5462455 5734815
4892 5734815 5807431 5673732 5707755 6017249 6149352 6552705 6673128 7012592 7426005 7727931
4882 7727931 8129428 8317943 8693033 8886380 8913195 8975287 9122629 9024244 8865717 8831860
4872 8831860 8968160 8927682 8621527 8532149 8242545 8325515 8545386 8424845 8536652 8691024
4862 8691024 8582309 8456234 8327918 8191702 8211227 8036329 7770124 7589564 7428658 7345909
4852 7345909 7333388 7390238 7305837 7393984 7179293 7313001 7443627 7383331 7451654 7658618 7761375
4841 7761375 7761989 7797053 8120389 8262768 8432790 8492315 8545801 8840588 8948485 9048545 9460590
4830 9460590 9967832 10156806 10413036 10664669 11074102 11520183 11731242 12037790 12647729 12815550
4820 12815550 12875721 13062265 13031114 12844881 12674573 12687690 12611139 12427011 12487443 12379117
4810 12379117 12467132 12575411 12559190 12376671 12474093 12461012 12284418 12031086 11592078 11458013
4800 11458013 11007066 10717074 10591603 10358901 10380059 10275832 10131341 10052784 9861819 9874788
4790 9874788 10106815 10461231 10531553 10610852 10887305 11199058 11466801 11593886 11863895 12246231
4780 12246231 12855207 13269051 13802589 14624322 15427414 15529775 15325299 14825627 14171857
4771 14171857 13834620 13532216 13353341 13362579 13625052 13643553 13592814 13596402 13716445 13877125
4761 13877125 14020498 14311259 14611390 14935517 15252797 15523099 16006356 16142254 16328273
4752 16328273 16507450 16686257 16923868 17461082 17721852 18034005 18527836 18806605 19201235
4743 19201235 19832253 20473176 21110151 21805154 22457410 23145829 24015666 24957407 25931653
4734 25931653 26872718 27700085 28586077 29520111 30589322 31519190 32546785 33460526 34467365
4725 34467365 35459874 36378405 37164334 38086791 39217298 40155982 41088873 42058204 43195870
4716 43195870 44470368 45538940 46787154 48048761 49200716 50041803 50931897 51809635 52513137
4707 52513137 53124216 53444843 53770131 54130346 53876284 53518274 52989158 52599170 51748808
4698 51748808 50704923 49715686 49049827 48207531 47184256 46466811 45623968 44752700 43799601
4689 43799601 43034993 42239712 41166925 39821426 38432396 36779580 35167024 33707663
4681 33707663 32366567 31070449 30009946 29234944 28346146 27783913 27371708 26952055 26837326
4672 26837326 26732864 26786755 26611177 26564155 26600096 26402506 26188388 25871083 25630295 25214771
4662 25214771 24750105 24386314 23945672 23634035 23250464 22807227 22292384 22157269 21783677
4653 21783677 21401578 20891469 20335620 19891422 19471933 19193870 18855356 18704582 18801886 18586257
4643 18586257 18237858 18056263 18001285 17690683 17359667 17228401 16827300 16291407 16038256 15978663
4633 15978663 15701679 15329697 15143961 14885130 14804418 14477515 14248700 14213970 14077395 13881842
4623 13881842 13528124 13434603 13242469 13017248 12803845 12654525 12211368 12101762 12027983 11894809
4613 11894809 11847365 11786752 11538159 11471064 11678816 11365924 11392397 11273619 11289234 11343355
4603 11343355 11446061 11313365 11334088 11265492 11076613 10867032 10667726 10575949 10236531 9839083
4593 9839083 9709703 9447388 9347625 9318013 9105105 8708934 8571918 8574568 8457471 8494431
4583 8494431 8244031 8346136 8198210 8058802 8188518 8288374 8200390 8279715 8281531 7991899
4573 7991899 7982733 8068009 7889467 7931237 7981942 7915405 7908120 7616668 7590604 7542790 7418192
4562 7418192 7501684 7293765 7409768 7497272 7305894 7201393 7152985 7151797 7041316 7066814 7078305
4551 7078305 6894447 6857899 6752187 6827426 6886254 6900857 6726869 6789637 6679657 6678195 6595310
4540 6595310 6547379 6680732 6906526 6767378 6690583 6582280 6380479 6432093 6491468 6519471
4530 6519471 6642466 6551718 6565777 6522780 6532835 6644014 6639195 6571415 6517096 6409332 6602255
4519 6602255 6587775 6714851 6725130 6493789 6342913 6501053 6549401 6581655 6721288 6816707
4509 6816707 6903361 6937122 7219073 7267861 7193187 7203724 7292326 7356737 7339745 7383271 7586468
4498 7586468 7681832 7801979 7959091 7885271 8039778 8293522 8397822 8493226 8494891 8887536
4488 8887536 8855598 8983511 8944670 8960580 9056557 9325557 9226639 9251752 9210513 9226195 9119638
4477 9119638 9480522 9245251 9351260 9422823 9353741 9328580 9313244 9528342 9560097 9608767 9828392
4466 9828392 9875548 9885627 10294877 10474893 10499127 10710682 10685007 10517807 10848520 10940354
4456 10940354 10999083 11019987 10928858 11066093 11294905 11579975 11918573 11971407 12001372 12261922
4446 12261922 12657811 12816967 13061200 13424211 13962436 14326467 14957589 15582012 16099158
4437 16099158 16771932 17550599 18261557 19018133 19789628 20693811 21665023 22889671 24159086
4428 24159086 25387170 26841789 28552640 30444635 32420372 34749219 37417487 40260357
4420 40260357 43584881 47178319 51405667 56261789 61435768 66860940 71977384 75655653
4412 75655653 76355239 74075079 68938410 62614131 56129351 50407978 45533653 41605267
4404 41605267 38496822 35833982 33550550 31835165 30361359 29055420 27963956 26949562
4396 26949562 26095666 25213295 24433720 23587026 22788890 21777417 21025265 20332187 19547663
4387 19547663 18820183 18255585 17957524 17560685 17056115 16831071 16801369 16687600 16496019 16302919
4377 16302919 16266177 16034260 16028700 15970065 15769385 15466068 14940055 14587323 14352592 13909208
4367 13909208 13370707 13045562 12527256 12111205 11926972 11694076 11354469 11395358 11341905 11139361
4357 11139361 10919996 10705837 10238898 9948829 9689270 9383309 9098441 8771080 8663328
4348 8663328 8507735 8055502 7933842 7844964 7577324 7547516 7541244 7576920 7581867 7716309 7509765
4337 7509765 7112100 7106668 7175011 7194560 6990507 6904547 6763284 6797524 6725684 6552777 6601971
4326 6601971 6577761 6451847 6470379 6383668 6357194 6374286 6349190 6243566 6287896 6304204 6203703
4315 6203703 6201855 5975298 5990923 6033565 5923103 5930808 5920033 5957761 5932683 5814524 5925911
4304 5925911 5983437 6115027 5965147 5646677 5951323 5997637 5853375 5822316 6050396 5924319
4294 5924319 5954984 5927344 5841555 5772721 5823191 5837775 5739585 5869343 5929284 6032392 6029119
4283 6029119 5937462 6079185 6171949 5940090 6111649 6291869 6313881 6217619 6186345 6290129
4273 6290129 6413296 6212806 6184486 6139870 6239460 6400162 6331753 6404403 6651718 6452734
4263 6452734 6378051 6382836 6540995 6832876 6981312 6836574 7047166 7165771 7335620 7456502
4253 7456502 7334878 7453679 7484342 7699559 7857518 7922452 8014499 8132430 8058744 7953533
4243 7953533 7853314 7489768 7448014 7135649 6858794 6712859 6865967 7120955 6896230 6765153
4233 6765153 6708064 6542936 6481618 6428891 6387621 6340972 6370627 6461357 6556252 6655728 6800983
4222 6800983 6475466 6512372 6642050 6546827 6415752 6532449 6836128 6917833 7015487 7040699
4212 7040699 7079768 7126191 7143697 7249418 7332488 7218665 7165959 7206382 7323857 7651484 7632517
4201 7632517 7706491 8006322 8010968 8108946 8230259 8336834 8485754 8663342 8887941 8940192
4191 8940192 8987975 9114108 9292318 9529458 9791989 10101028 10313412 10644702 10856712 10974563
4181 10974563 11254202 11409840 11761842 12217205 12413522 12588143 12916408 13287513 13836001
4172 13836001 14320853 14829458 15377217 15945478 16550286 16874775 17539584 18202936 19047877
4163 19047877 19789619 20598187 21088607 21789554 22273888 23003979 23846515 24750385 25480395
4154 25480395 26435251 27645910 28860621 29852155 31063834 31882680 32920354 33752051 34334248
4145 34334248 34628479 34435920 34257498 33984332 34232227 34308624 34659488 34903819 35003608 34849014
4135 34849014 34381444 34089218 33595938 33162256 32819734 32232699 31835019 31466625 30932826
4126 30932826 30586460 30340205 29908836 29809786 29485961 28920306 28377336 27864739 27044111 26457506
4116 26457506 25962504 25248306 24804312 24334935 23862895 23453180 23198445 22750851 22523094
4107 22523094 22087038 21663290 21335163 20933575 20513685 20163864 19897329 19656613 19576213 19347158
4097 19347158 19090369 18999628 19005458 19156331 19142266 19091399 18723572 18636030 18903930 18915047 18757838
4086 18757838 18773341 18868606 18883401 18797504 18800603 19060503 19075102 18803305 18789694 19011208 18802800
4075 18802800 18856057 18834338 18956587 19095100 19293812 19663694 19857224 19997682 20091024 20185739
4065 20185739 20341943 20054615 20053092 19912105 19568328 19081267 18653014 18066107 17577760 17122367
4055 17122367 17023958 16944025 16597216 16346280 16277930 16165586 16150911 15960486 15823835 15643343
4045 15643343 15472517 15294216 15062679 14855679 14560353 14523832 14567312 14477753 14346722 14359266
4035 14359266 14140191 14190585 14245734 14088881 13761406 13633482 13736692 14030432 13873332 13608054
4025 13608054 13699926 13811993 13728597 13714226 13566548 13369354 13321288 13190516 13092788 13102281 13153193
4014 13153193 13378559 13580688 13557970 13880810 14037322 14547651 14945638 15422057 16008244 16755456
4004 16755456 17726246 18945723 20330737 21992959 23922814 25495016 25312281 23729315
3996 23729315 21229064 18564156 16829081 15289827 14372790 13569882 12672032 12301302 11978967
3987 11978967 11662379 11605044 11618238 11521368 11345762 11321416 11418952 11635368 11805779 11951770
3977 11951770 12253027 12397610 12601462 12875310 13085442 13582354 14059895 14851150 15569166
3968 15569166 16575837 17722301 19042000 20641406 22507725 24784872 26993484 27910064
3960 27910064 27318661 25436569 22828754 20619500 18858926 17498623 16288830 15456164
3952 15456164 14527543 13638751 13144631 12527715 12070671 11656357 11187304 10870497 10651753
3943 10651753 10437780 10216242 10145167 10105102 10246194 10256196 10198159 10275758 10181788 10410479
3933 10410479 10577762 10718891 11093666 11440422 11737305 12067789 12431268 13253752 13985114
3924 13985114 14741217 15862104 17292404 18924929 21223114 23357349 26386487 30514895
3916 30514895 34066982 34461098 31627829 26511693 21508703 17954249 15537237 13627636
3908 13627636 12230870 11038327 10350965 9754622 8874498 8237814 7965490 7490538 7102223
3899 7102223 7012556 6779254 6557871 6448234 6322055 6193859 6121898 5822690 5723666 5455264
3889 5455264 5411727 5342562 5376769 5175852 4965749 4960532 5114535 4974720 4913481 4796382 4850769
3878 4850769 4948709 4891495 4864552 4687624 4728931 4710706 4491398 4587332 4588164 4552487 4602166
3867 4602166 4481453 4296878 4273314 4087461 3914302 3695111 3754192 3662117 3562014 3375201
3857 3375201 3477163 3624137 3497485 3441768 3291241 3448656 3466557 3392389 3496607 3633949
3847 3633949 3730866 3757447 3547496 3343940 3667612 3635269 3637880 3692447 3706593 3692156 3902682
3836 3902682 3744997 3799925 3732495 3638550 3550654 3371426 3396289 3570993 3780547 3752615 3548785
3825 3548785 3610577 3615674 3528111 3561774 3463882 3449180 3484388 3400897 3629489 3619838 3316497
3814 3316497 3541883 3648422 3593879 3539311 3419266 3398812 3330862 3277221 3175424 3095120 3229418
3803 3229418 3335233 3274776 3193719 3231139 3213631 3208608 3376007 3322871 3056330 3106137 3166409
3792 3166409 3049005 3109072 3427945 3490670 3405025 3451780 3479596 3230483 3453218 3394154 3378712
3781 3378712 3343281 3496011 3597042 3510855 3561550 3716181 3677270 3354097 3627881 3624509 3450929
3770 3450929 3352226 3478147 3579323 3591043 3682019 3879789 3944600 3876133 3726336 3776214 3908300
3759 3908300 3974934 3938475 4077166 4054188 3839545 3811232 3823869 3917782 4035939 4060589 4048979
3748 4048979 3969390 4043147 4202922 4243259 4371387 4393263 4581308 4208800 4277675 4283221 4571783
3737 4571783 4590922 4567144 4462889 4534642 4457190 4436552 4502086 4766711 4772184 4713496 4734424
3726 4734424 4925374 4956462 4841594 4877646 5010308 4977464 5055544 5066460 5007995 5102872 5048024
3715 5048024 5118275 5188208 5344572 5564710 5700012 5592744 5638310 5774864 5960372 6082045
3705 6082045 6125089 6175435 6117582 6193469 6297640 6388788 6560808 6665012 6676821 7011300 7102990
3694 7102990 7079734 7320109 7414377 7548087 7731572 7825129 7999623 8139401 8104968 8387141
3684 8387141 8511084 8673229 8619291 8840706 8985452 9015271 9114855 9159234 9048523 9241692
3674 9241692 9504114 9584461 9521796 9564578 9659429 9720188 9605734 9820196 9952590 10107005
3664 10107005 9953531 10000227 10128266 10314020 10333726 10512863 10780359 10813166 10952645 10948637
3654 10948637 11273237 11666990 11768492 11898235 12008163 12325979 12752190 13079886 13238846
3645 13238846 13573061 14212564 14827927 15129208 15468252 15788013 16305415 16960501 17393102
3636 17393102 17822639 18358446 18745015 19291828 19923433 20554113 20968747 21417288 21884964
3627 21884964 22309471 22790321 23261310 23809856 23942434 24019494 24233847 24569539 24546057 24532712
3617 24532712 24667493 24503763 24437794 24446934 24249749 24050214 23826710 23577559 23253617 23038063
3607 23038063 22894891 22661249 22501408 22133758 21696008 21353518 21077683 20781100 20737884 20468233
3597 20468233 20074940 19991982 19719583 19602009 19547079 19669388 19628304 19553543 19470384 19606241
3587 19606241 19654546 19966098 20181817 20232304 20403524 20619344 21072528 21319516 21748390 22187885
3577 22187885 22638898 23245872 23598165 24107142 24732903 25671542 26459429 27210509 27918491
3568 27918491 28692096 29717815 30960951 32034468 33373498 34752217 36261735 38020562
3560 38020562 39574615 41404106 43507799 45574114 47972506 50587061 53421618 56491439
3552 56491439 59548545 62697053 65376931 67937276 70544680 72784921 74367987 75369969
3544 75369969 76138194 76346377 76341080 76198165 76067303 75574863 75195368 74755097 74496779 74426751
3534 74426751 74042556 73468099 72555323 71244724 69654961 67635021 65123518 62518926 59624413
3525 59624413 56788145 53709488 50853155 48214221 45864493 43765714 41483054 39467411
3517 39467411 37629670 35886442 34661754 33567766 32411622 31412094 30823176 30102073 29328306
3508 29328306 28742646 28310635 27912358 27540486 27174289 26976030 26822083 26651407 26740700 26754113
3498 26754113 26688298 26642626 26361306 26049391 25851703 25607804 25304370 25239376 25252108 25094613
3488 25094613 24775788 24739793 24609872 24229741 24316783 24159013 23944812 24077589 24013200 23995516
3478 23995516 23815354 23599353 23725781 23938382 23815566 23800178 24076574 24035580 24080008 24127975
3468 24127975 24296750 24347925 24668105 25139975 25197043 25539052 25807930 26085085 26427750 26831379
3458 26831379 27302562 27650887 28228673 28708580 29263924 29933294 30396945 31139023 31670226
3449 31670226 32400450 33047757 33547792 34008363 34462786 35051956 35442381 35533858 36089124 36293210
3439 36293210 36689170 37115052 37193740 37453708 37887916 38496639 39140147 39908813 40888554 41770402
3429 41770402 42458895 43579063 44779864 46043733 47167424 48309131 49168471 49873438 50639118
3420 50639118 51312549 51453348 51388216 51372874 51339853 51096066 50947952 50698297 50500071 50339477
3410 50339477 50296448 50126744 50101854 50155906 50577116 50923055 51235603 51926940 52561267 53004528
3400 53004528 53620691 54324363 54764209 55053084 55229192 55285020 55186301 54955355 54460006 53722347
3390 53722347 53112738 52359512 51400038 50622784 49913242 49300579 49007142 48862481 48718801
3381 48718801 48783067 48877244 49235468 49653274 50191442 50916646 51936914 52830535 54041911
3372 54041911 55358976 56501131 57911320 59587491 61216396 63011004 64916814 67178082
3364 67178082 69511759 72001703 74649450 77522124 80523069 84091283 88029795 91990804
3356 91990804 96310382 100962892 106019843 111015023 116274638 121779571 127539070 133190066
3348 133190066 138736702 144155665 149391516 154064128 158165393 161954229 165148879 167655380
3340 167655380 169879165 171583516 172308925 172652123 172505594 172131048 171252871 169850400 168410621
3331 168410621 166792281 164805975 162491125 160224564 157857675 155552028 153169720 150748147
3323 150748147 148679213 146863090 145016538 143986626 143480665 143408379 144396607 145890338 148037632
3314 148037632 150987827 154693347 159139672 164458043 170244778 176394270 182947698 189871878
3306 189871878 196593327 202704308 208041285 212155349 215381765 217427312 218098714 218101309 217584118
3297 217584118 216612881 215458306 214302456 213363481 212363557 211268181 209603569 207407890
3289 207407890 204594518 200522852 195586191 189562977 182625423 175145116 167553847 159946722
3281 159946722 152346832 145141416 138364113 132168534 126371685 121076191 116303529 111987400
3273 111987400 108051905 104702653 101931229 99582183 97352187 95543343 93952000 92631085
3265 92631085 91642632 90868181 90030668 89344990 89015175 88560146 87912719 86923306 85916702
3256 85916702 85067146 83991910 83100896 82488513 81937043 81115741 80476964 80018060 79538529
3247 79538529 79044210 78011947 76904872 75663469 74190585 72752714 71198020 69380589
3239 69380589 67698795 66087487 64484521 63161605 62032599 60824057 60003680 59331153
3231 59331153 58614216 58014304 57426582 56987167 56401659 56150283 55639063 54768450 54134565
3222 54134565 53687616 53238330 52526417 52132287 51628909 51217772 50637352 50298790 49898466
3213 49898466 49554536 49217372 48683564 48460781 48218467 47871814 47221524 46539888 46078993
3204 46078993 45755293 44972603 44509360 43879128 43040960 42258956 41808755 41295044 40746447
3195 40746447 40206455 39534321 39091124 38797186 38289345 37908606 37829351 37478396 37318675 37138447
3185 37138447 36878536 36529303 36412863 36553689 36805246 36891754 36897757 36918906 37156395 37671989
3175 37671989 38494775 39304292 40008447 40779731 41610744 42569024 43864424 45287940 46803547
3166 46803547 48518482 50530418 52686817 54923310 57531856 60442981 63595485 66930622
3158 66930622 70174401 73818377 77258982 80954861 84498232 87562707 90514252 93011601
3150 93011601 95328047 97117440 98445931 99242193 99918918 100432327 100768632 101032161 101203129
3141 101203129 101586621 102081594 102474413 103099363 103323400 103117369 102711197 101386844 99607481
3132 99607481 96915477 93829355 90253346 86137674 81870294 77215066 72561850 68115006
3124 68115006 64227245 60430253 56842909 53822116 51236030 48640647 46467488 44629070
3116 44629070 43122290 41597587 40465454 39363533 38574362 37993550 37411102 36872331 36198517
3107 36198517 35822198 35657302 35469942 35155469 34978743 35032576 35213680 35178618 34926958 34690424
3097 34690424 34633334 34539386 34464370 34273547 33985155 33671931 33499727 33341237 33321405 33119598
3087 33119598 32843671 32736451 32713621 32634451 32553654 32469043 32238900 32190329 32084066 31806657
3077 31806657 31595660 31218203 30752421 30135258 29434521 28788622 28075242 27198911 26349436
3068 26349436 25504038 24775256 24057587 23081034 22297167 21664475 21057764 20447595 19830618
3059 19830618 19432019 19042805 18707013 18271548 18054476 17813965 17618520 17341968 17164499
3050 17164499 17124641 16849745 16634152 16246120 16118933 15969365 15722372 15831247 15780376 15618585
3040 15618585 15649292 15546419 15283500 15314553 15625048 15310268 15328597 15267438 15145974 15372917
3030 15372917 15459978 15520897 15489341 15527961 15595328 15358992 15631800 15825647 15743752 15712109 15811976
3019 15811976 15627774 15675081 15797541 15846646 15851388 15941106 15894711 15956621 15979779 16050664 16126449
3008 16126449 16191707 16139386 16253526 16455639 16516378 16628908 16556952 16746662 16859250 16970502
2998 16970502 16991962 17376184 17432966 17578414 17743424 18087298 18262359 18496225 18662500 19043937
2988 19043937 19540210 19865107 20165789 20403500 20763041 20932931 21188386 21661753 22233424
2979 22233424 22543706 22733572 23136308 23673965 24043441 24386925 24784141 25080920 25424812
2970 25424812 25800135 26344556 26621520 26928817 27511293 28027886 28540736 29061201 29641676
2961 29641676 30049750 30737280 31488193 31965090 32532190 33264647 34118073 34893097 36002889
2952 36002889 36886276 37774767 38770210 39720685 40768366 41945651 42998699 43929918 44763770
2943 44763770 45795842 46781697 47926764 49393890 50741569 52356738 53817890 55655804
2935 55655804 57733303 59768663 62281804 64803668 67690438 70807716 74204544 77776935
2927 77776935 81737268 86136002 90668923 95564024 100735253 106486979 112886185 119693259
2919 119693259 127293465 136060191 145447386 156231659 168086354 181002384 195434760
2912 195434760 211632068 229559775 249442319 271896370 296171696 321584710 346449265
2905 346449265 367445879 380366293 381473668 369511162 346845210 317967571 288527616
2898 288527616 261451901 237929037 218472200 202285660 189142141 178482356 169943483
2891 169943483 162965846 157520609 153587275 150821361 149397988 149193802 150342112 152578404
2883 152578404 155933915 160262282 165139092 169960927 173459581 174567384 172303836 167182904
2875 167182904 160240030 153393563 147318228 142745188 139630600 137770320 136826415 135994782
2867 135994782 134650216 132054751 127824089 122672763 117559906 113131450 109707249 106125302
2859 106125302 102834257 99722312 96988136 94920563 93080413 92220353 91958046 91757638
2851 91757638 91046322 89013344 85551043 80771070 75629434 70771649 66276826 62471470
2843 62471470 59057909 55726025 52680789 50391441 48308848 46377661 44507005 42904962
2835 42904962 41682131 40329209 39095367 37896282 36792873 35715038 34512280 33611157
2827 33611157 32535190 31701031 30978089 30440945 29444610 28259320 27767945 27153619 26384060
2818 26384060 25927224 25154299 24591669 24101473 23580882 23208091 22619355 22116275 21569047
2809 21569047 21157140 20838990 20556790 20131148 19716996 19274451 19181621 18867599 18538768 18296328
2799 18296328 18083560 18155232 17881992 17760871 17766521 17696867 17746823 17699885 17436270 17272582
2789 17272582 17229574 17188417 16971897 16359886 15951762 15479126 15049880 14573028 14187488 13981544
2779 13981544 13444173 12598469 12159255 11863108 11544488 11271152 11045617 10793343 10564880
2770 10564880 10280790 10051161 9950203 9606575 9381630 9276712 9229109 9169288 9005311 9076634
2760 9076634 8878280 8860476 8673679 8297967 7967970 7977657 7765928 7575892 7495795 7389369
2750 7389369 7127527 6834307 6714058 6613328 6572850 6372366 6107470 6078470 6117208 6021465
2740 6021465 6122151 5939934 5626644 5292535 5288034 5298305 5074583 5139758 5182301 5330220
2730 5330220 5508225 5300009 5116093 5079076 4951358 4792963 4848092 4783752 4617700 4667004
2720 4667004 4688063 4550322 4363096 4342319 4567646 4522963 4284475 3995270 4201671 4133785
2710 4133785 3999487 4073962 3953569 3900569 3857502 3907085 3623875 3509333 3633009 3485609
2700 3485609 3482498 3415880 3457174 3391535 3414650 3411939 3504804 3476787 3374848 3389345 3348831 3372489
2688 3372489 3263352 3167783 3001905 3080693 3189547 3169605 3140811 3073705 3239356 3097592
2678 3097592 3184325 3235040 3026145 2990412 3139551 3243725 3140108 2916928 2831528 2838276 2813062
2667 2813062 2882623 2952477 3123545 3179595 3164254 3021892 2872493 2760040 2882464 2978198
2657 2978198 2804296 2966275 3150849 3241754 3194558 3028918 2844792 2703406 2781072 2737214
2647 2737214 2810238 2861837 2921436 2843770 3083336 3289472 3149512 3070175 3149147 3142005 3178487
2636 3178487 3074819 3284707 3735029 3636518 3410224 3602761 3684586 3571094 3786319 3757135
2626 3757135 3694424 3961363 4136188 3961747 4024357 4084850 4168187 4302002 4181288 4350158
2616 4350158 4268238 4032864 3950445 3938510 3955465 3809637 3842784 3778161 3657724 3647003 3682907
2605 3682907 3694461 3804937 3898422 3807699 3848019 3791284 3814729 3893142 3809214 3970112 3968867
2594 3968867 3928258 4183417 3998337 3652882 3772064 3862554 3768404 3727013 3605669 3618859
2584 3618859 3669869 3659810 3580573 3587246 3631536 3556500 3600824 3611246 3619117 3603257 3621502 3635465
2572 3635465 3447109 3622263 3680801 3669456 3625969 3557129 3551704 3381050 3320081 3325910 3316496
2561 3316496 3248404 3188036 3000148 2994749 2859738 2852271 2808455 2704739 2705733 2694201 2788145 2908236
2549 2908236 2847253 2740750 2645017 2756428 2757196 2647898 2614867 2488944 2458020 2425355 2524855
2538 2524855 2713042 2570393 2600438 2535369 2484606 2516456 2451368 2214665 2134906 1979529 1920348
2527 1920348 1851277 2028567 2065803 1946287 2130737 1997784 1819953 1583137 1650936 1667261
2517 1667261 1727627 1774852 1903652 1811587 1798448 1588295 1572234 1399331 1184051 1370216
2507 1370216 1209476 1289295 1319842 1308149 1459674 1415848 1326337 1315972 1303625 1436202 1433986
2496 1433986 1381005 1532587 1326789 1339344 1302157 1348636 1314897 1140658 1030116 1036817 1080921
2485 1080921 1176501 1239162 1182231 1198336 1004404 803631 886487 774339 771718 782663 699696
2474 699696 775584 968228 860589 1015943 985419 969224 992675 806627 743842 804618 901684
2463 901684 815000 850012 787112 881042 801012 695895 659860 651583 614057 552190 570007 657990
2451 657990 553730 426358 486409 693351 521665 553175 608872 543256 673551 542684
2441 542684 466838 503521 521432 595288 719217 602536 492402 488241 236743 455073 591614
2430 591614 479986 374859 426085 384790 560041 687645 773286 544200 475822 677098
2420 677098 483046 565692 528013 289618 413808 492538 527307 499526 588158 605012 777477
2409 777477 602788 465686 440375 428870 475342 380386 389608 566122 703438 648037 437843
2398 437843 436371 627414 367539 385715 580726 514761 428679 486593 495806 599933 402124
2387 402124 380856 338221 701790 556263 453157 500194 510731 480499 527670 618331 475370
2376 475370 269295 268026 499298 445752 575179 592730 533452 474000 292315 507059 577583
2365 577583 710333 772247 560203 591727 778094 765846 543441 671868 677928 577004 686726
2354 686726 581199 645428 674843 659893 563816 573575 578426 518630 579617 502433 642779 634617
2342 634617 695439 617544 638678 494753 508120 442005 463463 481783 521636 542153 469715
2331 469715 444212 413006 475443 443333 420414 407773 366697 322802 532984 487241 392841
2320 392841 527847 535701 565104 533121 403300 279137 380177 353649 496369 641955 303463
2309 303463 248117 396619 424121 333871 304917 232624 407707 473776 488427 422574 430204
2298 430204 563000 474428 329586 390548 437391 441480 550874 384372 383234 359462 286652
2287 286652 221145 395663 420711 408719 353185 347785 408693 537622 642568 468694 398743
2276 398743 438963 429409 514964 446620 443476 518776 412157 420405 337657 357024 486107 463097
2264 463097 317397 400961 369014 169931 269233 328761 398770 509899 370376 549899 677428
2253 677428 756389 740989 771183 601659 538213 452298 612408 419415 400659 537610 557170
2242 557170 700676 785420 742660 653644 624187 419025 551029 442118 595543 678750 599365
2231 599365 538356 575051 626007 724640 791733 689795 715331 474234 563316 615217 656977
2220 656977 665133 814179 813507 578687 494787 615967 643276 809014 880733 842206 955454
2209 955454 941934 814689 574376 764793 752186 776232 818278 1028006 998168 948047 1042736
2198 1042736 1031279 1188461 1180012 1050321 1095245 1205613 1164285 1077094 948017 877116 1007901
2187 1007901 895434 1062399 1096533 978434 863420 986316 1069553 1038301 1082697 1410822
2177 1410822 1318744 1184113 1177580 1225390 1357066 1468114 1529624 1494409 1440081 1490272 1433994
2166 1433994 1533013 1564224 1721415 1782170 1656609 1911782 1936473 2077357 2145065 2053529 2184782
2155 2184782 2152382 1996596 2195053 2001724 1761476 2103610 2333407 2292871 2308301 2479094
2145 2479094 2808147 2810742 2579495 2413344 2636409 2485287 2699899 2705215 2563225 2734689
2135 2734689 2908205 3115116 3389478 3321275 3398019 3511294 3625299 3693135 3672496 3765297
2125 3765297 3984444 4180390 4430678 4594720 4806810 5158710 5325474 5512497 5834848 6237758
2115 6237758 6531831 6790510 7461675 7946055 8391356 8940970 9503431 10336160 10972763 11926845
2105 11926845 12964560 13817575 14506520 15531622 16507601 17860974 19555850 21423176 23519106
2096 23519106 26703248 30269080 34680187 39715280 46051053 53651914 62440059 66659653
2088 66659653 62746796 53547289 41693941 32931090 27185967 23080925 19661293 17231072
2080 17231072 15544214 14136808 12789989 11815399 11142117 10535086 9853287 9110234 8314989
2071 8314989 7553398 7060990 6782610 6266502 6005883 5671141 5471449 5118075 4684562 4580085
2061 4580085 4496244 4461116 4169849 3967005 3820234 3787222 3639007 3519395 3324676 3323881 3078246
2050 3078246 2847026 2730458 2692958 2737590 2583519 2610173 2560793 2430005 2365336 2246579
2040 2246579 2240413 2155742 2138391 1892418 1987932 2052321 1673779 1711488 1642523 1613712 1537210
2029 1537210 1311837 1265833 1216800 1391414 1373653 1290726 1199654 979014 1112365 1181725 1220627
2018 1220627 1180682 1177446 1300539 1072753 1187652 1149996 1234433 1305785 1053084 872232 752201
2007 752201 656254 770509 863410 886977 825708 782122 872514 843969 695997 669674 806655
1996 806655 773968 910204 804836 684681 601061 472377 482306 506579 450818 520255 437447
1985 437447 418606 438881 446100 630028 604376 398812 227928 460127 561401 457611 387084
1974 387084 551129 637333 474570 293369 235647 317267 416270 464415 288046 297887 210759
1963 210759 454676 685617 450449 551927 802453 448163 383345 328961 212667 473750
1953 473750 591487 471800 162343 103384 330395 346031 159141 175492 406124 388458
1943 388458 222451 276567 313552 233677 1787 -142055 -19429 212529 405188 276819
1933 276819 283177 318521 386525 456783 333966 172203 164900 88366 261099 218108 385965
1922 385965 330731 164393 453153 292887 223062 169733 176581 264334 68151 193381 232496
1911 232496 218045 160817 62784 145073 69460 216790 168737 111489 163776 173339 102296 169017
1899 169017 318661 179285 56641 212284 112008 131297 13615 127983 126621 173264
1889 173264 238134 233164 63035 93719 22947 -133450 -145077 -41798 20624 130196 49734
1878 49734 -80278 -14155 12978 129465 304523 261404 157578 185523 267619 448773 460737
1867 460737 241956 82355 29016 325193 114304 6426 126380 167049 155315 65078
1857 65078 231743 -3916 352260 209371 -7278 -38343 88339 227747 342967 272357
1847 272357 128784 142122 213378 262354 150721 232535 305863 132601 5696 88202 243667
1836 243667 371790 342849 185678 98925 67843 58561 139586 178546 271876 345355 333094
1825 333094 274983 360886 438075 589062 388984 293792 407801 294838 305030 139758 -43098
1814 -43098 -87147 -200397 -102540 14927 95164 256448 320139 79771 259590 424927 -8016
1803 -8016 -81700 37472 60014 89673 248204 207448 144408 -460 83287 145528 200808
1792 200808 61048 129542 82906 -62355 100791 184212 89211 52763 152603 254392 208371
1781 208371 198897 156337 158890 172629 115430 9277 -84441 -72147 -76119 -10700 244953 154467
1769 154467 47901 49464 167152 11837 69855 63647 -22995 38176 18419 -31427 10129
1758 10129 -66401 -234853 -130563 44208 182858 11176 101219 -21169 187295 443776
1748 443776 185325 280328 279953 132933 15350 -184479 -109430 -36511 47398 -36958 -269387
1737 -269387 -252430 -55627 -136139 -126202 -161854 -98728 -42905 88319 73155 58066 -4136
1726 -4136 -19978 -251004 -198032 -85960 -183783 -4441 268336 246080 37727 -89060 61873
1715 61873 -81303 86014 97448 111818 216601 71163 67162 -9275 -110052 -9534 109718
1704 109718 80749 18321 75622 66410 9201 74950 103350 192987 26741 -155824 -170126
1693 -170126 -96035 -73604 -51008 -67135 -107424 79413 132860 84683 -101585 -149047 -44006
1682 -44006 19520 -51436 28802 194685 191643 40038 65822 118958 -27793 81670 122708
1671 122708 157780 215796 223128 46610 56809 35465 56036 -72242 124552 78962 24578
1660 24578 162039 155693 25440 29719 -10661 61241 -3475 36337 142292 96882 75827 -35332
1648 -35332 216494 169156 48389 20972 130071 -141499 98862 127151 91900 42943 -95397
1637 -95397 -246640 -186535 -73900 -85849 -46204 -132785 -826 -34062 -42157 109197 159407
1626 159407 -36486 209332 81960 11368 -80843 14932 89368 301037 -2651 61389 113942
1615 113942 46697 -136897 -143342 -82280 -21220 -1425 -12690 18025 -54138 -10674 -32638 -82637
1603 -82637 -148307 -193919 -270444 -311233 -205978 13538 2921 -102896 40702 -13563 -209500
1592 -209500 -35172 27136 -7903 -105726 -154225 -182018 -191053 -127224 -217830 -167737 -116904 -108387
1580 -108387 -1922 -152134 -261408 -179454 -106562 -109035 -154667 -332194 -169336 -150278 -266477
1569 -266477 -421497 -341950 -151812 -26021 -77711 -9896 126869 98253 94604 115005 49590
1558 49590 -21187 62419 -14293 133051 37925 -44120 73352 -28468 -19133 -27627 79805
1547 79805 -18803 -29718 -103135 -20607 -8995 72222 -84609 39740 -90998 71043 -246969
1536 -246969 -109290 58303 -7460 34566 123464 10718 -76998 89644 77130 63650 37075
1525 37075 19268 146970 313718 180094 151817 28301 117792 164225 4828 -1751 -121068
1514 -121068 -87396 145465 -68015 -119683 -41560 -15462 -155930 14966 28088 -98933 -288107
1503 -288107 -135776 22687 -38735 -107340 19035 -6333 -12097 -32887 -162369 -156980 -37986
1492 -37986 31105 20678 117062 234304 31929 65410 64442 -4975 136673 206811 112385 140346
1480 140346 270914 75387 -55385 30661 -122717 -1430 51150 -47878 -163825 -178615
1470 -178615 -103126 -63531 17337 214274 104910 15533 -142324 -100561 -65787 13291 156705
1459 156705 85770 156527 17717 -11650 41446 197163 205308 190204 200594 155901 162002 255338
1447 255338 272605 133592 160319 222995 246428 134312 167956 196328 245942 179404 -10247
1436 -10247 61409 123907 30265 -62001 -52248 67 -55616 31340 22830 -11696 62787 -81915
1424 -81915 168189 156426 -79316 -48407 128229 26753 -79411 74919 -54482 -193588
1414 -193588 -28842 -70952 -31286 54232 -8439 142733 -119977 -149098 29588 -57322 -111693
1403 -111693 -106078 88585 -6645 82973 142114 64762 -245297 -242706 -254261 16918 129560
1392 129560 237910 120358 -40012 154275 -53517 -199124 -200389 -145364 -131309 -13754
1382 -13754 -102603 -263479 -123619 -183925 -45478 -68959 -156880 -7905 -61367 134209 139569
1371 139569 146078 68046 -198459 -88997 129786 219925 95906 -63033 75381 62351 7322
1360 7322 12638 -32494 37159 85584 56787 18693 150331 342845 209451 207514 215650 92470
1348 92470 129092 -29210 -101594 -75582 -166723 37869 182055 135012 -197 134656 130136
1337 130136 16407 110241 8309 -226782 -267571 -91978 21645 -122410 -81323 -104566
1327 -104566 2702 -15015 -68454 -117175 12498 115265 -51649 -182918 -76593 233294
1317 233294 215907 38298 -106241 -35484 -109911 -142004 -69981 74645 40000 -27934 -179851
1306 -179851 -140166 -164331 5781 132737 66912 5087 36643 111127 -64055 -45100 -152179
1295 -152179 -113225 -100998 -289878 -103610 -46901 -28914 41326 89593 111784 51576 -172588
1284 -172588 -113523 17826 -11763 95846 120606 46438 -52496 -61705 -110493 17817 -84366
1273 -84366 -14864 -26818 -139179 -106048 -66998 -7270 -126010 -282925 -306842 -150985 -41854
1262 -41854 -141666 45186 -154719 -108348 -102659 -191890 -151748 -130686 -46323 -35202 -3394 36750
1250 36750 140695 272616 232504 85406 -115984 -242127 -163306 -598 198775 42087
1240 42087 166830 79377 -216398 -52393 -30756 -248159 -110806 91194 180322 145343 53041
1229 53041 17891 53363 25937 129161 96673 177095 234185 34783 -133122 -247748 -220263
1218 -220263 -185806 -27958 156778 174296 81649 101839 38381 -164968 -141837 -118507 116327
1207 116327 159403 54375 41864 -37867 -148993 -170061 160475 178229 -34442 80102 85217
1196 85217 -27120 -132624 -61853 -108947 -125679 -113212 -95346 -150524 -59093 94513 85551
1185 85551 -97011 -140572 -1457 49957 66148 -99148 -303446 -50216 185569 -132933
1175 -132933 -297391 -173546 -47547 2580 143539 221299 9812 -244911 -218329 -125102
1165 -125102 -183183 -266808 -106897 -70248 -117763 -47567 -122405 -39935 -53579 -188139 -108201
1154 -108201 -44898 147222 -5451 -127610 -128506 -254049 56311 273390 -35527 198516
1144 198516 -13159 -236404 -5910 111314 79960 -35886 -88553 -102349 -150391 -122885 -73606
1133 -73606 29885 143418 123863 169699 191236 146619 188459 381908 263778 145906 83322
1122 83322 -124588 -125707 -153440 -269752 -233520 84493 142008 25654 -136401 -124364 -202747
1111 -202747 -246646 73681 167662 84422 -15045 47783 -112735 37890 111490 -54258 16700
1100 16700 24230 -87203 7288 -26021 -31940 -127339 -172186 -115546 -804 98010 71258 65709
1088 65709 24258 -44209 72745 261261 96591 -31460 -93284 -75959 -83671 -104502 61229
1077 61229 66218 10270 -174379 -100488 -88268 -55907 -87369 34033 35971 23406 -32887 -164966
1065 -164966 -39498 -152508 -183211 -165226 -224960 -179743 -29107 64442 120036 65546 -135870
1054 -135870 -204826 -236645 -119582 -15999 15792 -102024 -197970 9136 -35089 -89585 -283141
1043 -283141 -59825 -24567 44461 -75078 -286277 -282665 -183619 45405 35975 61797 304116
1032 304116 390624 140388 118307 147312 196880 168777 105544 281063 181523 103318 -19892
1021 -19892 -37162 109082 12400 -84034 -82312 89630 46500 -2756 33353 -11847 64606 -118258
1009 -118258 21553 84471 86267 1721 -31379 -37644 -38826 84309 171569 247140 55490 40949
997 40949 243835 401938 91395 -13546 42225 -224766 -217775 -250921 -178111 17675 77837
986 77837 -8421 -68498 -10740 -68862 56049 20120 51398 14978 -57216 -76604 -94039 36654
974 36654 -90922 -70691 -34603 -22083 113437 117646 -51460 -149684 -83703 23067 -135950
963 -135950 -42883 -108008 -239382 -214424 -172007 49173 -103688 -111092 -124861 48407 -29599
952 -29599 -58672 12210 62561 -17622 53051 15885 82320 170522 88925 166453 104430 163895
940 163895 205502 -868 88884 111275 22841 -124642 -35647 -50971 -85446 -83475 15482 -106331
928 -106331 -192333 -136104 44782 181375 165523 -45403 -119543 -26331 -40327 -34145 40925
917 40925 -13526 -59797 274511 168813 22168 126807 130467 -140046 -123408 60895 49714
906 49714 6808 102097 67057 65280 65548 69899 7498 -30012 -5150 -21294 125625 13147
894 13147 -19472 53167 -165741 -163959 -109731 -12831 -136487 -212392 -134396 -81816 -48619 -177652
882 -177652 -158160 -99198 -217559 71472 72518 254551 130401 93671 24962 -94572 59700
871 59700 28421 -100108 -197450 -151734 -240717 -294304 -226245 -136339 -142165 -194787 -304135 -291546
859 -291546 -336362 -221947 -99023 45894 20840 -118051 -146679 -252362 -147919 -158382 -128455
848 -128455 -1867 -87706 -91266 -45356 137720 146719 112148 44693 -87382 6319 -125478
837 -125478 -57639 19640 -65817 -144365 -240406 -213836 98017 56116 87242 263625 220005
826 220005 122487 -7750 -174651 36189 107903 102610 -899 1031 27067 103056 -63491
815 -63491 -34388 97993 101955 24438 71050 305999 266438 268379 225904 300747 326872 310287
803 310287 103061 1476 -117328 -142109 -83880 3949 -204775 -329187 -108131 -97169 -78134
792 -78134 10700 -255944 -178830 -118142 4218 35037 48582 88251 -49142 -65355 -76083
781 -76083 -32016 106469 -45338 -43668 -191663 -159854 -36284 -81011 -139726 -278927 -261000
770 -261000 -159602 -186467 -118438 -149911 -215383 -1008 -49330 -152149 -24568 -21441 44948
759 44948 -13545 197758 63684 34361 52351 153807 104255 98072 -80555 25074 228739
748 228739 97431 -87027 -51970 -67294 55074 -4466 -47672 10881 -9433 80754 76490
737 76490 205920 -47792 -50381 -13831 126349 -117690 -318496 -102280 -157404 -170637 92204
726 92204 66575 -25127 -163980 -124844 -158818 -254868 -223999 -40695 78772 12360 -232570
715 -232570 -27583 -71020 38578 59689 166887 225223 -7571 -74296 3422 -49787 -68453
704 -68453 -54616 -203990 -265206 -106449 -93231 46589 213036 338 20927 45691 106174
693 106174 140363 146567 -105529 -87089 -57169 -33124 -87562 -52205 91749 48252 31638 -198455
681 -198455 -215004 -212307 -163497 -66523 -104459 -260425 -80896 83842 -80419 -158873 -271444
670 -271444 -159736 -49231 -203484 -141350 -110975 25360 264741 217297 -56176 -53116 23869
659 23869 96898 5073 -72715 14853 -13908 -194349 -139967 62766 -195 30119 61891 9241
647 9241 -4598 31072 755 -192126 -174573 27196 148173 -128568 -18694 144169 55763
636 55763 -21865 -19110 -150219 -183209 -201420 -115389 70564 -14146 53762 58162 -53076 35264
624 35264 33571 -166600 -57777 38592 67151 55648 -153619 -143791 70722 72410 -65633 -67027
612 -67027 59230 112257 195060 47533 -122444 -135245 -241405 -52812 127605 65633 -258006
601 -258006 -346341 -331109 -180560 -108736 -214677 -123301 -190420 -78750 -128150 -212493 -280690
590 -280690 -153364 -156216 -82784 -54785 85348 134721 184347 69387 -223275 -330994 -178492
579 -178492 -91177 -26258 -14438 139886 105542 140384 112079 55793 127923 57416 -64647
568 -64647 70907 151009 107685 152824 605 -50100 -21451 -83272 -89647 -98214 46999 71539
556 71539 120160 47398 21717 226782 108338 -51058 -94632 -59156 38181 -115377 -43651
545 -43651 -44558 -54807 -148213 -131145 87645 24481 -92110 -113767 -94069 -187055 5426 110288
533 110288 -43818 -302922 -226949 59224 -67112 -92808 40695 -114373 43081 -73219
523 -73219 -194641 -251803 -145541 -67010 73184 134902 -163517 -170159 -61398 56287 -136364
512 -136364 -49495 -48676 2527 8676 -32420 36161 -78233 -1900 94380 100599 -133042 -92041
500 -92041 21099 -135806 -121660 233262 139617 -41511 -28695 128198 11567 -73523 28896
489 28896 -63258 -3292 -110409 -65779 -20918 -24131 -39471 -75686 131796 139540 -60390 -176731
477 -176731 -143420 -159240 -73294 6568 75538 34187 4796 -119070 8299 97102 35093
466 35093 -61026 -3445 61785 4301 -244992 -40625 -44991 29318 -148870 -191350 -117705 69886
454 69886 -20713 -148796 -22296 -70386 22466 177664 57005 -196982 -151085 177881 287055
443 287055 -141568 -115063 -134215 -115983 -9078 96788 -26130 62701 -56079 -229390 -156983
432 -156983 -7029 -7958 12108 -103747 -144994 47931 55915 62737 253155 82726 -8015 249655
420 249655 77572 34019 157693 161216 97856 189653 -6314 50474 141852 -5336 12829
409 12829 -30197 -35558 -82196 5184 -37292 98270 120895 67584 -194002 -87422 62920
398 62920 4349 76835 163524 246906 325441 286127 134254 222425 225880 127690 -94699 -61016
386 -61016 84946 -93926 -95915 -200435 -187872 -102500 9185 29364 189304 300546 43082
375 43082 58532 337373 92922 -189121 -22608 115424 150316 180335 137076 133070 17562
364 17562 135608 199764 7437 24209 -10954 -15598 38265 -122403 -76030 23164 -47932 851
352 851 35259 110222 130280 103628 147011 -48387 -6456 -23466 -7606 287682 130596 38271
340 38271 42031 267274 333562 155791 16371 -6753 92976 -13719 -56953 -178447 -136061
329 -136061 108682 238422 194350 43665 -3527 -69521 -91363 2986 -51175 -95868 -82063
318 -82063 -51696 71946 126760 -2195 37330 -92183 -126341 -1998 25669 -2612 81933
307 81933 132684 26285 157017 26515 -21413 14058 1027 22280 273741 245294 418885
296 418885 310390 28172 75453 113494 -124555 -140476 -172113 -373102 -25778 -8386 -109919
285 -109919 -102681 86449 163829 90533 30027 -33986 -72639 -5092 158200 51802 60919 72930
273 72930 191711 -14928 -36207 108110 -30815 24845 194532 138892 172619 224672 311717
262 311717 81785 -20193 -39359 26252 -76517 -57621 34916 251632 244623 44725 16643
251 16643 -232422 -129108 -39030 85963 310011 386238 114371 258672 226267 114831 14396
240 14396 -216659 -27757 171493 52185 18545 235314 107699 96917 182662 169461 143552
229 143552 159419 342955 225787 49143 -75074 -64123 150661 -68508 -194811 174037
219 174037 152241 72424 247234 139105 69045 30175 -111747 142248 233736 52973 -81565
208 -81565 -60987 -35400 136297 64524 -74876 -9193 68912 27549 30774 -1656 -6517 -139871
196 -139871 42958 231834 261536 230759 289666 303782 194555 178441 5695 38243 -25176
185 -25176 -124839 -28035 -80187 -37188 75865 -37711 -34220 -148369 -124970 -99759 22590
174 22590 -94536 -47605 112762 20966 113078 55786 126091 253870 148480 -11180 54033
163 54033 61716 156517 215332 264587 -9372 -81833 -2227 -111211 171509 162728 67941 112206
151 112206 88704 249215 -6747 43041 148224 12056 13599 8097 -38195 -51581 -29751
140 -29751 -12331 181260 49254 -30171 4734 173010 37744 -36483 135078 34780 131747
129 131747 56106 119654 209223 -160875 -148804 20274 38667 56123 100158 9008 114470
118 114470 156824 164685 112323 110561 240558 284661 95236 -52238 -47269 -32734 -74044 -123246
106 -123246 -94988 -5503 52412 71901 61771 72228 -92330 31542 124308 24357 66009
95 66009 90166 162496 152335 116406 149805 85509 86208 107414 14994 107824 48676 56084 247514
82 247514 191899 180008 22239 -72773 -11285 -4832 35919 -58419 24352 -18812 58613 87123
70 87123 89076 205128 191964 98826 97502 106236 173219 117514 59018 268346 299225 107081
58 107081 -59854 -116974 -33031 114995 83251 93860 41461 50264 85545 44679 15656 -54672
46 -54672 24651 89580 138536 86354 -28333 -139050 137707 94817 58529 109521 189263 226731
34 226731 136096 141211 181874 148310 173539 117883 161531 70016 -10545 24657 145264 177747
22 177747 -15560 -81470 1625 12677 117366 69425 -55636 81322 59598 40646 19991
11 19991 105977 93396 52790 110542 140639 -74542 13188 124256 144150 19106 37436
0 37436
$$ Imaginary data points
##PAGE= N=2
##DATA TABLE= (X++(I..I)), XYDATA
16383 -2913146 -2862320 -2844857 -2752929 -2833568 -2946398 -2709523 -2478630 -2471681 -2530218 -2613963 -2497671
16372 -2497671 -2477255 -2310847 -2276692 -2368367 -2268962 -2171323 -2114962 -2030447 -2098698 -2063591 -1948193
16361 -1948193 -1940318 -1845361 -1737630 -1802537 -1738480 -1620999 -1653390 -1610570 -1624723 -1675388 -1525703
16350 -1525703 -1458462 -1624858 -1395410 -1344784 -1364157 -1253049 -1245886 -1217812 -1254046 -1401725 -1285714
16339 -1285714 -1219695 -1127006 -1150329 -1116096 -1130614 -1121314 -1022593 -865791 -843747 -1056069 -1011081
16328 -1011081 -885129 -935726 -872422 -684805 -623221 -449333 -381513 -521768 -515960 -482224 -566741
16317 -566741 -563997 -360993 -303133 -300765 -190058 -308612 -303926 -326484 -103121 -115512 -126862
16306 -126862 -181079 -39909 -13646 101569 123670 64964 -21300 112610 68301 192657 150638
16295 150638 233704 370343 278078 271821 246680 384247 495437 540575 545435 410741 504082
16284 504082 422815 622390 754521 767262 807830 775166 873448 788108 744570 769514 791014
16273 791014 839822 998096 913793 967888 972104 927207 887386 957391 983309 1099408 1254181
16262 1254181 1361271 1340136 1396895 1350730 1222657 1280535 1248658 1187828 1355148 1473261
16252 1473261 1514922 1476576 1558054 1676624 1605451 1525780 1484912 1592587 1561280 1505433 1414691
16241 1414691 1629636 1849628 1699026 1650592 1632781 1638379 1758640 1889219 1850784 1783974
16231 1783974 1727192 1745929 1649173 1887058 1853878 2161196 2236767 2084109 2055320 1905372
16221 1905372 1894513 2108654 2143873 2288720 2248237 2123065 2213358 2250266 2204865 2211572 2281868
16210 2281868 2335948 2424583 2423180 2186299 2133042 2176040 2173386 2230026 2291467 2139815 2255060
16199 2255060 2407480 2420103 2265329 2317397 2543735 2576095 2661307 2606099 2651742 2537714
16189 2537714 2450578 2343150 2379859 2438232 2330808 2291237 2146014 2163688 2357661 2457988
16179 2457988 2619654 2855544 2931844 2823236 2782540 2678493 2746449 2989246 2948001 2779615
16169 2779615 2532759 2653575 2512244 2671696 2629918 2367554 2621349 2834105 3011565 2808796
16159 2808796 2700613 2660232 2861866 2896748 2996701 2909936 3003291 3085167 3127259 2957567 2781669
16148 2781669 2911489 2771521 2578696 2773510 2829347 2782424 2892700 2857271 2689583 2638890
16138 2638890 2704748 2694192 2587380 2729909 2684950 2746368 2784321 2757313 2680010 2810161 2861519
16127 2861519 2827137 2838280 2938948 2993263 3233443 3258247 3150358 3047488 2907780 3142640
16117 3142640 3014927 3133800 2996446 2819144 2863552 2989397 3088804 2973648 3084675 3049576
16107 3049576 2868256 2936655 2968160 3143202 3138736 3089589 3021694 2990805 3147636 3047502 3149756
16096 3149756 3181961 3365812 3537806 3407645 2967782 2914210 2876227 3073061 3224887 3098687
16086 3098687 3140410 3020781 3137243 3143955 3100646 3336246 3388722 3239989 3184413 2958661
16076 2958661 3232424 3295099 3237979 3102181 2966132 3045743 2987760 3178102 3089569 3179362
16066 3179362 3181452 3104776 3014879 3032215 3191945 3200267 3121052 3207963 3203107 2944267 3101070
16055 3101070 3236415 3219951 3360250 3185891 3147071 3068823 3102497 3230468 2937390 3067223
16045 3067223 2990315 3059383 3079341 3034204 3076956 3137009 2965912 3110015 3105091 2964701 2994705
16034 2994705 3232495 3153005 3250232 3120814 3047969 3207794 3119983 3045919 3174521 3065767
16024 3065767 3063456 3198300 2964091 3047186 3012726 3224207 3163206 3117774 3208504 3132547 2974616
16013 2974616 2983355 3169550 3191231 3131175 3103803 3216783 3295191 3402814 3124110 3035871 3149360
16002 3149360 3108061 3139674 3396618 3411446 3141261 2838375 3149190 3226246 3066518 3207145
15992 3207145 3061752 3194148 3282562 3155709 3114389 3174389 3024603 3034611 3080500 3198633
15982 3198633 3102246 3003358 3064145 3005821 3101894 3115611 3060018 3146275 3301229 3419867 3324487
15971 3324487 3210060 3128797 3204983 3030113 3114698 3123452 3160436 3277206 3298267 3059094 2985361
15960 2985361 3085866 3029827 3140732 3229995 3037669 3129439 3310155 3193855 3136595 3137400 3426213
15949 3426213 3228039 3078995 2964637 2953670 2913062 2984915 2982320 2860168 3060319 3036731
15939 3036731 2919954 2984315 3150294 3120071 3168535 3234139 3315027 3346777 3233729 3125321
15929 3125321 2990768 2949153 2997919 3115296 3043151 2955330 3103682 3173212 3162615 3191920 3163604
15918 3163604 3073730 3422804 3191795 3122883 3367772 3320240 3218643 3279880 3269175 3222617
15908 3222617 3316326 3175643 3118568 3002324 3129343 3139641 3122233 3091959 3107641 3145608 2978116
15897 2978116 3129569 3123556 3180982 3199373 3188480 3209378 3084696 3035638 3080813 3193554 3183593
15886 3183593 3210546 3202230 3142057 3351888 3300549 3083499 3114277 3188240 3270637 3301114 3207072
15875 3207072 3136941 2963994 2981669 3168314 3047084 2981383 3261280 3190126 3194060 3400314
15865 3400314 3374724 3219677 3159837 3172057 3047423 3015573 3006405 3046492 3018830 3191697 3194164
15854 3194164 3086572 3022405 3272789 3231488 3160653 3297953 3531029 3384988 3206188 3252614
15844 3252614 3234171 3116447 3070340 3264797 3399931 3308619 3130169 3068254 3287090 3471245
15834 3471245 3362741 3039861 2922585 2988587 3196217 3304431 3168015 3014038 3241706 3444318
15824 3444318 3378830 3208696 3139373 3068463 3032969 3208072 3206664 3317408 3420192 3356894 3161492
15813 3161492 3222500 3251687 3128093 3026858 3173869 3260966 3061112 3161599 3245163 3174913
15803 3174913 3127082 3064387 3283160 3284137 3175286 3278702 3335350 3305283 3425067 3333584 3280069
15792 3280069 3295021 3174448 3121123 3169337 2958938 3100686 3346315 3230180 3188383 3183382
15782 3183382 2943535 3044002 3383474 3279736 3191189 3383266 3331823 3156895 3115755 3148387
15772 3148387 3162283 3084753 3122010 3146030 2973376 3008087 3114854 3357774 3366798 3141842 3159314
15761 3159314 3276655 3179670 3138161 3096016 3115383 3335912 3389819 3363814 3223790 3424119
15751 3424119 3304758 3108914 3096381 3445626 3383741 3208873 3116112 3177865 3127594 3187404
15741 3187404 3248313 3251086 3075567 2900206 3165688 3230811 3389583 3144993 2971125 3154483
15731 3154483 3506023 3240618 3102552 3371855 3549683 3610395 3277097 3221375 3245053 3089406
15721 3089406 3281086 3291757 3350870 3352709 3291187 3272384 3282002 3351342 3216573 3150048 3136222
15710 3136222 2948789 3090254 3228794 3205570 3262811 3308171 3301975 3331963 3390404 3477608 3236963
15699 3236963 2975804 3077204 3174958 3179930 3075655 3156765 3255689 3325964 3012504 3020689 3106246
15688 3106246 3083453 3266365 3269303 3110254 3011628 3080090 3293024 3235364 3336923 3335083 3267734
15677 3267734 3107123 2957070 3145780 3279404 3206418 3333867 3261991 3196883 3219338 3285246
15667 3285246 3354347 3300504 3264071 3358083 3196923 3117164 3363141 3464840 3291596 3216657
15657 3216657 3291779 3400957 3401789 3239664 3257626 3380989 3304364 3020882 3180923 3254586 3176694
15646 3176694 3446846 3354764 3358193 3497916 3411794 3318063 3159072 3181818 3179420 3277875 3225074
15635 3225074 3101084 3165912 3076967 3151417 3471403 3428201 3453319 3374620 3388530 3277068 3390092
15624 3390092 3353221 3260088 3286476 3215402 3057286 3123932 3076201 3239456 3265857 3357215 3358992
15613 3358992 3354639 3182517 3140978 3266784 3243993 3388553 3423584 3399800 3347107 3365342 3371503
15602 3371503 3264013 3275897 3202823 3189904 3398581 3251343 3220609 3293443 3344660 3412119 3422533
15591 3422533 3297752 3364603 3227406 3217810 3135388 3235284 3219853 3167688 3191286 3189954 3349442
15580 3349442 3457033 3469740 3309850 3340577 3410928 3519443 3484817 3346204 3201985 3337805
15570 3337805 3454010 3452945 3365539 3422647 3420749 3580034 3577549 3420566 3373195 3273975 3412841
15559 3412841 3439974 3512629 3359401 3355078 3278755 3369542 3390522 3266291 3301561 3465622 3534816
15548 3534816 3255553 3159628 3372913 3380311 3284742 3318376 3317700 3474493 3222481 3141254 3403256
15537 3403256 3298495 3275502 3287883 3324714 3301030 3149443 3321909 3440339 3311855 3421749
15527 3421749 3238469 3293544 3330399 3316225 3392830 3296908 3378825 3477710 3292018 3380827 3577445
15516 3577445 3377184 3347464 3439700 3354417 3370332 3349399 3318126 3175857 3257312 3342073 3341193
15505 3341193 3131101 3256631 3320519 3383440 3367938 3235675 3337858 3267880 3389479 3322771
15495 3322771 3171323 3085229 3110664 3055257 3052039 3191446 3212670 3293757 3233569 3043941 3259177
15484 3259177 3410438 3333203 3216801 3119720 3174966 3024924 3264404 3429024 3202825 3296465
15474 3296465 3485336 3557900 3212813 3079394 3302556 3353138 3358958 3396390 3330418 3416958 3454890
15463 3454890 3441691 3177875 2998158 3235991 3262393 3133665 2998680 3016746 3181599 3231685
15453 3231685 3123390 3164271 3399554 3372714 3282964 3311201 3172554 3129014 3234372 3411616
15443 3411616 3660177 3482681 3281519 3218273 3395700 3256677 3325818 3393114 3363630 3254618
15433 3254618 3175578 3237682 3258919 3165189 3083704 3138134 3120351 3217040 3413163 3335097 3174289
15422 3174289 3094330 3190550 3260894 3203331 3201015 3449472 3527678 3460783 3484727 3370656 3421767
15411 3421767 3306564 3122981 3196580 3278251 3465947 3556640 3330264 3220617 3312734 3455147
15401 3455147 3565815 3288464 3339384 3367536 3257280 3309283 3239669 3339924 3132816 3308897
15391 3308897 3330797 3309564 3360094 3424258 3254022 3220937 3189092 3063904 3302485 3435420
15381 3435420 3516043 3514863 3657527 3583931 3411535 3283850 3346151 3392453 3403507 3401009 3509993
15370 3509993 3427979 3518091 3370646 3388953 3558276 3421416 3396699 3471343 3313008 3223145
15360 3223145 3191587 3292831 3529575 3585063 3490993 3443199 3454343 3235450 3293756 3298546 3381110
15349 3381110 3272053 3333210 3274174 3348208 3525893 3453009 3412513 3312221 3447244 3369628
15339 3369628 3228925 3204947 3152869 3379043 3266642 3319985 3470890 3504311 3395159 3435528
15329 3435528 3712059 3664190 3526537 3519928 3274516 3208108 3136789 3173464 3138242 3366180 3169348
15318 3169348 3058713 3345389 3287726 3072235 3061999 3095566 3291041 3420261 3420695 3391273 3460582
15307 3460582 3676373 3776451 3490736 3385241 3513529 3308246 3280147 3225107 3316932 3277234
15297 3277234 3199127 3288806 3314424 3345131 3407901 3334254 3234229 3240449 3287120 3254964 3267415
15286 3267415 3329349 3459858 3342552 3301696 3329786 3360563 3309209 3403131 3532698 3522793 3453116
15275 3453116 3340363 3004295 3180580 3264965 3197884 3441038 3529621 3538408 3475904 3497482 3516194
15264 3516194 3327248 3180657 3356401 3412549 3453732 3498271 3350163 3227984 3273136 3519466
15254 3519466 3482846 3510652 3429621 3348724 3489409 3346487 3257447 3377502 3447319 3554883
15244 3554883 3473028 3460025 3539796 3369130 3157534 3133094 3119121 3357554 3524247 3320968
15234 3320968 3236586 3302776 3340462 3303080 3371775 3349607 3226602 3231886 3402430 3478023 3329611
15223 3329611 3324012 3448591 3523939 3482216 3378595 3451144 3466955 3527457 3400677 3392305 3394733
15212 3394733 3398675 3500758 3203840 3181480 3365892 3400705 3417716 3349038 3711035 3640472 3487853
15201 3487853 3524602 3494927 3568933 3422935 3441568 3311319 3549842 3486934 3382249 3447513
15191 3447513 3644455 3568380 3351484 3367831 3218749 3325836 3321882 3394744 3453689 3608370
15181 3608370 3555033 3316404 3166552 3257965 3389878 3464091 3445079 3367327 3304618 3409376
15171 3409376 3571011 3347337 3295510 3315847 3377778 3320194 3374439 3511590 3373323 3241814
15161 3241814 3261523 3407024 3420775 3302169 3362247 3432405 3467787 3609438 3586500 3466258
15151 3466258 3461390 3339318 3481732 3329698 3445781 3541494 3418197 3487476 3353980 3394322
15141 3394322 3468524 3484860 3461326 3284855 3450996 3366081 3412550 3480635 3313167 3387434 3544566
15130 3544566 3584291 3415514 3594500 3376088 3404075 3452189 3481056 3274295 3207010 3184566
15120 3184566 3220504 3279392 3317035 3478404 3442625 3297943 3410375 3610378 3581006 3405170
15110 3405170 3363207 3661330 3700407 3643417 3645658 3588568 3668404 3663207 3500758 3325618 3500337
15099 3500337 3614483 3335551 3177887 3429394 3478810 3382938 3361891 3449020 3460632 3518226
15089 3518226 3459814 3490984 3451280 3391808 3445150 3431270 3564478 3311032 3394940 3420182 3660758
15078 3660758 3659185 3526894 3619998 3777196 3691247 3564085 3495167 3516751 3448541 3302720 3340151
15067 3340151 3495907 3465931 3350979 3593233 3341810 3344090 3368268 3448996 3525582 3374646
15057 3374646 3225700 3300391 3374887 3372114 3321306 3149047 3363996 3433905 3423001 3485306 3513571
15046 3513571 3412915 3229322 3236228 3303782 3374773 3383987 3368521 3361137 3354732 3253952 3402250
15035 3402250 3382409 3455899 3497836 3405720 3241456 3494042 3450937 3395926 3306886 3134903 3299074
15024 3299074 3187467 3394381 3346419 3194579 3369026 3521477 3470266 3524068 3499525 3438477
15014 3438477 3462470 3390057 3366454 3442241 3515792 3539180 3447991 3390504 3331892 3521739 3616109
15003 3616109 3539071 3378678 3487376 3729023 3711981 3608433 3463460 3462514 3478450 3471762 3610032
14992 3610032 3507452 3505158 3528243 3476479 3522262 3501711 3571846 3602443 3420559 3535679 3395689
14981 3395689 3201813 3343132 3480179 3470069 3287987 3025611 3344370 3624345 3510594 3550510
14971 3550510 3633148 3568132 3653306 3609839 3486088 3225130 3333378 3450109 3636212 3617485
14961 3617485 3501636 3616737 3604277 3521300 3370908 3636250 3433149 3406329 3403686 3446896
14951 3446896 3340025 3342647 3521695 3383237 3311896 3219958 3259849 3383086 3496042 3315092
14941 3315092 3561654 3592780 3567949 3585668 3689407 3759562 3637885 3616615 3384617 3491643
14931 3491643 3597463 3463273 3504235 3565815 3655643 3463349 3281850 3342057 3447744 3398050
14921 3398050 3493664 3432939 3329447 3397817 3368211 3265801 3185623 3299233 3508816 3483820
14911 3483820 3360826 3500927 3227764 3366367 3327601 3472198 3631480 3585041 3512931 3442110
14901 3442110 3435971 3665298 3563564 3689398 3714373 3739766 3732953 3749537 3753425 3482324 3285658
14890 3285658 3435932 3442269 3482878 3444687 3485576 3595846 3615718 3573706 3533585 3545166 3605795
14879 3605795 3520818 3279681 3307482 3488224 3501682 3587174 3579941 3774304 3949145 3799288
14869 3799288 3680387 3472305 3628171 3518868 3592430 3632778 3460960 3761523 3619813 3393158
14859 3393158 3466337 3600345 3644950 3536288 3781673 3817150 3794807 3705952 3597847 3436520
14849 3436520 3361810 3396906 3613036 3439138 3419871 3504621 3369044 3545262 3447568 3307381
14839 3307381 3270144 3362296 3544147 3648904 3625835 3547759 3651430 3770896 3743488 3556180
14829 3556180 3379999 3498167 3518974 3421980 3467375 3503225 3730489 3513662 3450852 3440780
14819 3440780 3471809 3430510 3559521 3624377 3568307 3496616 3418053 3451256 3589537 3624807 3705437
14808 3705437 3711976 3615534 3511754 3355618 3321278 3491966 3615673 3549885 3645241 3693373 3534051
14797 3534051 3611476 3583973 3504484 3668341 3729173 3717148 3675077 3485013 3417664 3620322 3804769
14786 3804769 3737385 3639372 3641338 3724014 3872995 3655642 3605828 3571943 3695567 3634431 3490060
14775 3490060 3300841 3287164 3514028 3780048 3952991 3813146 3615635 3633696 3634358 3531245
14765 3531245 3485725 3441502 3601515 3402027 3479679 3592346 3604499 3734185 3688490 3545942
14755 3545942 3697145 3684096 3580582 3573316 3396519 3418722 3348819 3337435 3339688 3509646 3592243
14744 3592243 3587056 3701322 3626179 3660307 3611593 3433572 3304774 3399470 3615441 3639375 3475673
14733 3475673 3673126 3603667 3602874 3557443 3425435 3530179 3548594 3687330 3603733 3485795 3407372
14722 3407372 3328595 3302275 3296352 3595101 3685573 3678827 3602760 3612108 3790634 3568800 3586313
14711 3586313 3356422 3681135 3722277 3762175 3546926 3554997 3752363 3516011 3611529 3697659
14701 3697659 3612695 3567810 3596028 3494886 3504131 3706310 3800841 3936003 3604281 3506357 3662914
14690 3662914 3654283 3587580 3555590 3433185 3754684 3587384 3195908 3244703 3416799 3553948
14680 3553948 3734118 3690833 3684077 3640041 3582864 3759637 3715123 3747969 3641145 3673191 3675266
14669 3675266 3788846 3541715 3592448 3441973 3248162 3394312 3568031 3637557 3857346 3791778
14659 3791778 3884573 3845751 3779378 3727221 3679654 3610489 3609350 3657407 3563973 3744569 3792304
14648 3792304 3751882 3676972 3731235 3720555 3493809 3448877 3491485 3646877 3494437 3450010 3572113
14637 3572113 3516005 3698471 3885904 3574199 3512763 3642093 3601197 3739614 3765805 3731402
14627 3731402 3752955 3550031 3662309 3781107 3635066 3675029 3885029 3621484 3560526 3530203
14617 3530203 3438108 3735836 3600171 3653975 3773043 3738499 3799838 3611515 3525800 3646118
14607 3646118 3864340 3700870 3639740 3593013 3534936 3599473 3501718 3617556 3780382 3788010 3622143
14596 3622143 3519726 3405643 3436483 3581609 3543027 3360684 3625239 3657815 3788505 3498575
14586 3498575 3549037 3460895 3338032 3408807 3659860 3617290 3681812 3675310 3542456 3437290 3411467
14575 3411467 3505832 3558013 3665180 3700860 3831566 3538766 3469936 3704280 3569513 3618435
14565 3618435 3895806 3732160 3698828 3647859 3494354 3540248 3700254 3840798 3812144 3776846
14555 3776846 3869146 3677059 3639419 3644538 3591577 3608974 3599841 3583401 3612470 3639165 3661756
14544 3661756 3578932 3604893 3427452 3553928 3463159 3477839 3666309 3770710 3743374 3759369
14534 3759369 3716311 3580519 3811548 3892811 3920679 3657391 3686067 3695879 3609506 3547209 3686490
14523 3686490 3739752 3730068 3692667 3626795 3792873 3707017 3631838 3514488 3500685 3512969 3616491
14512 3616491 3545476 3511391 3369475 3614757 3711746 3822668 3689307 3737520 3815565 3538637
14502 3538637 3420462 3493152 3564866 3492107 3561084 3477398 3634169 3539169 3440926 3608238 3723975
14491 3723975 3648816 3682822 3645978 3598866 3571299 3579397 3574250 3650043 3896038 3828139 3737435
14480 3737435 3557227 3444753 3562874 3629201 3765937 3841217 3722908 3572667 3802937 3895376
14470 3895376 3679681 3673131 3841493 3615872 3589262 3675383 3691176 3704514 3728207 3847349 3825978
14459 3825978 3936318 3836241 3753832 3822101 3787060 3679146 3839169 3681922 3645952 3814100
14449 3814100 3827618 4019237 3843387 3859513 3721988 3681648 3587304 3785570 3826954 3756476
14439 3756476 3591058 3460169 3567809 3679583 3732485 3779388 3779275 3859782 3978058 3784130
14429 3784130 3797812 3790851 3686419 3567755 3893756 3841888 3842377 3701857 3518158 3375520 3603052
14418 3603052 3733831 3643174 3551156 3538098 3680637 3829596 3711667 3501447 3501978 3466981 3570474
14407 3570474 3588415 3738242 3794237 3895598 3819647 3632630 3495728 3574821 3723419 3795017
14397 3795017 3663246 3669584 3639059 3779066 3849629 3866550 3932475 3743557 3796899 3672568 3730171
14386 3730171 3871387 3648878 3781989 3574353 3552249 3781176 3912775 3849951 4005549 3954532
14376 3954532 3737418 3739307 3733525 3800490 3816905 3823882 3770337 3771675 3662846 3627287 3453548
14365 3453548 3435138 3518823 3604977 3587186 3581995 3623589 3630643 3845331 3736891 3868858 3753105
14354 3753105 3642632 3799801 3720236 3570422 3570921 3796941 3797703 3784932 3857112 3819431 3716408
14343 3716408 3797796 3705566 3708197 3667369 3645542 3630270 3753130 3713892 3552189 3636013 3752851
14332 3752851 3738775 3527525 3608533 3724242 3635678 3639756 3462542 3534668 3457521 3551105 3515114
14321 3515114 3524528 3647451 3626992 3668619 3885381 3763432 3596185 3687207 3844591 3760797
14311 3760797 3571821 3739386 3902298 3941551 3908265 3837423 3878809 3932982 3832881 3823478 3781434
14300 3781434 3811405 3932925 3846272 3748414 3790407 3796668 3940232 3886463 3713815 3942257 3703815
14289 3703815 3730414 3797201 3700085 3740226 3772497 3792214 3893885 3754747 3741178 3642834 3393832
14278 3393832 3614951 3635804 3762281 3713934 3764474 3734249 3673228 3508801 3472757 3673308
14268 3673308 3851446 3904892 3876497 3714258 3654424 3681081 3778926 3804905 3894123 3725847 3695968
14257 3695968 3698869 3495425 3551344 3464816 3439539 3565250 3751036 3883186 3770093 3932178
14247 3932178 4034475 3877565 3570603 3495152 3779504 3931089 3818011 3797353 3760618 3861636
14237 3861636 3843335 3926729 3811601 3682402 3921633 3971320 3833770 3692005 3712719 3885064
14227 3885064 3838620 3918921 3909097 3770588 4032631 3940862 3738644 3776267 3829749 3667045 3728443
14216 3728443 3790810 3800741 3829263 3784940 3864602 3895297 3984859 3911621 3870272 3816357 3718407
14205 3718407 3865646 3798079 3763989 3761711 3971189 3866375 3794566 3670896 3817954 3862098
14195 3862098 3884966 3894070 3856718 3876946 3936671 3937916 3766783 3835505 3752555 3867909 3751804
14184 3751804 3879548 3878858 3687093 3653042 3827460 3712795 3825352 3828753 3820779 3773449 3861954
14173 3861954 3856371 3750653 3735343 3703188 3790199 3779905 3858256 3983105 3979934 3867096 3945832
14162 3945832 3706808 3715380 3871158 3928425 3886072 3635298 3765117 3797009 3740223 3789413 3850153
14151 3850153 3976773 3734712 3933125 4008779 3941229 3858524 3766912 3752876 3630571 3740445
14141 3740445 3862735 3782158 3879845 3713757 3745178 3995897 4032229 3990604 4020739 3981631 3688489
14130 3688489 3608488 3523125 3553418 3681706 3915736 4033411 3928151 3903067 3878017 3744507
14120 3744507 3709863 3851614 3895145 3895258 3925061 3934627 3979096 3877875 3860714 3785649 3789154 3863965
14108 3863965 3710452 3747334 3834106 4018641 3898215 4068746 3933402 3665392 3779858 3896827
14098 3896827 4017732 3773030 3677973 3701456 3711609 3769334 3596237 3847356 3854595 3715681
14088 3715681 3823073 3837229 3960064 3986050 3914093 3885982 3805271 3894952 3867259 3904177 3922261
14077 3922261 3936804 3916393 3849251 3690857 3707694 3815327 3770853 3846354 4064347 4082050 3905254
$$ [...]
##END NTUPLES=NMR SPECTRUM
##END=
