##TITLE=1H_CA-9040-2
 CDCl3
 108 sc, 
 25.07.2022
##JCAMPDX= 6.0         $$ Bruker NMR JCAMP-DX V2.0
##DATA TYPE= NMR SPECTRUM
##DATA CLASS= NTUPLES
##ORIGIN= UXNMR, Bruker Analytische Messtechnik GmbH
##OWNER= root
$$ XWIN-NMR		Version 3.5
$$ Mon Jul 25 14:23:07 2022 Russian Standard Time (UT+4h)  she@DPX200
##.OBSERVE FREQUENCY= 200.1313499994
##.OBSERVE NUCLEUS= ^1H
##.ACQUISITION MODE= SIMULTANEOUS
##.ACQUISITION SCHEME= undefined
##.AVERAGES= 9
##.DIGITISER RES= 18
##SPECTROMETER/DATA SYSTEM= spect
##.PULSE SEQUENCE= zg30
##.SOLVENT NAME= CDCl3
##.SHIFT REFERENCE= (INTERNAL, CDCl3, 0, 15.77)
##AUDIT TRAIL= $$ (NUMBER, WHEN, WHO, WHERE, WHAT)
$$ ##TITLE= Audit trail, XWIN-NMR		Version 3.5
$$ ##JCAMPDX= 5.01
$$ ##ORIGIN= Bruker BioSpin GmbH
$$ ##OWNER= she
$$ F:/spectra/data/she/nmr/H-F/1/pdata/1/auditp.txt
$$ ##AUDIT TRAIL=  $$ (NUMBER, WHEN, WHO, WHERE, WHAT)
(   1,<2022-07-25 14:21:33.78 +0400>,<she>,<DPX200>,
      <created by zg, POWCHK disabled, PULCHK disabled
       terminated by command 'halt'
       configuration hash MD5:
       00 E9 B6 7A A2 85 ED C7 34 08 36 98 17 FE 4E 26
       data hash MD5: 16K
       B4 3E FA 8A A4 DA 4D 49 3B 0F B4 26 26 11 15 67>)
(   2,<2022-07-25 14:21:37.93 +0400>,<she>,<DPX200>,
      <Start of raw data processing
       efp BC_mod = 2 LB = 0.24 FT_mod = 6 PKNL = 1 PHC0 = -18036.88 PHC1 = 7.60068 SI = 16K 
       data hash MD5: 16K
       28 28 6C 8E 44 45 09 9B 77 A4 B5 0B DE FA 46 7D>)
(   3,<2022-07-25 14:21:55.93 +0400>,<she>,<DPX200>,
      <pk PHC0 = -2.13308 PHC1 = 2.8 
       data hash MD5: 16K
       2E 7C 4A 34 4E 34 FA 98 68 C2 B6 05 BA C8 2F EE>)
(   4,<2022-07-25 14:21:59.59 +0400>,<she>,<DPX200>,
      <abs ABSG = 5 
       data hash MD5: 16K
       F2 CD 5B E3 33 F5 17 B3 04 5A AB 5A 00 6E DF F5>)
$$ ##END=
$$ 
$$ hash MD5
$$ D1 93 C3 CA 68 C4 09 F2 31 48 C4 46 C6 9D 6F 33
##$RELAX= 
##$RELAX= 
##$RELAX= 
##$RELAX= 
##$RELAX= 
##$RELAX= 
$$ Bruker specific parameters
$$ --------------------------
##$DU= <F:/spectra>
##$EXPNO= 1
##$NAME= <H-F>
##$PROCNO= 1
##$TYPE= <nmr>
##$USER= <she>
##$AMP= (0..31)
100 100 100 100 100 100 100 100 100 100 100 100 100 100 100 100 100 100 
100 100 100 100 100 100 100 100 100 100 100 100 100 100 
##$AQSEQ= 0
##$AQ_mod= 1
##$AUNM= <au_zg>
##$AUTOPOS= <>
##$BF1= 200.13
##$BF2= 200.13
##$BF3= 200.13
##$BF4= 200.13
##$BF5= 200.13
##$BF6= 200.13
##$BF7= 200.13
##$BF8= 200.13
##$BYTORDA= 1
##$CFDGTYP= 0
##$CFRGTYP= 5
##$CHEMSTR= <none>
##$CNST= (0..31)
1 1 145 1 1 1 1 1 1 1 1 1 1 1 1 1 1 1 1 1 1 1 1 1 1 1 1 1 1 1 1 1 
##$CPDPRG= <>
##$CPDPRG1= <>
##$CPDPRG2= <>
##$CPDPRG3= <>
##$CPDPRG4= <mlev>
##$CPDPRG5= <mlev>
##$CPDPRG6= <mlev>
##$CPDPRG7= <mlev>
##$CPDPRG8= <mlev>
##$CPDPRGB= <>
##$CPDPRGT= <>
##$D= (0..31)
0 1.2 0 0 0 0 0 0 0 0.06 0 0.03 0 0 0 0 0.0002 0 0 0 0 0 0 0 0 0 0 0 0 
0 0 0 
##$DATE= 1658744493
##$DBL= (0..7)
120 120 120 120 120 120 120 120 
##$DBP= (0..7)
150 150 150 150 150 150 150 150 
##$DBP07= 0
##$DBPNAM0= <>
##$DBPNAM1= <>
##$DBPNAM2= <>
$$ [...]
##$SUBNAM2= <"">
##$SUBNAM3= <"">
##$SUBNAM4= <"">
##$SUBNAM5= <"">
##$SUBNAM6= <"">
##$SUBNAM7= <"">
##$SUBNAM8= <"">
##$SUBNAM9= <"">
##$SW= 18.0517283424941
##$SWIBOX= (0..15)
0 0 2 0 0 0 0 0 0 0 0 0 0 0 0 0 
##$SW_h= 3612.71676300578
##$TD= 16384
##$TD0= 1
##$TE= 0
##$TE2= 300
##$TE3= 300
##$TEG= 300
##$TL= (0..7)
0 120 120 120 120 120 120 120 
##$TP= (0..7)
150 150 150 150 150 150 150 150 
##$TP07= 0
##$TPNAME0= <>
##$TPNAME1= <>
##$TPNAME2= <>
##$TPNAME3= <>
##$TPNAME4= <>
##$TPNAME5= <>
##$TPNAME6= <>
##$TPNAME7= <>
##$TPOAL= (0..7)
0.5 0.5 0.5 0.5 0.5 0.5 0.5 0.5 
##$TPOFFS= (0..7)
0 0 0 0 0 0 0 0 
##$TUNHIN= 0
##$TUNHOUT= 0
##$TUNXOUT= 0
##$USERA1= <user>
##$USERA2= <user>
##$USERA3= <user>
##$USERA4= <user>
##$USERA5= <user>
##$V9= 5
##$VALIST= <valist>
##$VCLIST= <CCCCCCCCCCCCCCC>
##$VD= 0
##$VDLIST= <DDDDDDDDDDDDDDD>
##$VPLIST= <PPPPPPPPPPPPPPP>
##$VTLIST= <TTTTTTTTTTTTTTT>
##$WBST= 1024
##$WBSW= 4
##$XGAIN= (0..3)
0 0 0 0 
##$XL= 0
##$YL= 0
##$YMAX_a= 196352
##$YMIN_a= -245709
##$ZGOPTNS= <>
##$ZL1= 120
##$ZL2= 120
##$ZL3= 120
##$ZL4= 120
##$ABSF1= 15.73366
##$ABSF2= -2.31819
##$ABSG= 5
##$ABSL= 3
##$ALPHA= 0
##$AQORDER= 0
##$ASSFAC= 0
##$ASSFACI= 0
##$ASSFACX= 0
##$ASSWID= 0
##$AUNMP= <proc_1d>
##$AZFE= 0.1
##$AZFW= 0.1
##$BCFW= 0
##$BC_mod= 2
##$BYTORDP= 0
##$COROFFS= 0
##$CY= -3
##$DATMOD= 1
##$DC= 0
##$DFILT= <>
##$DTYPP= 0
##$F1P= 0
##$F2P= 0
##$FCOR= 1
##$FTSIZE= 16384
##$FT_mod= 6
##$GAMMA= 0
##$GB= 0
##$INTBC= 1
##$INTSCL= 0
##$ISEN= 128
##$LB= 0.24
##$LEV0= 0
##$LPBIN= 0
##$MAXI= 10000
##$MC2= 0
##$MEAN= 0
##$ME_mod= 0
##$MI= 1.114404
##$NCOEF= 0
##$NC_proc= -7
##$NLEV= 6
##$NOISF1= 3.799351
##$NOISF2= 2.8
##$NSP= 0
##$NTH_PI= 0
##$NZP= 0
##$OFFSET= 15.77003
##$PC= 1
##$PHC0= -18039.01
##$PHC1= 10.40068
##$PH_mod= 1
##$PKNL= yes
##$PPARMOD= 0
##$PSCAL= 0
##$PSIGN= 0
##$REVERSE= no
##$SF= 200.130000301612
##$SI= 16384
##$SIGF1= 3
##$SIGF2= 2
##$SINO= 5.538805
##$SIOLD= 16384
##$SREGLST= <1H.CDCl3>
##$SSB= 0
##$STSI= 16384
##$STSR= 0
##$SW_p= 3612.71676300578
##$SYMM= 0
##$S_DEV= 0
##$TDeff= 16384
##$TDoff= 0
##$TI= <>
##$TILT= no
##$TM1= 0
##$TM2= 0
##$TOPLEV= 0
##$USERP1= <user>
##$USERP2= <user>
##$USERP3= <user>
##$USERP4= <user>
##$USERP5= <user>
##$WDW= 1
##$XDIM= 16384
##$YMAX_p= 527929794
##$YMIN_p= -592259
$$ End of Bruker specific parameters
$$ ---------------------------------
##NTUPLES= NMR SPECTRUM
##VAR_NAME=  FREQUENCY,     SPECTRUM/REAL,   SPECTRUM/IMAG
##SYMBOL=    X,             R,               I
##VAR_TYPE=  INDEPENDENT,   DEPENDENT,       DEPENDENT
##VAR_FORM=  AFFN,          ASDF,            ASDF
##VAR_DIM=   16384,         16384,           16384
##UNITS=     HZ,            ARBITRARY UNITS, ARBITRARY UNITS
##FACTOR=    0.220516191357247, 1,           1
##FIRST=     3156.05611299274, 0,            0
##LAST=      -456.660650013037, 0,           0
##MIN=       -456.660650013037, -592259,     0
##MAX=       3156.05611299274, 527929794,    0
$$ Real data points
##PAGE= N=1
##DATA TABLE= (X++(R..R)), XYDATA
$$ [...]
$$ plain form
7400 -86056 84222 169602 -77869 -209290 -31137 -329289 -262734 -140862 -78882 -62247 -260662
7389 -260662 -140488 -111058 -65007 -159390 -32698 -105629 -224701 -147690 -1298 40441 -174688
7378 -174688 -95690 -124034 -161898 -447308 -200763 37005 19191 -105786 -120471 58867 -122186
7367 -122186 -44383 -65762 -17522 58700 131809 42963 56253 -57936 -153522 -123026 -156149
7356 -156149 -169078 32945 97499 92851 69954 96309 66146 -120134 -258271 -134543 -155053
7345 -155053 -188390 -158110 -316220 -148577 -52798 -64225 -197306 -32722 176589 -45067
7335 -45067 59893 -52392 -54991 -52487 -67324 -238761 -216466 70975 133144 86578 5569
7324 5569 -108132 -232527 -186346 -107940 14195 4439 -101165 -250903 -204661 -139388 -111775
$$ packed form
7400h6056J70278Q5380k47471j31421J78153k98152O6555J21872O1980J6635j98415
7389b60662J20174K9430M6051r4383J26692p2931j19072P7011J46392M1739k15129
7378a74688P8998k8344l7864k85410K46545K37768j7814j24977j4685J79338j81053
7367a22186P7803k1379M8240P6222P3109q8846J3290j14189r5586L0496l3123
7356a56149j2929K02023O4554m648k2897K6355l0163j86280j38137J23728k0510
7345a55053l3337L0280j58110J67643R5779j1427j33081J64584K09311k21656
7335d5067J04960j12285k599K504j4837j71437K2295K87441O2169m6566q1009
7324E569j13701j24395M6181P8406J22135r756j05604j49738M6242O5273K7613
$$ plain form
7313 -111775 -18446 -96011 -300929 -260781 -110018 -229281 -245919 -191101 -244145 -281055 -134556
7302 -134556 -189760 -163569 -130411 -168995 -164260 -287501 -369682 -349467 -16593 117100 29833
7291 29833 -222037 -404246 -358039 -161268 -161410 -131185 -126952 -195968 -72734 -132050 -152736 -170000
7279 -170000 -122845 -102784 30385 65734 -100081 -106031 -256151 -154902 -286123 -299766 -252256
7268 -252256 -252605 -31529 -79378 -360937 -165192 -62479 -130053 -343847 -220284 -38028 -253194
7257 -253194 -432950 -287223 -224059 -320501 -109700 -266876 -272060 -293044 -358204 -75162 -69827
7246 -69827 4565 -9382 -119348 93593 17927 -161131 -203523 -3634 110204 -71762 -217534
7235 -217534 -388370 -291070 -374136 -244107 -114764 -249136 -191259 -36865 -200545 -40266
$$ packed form
7313a11775R3329p7565k04918M0148J50763j19263j6638N4818n3044l6910J46499
7302a34556n5204K6191L3158l8584M735j23241q2181K0215L32874J33693q7267
7291B9833k51870j82209M6207J96771j42L0225M233o9016J23234n9316k0686j7264
7279a70000M7155K0061J33169L5349j65815n950j50120J01249j31221j3643M7510
7268b52256l49K21076m7849k81559J95745J02713o7574k13794J23563J82256k15166
7257b53194j79756J45727O3164r6442K10801j57176n184k0984o5160K83042N335
7246f9827P4392j3947j09966K12941p5666j79058m2392J99889J13838j81966j45772
7235b17534j70836R7300q3066J30029J29343j34372N7877J54394j63680J60279
$$ plain form
7225 -40266 -140933 -370530 -152067 -134826 -120412 -329828 -335068 -267601 -260146 -147659 -108999
7214 -108999 -256366 -116344 -215799 -243617 -136754 -254466 -137088 -206722 -57683 55324
7204 55324 125002 -26855 5581 119396 42517 16174 -216129 -156042 -363959 -224067 -40187
7193 -40187 -233500 -60679 -157559 -210012 -77637 -44900 -90658 -97286 -232670 -338658 -9010
7182 -9010 260454 13602 -50265 -2014 -223404 -156835 16293 9013 -129008 -197338 -153272
7171 -153272 -190246 -299229 -180520 -186299 -140600 -240543 -239087 -121199 90524 11109 7218
7160 7218 -105917 -18368 -85570 -21055 -112901 -287707 -181578 1099 72365 -24386 -79836
7149 -79836 -175112 -169274 -189784 -377437 -319877 -42458 5441 -175916 -283352 -156774 -140433
$$ packed form
7225d0266j00667k29597K18463J7241J4414k09416n240O7467P455J12487L8660
7214a08999j47367J40022r9455k7818J06863j17712J17378o9634J49039J13007
7204E5324O9678j51857L2436J13815p6879k6343k32303O0087k07917J39892J83880
7193d0187j93313J72821r6880n2453J32375L2737m5758o628j35384j05988L29648
7182i010K69464k46852o3867M8251k21390O6569J73128p280j38021o8330M4066
7171a53272l6974j08983J18709n779M5699r9943J456J17888K11723p9415l891
7160G218j13135Q7549o7202O4515r1846j74806J06129J82677P1266r6751n5450
7149g9836r5276N838k0510j87653N7560K77419M7899j81357j07436J26578J6341
$$ plain form
7138 -140433 -170881 42282 103120 52337 121161 -232009 -382635 -74433 84747 -67499
7128 -67499 -7043 -22214 -13869 -96596 8193 66728 128412 44539 -51212 -25947 -37102 -71325
7116 -71325 -192391 -280599 -238647 -197635 -263869 -243969 -269908 -350139 -187739 -81387 -254345
7105 -254345 -49902 203930 137710 -272171 -322363 -134771 -214329 -166398 -71004 105819 25428
7094 25428 66330 203616 -14830 27971 193470 84343 -95876 -291982 -361187 -331377 -142444
7083 -142444 -325782 -252619 -179743 -244514 -34657 -65128 -133091 -182420 -126138 -112451 -255332
7072 -255332 -218103 -92117 -148625 -185110 -211013 -110077 49489 -118802 -173525 -141788 -39933
7061 -39933 -140953 -298134 -52195 -188398 -327020 -233960 -49273 124970 29396 -118408
$$ packed form
7138a40433l0448K13163O0838n0783O8824l53170j50626L08202J59180j52246
7128f7499O0456j5171Q345q2727J04789N8535O1684q3873r5751K5265j1155l4223
7116g1325j21066q8208M1952M1012o6234J9900k5939q0231J62400J06352j72958
7105b54345K04443K53832o6220m09881n0192J87592p9558M7931R5394J76823q0391
7094B5428M0902J37286k18446M2801J65499j09127j80219j96106o9205K9810J88933
7083a42444j83338P3163P2876o4771K09857l0471o7963m9329N6282J3687j42881
7072b55332L7229J25986n6508l6485k5903J00936J59566j68291n4723L1737J01855
7061c9933j01020j57181K45939j36203j38622R3060J84687J74243r5574j47804
$$ plain form
7051 -118408 -272392 -252620 -232674 -220397 -82886 99663 -77397 -316842 -237803 -4951
7041 -4951 47487 19536 59876 -249698 -488060 -360680 -161521 62487 -111343 -233290 -82047
7030 -82047 -51017 98091 -50232 -198014 -248988 -209165 -85103 -191124 -190976 -178489 -335525
7019 -335525 -239170 -132670 81828 9575 26487 299092 38545 -140349 -257202 -179307
7009 -179307 2771 -102674 138217 335220 230589 -38567 -165620 -10292 60528 47092
6999 47092 -183395 -339796 -368241 -170853 -171169 -251598 -112553 -141604 -105424 -145070 -281408
6988 -281408 -121281 -193872 -227746 23209 -107219 -201059 -159074 -58710 -138663 -158086 -145383
6977 -145383 -104948 -85319 -79906 -207819 -237363 -31691 -12425 124383 70599 14031 -52088
$$ packed form
7051a18408j53984J9772J9946J2277J37511J82549j77060k39445P9039K32852
7041d951N2438k7951M0340l09574k38362J27380J99159K24008j73830j21947J51243
7030h2047L1030J49108j48323j47782n0974L9823J24062j06021J48J2487j57036
7019c35525R6355J06500K14498p2253J6912K72605k60547j78894j16853P7895
7009a79307J82078j05445K40891J97003j04631k69156j27053J55328P0820j3436
6999D7092k30487j56401k8445J97388l16q0429J39045k9051L6180l9646j36338
6988b81408J60127p2591l3874K50955j30428r3840M1985J00364p9953j9423J2703
6977a45383M0435J9629N413j27913k9544K05672J9266J36808n3784n6568o6119
$$ plain form
6966 -52088 80970 95769 -186432 -189634 -189193 22915 352001 223140 36674 44296 88894
6955 88894 -6884 30685 -136339 -177665 -133613 -229985 -319914 -285908 -186104 -97337 34738
6944 34738 133187 -10740 -117159 -186735 -252587 -62758 54135 82563 -72600 -47740 -51660
6933 -51660 -115396 -54490 -170084 -300441 -109608 -39563 -28588 56011 84910 4333 -24677
6922 -24677 -57408 -8882 -163502 -153239 -299825 -197106 -154366 44998 137307 122092 136740
6911 136740 86187 84452 127222 118891 126473 166316 141360 -140646 -9968 75657 -29756 -281731
6899 -281731 -209083 -135981 -170356 43433 -73363 149421 124976 -80741 39508 229029
6889 229029 -89657 -144538 -220438 -47115 -102284 156902 -12481 -157514 -146820 -462002
$$ packed form
6966e2088J33058J4799k82201l202M41K12108L29086j28861j86466P622M4598
6955H8894r5778L7569j67024m1326M4052r6372q9929L4006R9804Q8767J32075
6944C4738R8449j43927j06419o9576o5852J89829J16893K8428j55163K4860l920
6933e1660o3736O0906j15594j30357J90833P0045J0975Q4599K8899q0577k9010
6922b4677l2731M8526j54620J0263j46586J02719M2740J99364R2309j5215J4648
6911A36740n0553j735M2770q331P582L9843k4956k82006J30678Q5625j05413k51975
6899b81731P2648P3102l4375K13789j16796K22784k4445k05717J20249J89521
6889B29029l18686n4881p5900J73323n5169K59186j69383j45033J0694l15182
$$ plain form
6879 -462002 -511431 -207553 -256052 -345854 -219016 -357980 -377217 -210033 -74282 59106
6869 59106 -63501 27001 230966 204059 44545 -4055 -73482 -228060 -62758 89447 38551
6858 38551 -79930 -265589 -268964 -148383 -221245 -49917 -19674 226184 118785 -100107 -319422
6847 -319422 -335347 -212090 -301586 -86103 -171208 -352129 -473910 -336450 -168219 4768
6837 4768 -199369 -11524 138453 -225895 -155421 -182119 -47039 169966 -1304 -45210 203653
6826 203653 -145596 -375434 -259981 -78333 -72742 -209988 -95222 -97300 -219516 -151821 -184693
6815 -184693 -238097 -106450 -189149 -119166 -90379 -207079 -153195 -58608 -127399 -138834 10260
6804 10260 -47324 10254 62539 20060 75244 -2477 22767 73606 119038 112688 47606 91243
$$ packed form
6879d62002m9429L03878m8499q9802J26838j38964j9237J67184J35751J33388
6869E9106j22607R0502K03965k6907j59514m8600o9427j54578J65302J52205n0896
6858C8551j18481j85659l375J20581p2862J71328L0243K45858j07399k18892k19315
6847c19422j5925J23257q9496K15483q5105j80921j21781J37460J68231J72987
6837D768k04137J87845J49977l64348P0474k6698J35080K17005j71270m3906K48863
6826B03653l49249k29838J15453J81648N591j37246J14766k078j22216O7695l2872
6815a84693n3404J31647q2699O9983K8787j16700N3884R4587o8791j1435J49094
6804A0260n7584N7578N2285m2479N5184p7721K5244N0839M5432o350o5082M3637
$$ plain form
6792 91243 88634 81970 137008 -203466 -465666 -302823 -297865 -122061 -320836 -220770 -42984
6781 -42984 -26729 -53046 -56940 64792 8377 120192 153167 43943 277412 287079 -30315
6770 -30315 73996 91889 56426 10507 11882 31653 33190 277277 108752 -11893 105166
6759 105166 103757 113840 -153789 -265956 -33761 90155 -113003 22023 75165 -20698 -18232
6748 -18232 -108500 -112560 -90588 -253929 -209915 -68106 -82473 -89676 -161770 -140026 -133030 18730
6736 18730 125022 145804 158064 -95989 -142060 15270 53278 -1708 -62804 3892 -121995
6725 -121995 -156874 -27294 -142318 -123281 135946 52009 -38013 42081 71787 -98269 -60689
6714 -60689 -206369 -247967 -226123 -109387 81354 -64977 34788 -197363 -185494 -41629 52838
$$ packed form
6792I1243k609o664N5038l40474k62200J62843M958J75804j98775J00066J77786
6781d2984J6255k6317l894J21732n6415J11815L2975j09224K33469R667l17394
6770c0315J04311J7893l5463m5919J375J9771J537K44087j68525j20645J17059
6759A05166j409J0083k67629j12167K32195J23916k03158J35026N3142r5863K466
6748a8232r0268m060K1972j63341M4014J41809j4367p203p2094K1744O996J51760
6736A8730J06292K0782J2260k54053m6071J57330L8008n4986o1096O6696j25887
6725a21995l4879J29580j15024J9037K59227q3937r0022Q0094K9706j70056L7580
6714f0689j45680m1598K1844J16736J90741j46331R9765k32151J1869J43865R4467
$$ plain form
6703 52838 118868 -80675 -44890 -136077 -175854 -101513 33817 -81684 19714 127726 238690
6692 238690 324549 191444 23531 -137008 -198111 -52642 -35257 -32116 70869 120316 33424
6681 33424 -35829 199579 62567 98250 177220 95239 20137 35793 -4566 -69734 -64646 24032
6669 24032 19947 -128830 -305126 -122618 49236 57329 230431 218446 -27271 -48797 -130124
6658 -130124 -19969 -112494 -303986 -52731 -68848 -83329 -56380 -96857 -192768 -442647 -23754
6647 -23754 117329 6891 -35268 -70505 -134535 -121035 -194140 -104239 -6818 67813 174516
6636 174516 34234 11054 83085 81052 16544 204232 125125 148775 65603 66854 -55262
6625 -55262 -44970 -65558 14128 32266 133832 -44382 -64988 -173978 -202212 -101768 -135874
$$ packed form
6703E2838O6030j99543L5785r1187l9777P4341J35330j15501J01398J08012J10964
6692B38690Q5859j33105j67913j60539o1103J45469J7385L141J02985M9447q6892
6681C3424o9253K35408j37012L5683P8970q1981p5102J5656m0359o5168N088Q8678
6669B4032m085j48777j76296J82508J71854Q093J73102j1985k45717k1526q1327
6658a30124J10155r2525j91492K51255j6117j4481K6949m0477r5911k49879M18893
6647b3754J41083j10438m2159l5237o4030J3500p3105Q9901R7421P4631J06703
6636A74516j40282k3180P2031k033o4508J87688p9107K3650q3172J251j22116
6625e5262J0292k0588P9686J8138J01566j78214k0606j08990k8234J00444l4106
$$ plain form
6614 -135874 31501 -68218 53225 140298 4310 84394 193728 143724 58585 -226533 -2917
6603 -2917 179821 289755 -121329 -48604 69674 15702 97249 119367 212260 184495 68428
6592 68428 -130818 61791 175578 53484 48732 10904 21742 -1624 -104392 -101077 -30487
6581 -30487 62430 -32441 -5772 79299 157883 202158 289058 234705 1381 8014 112720 198559
6569 198559 -79097 -133004 -155735 -250586 -198997 -257052 -175245 -24815 -36671 -182623 -37251
6558 -37251 37556 -140819 -107111 76281 128780 -41512 -216830 89497 56978 -322075 -140560
6547 -140560 -11796 110120 168857 -108825 -207899 -182437 -2975 154827 54921 34664 -2370
6536 -2370 -84880 110006 9992 -49878 14970 268574 126089 35306 8743 171840 52045
$$ packed form
6614a35874J67375r9719J21443Q7073j35988Q0084J09334n0004q5139k85118K23616
6603b917J82738J09934m11084P2725J18278n3972Q1547K2118R2893k7765j16067
6592F8428j99246J92609J13787j22094m752l7828J0838k3366j02768L315P0590
6581c0487R2917r4871K6669Q5071P8584M4275Q6900n4353k33324O633J04706Q5839
6569A98559k77656n3907k2731r4851N1589n8055Q1807J50430j1856j45952J45372
6558c7251P4807j78375L3708J83392N2499j70292j75318L06327l2519l79053J81515
6547a40560J28764J21916N8737k77682r9074K5462J79462J57802r9906k0257l7034
6536b370q2510J94886j00014n9870O4848K53604j42485r0783k6563J63097j19795
$$ plain form
6525 52045 -183845 -110325 63425 11051 -143759 -86405 -66453 70521 59193 -54515 -126575
6514 -126575 -108650 -109185 -69387 36819 71440 -72822 -167519 -153704 -170367 -11079 -49360
6503 -49360 -91271 -117879 -254352 -223321 -201247 19220 26327 150808 222634 -27510 -202147
6492 -202147 -119066 129974 37979 21529 68647 7003 -29517 -24402 120261 -57333 -255462
6481 -255462 66822 309200 248712 72590 70648 102939 76334 -67954 5448 90568 -82460
6470 -82460 4686 -12257 66076 136592 98444 -72741 -22300 -8571 -109803 -135643 -138392 -141623
6458 -141623 19809 -129459 -186101 28312 -213183 -183454 115128 151572 127982 79301 136148
6447 136148 48970 167190 158826 235945 292617 239842 192867 101012 126428 -47587 -130014
$$ packed form
6525E2045k35890P3520J73750n2374j54810N7354J9952J36974j1328j13708p2060
6514a26575J7925n35L9798J06206L4621j44262r4697J3815j6663J59288l8281
6503d9360m1911k6608j36473L1031K2074K20467P107J24481P1826k50144j74637
6492b02147Q3081K49040r1995j6450M7118o1644l6520N115J44663j77594j98129
6481b55462L22284K42378o0488j76122j942L2291k6605j44288P3402Q5120j73028
6470h2460Q7146j6943P8333P0516l8148j71185N0441J3729j01232k5840k749l231
6458a41623J61432j49268n6642K14413k41495K9729K98582L6444k3590m8681N6847
6447A36148q7178J18220q364P7119N6672n2775m6975r1855K5416j74015q2427
$$ plain form
6436 -130014 -81193 33621 -54399 21273 -195548 -396716 -138147 57723 266311 -51855
6426 -51855 -83231 151360 -28811 -21187 112494 55895 151621 207264 304823 167830 191034
6415 191034 217777 101046 116861 62023 59548 106491 833 -76808 88766 25113 -69560
6404 -69560 -255784 -276842 -58464 -127421 -16455 129608 84896 7000 199378 375058 291449
6393 291449 406068 589241 421774 142039 195373 -22100 33704 -183944 -153669 80880
6383 80880 32781 -185892 -32705 46568 1341 136641 -7813 -40226 -185687 -201921 24238
6372 24238 257088 287888 69491 -36814 -62264 21682 93403 224057 258451 225934 151770
6361 151770 89589 119873 -16912 -94143 -17959 10173 -80458 -29247 -96166 -137298 163131
$$ packed form
6436a30014M8821J14814q8020P5672k16821k01168K58569J95870K08588l18166
6426e1855l1376K34591j80171P624J33681n6599R5726N5643R7559j36993K3204
6415A91034K6743j16731J5815n4838k475M6943j05658p7641J65574o3653r4673
6404f9560j86224k1058K18378o8957J10966J46063m4712p7896J92378J75680q3609
6393B91449J14619J83173j67467k79735N3334k17473N5804k17648L0275K34549
6383H0880m8099k18673J53187P9273m5227J35300j44454l2413j45461j6234K26159
6372B4238K32850L0800k18397j06305k5450Q3946P1721J30654L4394l2517p4164
6361A51770o2181L0284j36785p7231P6184K8132r0631N1211o6919m1132L00429
$$ plain form
6350 163131 199448 -30196 -44001 -17543 -155605 -49512 7687 -331187 -377192 -305973 -256280
6339 -256280 -76704 5315 121346 222703 61629 -28684 118363 -16579 -143441 18280
6329 18280 -32594 113053 195634 210935 101527 125297 -58282 -255985 -226566 -34390 7158
6318 7158 96055 140032 -2747 168202 87227 22939 -26636 -41702 -177450 66284 114639
6307 114639 160367 223346 133764 86051 113441 20150 97301 160283 151564 154679 174906 189375
6295 189375 -15886 154390 199639 93820 121905 87892 -83649 -35918 -53743 80798 -246
6284 -246 195034 426135 106778 161650 201447 225366 205153 75441 233527 360837 258885
6273 258885 -94381 -93521 135489 -28167 84944 55241 97254 18057 109331 214125 46122
$$ packed form
6350A63131L6317k29644j3805K6458j38062J06093N7199l38874m6005P1219M9693
6339b56280J79576Q2019J16031J01357j61074r0313J47047j34942j26862J61721
6329A8280n0874J45647Q2581J5301j09408K3770j83579j97703K9419J92176M1548
6318G158Q8897M3977j42779J70949q0975o4288m9575j5066j35748K43734M8355
6307A14639M5728O2979q9582m7713K7390r3291P7151O2982q719L115K0227J4469
6295A89375k05261J70276M5249j05819K8085l4013j71541M7731j7825J34541q1044
6284b46J95280K31101l19357N4872L9797K3919k0213j29712J58086J27310j01952
6273B58885l53266Q60K29010j63656J13111k9703M2013p9197R1274J04794j68003
$$ plain form
6262 46122 8977 -126599 -156187 -140436 35520 70223 44931 -46726 -283679 11259 161138
6251 161138 103610 242382 139483 234099 175209 25359 177383 165588 28557 -135497
6241 -135497 3815 148430 -143214 -156728 -15575 -137084 -102024 112555 -4579 118040
6231 118040 302076 322110 383566 295719 47071 86547 -16325 148593 283987 193556 186384
6220 186384 307556 176202 -80896 125067 184933 -17506 151427 323417 218290 352865
6210 352865 193282 235276 230735 251534 24950 237361 178203 128982 30741 -50779 172182
6199 172182 146246 247395 467724 488832 41213 61819 258418 428070 123515 341241
6189 341241 472702 511752 318771 27177 263179 246624 102904 179026 237730 293879 222760
$$ packed form
6262D6122l7145j35576k9588J5751J75956L4703k5292r1657k36953K94938J49879
6251A61138n7528J38772j02899R4616n8890j49850J52024j1795j37031j64054
6241a35497J39312J44615k91644j3514J41153j21509L5060K14579j17134J22619
6231A18040J84036K0034O1456q7847k48648L9476j02872J64918J35394r0431p172
6220A86384J21172j31354k57098K05963N9866k02439J68933J71990j05127J34575
6210C52865j59583M1994m541K0799k26584K12411n9158m9221r8241q1520K22961
6199A72182k5936J01149K20329K1108m47619K0606J96599J69652l04555K17726
6189C41241J31461L9050j92981k91594K36002j6555j43720P6122N8704N6149p1119
$$ plain form
6178 222760 48420 157102 328307 289631 79177 151788 86691 21126 146731 286187
6168 286187 376899 285270 157100 117306 172784 122880 102783 75420 33470 59151 175333
6157 175333 55914 43406 -5959 72937 220692 252373 15127 101256 226403 154415 -44391
6146 -44391 33126 160441 82144 127696 243147 356016 195561 231332 226783 213562 289648
6135 289648 393042 539094 325849 210354 341664 14232 -96048 65351 421847 479946
6125 479946 484199 393712 226376 22072 133769 117095 66945 92049 135105 162819 200267
6114 200267 -18550 -131090 -27509 -14954 7938 143691 218271 293500 296102 362154 315262
6103 315262 356505 357281 292274 211257 1065 154349 43455 68914 271045 282535 151403
$$ packed form
6178B22760j74340J08682J71205l8676k10454P2611o5097o5565J25605J39456
6168B86187R0712r1629j28170l9794N5478m9904k0097k7363m1950K5681J16182
6157A75333j19419j2508m9365P8896J47755L1681k37246Q6129J25147p1988j98806
6146d4391P7517J27315p8297M5552J15451J12869j60455L5771m549j3221P6086
6135B89648J03394J46052k13245j15495J31310l27432j10280J61399L56496N8099
6125D79946M253r0487j67336k04304J11697j6674n0150K5104M3056K7714L7448
6114B00267k18817j12540J03581J2555K2892J35753P4580P5229K602O6052m6892
6103C15262M1243P76o5007q1017k10192J53284j10894K5459K02131J1490j31132
$$ plain form
6092 151403 -17168 -57975 23944 -34429 -4298 276905 269413 407991 486857 271238 -19887
6081 -19887 77800 86268 106279 140423 105537 8152 20522 147730 30272 -16658 89405
6070 89405 54460 68046 187824 89044 15338 111298 408054 319570 455527 279344 185029
6059 185029 205587 154762 31634 259725 456088 389544 186841 223731 317791 257976 144959
6048 144959 132875 181585 225207 133313 132360 -15598 81995 286748 29049 193238 180233
6037 180233 249293 304798 234239 137079 70317 123494 321664 181715 198380 89903 17240
6026 17240 171693 211694 291043 298697 287648 297945 244447 234385 196660 93101 250286
6015 250286 247069 370031 469734 379594 285456 67335 140266 468859 450901 288257 224702
$$ packed form
6092A51403j68571m0807Q1919n8373L0131K81203p492J38578P8866k15619k91125
6081a9887R7687Q468K0011L4144l4886r7385J2370J27208j17458m6930J06063
6070H9405l4945J3586J19778r8780p3706R5960K96756q8484J35957j76183r4315
6059A85029K0558n0825j23128K28091J96363o6544k02703L6890R4060n9815j13017
6048A44959j2084M8710M3622r1894r53j47958R7593K04753k57699J64189j3005
6037A80233O9060N5505p0559r7160o6762N3177J98170j39949J6665j08477p2663
6026A7240J54453M0001P9349P654j1049J0297n3498j0062l7725j03559J57185
6015B50286l217J22962R9703r0140r4138k18121P2931L28593j7958j62644o3555
$$ plain form
6004 224702 369739 180510 -19686 81850 181378 144726 157205 257059 92479 107964 117176
5993 117176 -41536 66480 152285 155822 58503 -5381 -1211 34346 -46773 -90778 134554
5982 134554 64019 26163 239917 356219 218351 173042 284518 194184 218436 352848 315205
5971 315205 220354 368205 342037 231270 289634 408433 352858 139201 214372 281138 110779
5960 110779 174199 -59973 -59949 154596 173721 186708 34688 2004 50972 226494 137738
5949 137738 113303 163990 240418 158874 366177 333669 324683 414547 252635 147225 144628
5938 144628 365448 479927 216119 77877 245893 274171 337077 265097 343807 280145 315395
5927 315395 267111 153817 237777 219342 102560 148863 157084 58838 122798 203673 -34012
$$ packed form
6004B24702J45037j89229k00196J01536R9528l6652J2479R9854j64580J5485R212
5993A17176j58712J08016Q5805L537r7319o3884M170L5557q1119m4005K25332
5982A34554p0535l7856K13754J16302j37868m5309J11476r0334K4252J34412l7643
5971C15205r4851J47851k6168j10767N8364J18799n5575k13657P5171O6766j70359
5960A10779O3420k34172K4K14545J9125J2987j52020l2684M8968J75522q8756
5949A37738k4435N0687P6428q1544K07303l2508q986Q9864j61912j05410k597
5938A44628K20820J14479k63808j38242J68016K8278O2906p1980P8710o3662L5250
5927C15395m8284j13294Q3960j8435j16782M6303Q221r8246O3960Q0875k37685
$$ plain form
5916 -34012 -98881 130785 247506 182960 180316 -79404 -99954 43595 62361 245780 327294
5905 327294 457488 446375 296307 272212 228638 182097 471189 323225 134288 102988 290389
5894 290389 413335 409716 260529 324707 291945 249152 191281 330073 365470 357320 252712
5883 252712 371984 540934 443783 301880 318717 235318 228609 262415 -7344 38501 86135
5872 86135 200264 336476 398362 268627 272176 197487 432753 404397 254279 338233 417610
5861 417610 456745 267802 147994 202756 390259 434440 382232 492957 387068 236333
5851 236333 117716 16029 116481 106843 209411 154120 303326 572583 495988 488619 236230
5840 236230 331140 301322 247322 392508 377728 472486 415400 471991 609598 332738 381943
$$ packed form
5916c4012o4869K29666J16721o4546k644k59720k0550J43549J8766J83419Q1514
5905C27294J30194j1113j50068k4095m3574m6541K89092j47964j88937l1300J87401
5894B90389J22946l619j49187O4178l2762m2793n7871J38792L5397q150j04608
5883B52712J19272J68950r7151j41903J6837q3399o709L3806k69759M5845M7634
5872H6135J14129J36212O1886j29735L549p4689K35266k8356j50118Q3954P9377
5861D17610L9135j88943j19808N4762J87503M4181n2208J10725j05889j50735
5851B36333j18617j01687J00452r638J02568n5291J49206K69257p6595p369k52389
5840B36230R4910k9818n4000J45186j4780R4758n7086N6591J37607k76860M9205
$$ plain form
5829 381943 444889 286742 244294 404632 664896 556269 412677 222643 350494 198638
5819 198638 261826 266147 261690 255965 209117 394386 408613 661468 632060 498388 390391
5808 390391 409094 361252 462842 551241 314237 328499 454077 531762 655822 638357 468649
5797 468649 437917 610376 680697 421214 454436 432743 317101 440864 490129 437668 473051
5786 473051 452697 351694 547406 605399 522471 494462 370105 468657 670259 526798 479144
5775 479144 464281 658718 566659 350105 423285 486547 449556 549964 725060 564956 575781
5764 575781 652180 608476 585712 515424 533133 683999 614016 614022 633366 566481 570780 722460
5752 722460 647807 534091 593964 578837 453556 364923 483814 426250 429055 446008 613087
$$ packed form
5829C81943O2946j58147m2448J60338K60264j08627j43592j90034J27851j51856
5819A98638O3188M321m457n725m6848J85269J4227K52855k9408j33672j07997
5808C90391J8703m7842J01590Q8399k37004J4262J25578P7685J24060j7465j69708
5797D68649l0732J72459P0321k59483L3222k1693j15642J23763M9265n2461L5383
5786D73051k0354j01003J95712N7993q2928k8009j24357R8552K01602j43461m7654
5775D79144j4863J94437r2059k16554P3180O3262l6991J00408J75096j60104J0825
5764E75781P6399m3704k2764p0288J7709J50866o9983OJ9344o6885M299J51680
5752G22460p4653j13716N9873j5127j25281q8633J18891n7564K805J6953J67079
$$ plain form
5741 613087 610684 653374 652902 572681 417009 546816 418596 454775 547562 471679 584301
5730 584301 534449 539502 598095 615548 727040 476094 479601 652118 803420 755428 645351
5719 645351 416181 428713 647430 878819 896722 657108 955639 910398 716336 425950
5709 425950 515494 764136 707524 971226 953151 533045 643562 703726 605147 812875 1005070
5698 1005070 1023230 904571 859498 845385 778416 783074 762085 951625 930550 1071955 1046222
5687 1046222 973407 1021952 1106600 961733 1075509 1249674 1099901 955661 1052662 840533
5677 840533 1000328 1114843 1242803 1292688 1402263 1277327 1383663 1571722 1765240 1762030
5667 1762030 1711416 1792446 1840082 1917898 1825742 1885399 1991439 2086764 2145264 2191885 1927119
$$ packed form
5741F13087k403M2690m72q0221j55672J29807j28220L6179R2787p5883J12622
5730E84301m9852N053N8593J7453J11492k50946L507J72517J51302m7992j10077
5719F45351k29170J2532K18717K31389J7903k39614K98531m5241j94062k90386
5709D25950Q9544K48642n6612K63702j8075m20106J10517O0164r8579K07728J92195
5698A005070J8160j18659m5073j4113o6969M658k0989J89540k1075J41405k5733
5687A046222p2815M8545Q4648j44867J13776J74165j49773j44240R7001k12129
5677H40533J59795J14515J27960M9885J09575j24936J06336J88059J93518l210
5667A762030n0614Q1030M7636P7816r2156N9657J06040R5325N8500M6621k64766
$$ plain form
5656 1927119 1860316 2139816 1970584 2052975 2243876 2196379 2216853 1968533 1805087 1848641
5646 1848641 1888752 1698458 1703898 1637467 1844416 1824203 1693391 1564843 1500623 1237131 1186701
5635 1186701 1329880 1204035 1194538 1314859 1340222 1091021 1200375 1280397 1360405 1430873 1432984
5624 1432984 1641895 1511766 1419848 1517009 1501068 1254226 1178116 1158495 1415338 1646875
5614 1646875 1627172 1621288 1561665 1189978 1186862 1374088 1411500 1362082 1568030 1531619 1587350
5603 1587350 1557904 1513536 1586696 1484611 1344577 1353199 1346660 1283165 1218651 1393925 1330342
5592 1330342 1410026 1409526 1345708 1534998 1602987 1525708 1333214 1513026 1518324 1875827 1626009
5581 1626009 1469793 1547152 1840292 1854597 1585752 1647900 1697416 1654909 1645598 1886949 1804259
$$ packed form
5656A927119o6803K79500j69232Q2391J90901m7497K0474k48320j63446M3554
5646A848641M0111j90294N440o6431K06949k0213j30812j28548o4220k63492n0430
5635A186701J43179j25845r497J20321K5363k49201J09354Q0022Q0008P0468K111
5624A432984K08911j30129r1918R7161j5941k46842p6110j9621K56843K31537
5614A646875j9703n884n9623l71687l116J87226L7412m9418K05948l6411N5731
5603A587350k9446m4368P3160j02085j40034Q622o539o3495o4514J75274o3583
5592A330342P9684n00o3818J89290O7989p7279j92494J79812N298L57503k49818
5581A626009j56216P7359K93140J4305k68845O2148M9516m2507r311K41351q2690
$$ plain form
5570 1804259 1963980 2168556 2009223 1747710 1946748 2109043 2000925 2140834 2324355 2273198
5560 2273198 2083473 2129378 2140715 2194178 2308477 2284122 2258545 2358542 2448014 2544472 2686320
5549 2686320 2435288 2406399 2500879 2420908 2505358 2816575 2895931 2796213 2710621 2632194 2642350
5538 2642350 2625940 2577625 2539787 2873894 2917520 2849884 2930143 3057385 3004041 2948171 3054324
5527 3054324 2986136 3007106 3144274 3201247 3176074 3076164 2815378 3016919 3238552 3240465 3239545
5516 3239545 3227172 3143859 3118869 3262217 3282567 3296783 3557478 3598921 3357045 3444924 3429042
5505 3429042 3488170 3458533 3409787 3578944 3480813 3638088 3969247 4108626 3998055 3992661 4008943
5494 4008943 4027721 4181026 4160665 4126539 4070569 4261854 4393284 4662059 4647198 4574717 4629506
$$ packed form
5570A804259J59721K04576j59333k61513J99038J62295j08118J39909J83521n1157
5560B273198j89725M5905J1337N3463J14299k4355k5577R9997Q9472R6458J41848
5549B686320k51032k8889R4480p9971Q4450L11217P9356r9718q5592p8427J0156
5538B642350j6410m8315l7838L34107M3626o7636Q0259J27242n3344n5870J06153
5527C054324o8188K0970J37168N6973k5173r9910k60786K01541K21633J913r20
5516C239545j2373q3313k4990J43348K0350J4216K60695M1443k41876Q7879j5882
5505C429042N9128k9637m8746J69157r8131J57275L31159J39379j10571n394J6282
5494D008943J8778J53305k0361l4126n5970J91285J31430K68775j4861p2481N4789
$$ plain form
5483 4629506 4837303 4788935 4763498 5032704 5056585 5138179 5013141 4985619 5341728 5306914 5475347
5472 5475347 5453371 5544530 5601364 5719711 5835119 6073774 6241463 6259550 6460120 6474729
5462 6474729 6674896 7006432 6992472 7347494 7590340 7636257 7842180 7957370 8172035 8296796
5452 8296796 8771533 8875757 9019173 9339430 9599067 9796495 9908453 10188245 10392612 10846134
5442 10846134 11138785 11424564 11941625 12380844 12797725 12780689 13080867 13408366 13893250 14182969
5432 14182969 14584918 14809882 15095685 15540567 15883722 16162785 16442519 16645450 17179136
5423 17179136 17666892 18067929 18270525 18673733 19080082 19219067 19798246 20312186 20794853
5414 20794853 21171077 21828371 22403657 22950140 23457068 24042315 24695201 25241654 25862470
$$ packed form
5483D629506K07797m8368k5437K69206K3881Q1594j25038k7522L56109l4814J68433
5472E475347k1976R1159N6834J18347J15408K38655J67689J8087K00570J4609
5462F474729K00167L31536j3960L55022K42846M5917K05923J15190K14665J24761
5452H296796M74737J04224J43416L20257K59637J97428J11958K79792K04367M53522
5442A0846134K92651K85779N17061M39219M16881j7036L00178L27499M84884K89719
5432A4182969M01949K24964K85803M44882L43155K79063K79734K02931N33686
5423A7179136M87756M01037K02596M03208M06349J38985N79179N13940M82667
5414B0794853L76224O57294N75286N46483N06928N85247O52886N46453O20816
$$ plain form
5405 25862470 26417481 27132705 27975599 28866084 29830833 30803990 32162487 33122356 34177545
5396 34177545 35136795 36147549 37463650 38635752 40107855 41446643 43058462 44656635
5388 44656635 46264271 48077755 49956538 52058001 54262911 56475763 59098605 61769434
5380 61769434 64735290 67956731 71437460 75058949 79124375 83675988 88189703 93467865
5372 93467865 99366359 105756667 113087772 120821256 129336332 138647600 148758164 159528569
5364 159528569 171146510 183649641 196291178 209221849 221767565 233340953 243711887
5357 243711887 253055387 261020190 267458852 271844517 273716477 272016840 265594252 255353652
5349 255353652 242275812 227859736 213118779 198329182 183304860 168269996 153491814
$$ packed form
5405B5862470N55011P15224Q42894Q90485R64749R73157J358497R59869J055189
5396C4177545R59250J010754J316101J172102J472103J338788J611819J598173
5388D4656635J607636J813484J878783K101463K204910K212852K622842K670829
5380F1769434K965856L221441L480729L621489M065426M551613M513715N278162
5372I3467865N898494O390308P331105P733484Q515076R311268J0110564J0770405
5364A59528569J1617941J2503131J2641537J2930671J2545716J1573388J0370934
5357B43711887R343500P964803O438662M385665J871960j699637o422588j0240600
5349B55353652j3077840j4416076j4740957j4789597j5024322j5034864j4778182
$$ plain form
5342 153491814 139229819 126209226 114586967 104453423 95546312 87655674 80742360
5335 80742360 74756735 69546247 65108996 61140313 57431397 54332511 51115252 48409262
5327 48409262 45795198 43353406 41557917 39520853 37867027 36269323 34923397 33547661
5319 33547661 32118644 30798835 29707804 28467000 27480362 26640133 25855831 24932536 24029218
5310 24029218 23160815 22457203 21820781 21374049 20934573 20121634 19302458 18891649 18303084
5301 18303084 17884490 17409921 16910772 16446582 16010666 15698127 15351620 14964239 14569211
5292 14569211 14280854 13871159 13514260 13366127 13201029 12884384 12422397 12234220 12112251
5283 12112251 11788279 11877392 11483863 11254549 11015385 10750859 10591583 10287210 9898543 9576620
$$ packed form
5342A53491814j4261995j3020593j1622259j0133544q907111p890638o913314
5335H0742360n985625n210488m437251l968683l708916l098886l217259k705990
5327D8409262k614064k441792j795489k037064j653826j597704j345926j375736
5319C3547661j429017j319809j091031j240804r86638q40229p84302r23295r03318
5310B4029218q68403p03612o36422m46732m39476q12939q19176m10809n88565
5301A8303084m18594m74569m99149m64190m35916l12539l46507l87381l95028
5292A4569211k88357m09695l56899j48133j65098l16645m61987j88177j21969
5283A2112251l23972Q9113l93529k29314k39164k64526j59276l04373l88667l21923
$$ plain form
5273 9576620 9391143 9236680 9053460 8948335 8791980 8523485 8302160 8341324 8163554 7987161
5263 7987161 7953196 7562815 7320490 7183156 6940283 6986256 6941811 6913261 6732151 6640665
5253 6640665 6581766 6510456 6349992 6394934 6118159 6105655 6032214 5827914 6072719 5770563
5243 5770563 5693266 5675252 5488000 5465151 5403108 5311503 5294276 5223405 5112620 5018723 4895936
5232 4895936 5043259 4962232 4692174 4771408 4835082 4670747 4628733 4630868 4430586 4291088 4258851
5221 4258851 4463996 4171660 4244462 4336960 4116861 4048521 3937620 3805331 3788055 3866391
5211 3866391 3772446 3716521 3590126 3592656 3545032 3388018 3431989 3392454 3196954 3312005 3145614
5200 3145614 3099699 3147502 3166909 3314694 3121694 3217961 3190418 2842759 2891004 2729578 2527383
$$ packed form
5273I576620j85477j54463j83220j05125j56355k68495k21325L9164j77770j76393
5263G987161l3965l90381k42325j37334k42873M5973m4445k8550j81110r1486
5253F640665n8899p1310j60464M4942k76775j2504p3441k04300K44805l02156
5243E770563p7297j8014j87252k2849o2043r1605j7227p0871j10785r3897j22787
5232D895936J47323q1027k70058P9234O3674j64335m2014K135k00282j39498l2237
5221D258851K05145k92336P2802R2498k20099o8340j10901j32289j7276P8336
5211C866391r3945n5925j26395K530m7624j57014M3971l9535j95500J15051j66391
5200C145614m5915M7803J9407J47785j93000R6267k7543l47659M8245j61426k02195
$$ plain form
5189 2527383 2500714 2216876 2346476 2649483 2589642 2480535 2354605 2399105 2234896 2355159
5179 2355159 2504843 2229720 2371922 2540299 2347444 2360434 2416080 2309605 2262689 2335521
5169 2335521 2200339 2001332 1973555 1838024 2018630 2017202 2031032 2036624 2115952 2088823 2033786
5158 2033786 1871175 2036225 1973679 1897504 1947742 1913308 1956392 1764859 1776584 1908151 1916668
5147 1916668 1913854 1900653 1862215 1886417 1812359 1902620 1884562 1832484 1778669 1579378 1747158
5136 1747158 1816544 1795479 1961440 1908723 1861226 1797501 1777515 1653915 1548283 1631729 1768849
5125 1768849 1657797 1619993 1556919 1594414 1587877 1523228 1595159 1693085 1664316 1545968 1518574
5114 1518574 1578393 1586103 1453136 1692557 1706574 1690532 1543647 1427510 1267876 1402977
$$ packed form
5189B527383k6669k83838J29600L03007n9841j09107j25930M4500j64209J20263
5179B355159J49684k75123J42202J68377j92855J2990N5646j06475m6916P2832
5169B335521j35182j99007k7777j35531J80606j428J3830N592P9328k7129n5037
5158B033786j62611J65050o2546p6175N0238l4434M3084j91533J1725J31567Q517
5147A916668k814j3201l8438K4202p4058R0261j8058n2078n3815j99291J67780
5136A747158O9386k1065J65961n2717m7497o3725j9986j23600j05632Q3446J37120
5125A768849j11052l7804o3074L7495o537o4649P1931R7926k8769j18348k7394
5114A518574N9819P710j32967K39421J4017j6042j46885j16137j59634J35101
$$ plain form
5104 1402977 1537800 1513564 1536596 1667350 1582550 1531011 1632974 1705348 1573051 1444242
5094 1444242 1496226 1288703 1548770 1675981 1602398 1674459 1650561 1401061 1308003 1573878
5084 1573878 1481752 1530511 1688476 1669246 1819446 1756173 1650438 1794778 1919621 1722261
5074 1722261 1931535 2112591 2058310 1978293 1956046 1772575 1786165 1709460 1971756 1876565 1903040
5063 1903040 2092351 2128210 2269193 2091918 2113569 2298615 2463733 2543416 2600632 2524612
5053 2524612 2692215 2965604 2804654 2693302 2673012 2850986 2845113 2836284 3014652 2921972 2779164
5042 2779164 2630298 2618361 2520441 2564496 2559312 2535881 2340351 2178311 2021618 2008562 2028745
5031 2028745 1920607 2065864 2127871 2015625 1841810 1745336 2011467 1825190 1653220 1627197
$$ packed form
5104A402977J34823k4236K3032J30754q4800n1539J01963P2374j32297j28809
5094A444242N1984k07523K60067J27211p3583P2061k3898k49500r3058K65875
5084A573878r2126M8759J57965j9230J50200o3273j05735J44340J24843j97360
5074A722261K09274J81056n4281q0017k2247j83471J3590p6705K62296r5191K6475
5063A903040J89311L5859J40983j77275K1651J85046J65118P9683N7216p6020
5053B524612J67603K73389j60950j11352k0290J77974n873q829J78368r2680j42808
5042B779164j48866j1937r7920M4055n184k3431j95530j62040j56693j3056K0183
5031B028745j08138J45257O2007j12246j73815r6474K66131j86277j71970k6023
$$ plain form
5021 1627197 1495714 1839490 1916413 1857776 1661944 1514710 1555389 1510645 1585084 1624689 1491157
5010 1491157 1505593 1555745 1513819 1403381 1381498 1415626 1415621 1475374 1453519 1512288 1482640 1507893
4998 1507893 1443055 1416252 1317041 1217719 1387450 1463679 1490394 1559439 1478122 1479945 1707139
4987 1707139 1715860 1632683 1543767 1530141 1506313 1474826 1571569 1565343 1747134 1633273 1474331
4976 1474331 1387563 1553749 1611809 1626587 1542685 1552079 1682141 1486515 1327044 1233033 1493544
4965 1493544 1739197 1430303 1527168 1793497 1459326 1474219 1569701 1587817 1612722 1527147 1615983
4954 1615983 1575976 1748974 1831817 1696963 1859146 1990102 1970830 1670867 1717143 1643345
4944 1643345 1728599 1520490 1592227 1719751 1947615 1834749 1794430 1988021 2124516 2234538
$$ packed form
5021A627197j31483L43776P6923n8637j95832j47234M0679m4744P4439L9605j33532
5010A491157J4436N0152m1926j10438k1883L4128nN9753k1855N8769k9648K5253
4998A507893o4838k6803r9211r9322J69731P6229K6715O9045q1317J823K27194
4987A707139Q721q3177q8916j3626k3828l1487R6743o226J81791j13861j58942
4976A474331q6768J66186N8060J4778q3902R394J30062j95626j59471r4011K60511
4965A493544K45653l08894R6865K66329l34171J4893R5482J8116K4905q5575Q8836
4954A615983m0007J72998Q2843j34854J62183J30956j9272k99963M6276p3798
4944A643345Q5254k08109P1737J27524K27864j12866m0319J93591J36495J10022
$$ plain form
4934 2234538 2235176 2071203 1926616 2177364 2442774 2426932 2198906 2365665 2525899 2554763
4924 2554763 2446167 2436822 2542303 2675163 2497922 2259362 2167768 2353003 2307501 2541499
4914 2541499 2690883 2672975 2722391 2504419 2426635 2688323 2598266 2646460 2609459 2693912 2816871
4903 2816871 3010912 3070497 2892564 3175637 3201548 3169527 3209125 3217404 3322780 3129947 3138117
4892 3138117 3459145 3501166 3433095 3574581 3375595 3518253 3537758 3294674 3127695 3020420
4882 3020420 3073101 3080731 3215564 3386719 3306688 3367277 3419998 3514155 3419232 3378272 3337277
4871 3337277 3345775 3350786 3468832 3568383 3571509 3759239 3518146 3525904 3521138 3679316 3579443 3495786
4859 3495786 3588038 3564428 3529924 3709895 3710522 3859884 3982129 3811503 3932536 3938939 3980395
$$ packed form
4934B234538O38j63973j44587K50748K65410j5842k28026J66759J60234K8864
4924B554763j08596r345J05481J32860j77241k38560r1594J85235m5502K33998
4914B541499J49384j7908M9416k17972p7784K61688r0057M8194l7001Q4453J22959
4903B816871J94041N9585j77933K83073K5911l2021L9598Q279J05376j92833Q170
4892C138117L21028M2021o8071J41486j98986J42658J9505k43084j66979j07275
4882C020420N2681P630J34833J71155q0031O0589N2721R4157r4923m0960m0995
4871C337277Q498N011J18046R9551L126J87730k41093P758m766J58178r9873q3657
4859C495786R2252k3610l4504J79971O27J49362J22245j70626J21033O403M1456
$$ plain form
4848 3980395 4191023 3965146 4093226 4160338 4225406 4215954 4235301 4282738 4393601 4412195 4509612
4837 4509612 4697716 4818572 4471853 4501907 4737937 4688758 4885364 4969335 4934676 4963929
4827 4963929 4942606 5057592 5135191 5189668 5372211 5552994 5585235 5726111 5959806 5793398
4817 5793398 5828031 5858368 5884674 6004244 6088163 6152500 6241477 6215079 6353876 6563483 6804623
4806 6804623 6909165 6828332 6662898 6847146 6885666 6829670 6968380 7072975 7244398 7405069
4796 7405069 7646669 7673350 7655029 8001534 8246080 8406676 8381320 8345310 8266238 8552937
4786 8552937 8753996 8656502 8771841 8757552 9106944 9398037 9588223 9529725 9833942 9892326
4776 9892326 9890164 10025925 10304286 10474393 10575323 10949212 11121227 11325631 11542551 11592342
$$ packed form
4848C980395K10628k25877J28080O7112O5068r452J9347M7437J10863J8594R7417
4837D509612J88104J20856l46719L0054K36030m9179J96606Q3971l4659K9253
4827D963929k1323J14986P7599N4477J82543J80783L2241J40876K33695j66408
4817E793398L4633L0337K6306J19570Q3919O4337Q8977k6398J38797K09607K41140
4806F804623J04542q0833j65434J84248L8520n5996J38710J04595J71423J60671
4796G405069K41600K6681j8321L46505K44546J60596k5356l6010p9072K86699
4786H552937K01059r7494J15339j4289L49392K91093J90186n8498L04217N8384
4776I892326k162J35761K78361J70107J00930L73889J72015K04404K16920M9791
$$ plain form
4766 11592342 11845745 12039637 12285501 12477102 12736149 13048481 13156245 13718030 13953510
4757 13953510 14381076 14575140 14726965 15112247 15420243 15832664 16581933 17061706 17473565
4748 17473565 17861148 18299932 18781372 19295502 19763717 20075272 20617288 21250604 21784160
4739 21784160 22436360 23108661 23887607 24352623 25126186 25941976 26491125 27045525 27723031
4730 27723031 28463952 28612325 29350670 29999816 30257016 30863077 31196425 31504514 31632559
4721 31632559 31836680 31882262 31785686 31628203 31471100 31340346 30992402 30460896 29978653 29763814
4711 29763814 29326197 28786788 28175181 27876133 27395595 26940751 26471505 25798628 25350887
4702 25350887 25295320 24886027 24636896 24345458 24046401 23813072 23582861 23587047 23579470 23470614
$$ packed form
4766A1592342K53403J93892K45864J91601K59047L12332J07764N61785K35480
4757A3953510M27566J94064J51825L85282L07996M12421P49269M79773M11859
4748A7473565L87583M38784M81440N14130M68215L11555N42016O33316N33556
4739B1784160O52200O72301P78946M65016P73563Q15790N49149N54400O77506
4730B7723031P40921J48373P38345O49146K57200O06061L33348L08089J28045
4721C1632559K04121M5582r6576j57483j57103j30754l47944n31506m82243k14839
4711B9763814m37617n39409o11607k99048m80538m54844m69246o72877m47741
4702B5350887n5567m09293k49131k91438k99057k33329k30211M186p577j08856
$$ plain form
4692 23470614 23312309 23350109 23377467 23410552 23378388 23506468 23471618 23112901 23040074 22884809
4682 22884809 22623400 22420560 22291910 22269143 22520891 22692009 22435422 22668870 22950333 23038360
4672 23038360 23070241 23284848 23493982 23769549 23801573 24136828 24673072 25018407 25365183 25632262
4662 25632262 25898133 26212057 26815366 27172545 27619651 28273906 28808804 29765136 30175747
4653 30175747 30894754 31576274 32007918 32699374 33303629 34017836 34736139 35414419 36290027
4644 36290027 37406584 38193200 39501831 40844449 41705505 42879459 44328726 45960949
4636 45960949 47369975 48947417 50775160 52856050 55169296 57449411 59703488 62201226
4628 62201226 64834805 67263288 69562053 71745531 74106642 76129049 78062644 79944559
$$ packed form
4692B3470614j58305L7800K7358L3085l2164J28080l4850l58717p2827j55265
4682B2884809k61409k02840j28650k2767K51748J71118k56587K33448K81463Q8027
4672B3038360L1881K14607K09134K75567L2024L35255N36244L45335L46776K67079
4662B5632262K65871L13924O03309L57179M47106O54255N34898R56332M10611
4653C0175747P19007O81520M31644O91456O04255P14207P18303O78280Q75608
4644C6290027J116557P86616J308631J342618Q61056J173954J449267J632223
4636D5960949J409026J577442J827743K080890K313246K280115K254077K497738
4628F2201226K633579K428483K298765K183478K361111K022407J933595J881915
$$ plain form
4620 79944559 82242253 84016564 86337997 88791577 91224788 93619837 95968976 98316536
4612 98316536 100337889 102154876 104020625 106234526 108486912 111204780 113798133 116483949
4604 116483949 119506631 122681472 126001249 129549475 133697785 138349862 143413853 149339988
4596 149339988 155625962 162092955 168913769 175312084 180903942 185383894 187888082 187785884
4588 187785884 185041395 180078942 174575499 169661537 166200736 163829651 162930085 163443839
4580 163443839 165111826 167957032 171457990 175911851 181168895 186504538 191759316 196719749
4572 196719749 200347937 202625406 202920596 201357311 198226573 193144373 186930863 180209842
4564 180209842 172941010 166196542 160321207 155507223 152140508 149589656 147894177 147015985
$$ packed form
4620G9944559K297694J774311K321433K453580K433211K395049K349139K347560
4612I8316536K021353J816987J865749K213901K252386K717868K593353K685816
4604A16483949L022682L174841L319777L548226M148310M652077N063991N926135
4596A49339988O285974O466993O820814O398315N591858M479952K504188j02198
4588A87785884k744489m962453n503443m913962l460801k371085q99566N13754
4580A63443839J667987K845206L500958M453861N257044N335643N254778M960433
4572A96719749L628188K277469K95190j563285l130738n082200o213510o721021
4564A80209842p268832o744468n875335m813984l366715k550852j695479q78192
$$ plain form
4556 147015985 146965313 147968617 149589125 151738709 154878256 158304050 161867019 165656324
4548 165656324 169597022 173455141 176908620 179910844 182403479 184333103 185550332 185954535
4540 185954535 185483453 184312476 182461913 180237079 177608295 174787207 171875970 169150946
4532 169150946 167060568 165176524 163712209 162531498 161534568 160822997 160183223 159601728 158704683
4523 158704683 158141122 157303251 156032688 154426013 152230879 149053811 145507179 141721424
4515 141721424 137565812 133310352 129506943 125732905 121733627 117732068 114004272 110656030
4507 110656030 107458442 104119209 101093588 98562833 96020650 93701977 91524025 89512144
4499 89512144 87432982 85259235 83341615 81343778 79471515 77771005 75957103 74273289
$$ packed form
4556A47015985n0672J003304J620508K149584L139547L425794L562969L789305
4548A65656324L940698L858119L453479L002224K492635J929624J217229M04203
4540A85954535m71082j170977j850563k224834k628784k821088k911237k725024
4532A69150946k090378j884044j464315j180711r96930p11571o39774n81495q97045
4523A58704683n63561q37871j270563j606675k195134l177068l546632l785755
4515A41721424m155612m255460l803409l774038l999278m001559l727796l348242
4507A10656030l197588l339233l025621k530755k542183k318673k177952k011881
4499H9512144k079162k173747j917620j997837j872263j700510j813902j683814
$$ plain form
4491 74273289 72570146 70755080 69081411 67553713 65761072 63936815 62259962 60801379
4483 60801379 59260936 57519371 56044799 54670463 53427884 52119371 50723958 49473629
4475 49473629 48497812 47766474 47132219 46358072 45834681 45194205 44770499 44301164 43964486
4466 43964486 43783363 43535970 43355338 43389685 43146700 42817637 42711553 42646819 42721423 43077962
4456 43077962 42936871 42956263 42864679 42956006 43448572 43843060 44307988 44763059 45178933 45161889
4446 45161889 45632554 46105121 46891016 47314962 47825318 48476399 48967877 49698056 50591295
4437 50591295 51323772 52305437 53320268 54192380 55145999 56507663 57992973 59443951 61160531
4428 61160531 62983715 64624049 66545093 68809219 71018302 73349005 75619446 78068682
$$ packed form
4491G4273289j703143j815066j673669j527698j792641j824257j676853j458583
4483F0801379j540443j741565j474572j374336j242579j308513j395413j250329
4475D9473629r75817p31338o34255p74147n23391o40476m23706m69335l36678
4466D3964486j81123k47393j80632L4347k42985l29063j06084o4734P4604L56539
4456D3077962j41091J9392r1584R1327M92566L94488M64928M55071M15874j7044
4446D5161889M70665M72567P85895M23946N10356O51081M91478P30179Q93239
4437E0591295P32477R81665J014831Q72112R53619J361664J485310J450978J716580
4428F1160531J823184J640334J921044K264126K209083K330703K270441K449236
$$ plain form
4420 78068682 80972888 83536848 86765537 90142295 93627253 97293944 100954128 105292365
4412 105292365 109898022 114693029 120013454 126099398 132442533 139453993 147221396 155696785
4404 155696785 165354338 175657522 187246946 199735157 213858182 229770938 247581085
4397 247581085 267169653 288931712 313220187 339582689 368159739 398200608 429589863
4390 429589863 461476015 491166317 515526067 527929794 518925918 484665010 434667743
4383 434667743 382088315 334584486 294184754 260472831 232786629 209534610 190051412
4376 190051412 173552637 159015295 146397088 135645025 125984822 117458302 109766233
4369 109766233 102892322 96976121 91516908 86343821 81846626 77779981 73725183 70037495
$$ packed form
4420G8068682K904206K563960L228689L376758L484958L666691L660184M338237
4412A05292365M605657M795007N320425O085944O343135P011460P767403Q475389
4404A55696785R657553J0303184J1589424J2488211J4123025J5912756J7810147
4397B47581085J9588568K1762059K4288475K6362502K8577050L0040869L1389255
4390D29589863L1886152K9690302K4359750J2403727r003876l4260908m9997267
4383D34667743n2579428m7503829m0399732l3711923k7686202k3252019j9483198
4376A90051412j6498775j4537342j2618207j0752063r660203q526520p692069
4369A09766233o873911n916201n459213n173087m497195m066645m054798l687688
$$ plain form
4361 70037495 66712502 63567311 61107574 58712258 56432052 54335520 52185220 50377976
4353 50377976 48649642 46871447 45137298 43354882 41957414 40502812 39483040 38377490
4345 38377490 37342137 36386371 35206647 34179432 33338990 32605072 31485088 30539320 29660141
4336 29660141 28879375 28170710 27363060 26836817 25910281 25000457 24262715 23880496 23429587
4327 23429587 22760079 21984816 21656797 21376955 20979353 20603983 20108560 19824893 19654595
4318 19654595 19542267 19179116 18615153 18135546 17969130 17537890 17136678 16915327 16718189
4309 16718189 16213548 15985669 15722644 15515698 15192608 14633429 14291285 14086120 13728162
4300 13728162 13223429 13322652 13078352 12913251 12550581 12309267 11900464 11934146 11840244 11482853
$$ packed form
4361G0037495l324993l145191k459737k395316k280206k096532k150300j807244
4353E0377976j728334j778195j734149j782416j397468j454602j019772j105550
4345C8377490j035353r55766j179724j027215q40442p33918j119984r45768q79179
4336B9660141p80766p08665q07650n26243r26536r09824p37742l82219m50909
4327B3429587o69508p75263l28019k79842l97602l75370m95423k83667j70298
4318A9654595j12328l63151n63963m79607j66416m31240m01212k21351j97138
4309A6718189n04641k27879k63025k06946l23090n59179l42144k05165l57958
4300A3728162n04733R9223k44300j65101l62670k41314m08803L3682r3902l57391
$$ plain form
4290 11482853 11445467 11144818 11046017 10922077 10755022 10622382 10571749 10462152 10475293 10188320
4280 10188320 9932765 10110838 9844852 9575025 9461442 9547961 9380743 9312904 9050289 8822400
4270 8822400 8554122 8416275 8389560 8335759 8562083 8287368 7953554 8013543 8023464 7972848 7841053
4259 7841053 7606984 7704849 7555819 7358617 7249466 7111296 6940764 6825261 6919763 6785328
4249 6785328 6590272 6423787 6334205 6306736 6376460 6385428 6171482 5992667 5761126 5978120
4239 5978120 5926756 5908748 5962695 6011431 5940905 5823051 5697601 5550993 5397312 5449755 5483052
4228 5483052 5160807 5128744 5007583 5006034 5129437 4989484 5125838 4969034 4809784 4671155
4218 4671155 4524567 4446344 4261780 4003303 3960066 3832789 4132321 3936147 3835414 3963855
$$ packed form
4290A1482853l7386l00649r8801j23940j67055j32640n0633j09597J3141k86973
4280A0188320k55555J78073k65986k69827j13583Q6519j67218o7839k62615k27889
4270H822400k68278j37847k6715n3801K26324k74715l33814N9989R921n0616j31795
4259G841053k34069R7865j49030j97202j09151j38170j70532j15503R4502j34435
4249F785328j95056j66485q9582k7469O9724Q968k13946j78815k31541K16994
4239E978120n1364j8008N3947M8736p0526j17854j25450j46608j53681N2443L3297
4228E483052l22245l2063j21161j549J23403j39953J36354j56804j59250j38629
4218D671155j46588p8223j84564k58477m3237j27277K99532j96174j00733J28441
$$ plain form
4208 3963855 3851999 3876210 3856579 3809748 3652553 3467145 3404862 3350329 3315693 3388953 3231549
4197 3231549 2883510 2735858 2992660 2999529 2999601 2853522 2791383 2827033 2916198 2703853 2526660
4186 2526660 2779414 2856405 2726860 2542230 2432087 2366500 2443624 2559273 2647544 2587353
4176 2587353 2460701 2474617 2477698 2576892 2541612 2451536 2289091 2358770 2497149 2305822 2262313
4165 2262313 2154058 2153460 2076952 2371708 2286387 2327878 2220498 2244095 2145660 2053491 2281831
4154 2281831 2141442 1966957 1907807 1827146 1794215 1791238 1677123 1757584 1837924 2013737 1874402
4143 1874402 1916241 1750572 1864841 1844879 1669975 1691440 1535515 1721377 1650104 1456955
4133 1456955 1431383 1596238 1522867 1409036 1329229 1491846 1542875 1495211 1415339 1371195 1327217
$$ packed form
4208C963855j11856K4211j9631m6831j57195j85408o2283n4533l4636P3260j57404
4197C231549l48039j47652K56802O869P2j46079o2139L5650Q9165k12345j77193
4186B526660K52754P6991j29545j84630j10143o5587P7124J15649Q8271o0191
4176B587353j26652J3916L081R9194l5280r0076j62445O9679J38379j91327m3509
4165B262313j08255n98p6508K94756q5321M1491j07380K3597r8435r2169K28340
4154B281831j40389j74485n9150q0661l2931k977j14115Q0461Q0340J75813j39335
4143A874402M1839j65669J14269j9962j74904K1465j55925J85862p1273j93149
4133A456955k5572J64855p3371j13831p9807J62617N1029m7664p9872m4144m3978
$$ plain form
4122 1327217 1289034 1788492 1833972 1713340 1518124 1505409 1411552 1497951 1627993 1432005
4112 1432005 1220478 1423811 1545154 1801456 1865814 1901395 2017878 2070183 1669395 1718206
4102 1718206 1751101 1745712 1877385 1688394 1677101 1931836 2077110 2108225 2330541 2474983
4092 2474983 2444213 2724147 2826832 2899538 3092368 3275316 3385379 3371928 3145666 3205987
4082 3205987 3138006 3110240 3268453 3007484 2614923 2422212 2256637 2042981 1975836 1891657
4072 1891657 1765502 1625459 1477561 1445905 1621359 1632107 1690495 1538417 1441640 1560220
4062 1560220 1623653 1420833 1318864 1187486 1078026 1022105 967189 1040301 982601 1112827
4052 1112827 1258168 1085433 924330 854626 961108 1102237 1158124 829434 803191 803239 527363
$$ packed form
4122A327217l8183M99458M5480j20632j95216j2715r3857Q6399J30042j95988
4112A432005k11527K03333J21343K56302O4358L5581J16483N2305m00788M8811
4102A718206L2895n389J31673j88991j1293K54735J45274L1115K22316J44442
4092B474983l0770K79934J02685P2706J92830J82948J10063j3451k26262O0321
4082C205987o7981k7766J58213k60969l92561j92711j65575k13656o7145q4179
4072A891657j26155j40043j47898l1656J75454J0748N8388j52078r6777J18580
4062A560220O3433k02820j01969j31378j09460n5921n4916P3112n7700J30226
4052A112827J45341j72735j61103o9704J06482J41129N5887l28690k6243M8k75876
$$ plain form
4041 527363 746507 1064164 950851 822167 953100 918970 617416 603338 622999 767429
4031 767429 743257 600112 424310 422574 572152 767380 877115 837084 678498 538502
4021 538502 552088 654422 507676 740655 770776 698852 509263 474384 582406 552328 451858
4010 451858 362349 608463 578646 548456 401375 520922 587627 577859 474397 467540 595754
3999 595754 564484 464541 551090 623897 418330 523842 226651 216040 386084 316446 355776
3988 355776 482120 494222 475775 453012 511645 419889 362723 323303 393422 596108 703685
3977 703685 709583 564690 487795 756009 827917 891967 592786 426226 352295 336987 479838
3966 479838 475362 436217 475699 620659 378275 479699 461089 491183 469499 444499 550786
$$ packed form
4041E27363K19144L17657j13313j28684J30933l4130l01554j4078J9661J44430
4031G67429k4172j43145j75802j736J49578J95228J09735m0031j58586j39996
4021E38502J3586J02334j46746K32979L0121p1924j89589l4879J08022l0078j00470
4010D51858q9509K46114k9817l0190j47081J19547O6705r768j03462o857J28214
3999E95754l1270r9943Q6549P2807k05567J05512k97191j0611J70044o9638L9330
3988C55776J26344J2102j8447k2763N8633r1756n7166l9420P0119K02686J07577
3977G03685N898j44893p6895K68214P1908O4050k99181j66560p3931j5308J42851
3966D79838m476l9145L9482J44960k42384J01424j8610L0094k1684k5000J06287
$$ plain form
3955 550786 560174 222680 295722 457573 654686 611056 739334 503315 429211 396001 414276
3944 414276 555887 566083 612018 711110 680762 732127 719818 668179 651734 402313 610429
3933 610429 518240 443758 469820 436049 385657 484360 604213 631363 614374 470084 320680
3922 320680 320043 405204 295447 299015 133072 223284 213642 227982 600050 326723 111193
3911 111193 296119 298445 286899 272087 348730 236877 87588 136953 -71282 25200 138772
3900 138772 181745 211009 187941 118261 218335 350700 309946 242438 98126 45745 86781
3889 86781 166771 112565 -71816 -144764 139196 217467 139885 256416 181674 63521 149935
3878 149935 181708 216333 101670 177259 230244 103350 189690 173676 90254 75796 105309
$$ packed form
3955E50786R388l37494P3042J61851J97113m3630J28278k36019p4104l3210J8275
3944D14276J41611J0196M5935R9092l0348N1365j2309n1639j6445k49421K08116
3933F10429r2189p4482K6062l3771n0392R8703J19853K7150j6989j44290j49404
3922C20680o37Q5161j09757L568j65943R0212r642J4340L72068k73327k15530
3911A11193J84926K326j1546j4812P6643j11853j49289M9365k08235R6482J13572
3900A38772M2973K9264k3068o9680J00074J32365m0754o7508j44312n2381M1036
3889H6781P9990n4206j84381p2948K83960P8271p7582J16531p4742j18153Q6414
3878A49935L1773L4625j14663P5589N2985j26894Q6340j6014q3422j4458K9513
$$ plain form
3867 105309 326679 404298 121771 183450 219484 147090 85711 105212 132466 42799 47673
3856 47673 275355 410653 114303 -21288 -22235 -232316 -172229 70194 305174 265673 159565
3845 159565 100627 30043 42598 157613 -59723 19 259979 167336 302953 274882 101352
3834 101352 231086 318092 289649 228787 282896 207739 108038 127019 82633 125342 45042
3823 45042 145966 271666 98290 31772 46616 59971 160055 94141 37514 117699 118206
3812 118206 57972 145009 112646 180374 -1078 -136495 -94805 130104 150716 122677 152203
3801 152203 139318 3898 -166309 -207881 -180712 -47340 17968 160753 160225 159869 187446 355712
3789 355712 277056 79467 8820 -132406 -238734 -158393 -99354 2609 -160442 -110625 25088
$$ packed form
3867A05309K21370P7619k82527O1679L6034p2394o1379J9501K7254q9667M874
3856D7673K27682J35298k96350j35591r47k10081O0087K42423K34980l9501j06108
3845A59565n8938p0584J2555J15015k17336N9742K59960r2643J35617k8071j73530
3834A01352J29734Q7006k8443o0862N4109p5157r9701J8981m4386M2709q0300
3823D5042J00924J25700j73376o6518J4844J3355J00084o5914n6627Q0185N07
3812A18206o0234Q7037l2363O7728j81452j35417M1690K24909K0612k8039K9526
3801A52203j2885j35420j70207m1572K7169J33372O5308J42785n28l56K7577J68266
3789C55712p8656j97589p0647j41226j06328Q0341N9039J01963j63051M9817J35713
$$ plain form
3778 25088 -114424 -168271 12136 -15811 37114 -150449 -77156 130052 46269 227440 282400
3767 282400 91046 -227954 -116766 -101509 -31973 -325 110179 9819 123552 353425
3757 353425 199733 271897 169082 26824 -90786 -72827 17889 121862 263898 188104
3747 188104 90051 76055 -115694 -191690 -60466 -176229 -12397 70372 4494 -152065 -418874
3736 -418874 -332097 -117126 107307 17800 -68907 -34861 100907 61292 -85173 -144096 -174259
3725 -174259 -219540 -104365 110395 218268 32587 -21584 -157970 -173391 -108983 -255851
3715 -255851 -55606 -151641 -66539 -124895 37143 102199 78826 157258 135454 -37756 5184
3704 5184 -33210 -202160 -232316 -331765 31080 -81305 -288091 -24165 -145157 -103651 108135
$$ packed form
3778B5088j39512n3847J80407k7947N2925j87563P3293K07208q3783J81171N4960
3767B82400j91354l19000J11188J5257O9536L1648J10504j00360J13733K29873
3757C53425j53692P2164j02815j42258j17610J7959R0716J03973J42036p5794
3747A88104r8053j3996j91749p5996J31224j15763J63832Q2769o5878j56559k66809
3736d18874Q6777K14971K24433q9507q6707L4046J35768l9615j46465n8923l0163
3725a74259m5281J15175K14760J07873j85681n4171j36386j5421O4408j46868
3715b55851K00245r6035Q5102n8356J62038O5056k3373P8432k1804j73210M2940
3704E184l8394j68950l0156r9449L62845j12385k06786K63926j20992M1506K11786
$$ plain form
3693 108135 -42956 -153226 -281729 -141913 49070 144068 45943 -81178 113059 71945
3683 71945 -63393 224512 325958 159302 24922 37604 -125701 -264582 -187831 -134392
3673 -134392 -301716 -323425 -156588 -200329 -117153 -18017 -570 163351 171245 33090 62327
3662 62327 -93243 -281657 -242239 -191673 -200969 -243699 -162116 -404588 -326914 -219094 -196090
3651 -196090 17185 -62086 -159026 -31835 -64990 -47086 -279812 -230892 63226 112967 41318
3640 41318 51483 69166 -53230 119767 -111153 -199991 -5290 -110562 -246434 -112170
3630 -112170 -21472 -67157 -48387 -40530 16108 -81732 -4336 117473 18235 52531 -133989
3619 -133989 -89255 -84811 81970 -49548 -187706 -188385 -16124 -49582 103476 149194 89159
$$ packed form
3693A08135j51091j10270j28503J39816J90983R4998r8125j27121J94237m1114
3683G1945j35338K87905J01446j66656j34380J2682j63305j38881P6751N3439
3673a34392j67324k1709J66837m3741Q3176R9136J7447J63921P894j38155K9237
3662F2327j55570j88414L9418N0566r296m2730Q1583k42472P7674J07820K3004
3651a96090K13275p9271r6940J27191l3155J7904k32726M8920K94118M9741p1649
3640D1318J0165J7683j22396J72997k30920q8838J94701j05272j35872J34264
3630a12170R0698m5685J8770P857N6638r7840P7396J21809r9238L4296j86520
3619a33989M4734M444J66781j31518j38158o79J72261l3458J53058M5718o0035
$$ plain form
3608 89159 101409 82183 43311 19399 -13635 -149319 -278090 -335242 -219093 -82675 -210352
3597 -210352 -29365 104060 73399 -11962 -177904 -231853 -236790 -132680 -102455 3211 142220
3586 142220 70117 9922 128727 -80516 187184 124144 79575 157241 74800 -76415 -69511
3575 -69511 -159223 -42123 -5808 -9559 176300 271632 76387 150283 148156 74380 37161 -115222
3563 -115222 53811 105594 262354 275728 255573 216510 17203 -23591 -24017 23280 172180
3552 172180 147788 136738 57425 10792 40253 44328 99817 -37460 218968 336046 291386
3541 291386 195554 30693 68927 -40701 -82803 -167740 -189578 -404029 -295978 -87342 -210574
3530 -210574 -6995 127113 70779 -15117 -27427 19903 25818 155236 215215 247169 244634
$$ packed form
3608H9159J2250j9226l8872k3912l3034j35684j28771n7152J16149J36418j27677
3597b10352J80987J33425l0661q5361j65942n3949m937J04110L0225J05666J39009
3586A42220p2103o0195J18805k09243K67700o3040m4569P7666q2441j51215O904
3575f9511q9712J17100L6315l751J85859R5332j95245P3896k127p3776l7219j52383
3563a15222J69033N1783J56760J3374k0155l9063j99307m0794m26M7297J48900
3552A72180k4392j1050p9313m6633K9461M075N5489j37277K56428J17078m4660
3541B91386r5832j64861L8234j09628m2102q4937k1838k14451J08051K08636j23232
3530b10574K03579J34108n6334q5896j2310M7330N915J29418N9979L1954k535
$$ plain form
3519 244634 38458 -88083 41892 178390 -93538 -90733 45789 31731 45638 -69817
3509 -69817 -71542 -196426 -366896 -207344 112815 17271 81753 161567 91826 -122247 -117688
3498 -117688 -172707 -310857 -271951 -215371 -22657 9590 -137286 -157691 -23909 26774 85039
3487 85039 -1063 89821 2259 118516 124272 -70266 275333 194716 162778 -84273 -121608
3476 -121608 -13472 281 122470 4298 100642 138746 101829 106846 30180 -31677 167947
3465 167947 234161 191995 10022 -84885 -138723 -67951 -141112 -156506 17751 54506 153971
3454 153971 56429 40317 71396 -77539 -128047 -168349 -178575 -162138 -157907 -135791 -141861 -270411
3442 -270411 -219929 -72908 -42428 -31239 -110371 -143271 -130609 -93584 -110217 -98595 -33261
$$ packed form
3519B44634k06176j26541J29975J36498k71928K805J36522j4058J3907j15455
3509f9817j725j24884j70470J59552L20159r5544O4482P9814o9741k14073M559
3498a17688n5019j38150L8906N6580J92714L2247j46876k0405J33782N0683N8265
3487H5039q6102R0884q7562J16257N756j94538L45599q0617l1938k47051l7335
3476a21608J08136J3753J22189j18172R6344L8104l6917N017p6666o1857J99624
3465A67947O6214m2166j81973r4907n3838P0772p3161j5394J74257L6755R9465
3454A53971r7542j6112L1079j48935n0508m0302j0226J6437M231K2116o070j28550
3442b70411N0482J47021L0480J1189p9132l2900J2662L7025j6633J1622O5334
$$ plain form
3431 -33261 -92721 -62413 209777 215692 254715 216721 -94028 -51142 149523 78288 250612
3420 250612 216882 90518 204410 280565 340729 239022 246005 149801 153826 30687 97471
3409 97471 39479 -439 164 -204992 -114604 -293449 -314754 -288043 -182247 -38782 14427
3398 14427 -239395 -198673 6979 -66393 135369 263441 147627 8988 124998 59079
3388 59079 -22687 16512 118509 -60503 -166247 -122110 -146754 -31527 -10968 -155346 -131105
3377 -131105 -49984 -35039 225483 83437 -62612 114525 127551 163734 36773 -24688 -54226
3366 -54226 -58678 -2417 72688 98934 99946 186367 234125 200196 241602 -8920 4186 130704
3354 130704 17222 136909 58802 29811 245099 274870 45347 161825 67287 44648 56126
$$ packed form
3431c3261n9460L0308K72190N915L9023l7994l10749M2886K00665p1235J72324
3420B50612l3730j26364J13892P6155O0164j01707O983r6204M025j23139O6784
3409I7471n7992l9918O03k05156R0388j78845k1305K6711J05796J43465N3209
3398A4427k53822M0722K05652p3372K01762J28072j15814j38639J16010o5919
3388E9079q1766L9199J01997j79012j05744M4137k4644J15227K0559j44378K4241
3377a31105Q1121J4945K60522j42046j46049J77137J3026L6183j26961o1461k9538
3366e4226m452N6261P5105K6246J012Q6421M7758l3929M1406k50522J3106J26518
3354A30704j13482J19687p8107k8991K15288K9771k29523J16478r4538k2639J1478
$$ plain form
3343 56126 6639 40550 152452 192121 190800 174143 217758 134057 -81086 192215 250581
3332 250581 142094 180275 33707 120366 -50854 132090 86811 -12115 52635 152875 288981
3321 288981 235064 156372 75698 -23121 -145312 -165766 -177358 181306 329206 302457 177000
3310 177000 -73738 16293 129009 55786 133715 104309 28522 170760 282517 304484 321172
3299 321172 321434 248422 117678 158844 143406 275155 94712 -56656 53137 -18447 -152513
3288 -152513 -94496 63478 84678 140005 126595 159440 350800 429760 376964 276714 392857
3277 392857 400701 188816 277688 214277 56392 105939 250800 489501 512611 477150 482653
3266 482653 501747 350951 323313 329663 543884 478908 291214 372210 486143 416695 334184
$$ packed form
3343E6126m9487L3911J11902L9669j321j6657M3615q3701k15143K73301N8366
3332B50581j08487L8181j46568Q6659j71220J82944m5279r8926O4750J00240J36106
3321B88981n3917p8692q0674r8819j22191k0454j1592L58664J47900k6749j25457
3310A77000k50738R0031J12716p3223P7929k9406p5787J42238J11757K1967J6688
3299C21172K62p3012j30744M1166j5438J31749j80443j51368J09793p1584j34066
3288a52513N8017J57974K1200N5327j3410L2845J91360P8960n2796j00250J16143
3277C92857P844k11885Q8872o3411j57885M9547J44861K38701K3110l5461N503
3266D82653J9094j50796k7638O350K14221o4976j87694Q0996J13933o9448q2511
$$ plain form
3255 334184 327539 301974 276849 431731 365753 479373 358613 378780 501310 531880 575149
3244 575149 619400 647239 535871 428354 464307 728136 786966 898885 847832 1033097 1153691
3233 1153691 1108419 954348 1061075 895264 977564 1116835 1080204 1164963 1266089 1420269
3223 1420269 1419144 1425050 1692033 1850796 1878155 1965467 1923138 2150907 2482419 2580490 2504374
3212 2504374 2484055 2632988 2724477 2922598 2936416 2765680 2542382 2379678 2366685 2219523
3202 2219523 1916846 1845432 1859640 1588961 1321783 1426758 1632535 1538281 1703376 1459816
3192 1459816 1521340 1854238 1796923 1722730 1576123 1522000 1546817 1636987 1632306 1892891 1819491
3181 1819491 1633826 1675402 1647923 1490349 1297098 1222546 1117426 926591 1035990 1114884
$$ packed form
3255C34184o645k5565k5125J54882o5978J13620j20760K0167J22530L0570M3269
3244E75149M4251K7839j11368j07517L5953K63829N8830J11919n1053J85265J20594
3233A153691m5272j54071J06727j65811Q2300J39271l6631Q4759J01126J54180
3223A420269j125N906K66983J58763K7359Q7312m2329K27769L31512R8071p6116
3212B504374k0319J48933R1489J98121J3818j70736k23298j62704j2993j47162
3202B219523l02677p1414J4208k70679k67178J04975K05777r4254J65095k43560
3192A459816O1524L32898n7315p4193j46607n4123K4817R0170m681K60585p3400
3181A819491j85665M1576k7479j57574j93251p4552j05120j90835J09399P8894
$$ plain form
3171 1114884 1337891 1098946 727610 882077 874054 996431 1017260 1150312 1185893 1292489
3161 1292489 1520295 1566011 1556263 1602531 1859977 1983213 2259197 2103529 1931956 2221100
3151 2221100 2555117 2524480 2366148 2175246 1485057 1151817 1263776 1231659 1092494 846359
3141 846359 945046 1121549 1066044 1136867 995005 912974 831479 893193 898119 1015141 1038980
3130 1038980 982252 993609 768060 700902 1004181 1101793 922762 1100153 1373026 1358537
3120 1358537 1238766 1209835 1086682 984489 654049 516894 411460 369984 483706 657058
3110 657058 572845 312474 397082 439816 469729 370019 521071 446010 333922 377755 283455
3099 283455 528898 515850 207163 236820 282960 365073 331239 376972 138452 194015 202894
$$ packed form
3171A114884K23007k38945l71336J54467q023J22377K0829J33052L5581J06596
3161A292489K27806M5716r748M6268K57446J23236K75984j55668j71573K89144
3151B221100L34017l0637j58332j90902o90189l33240J11959l2117j39165k46135
3141H46359R8687J76503n5505P0823j41862q2031q1495O1714M926J17022K3839
3130A038980n6728J1357k25549o7158L03279R7612j79031J77391K72873j4489
3120A358537j19771k8931j23153j02193l30440j37155j05434m1476J13722J73352
3110F57058q4213k60371Q4608M2734K9913r9710J51052p5061j12088M3833r4300
3099B83455K45443j3048l08687K9657M6140Q2113l3834M5733k38520N5563Q879
$$ plain form
3088 202894 -6832 51426 30100 62533 147666 373042 441511 254120 86245 87051 155321
3077 155321 21139 -41515 76997 188920 382209 233643 -17857 -124327 87949 207733
3067 207733 94216 -100467 -326138 -168390 -238249 -104467 137269 -142735 -180559 -84006
3057 -84006 24632 -10452 -76937 -54497 -32244 212565 194997 183542 78987 68005 156910
3046 156910 161318 -60046 31575 153026 55848 182485 50016 40188 105722 140391 -56717
3035 -56717 89392 -22561 -71997 7042 13785 22178 187320 100628 -131135 -236804 -99660
3024 -99660 -332078 -230190 -142824 -251469 -29747 152224 166886 192138 307649 151203
3014 151203 169591 128243 -130395 -83825 79508 171933 262086 271284 173894 136892 110962
$$ packed form
3088B02894k09726N8258k1326L2433Q5133K25376O8469j87391j67875Q06O8270
3077A55321j34182o2654J18512J11923J93289j48566k51500j06470K12276J19784
3067B07733j13517j94683k25671J57748o9859J33782K41736k80004l7824R6553
3057h4006J08638l5084o6485K2440K2253K44809j7568j1455j04555j0982Q8905
3046A56910M408k21364R1621J21451r7178J26637j32469r828O5534L4669j97108
3035e6717J46109j11953m9436P9039O743Q393J65142q6692k31763j05669J37144
3024i9660k32418J01888Q7366j08645K21722J81971J4662K5252J15511j56446
3014A51203J8388m1348k58638M6570J63333R2425R0153R198r7390l7002k5930
$$ plain form
3003 110962 242127 384074 1312 -92723 -67821 117474 139572 53392 -25544 -128643 -92596
2992 -92596 14957 -135688 -23094 35571 7831 -44876 -38218 -137461 -122612 -99679 -49676
2981 -49676 -41306 53065 117471 -214426 -169276 96996 -35961 -26000 -111555 -43012 47207 -88946
2969 -88946 -84849 95270 -2361 -134693 -118245 -24389 36884 128823 -56766 20060 49692
2958 49692 -204508 -345955 -284090 -163690 -141081 69215 41238 160857 260782 222393 213758
2947 213758 283680 205180 55281 -192385 -154898 -45079 -92220 170313 115145 17426 149876
2936 149876 57415 -196070 -200010 82888 31896 31529 -30813 -112140 -127664 25595 81775 32709
2924 32709 -38955 -101572 -52121 113764 -57204 -7965 102491 -105728 -225426 -42121 78152
$$ packed form
3003A10962J31165J41947l82762r4035K4902J85295K2098q6180p8936j03099L6047
2992i2596J07553j50645J12594N8665k7740n2707O658r9243J4849K2933N0003
2981d9676Q370R4371O4406l31897M5150K66272j32957R961q5555O8543R0219j36153
2969h8946M097J80119r7631j32332J6448R3856O1273R1939j85589P6826K9632
2958D9692k54200j41447O1865J20400K2609K10296k7977J19619R9925l8389q635
2947B13758O9922p8500j49899k47666L7487J09819m7141K62533n5168r7719J32450
2936A49876r2461k53485l940K82898n0992l67o2342q1327j5524J53259N6180m9066
2924C2709p1664o2617M9451J65885j70968M9239J10456k08219j19698J83305J20273
$$ plain form
2913 78152 110857 248172 50500 152621 102085 1879 121504 81281 17292 -36811 114052
2902 114052 143046 170278 12336 8586 14519 58792 -17094 68111 141224 139646 121515 91968
2890 91968 22815 110743 250744 381832 267327 193315 240509 219687 164662 192856 228420
2879 228420 300972 452688 169156 199965 153301 242716 384120 262787 257185 254206 184014
2868 184014 62227 50151 113548 347365 243456 62827 168123 96727 112426 230991
2858 230991 309367 364464 342371 308905 206894 -18513 54515 181721 167020 4753 -27849
2847 -27849 178001 219811 289433 145140 163348 242458 112409 84170 88203 -1881 181740
2836 181740 263115 170650 287598 361056 306457 221052 196186 86466 154807 216075 222564
$$ packed form
2913G8152L2705J37315j97672J02121n0536j00206J19625m0223o3989n4103J50863
2902A14052K8994K7232j57942l750N933M4273p5886Q5205P3113j578j8131k9547
2890I1968o9153Q7928J40001J31088j14505p4012M7194k0822n5025K8194L5564
2879B28420P2552J51716k83532L0809m6664Q9415J41404j21333n602k979p0192
2868A84014j21787j2076O3397K33817j03909j80629J05296p1396J5699J18565
2858B30991P8376N5097k2093l3466j02011k25407P3028J27206j4701j62267l2602
2847b7849K05850M1810O9622j44293J8208P9110j30049k8239M033r0084J83621
2836A81740Q1375r2465J16948P3458n4599q5405k4866j09720O8341O1268O489
$$ plain form
2825 222564 250532 356911 24219 58155 383861 392703 270256 109497 193429 321673 141338
2814 141338 -67407 51994 159366 217452 146859 169582 97757 -92533 7196 46783 150183
2803 150183 123635 58941 57334 221352 188161 -56478 -31972 25725 -90168 31723 42297
2792 42297 143353 235027 23067 18893 202164 255500 254189 61634 -4858 144843 82245
2781 82245 -27539 75225 -89643 -157982 -96842 23484 38826 24640 -12548 -186523 -51749
2770 -51749 -176395 -215883 -212524 -119407 40807 -44139 136821 63730 -8298 -169358 -177487
2759 -177487 74917 -215580 -272193 -98616 -216060 -26675 -10323 144484 -23388 51786
2749 51786 -82995 129299 49669 -140404 -146776 35641 -5738 -15829 23599 123943 5479
$$ packed form
2825B22564K7968J06379l32692L3936L25706Q842j22447j60759Q3932J28244j80335
2814A41338k08745J19401J07372N8086p0593K2723p1825j90290R9729L9587J03400
2803A50183k6548o4694j607J64018l3191k44639K4506N7697j15893J21891J0574
2792D2297J01056R1674k11960m174J83271N3336j311j92555o6492J49701o2598
2781H2245j09784J02764j64868o8339O1140J20326J5342j4186l7188j73975J34774
2770e1749j24646l9488L359R3117J60214q4946J80960p3091p2028j61060q129
2759a77487K52404k90497n6613J73577j17444J89385J6352J54807j67872P5174
2749E1786j34781K12294p9630j90073o372J82417m1379j0091L9428J00344j18464
$$ plain form
2738 5479 -272015 -116138 20245 98310 -322981 -100997 -2615 75961 -111057 -265716 -146240
2727 -146240 20136 -41139 36801 92292 187961 36670 97562 -135502 -54910 -90909 -313323
2716 -313323 -385472 -52586 -63607 -152955 -99358 -232045 -153526 -182689 -255200 -166700 -113391
2705 -113391 55881 -119350 -142780 -279222 -193383 -28368 139334 165185 -115134 -337742
2695 -337742 -153121 119984 175718 171314 96170 -164572 -223184 -172065 18042 -201430 -226136
2684 -226136 -205400 -317133 -115978 -185088 -250987 -12158 86618 102380 21076 -57195 70864
2673 70864 -61288 -67779 -253686 -280474 -225657 -188069 -141498 -118475 -109423 -214937 -305230 -56714
2661 -56714 72326 -111526 -92516 -63365 -167380 -55502 -256339 -329157 -474051 -489321 -181349
$$ packed form
2738E479k77494J55877J36383P8065m21291K21984R8382P8576j87018j54659J19476
2727a46240J66376o1275P7940N5491R5669j51291O0892k33064Q0592l5999k22414
2716c13323p2149L32886j1021q9348N3597j32687P8519k9163p2511Q8500N3309
2705a13391J69272j75231k3430j36442Q5839J65015J67702K5851k80319k22608
2695c37742J84621K73105N5734m404p5144k60742n8612N1119J90107k19472k4706
2684b26136K0736j11733K01155o9110o5899K38829R8776J5762q1304p8271J28059
2673G0864j32152o491j85907k6788N4817L7588M6571K3023R052j05514r0293K48516
2661e6714J29040j83852J9010K9151j04015J11878k00837p2818j44894j5270L07972
$$ plain form
2650 -181349 -194030 -336403 -398097 -105883 -61243 -158119 -77985 -203150 -76043 -277292 -90927
2639 -90927 -7157 45141 -177208 -202559 -95574 49497 -15479 -113499 -148852 -202701 -229388
2628 -229388 120840 32821 -164961 -314900 -361414 -134169 -197006 -236028 -18249 -134453
2618 -134453 -168673 -260049 -243568 -141120 -111095 -89468 -789 168640 -369963 -234017 70649
2607 70649 137100 -157309 -185790 -103879 79803 185658 118611 162013 118710 81991 69608
2596 69608 -89799 -189144 -195120 -114851 -245582 -148454 11286 -115235 -6168 -991 -29553
2585 -29553 -182392 -11888 249240 349804 289576 316553 223689 127574 17311 -46063 185694
2574 185694 -38358 -136224 -136696 -21250 125083 152097 63854 -51899 26755 233914 219498
$$ packed form
2650a81349j2681j42373o1694K92214M4640r6876Q0134j25165J27107k01249J86365
2639i0927Q3770N2298k22349k5351J06985J45071o4976r8020l5353n3849k6687
2628b29388L50228q8019j97782j49939m6514K27245o2837l9022K17779j16204
2618a34453l4220r1376J6481J02448L0025K1627Q8679J69429n38603J35946L04666
2607G0649O6451k94409k8481Q1911J83682J05855o7047M3402m3303l6719j2383
2596F9608j59407r9345n976Q0269j30731R7128J59740j26521J09067N177k8562
2585b9553j52839J70504K61128J00564o0228K6977r2864r6115j10263o3374K31757
2574A85694k24052r7866m72J15446J46333K7014q8243j15753P8654K07159j4416
$$ plain form
2563 219498 59717 41634 -228087 12174 106021 -212333 -215965 -171917 -19148 36584 22855
2552 22855 91716 66386 -192965 -239319 -105041 -53460 13155 -85223 55928 173939 16055
2541 16055 31005 100660 225154 154480 34275 9707 -56165 -54652 142544 132528 25479
2530 25479 -28642 56331 -147933 -221186 -141203 -260687 -183526 -152623 -136814 -194554 -96870
2519 -96870 -59321 -166512 -183753 -195871 -82415 21103 -23905 -135912 -60736 -141785 -135376
2508 -135376 14824 -74943 26793 39651 -49567 -20157 -34281 -82271 -89148 -53931 -132936
2497 -132936 11070 191531 7227 -16265 -89469 -217043 112569 113257 -30775 -52918 -89769
2486 -89769 -107051 -100003 114449 173973 35611 -86510 -198828 -57983 98313 162992 69681
$$ packed form
2563B19498j59781j8083k69721K40261R3847l18354l632M4048J52769N5732j3729
2552B2855O8861k5330k59351m6354J34278N1581O6615r8378J41151J18011j57884
2541A6055J4950O9655J24494p0674j20205k4568o5872J513J97196j0016j07049
2530B5479n4121Q4973k04264p3253P9983j19484P7161L0903J5809n7740R7684
2519i6870L7549j07191j7241j2118J13456J03518m5008j12007P5176q1049O409
2508a35376J50200q9767J01736J2858q9218K9410j4124m7990o877L5217p9005
2497a32936J44006J80461j84304k3492p3204j27574L29612O88j44032k2143l6851
2486h9769j7282P048K14452N9524j38362j22121j12318J40845J56296O4679r3311
$$ plain form
2475 69681 63190 27761 55981 235870 14453 -238164 -197437 40174 90962 96233 -82648
2464 -82648 -197111 -111293 -29972 -214123 -201585 6491 -151153 112310 48672 -175655 -231248
2453 -231248 -5985 -76009 -322331 -183028 -150880 -2462 -46293 -21410 -12487 -109976 -349160
2442 -349160 -342160 -32284 -247096 -90786 114474 25165 -155038 -226849 -213453 -138000 -97932
2431 -97932 -33083 -178979 -197618 -9850 49041 55146 11222 -51501 -219661 -160485 -119569
2420 -119569 -23548 -94542 -18590 84655 202401 -19464 67450 113275 -184416 -210805 -224021
2409 -224021 -194104 -121899 -175584 -133831 -257839 -154751 115138 -57723 -175539 91253
2399 91253 154933 83683 89036 378452 149202 -134638 113290 175099 360429 274354 239861
$$ packed form
2475F9681o491l5429K8220J79889k21417k52617M0727K37611N0788N271j78881
2464h2648j14463Q5818Q1321j84151J2538K08076j57644K63463o3638k24327n5593
2453b31248K25263p0024k46322J39303L2148J48418m3831K4883Q923r7489k39184
2442c49160P000L09876k14812J56310K05260q9309j80203p1811J3396P5453M0068
2431i7932O4849j45896j8639J87768N8891O105m3924o2723j68160N9176M0916
2420a19569R6021p0994P5952J03245J17746k21865Q6914M5825k97691k6389j3216
2409b24021K9917P2205n3685M1753j24008J03088K69889j72861j17816K66792
2399I1253O3680p1250N353K89416k29250k83840K47928O1809J85330q6075l4493
$$ plain form
2388 239861 101909 140806 90138 43364 -84188 -228175 -82219 -63823 -139855 -123615 56529
2377 56529 120011 152825 -123972 -63364 79205 134679 220072 76185 206327 15030 -147086
2366 -147086 -104178 -184510 -202098 -85206 120484 252911 308387 141872 269113 341470 131935
2355 131935 4944 -193762 -70878 -38784 97799 40383 -10280 221285 214850 312704 205554
2344 205554 218695 358027 226225 252195 451044 419698 263891 178756 384628 257065
2334 257065 439752 452745 554064 440507 304530 288992 230205 42218 -3922 -25930 65455
2323 65455 180170 29341 134229 -4146 143555 219820 203841 121477 279324 307783 189384
2312 189384 208011 176731 129266 157004 137965 90635 178081 118715 -40814 -150670 195044
$$ packed form
2388B39861j37952L8897n0668m6774j27552j43987J45956J8396p6032J6240J80144
2377E6529O3482L2814k76797O0608J42569N5474Q5393j43887J30142j91297j62116
2366a47086M2908q0332j7588J16892K05690J32427N5476j66515J27241P2357k09535
2355A31935j26991j98706J22884L2094J36583n7416n0663K31565o435R7854j07150
2344B05554J3141J39332j31802K5970J98849l1346j55807q5135K05872j27563
2334B57065J82687J2993J01319j13557j35977j5538n8787j87987m6140k2008R1385
2323F5455J14715j50829J04888j38375J47701P6265j5979q2364J57847K8459j18399
2312A89384J8627l1280m7465K7738j9039m7330Q7446n9366j59529j09856L45714
$$ plain form
2301 195044 176896 177919 201066 244939 230652 159544 324832 367480 403837 228669 304383
2290 304383 493394 370537 292124 366181 110020 279897 276047 363104 348960 310718 343240
2279 343240 399601 307371 230198 237885 427293 323554 23871 3640 155525 150893 210739
2268 210739 381123 270202 267487 209122 363667 483315 262306 187384 330829 215624
2258 215624 115008 285627 361052 186852 220339 315242 109874 182116 254541 125129 439579
2247 439579 341401 372494 339156 275907 331772 502490 518265 375804 605087 470161 323331
2236 323331 265462 196140 198176 304038 276208 474300 312269 362068 576718 513561 309088
2225 309088 415832 370931 211213 214516 556309 579463 412291 274044 184184 201645 389664
$$ packed form
2301A95044j8148J023K3147M3873j4287p1108J65288M2648L6357j75168P5714
2290C04383J89011j22857p8413P4057k56161J69877l850Q7057j4144l8242L2522
2279C43240N6361r2230p7173P687J89408j03739k99683k0231J51885m632N9846
2268B10739J70384j10921k715n8365J54545J19648k21009p4922J43445j15205
2258B15624j00616J70619P5425j74200L3487R4903k05368P2242P2425j29412L14450
2247D39579r8178L1093l3338o3249N5865J70718J5775j42461K29283j34926j46830
2236C23331n7869o9322K036J05862k7830J98092j62031M9799K14650o3157k04473
2225C09088J06744m4901j59718L303L41793K3154j67172j38247q9860J7461J88019
$$ plain form
2214 389664 660310 501146 621406 915302 906159 751766 627710 631257 783257 830627 776943
2203 776943 682719 512903 450103 615670 490036 635648 742246 701904 725451 670329 849888
2192 849888 886371 700162 802601 657729 749927 1049526 851712 794578 840477 925901 941937
2181 941937 978056 1032406 959116 1149500 1048356 1161218 1060759 1110976 1160459 1298537 1210440
2170 1210440 1328157 1349311 1336101 1325929 1379258 1604973 1486653 1577172 1635811 1706091 1792417
2159 1792417 1879801 2021860 1960745 1868497 1866641 2063734 2267780 2407982 2407181 2519249 2528097
2148 2528097 2338232 2504112 2383195 2559039 2712890 2657689 2553890 2668902 2874364 2725673
2138 2725673 2757687 3027825 3071551 2958545 3214021 3217375 3450639 3568887 3417479 3337395
$$ packed form
2214C89664K70646j59164J20260K93896r143j54393j24056L547J52000M7370n3684
2203G76943r4224j69816o2800J65567j25634J45612J06598m0342K3547n5122J79559
2192H49888L6483j86209J02439j44872R2198K99599j97814n7134M5899Q5424J6036
2181I41937L6119N4350p3290J90384j01144J12862j00459N0217M9483J38078q8097
2170A210440J17717K1154j3210j0172N3329K25715j18320R0519N8639P0280Q6326
2159A792417Q7384J42059o1115r2248j856J97093K04046J40202q01J12068Q848
2148B528097j89865J65880j20917J75844J53851n5201j03799J15012K05462j48691
2138B725673L2014K70138M3726j13006K55476L354K33264J18248j51408q0084
$$ plain form
2128 3337395 3461721 3708908 3881536 3934384 3977059 4315922 4493009 4394968 4492586 4740480
2118 4740480 4921478 4950246 5154244 5277035 5333624 5540529 5735364 6139730 6533337 6622067
2108 6622067 6876995 7388085 7461052 7692396 7877393 8218786 8595453 9122487 9655283 10178655
2098 10178655 10528222 11239530 11594407 11969040 12709178 13637972 14276914 15146621 16068265
2089 16068265 17009621 17882327 19140701 20868680 22427332 23946614 25733725 27652905
2081 27652905 29822132 32433142 35411791 38822210 42947888 47183942 51666851 57250472
2073 57250472 62623374 67660174 73486944 77975063 73014247 61305270 50110021 41643568
2065 41643568 35451131 30817445 26971539 24310794 22050594 19690453 17823217 16528654
$$ packed form
2128C337395J24326K47187J72628N2848M2675L38863J77087r8041R7618K47894
2118D740480J80998K8768K03998J22791N6589K06905J94835M04366L93607Q8730
2108F622067K54928N11090P2967K31344J84997L41393L76667N27034N32796N23372
2098A0178655L49567P11308L54877L74633P40138R28794O38942Q69707R21644
2089A6068265R41356Q72706J258374J727979J558652J519282J787111J919180
2081B7652905K169227K611010K978649L410419M125678M236054M482909N583621
2073E7250472N372902N036800N826770M488119m960816j1708977j1195249q466453
2065D1643568o192437m633686l845906k660745k260200k360141j867236j294563
$$ plain form
2057 16528654 15499812 14663664 14007314 12941238 12039065 11259540 10376942 9617485 9064594
2048 9064594 8743314 8248887 7604323 7238964 6893062 6457856 5987185 5878554 5740001 5472003
2038 5472003 5341444 5157487 4832853 4497371 4354911 4187561 4095597 4094390 3755249 3704824
2028 3704824 3859779 3738026 3579930 3600737 3554304 3434867 3129383 2992209 2850601 2788727
2018 2788727 2743922 2691925 2610053 2545391 2427950 2259821 2192390 2185159 2153975 2052388 1911213
2007 1911213 2074114 2041812 1838557 1933090 1937408 2075879 2117645 1972682 1864498 1883756 1921661
1996 1921661 1932974 1617838 1427009 1543079 1509712 1433148 1428743 1585050 1355518 1410045 1348830
1985 1348830 1369600 1378134 1270246 1151829 1138000 1154672 1174573 1252587 957274 750842 956542
$$ packed form
2057A6528654j028842q36148o56350j066076r02173p79525q82598p59457n52891
2048I064594l21280m94427o44564l65359l45902m35206m70671j08631j38553k67998
2038E472003j30559j83957l24634l35482j42460j67350r1964j207l39141n0425
2028C704824J54955j21753j58096K0807m6433j19437l05484j37174j41608o1874
2018B788727m4805n1997q1872o4662j17441j68129o7431p231l1184j01587j41175
2007A911213J62901l2302k03255R4533M318J38471M1766j44963j08184J9258L7905
1996A921661J1313l15136j90829J16070l3367p6564m405J56307k29532N4527o1215
1985A348830K0770Q534j07888j18417j3829J6672J9901P8014k95313k06432K05700
$$ plain form
1974 956542 1018429 911411 994732 1027384 1016879 1091697 1239889 888958 691021 710661 606104
1963 606104 787246 793917 715606 807736 711473 808905 663147 577417 583884 544291 483436 446483
1951 446483 683618 705073 675366 668231 758814 836916 958664 743746 424125 615213 446888
1940 446888 469154 546525 453414 466125 482115 441916 367840 497098 549793 540486 585874 563743
1928 563743 422697 209420 383746 502956 454520 291905 436265 701630 618543 468687
1918 468687 401050 482236 380775 298453 313839 542988 409275 307595 362100 630306 676178
1907 676178 555154 572447 431149 381128 348102 320085 232148 142991 35531 206120 160216
1896 160216 138729 169461 222374 315859 305630 440769 275324 75091 249530 273444 284604
$$ packed form
1974I56542O1887j07018Q3321L2652j0505P4818J48192l50931j97937J9640j04557
1963F06104J81142O671p8311R2130r6263R7432j45758q5730O467l9593o0855l6953
1951D46483K37135K1455k9707p135R0583P8102J21748k14918l19621J91088j68325
1940D46888K2266P7371r3111J2711J5990m0199p4076J29258N2695r307M5388k2131
1928E63743j41046k13277J74326J19210m8436j62615J44360K65365q3087j49856
1918D68687o7637Q1186j01461q2322J5386K29149j33713j01680N4505K68206M5872
1907F76178j21024J7293j41298n0021l3026k8017q7937q9157j07460J70589m5904
1896A60216k1487L0732N2913R3485j0229J35139j65445k00233J74439K3914J1160
$$ plain form
1885 284604 -17592 79615 1992 -43545 87594 178391 25318 -26662 52908 251405 133606
1874 133606 270295 265155 320340 346960 239615 285094 341723 116042 -82211 353133 273377
1863 273377 -542 -10359 66585 88279 336938 323774 66540 80136 184252 84777 22339
1852 22339 -78007 -92475 -25989 128440 -93892 -130215 -220355 -249693 -177604 -120888 101153
1841 101153 20804 153103 89228 -79697 4773 83901 -45829 21881 157184 105955 118330
1830 118330 136188 276298 169119 202552 186112 284099 76307 -229862 -137802 204718 89472
1819 89472 131205 243969 80394 -114138 88487 183956 243354 208931 222648 75118 -46428
1808 -46428 -81304 25169 152960 520675 222310 -18884 174624 140315 349600 531730
$$ packed form
1885B84604l02196R7207p7623m5537J31139R0797j53073n1980P9570J98497j17799
1874A33606J36689n140N5185K6620j07345M5479N6629k25681j98253M35344p9756
1863B73377k73919r817P6944K1694K48659j3164k57234J3596J04116r9475o2438
1852B2339j00346j4468O6486J54429k22332l6323r0140k9338P2089N6716K22041
1841A01153q0349J32299o3875j68925Q4470P9128j29730O7710J35303n1229J2375
1830A18330J7858J40110j07179L3433j6440R7987k07792l06169R2060L42520j15246
1819H9472M1733J12764j63575j94532K02625R5469N9398l4423J3717j47530j21546
1808d6428l4876J06473J27791L67715k98365k41194J93508l4309K09285J82130
$$ plain form
1798 531730 413850 279436 285402 260517 495215 257476 -171564 -128493 -83248 -31321 110389
1787 110389 202314 73305 124022 214069 31781 -63920 -50534 18988 76483 71042 7913
1776 7913 -58425 -126813 -1507 -10332 38143 69544 111633 146058 227957 152282 -35957 -176216
1764 -176216 -96301 -40147 34047 -5457 130904 131884 -80330 -131560 -175726 -82234 15203 15537
1752 15537 61254 162180 154730 43096 -11081 -90015 -31264 73972 -151218 -16607 159754
1741 159754 36068 50770 -143331 -260406 -21475 215438 -68250 -215703 -148099 -69335
1731 -69335 48494 57950 -239060 -457885 -418576 -254761 -173816 -152907 86818 -96645 -202417
1720 -202417 -74652 -306086 -55504 70279 93202 78159 122262 33143 93019 141449 11655
$$ packed form
1798E31730j17880j34414N966k4885K34698k37739m29040M3071M5245N1927J41710
1787A10389R1925j29009N0717R0047j82288r5701J3386O9522N7495n441o3129
1776G913o6338o8388J25306q825M8475L1401M2089L4425Q1899p5675j88239j40259
1764a76216P9915N6154P4194l9504J36361R80k12214n1230m4166R3492R7437L34
1752A5537M5717J00926p450j11634n4177p8934N8751J05236k25190J34611J76361
1741A59754j23686J4702j94101j17075K38931K36913k83688j47453O7604P8764
1731f9335J17829R456k97010k18825L9309J63815Q0945K0909K39725j83463j05772
1720b02417J27765k31434K50582J25783K2923j5043M4103q9119N9876M8430j29794
$$ plain form
1709 11655 -175427 -259521 -201810 -194558 -104386 -166734 -183226 -178203 -129616 -27099 33288 -165911
1697 -165911 -256702 72355 226094 142903 -1778 -129363 80706 80599 -50164 -70133 -198980
1686 -198980 15805 84629 126408 71111 -68053 -112769 -16463 -73139 -128793 -102590 -5327
1675 -5327 -42068 5303 -34012 -93429 -81359 1188 163186 15144 -60781 -54100 10758 91381
1663 91381 -112425 -177630 -111316 -105853 122157 -10182 107405 -92353 -17965 -64749 -201341
1652 -201341 -201294 -88550 -48845 -120512 -101385 -40296 193782 163885 -176233 -82231 -40901 645
1640 645 -110199 -38203 -2376 -5986 28891 -99578 140978 23260 -269310 -260626 35772
1629 35772 -30140 -217065 -29907 -6884 -182946 -199901 -150901 -34937 -139354 -203701 -62897
$$ packed form
1709A1655j87082q4094N7711P252R0172o2348j6492N023M8587J02517O0387j99199
1697a65911r0791L29057J53739q3191j44681j27585K10069j07j30763j9969j28847
1686a98980K14785O8824M1779n5297j39164m4716R6306n6676n5654K6203R7263
1675e327l6741M7371l9315n9417J2070Q2547J61998j48042p5925O681O4858Q0623
1663I1381k03806o5205O6314N463K28010j32339J17587j99758P4388m6784j36592
1652b01341M7J12744L9705p1667J9127O1089K34078k9897l40118R4002M1330M1546
1640F45j10844P1996L5827l610L4877j28469K40556j17718k92570Q684K96398
1629C5772o5912j86925J87158K3023j76062j6955M9000J15964j04417o4347J40804
$$ plain form
1618 -62897 -16358 818 65331 12877 8434 -131752 -254739 -53197 247355 200570 64178
1607 64178 -59625 -28536 -65306 -58102 77645 46680 -124912 -73780 58440 136924 108958
1596 108958 130586 225908 6373 121420 -54533 -217972 77019 156739 177999 235555 104956
1585 104956 -29172 -44016 53995 192852 153083 13562 -36670 -149150 -256910 -265189 -137049
1574 -137049 -231993 -110578 -111595 12223 -113195 -188625 55776 -26179 -233412 74455 61700
1563 61700 -136172 -369620 -250 147389 -53033 106608 -58095 -116509 -188420 -205747
1553 -205747 -175544 -304915 -245604 -149478 -282233 -240363 -140940 -54739 -27074 -2451 -58838
1542 -58838 -36497 18348 -171355 -90379 -89296 -48200 -17363 -256570 -145214 -8296 -49793
$$ packed form
1618f2897M6539J7176O4513n2454m443j40186j22987K01542L00552m6785j36392
1607F4178j23803L1089l6770P204J35747l0965j71592N1132J32220P8484k7966
1596A08958K1628R5322k19535J15047j75953j63439K94991P9720K1260N7556j30599
1585A04956j34128j4844R8011J38857l9769j39521n0232j12480j07760q279J28140
1574a37049r4944J21415j017J23818j25418p5430K44401q1955k07233L07867j2755
1563F1700j97872k33448L69370J47639k00422J59641j64703n8414p1911j7327
1553b05747L0203j29371N9311R6126j32755M1870R9423Q6201K7665K4623n6387
1542e8838K2341N4845j89703Q0976J083M1096L0837k39207J11356J36918m1497
$$ plain form
1531 -49793 177309 184231 138183 55472 -16755 247528 -44360 -65573 85285 -68358 -231891
1520 -231891 -47831 -229137 -169945 -473689 -280369 -79323 -200173 -151998 -42963 -157970
1510 -157970 -197085 -99845 63284 -98507 -91709 57466 150387 138964 -129985 -216013 -239737
1499 -239737 -213438 -373577 -240179 67480 18760 -150007 9661 137838 35357 -226156
1489 -226156 -142068 -29241 -45757 160409 196673 -18741 -228592 -160117 -79493 -92779 -80751
1478 -80751 -99820 -61129 -78305 -117825 -25082 -56211 35005 71497 83256 122018 -167799 -363798
1466 -363798 -354074 -361361 -500402 -277332 -254465 -186152 -147226 -161665 -52788 -182338 -265253
1455 -265253 -338380 55806 169872 -52387 -183951 -265305 -197681 -7134 39640 -116821
$$ packed form
1531d9793K27102O922m6048q2711p2227K64283k91888k1213J50858j53643j63533
1520b31891J84060j81306N9192l03744J93320K01046j20850M8175J09035j15007
1510a57970l9115R7240J63129j61791O798J49175R2921j1423k68949q6028k3724
1499b39737K6299j60139J33398L07659m8720j68767J59668J28177j02481k61513
1489b26156Q4088J12827j6516K06166L6264k15414k09851O8475Q0624j3286J2028
1478h0751j9069L8691j7176l9520R2743l1129R1216L6492J1759L8762k89817j95999
1466c63798R724p287j39041K23070K2867O8313L8926j4439J08877j29550q2915
1455b65253p3127L94186J14066k22259j31564q1354O7624J90547M6774j56461
$$ plain form
1445 -116821 -2009 -8316 -190133 -92250 67139 25510 141121 187645 103904 -6111 -95516
1434 -95516 -134526 114835 159147 -29334 -187176 -290275 -243906 -282886 -138497 32594 55228
1423 55228 120281 18017 -109326 -335946 -105849 -104360 -80458 -7098 14039 64920 22271
1412 22271 158319 87907 25926 123904 13183 -156622 -64590 -99418 -111693 -148614 -166774
1401 -166774 -69893 -19031 -19294 -150587 -139866 43929 -115683 -258333 -154418 -76061 -146468
1390 -146468 -140899 -202852 -162871 -206724 -236673 -194618 -175016 -84151 -29429 76334 -20838 28303
1378 28303 66410 125196 127356 -8948 -137503 -83632 -102967 237960 -46687 112209 117697
1367 117697 -109270 90673 286451 -44041 9412 -103949 -194413 -218596 -228709 -55302
$$ packed form
1445a16821J14812o307j81817R7883J59389m1629J15611M6524q3741j10015q9405
1434i5516l9010K49361M4312j88481j57842j03099M6369l8980J44389J71091K2634
1423E5228O5053j02264j27343k26620K30097J489K3902P3360K1137N0881m2649
1412B2271J36048p0412o1981R7978j10721j69805R2032l4828j2275l6921j8160
1401a66774R6881N0862k63j31293J0721J83795j59612j42650J03915P8357p0407
1390a46468N569o1953L9981m3853k9949M2055J9602R0865N4722J05763r7172M9141
1378B8303L8107N8786K160j36304j28555N3871j9335L40927k84647J58896N488
1367A17697k26967J99943J95778l30492N3453j13361r0464k4183j0113J73407
$$ plain form
1357 -55302 -56110 28023 -97937 -166427 -217649 7442 -7567 58375 52223 -125778 -170115 -22219
1345 -22219 -115412 -20371 -165082 -62117 -165472 -63322 27753 30777 82984 59716 -347417
1334 -347417 -383414 -242548 -49467 -22605 34973 75613 152385 88670 91095 47322 -56292
1323 -56292 15244 -58424 -228776 -248104 -133128 -259326 -50717 -151638 -82989 -23075 12573
1312 12573 133177 -81968 -258885 -345473 -39524 -122939 -78403 -33980 -107893 -43953 76277
1301 76277 -62482 -185083 -196366 -97140 42456 41724 -91384 -230688 -44392 -115843 66088
1290 66088 -111435 -118327 -87807 -225933 -219539 5466 55719 85235 -3748 -7977 -26110 -145010
1278 -145010 21387 4531 -229072 -8322 53490 -147025 -115997 -58388 -207072 -309589
$$ packed form
1357e5302q08Q4133j25960o8490n1222K25091j5009O5942o152j78001m4337J47896
1345b2219r3193R5041j44711J02965j03355J02150R1075L024N2207k3268m07133
1334c47417l5997J40866J93081K6862N7578M0640P6772o3715K425m3773j03614
1323e6292P1536p3668j70352j9328J14976j26198K08609j00921O8649N9914L5648
1312A2573J20604k15145j76917q6588L05949q3415M4536M4423p3913O3940J20230
1301G6277j38759j22601j1283R9226J39596p32j33108j39304J86296p1451J81931
1290F6088j77523o892L0520j38126O394K25005N0253K9516q8983m229j8133j18900
1278a45010J66397j6856k33603K20750O1812k00515L1028N7609j48684j02517
$$ plain form
1268 -309589 -275739 -348266 -138260 -18751 -33235 19831 -77436 95401 206258 -127039 -402150
1257 -402150 -267720 -115286 -140372 -290990 -268770 -249587 -81669 19307 115477 249099
1247 249099 95258 126068 52298 172988 -15536 -53233 -70840 -246547 -120436 -42137 -108479
$$ packed form
1268c09589L3850p2527K10006J19509j4484N3066r7267J72837J10857l33297k75111
1257d02150J34430J52434k5086j50618K2220J9183J67918J00976R6170J33622
1247B49099j53841L0810p3770J20690j88524l7697j7607j75707J26111P8299o6342
$$ [...]
##END NTUPLES=NMR SPECTRUM
##END=
