##TITLE=1H_CA-9032-1
 CDCl3
 8 sc, 
 8.07.2022
##JCAMPDX= 6.0         $$ Bruker NMR JCAMP-DX V2.0
##DATA TYPE= NMR SPECTRUM
##DATA CLASS= NTUPLES
##ORIGIN= UXNMR, Bruker Analytische Messtechnik GmbH
##OWNER= root
$$ XWIN-NMR		Version 3.5
$$ Fri Jul  8 13:50:29 2022 Russian Standard Time (UT+4h)  she@DPX200
##.OBSERVE FREQUENCY= 200.1313499994
##.OBSERVE NUCLEUS= ^1H
##.ACQUISITION MODE= SIMULTANEOUS
##.ACQUISITION SCHEME= undefined
##.AVERAGES= 8
##.DIGITISER RES= 18
##SPECTROMETER/DATA SYSTEM= spect
##.PULSE SEQUENCE= zg30
##.SOLVENT NAME= CDCl3
##.SHIFT REFERENCE= (INTERNAL, CDCl3, 0, 15.7987)
##AUDIT TRAIL= $$ (NUMBER, WHEN, WHO, WHERE, WHAT)
$$ ##TITLE= Audit trail, XWIN-NMR		Version 3.5
$$ ##JCAMPDX= 5.01
$$ ##ORIGIN= Bruker BioSpin GmbH
$$ ##OWNER= she
$$ F:/spectra/data/she/nmr/H-F/1/pdata/1/auditp.txt
$$ ##AUDIT TRAIL=  $$ (NUMBER, WHEN, WHO, WHERE, WHAT)
(   1,<2022-07-08 13:49:21.37 +0400>,<she>,<DPX200>,
      <created by zg, POWCHK disabled, PULCHK disabled
       configuration hash MD5:
       00 E9 B6 7A A2 85 ED C7 34 08 36 98 17 FE 4E 26
       data hash MD5: 16K
       BB 4E 9B 4F EE 0A 9B CB 5E B1 31 6E 05 91 4C 7E>)
(   2,<2022-07-08 13:49:24.56 +0400>,<she>,<DPX200>,
      <Start of raw data processing
       efp BC_mod = 2 LB = 0.24 FT_mod = 6 PKNL = 1 PHC0 = -18054.17 PHC1 = 4.200677 SI = 16K 
       data hash MD5: 16K
       7D C1 7B 1D 55 88 0D 67 08 1A DF 32 2F 0D 0C 87>)
(   3,<2022-07-08 13:49:41.96 +0400>,<she>,<DPX200>,
      <pk PHC0 = -2.704689 PHC1 = 3.6 
       data hash MD5: 16K
       F2 7D D2 EF C8 9D F2 E1 BE 10 00 14 19 76 B2 49>)
(   4,<2022-07-08 13:49:45.84 +0400>,<she>,<DPX200>,
      <abs ABSG = 5 
       data hash MD5: 16K
       3B 24 3A B6 9B 87 5C CC 90 4D E2 DC F6 5D 82 34>)
$$ ##END=
$$ 
$$ hash MD5
$$ 2C 74 E3 57 90 BD 77 89 48 6A 71 7D 71 FD 83 5D
##$RELAX= 
##$RELAX= 
##$RELAX= 
##$RELAX= 
##$RELAX= 
##$RELAX= 
$$ Bruker specific parameters
$$ --------------------------
##$DU= <F:/spectra>
##$EXPNO= 1
##$NAME= <H-F>
##$PROCNO= 1
##$TYPE= <nmr>
##$USER= <she>
##$AMP= (0..31)
100 100 100 100 100 100 100 100 100 100 100 100 100 100 100 100 100 100 
100 100 100 100 100 100 100 100 100 100 100 100 100 100 
##$AQSEQ= 0
##$AQ_mod= 1
##$AUNM= <au_zg>
##$AUTOPOS= <>
##$BF1= 200.13
##$BF2= 200.13
##$BF3= 200.13
##$BF4= 200.13
##$BF5= 200.13
##$BF6= 200.13
##$BF7= 200.13
##$BF8= 200.13
##$BYTORDA= 1
##$CFDGTYP= 0
##$CFRGTYP= 5
##$CHEMSTR= <none>
##$CNST= (0..31)
1 1 145 1 1 1 1 1 1 1 1 1 1 1 1 1 1 1 1 1 1 1 1 1 1 1 1 1 1 1 1 1 
##$CPDPRG= <>
##$CPDPRG1= <>
##$CPDPRG2= <>
##$CPDPRG3= <>
##$CPDPRG4= <mlev>
##$CPDPRG5= <mlev>
##$CPDPRG6= <mlev>
##$CPDPRG7= <mlev>
##$CPDPRG8= <mlev>
##$CPDPRGB= <>
##$CPDPRGT= <>
##$D= (0..31)
0 1.2 0 0 0 0 0 0 0 0.06 0 0.03 0 0 0 0 0.0002 0 0 0 0 0 0 0 0 0 0 0 0 
0 0 0 
##$DATE= 1657273761
##$DBL= (0..7)
120 120 120 120 120 120 120 120 
##$DBP= (0..7)
150 150 150 150 150 150 150 150 
##$DBP07= 0
##$DBPNAM0= <>
##$DBPNAM1= <>
##$DBPNAM2= <>
##$DBPNAM3= <>
##$DBPNAM4= <>
$$ [...]
##$SUBNAM2= <"">
##$SUBNAM3= <"">
##$SUBNAM4= <"">
##$SUBNAM5= <"">
##$SUBNAM6= <"">
##$SUBNAM7= <"">
##$SUBNAM8= <"">
##$SUBNAM9= <"">
##$SW= 18.0517283424941
##$SWIBOX= (0..15)
0 0 2 0 0 0 0 0 0 0 0 0 0 0 0 0 
##$SW_h= 3612.71676300578
##$TD= 16384
##$TD0= 1
##$TE= 0
##$TE2= 300
##$TE3= 300
##$TEG= 300
##$TL= (0..7)
0 120 120 120 120 120 120 120 
##$TP= (0..7)
150 150 150 150 150 150 150 150 
##$TP07= 0
##$TPNAME0= <>
##$TPNAME1= <>
##$TPNAME2= <>
##$TPNAME3= <>
##$TPNAME4= <>
##$TPNAME5= <>
##$TPNAME6= <>
##$TPNAME7= <>
##$TPOAL= (0..7)
0.5 0.5 0.5 0.5 0.5 0.5 0.5 0.5 
##$TPOFFS= (0..7)
0 0 0 0 0 0 0 0 
##$TUNHIN= 0
##$TUNHOUT= 0
##$TUNXOUT= 0
##$USERA1= <user>
##$USERA2= <user>
##$USERA3= <user>
##$USERA4= <user>
##$USERA5= <user>
##$V9= 5
##$VALIST= <valist>
##$VCLIST= <CCCCCCCCCCCCCCC>
##$VD= 0
##$VDLIST= <DDDDDDDDDDDDDDD>
##$VPLIST= <PPPPPPPPPPPPPPP>
##$VTLIST= <TTTTTTTTTTTTTTT>
##$WBST= 1024
##$WBSW= 4
##$XGAIN= (0..3)
0 0 0 0 
##$XL= 0
##$YL= 0
##$YMAX_a= 576171
##$YMIN_a= -580423
##$ZGOPTNS= <>
##$ZL1= 120
##$ZL2= 120
##$ZL3= 120
##$ZL4= 120
##$ABSF1= 15.73587
##$ABSF2= -2.315979
##$ABSG= 5
##$ABSL= 3
##$ALPHA= 0
##$AQORDER= 0
##$ASSFAC= 0
##$ASSFACI= 0
##$ASSFACX= 0
##$ASSWID= 0
##$AUNMP= <proc_1d>
##$AZFE= 0.1
##$AZFW= 0.1
##$BCFW= 0
##$BC_mod= 2
##$BYTORDP= 0
##$COROFFS= 0
##$CY= -3
##$DATMOD= 1
##$DC= 0
##$DFILT= <>
##$DTYPP= 0
##$F1P= 0
##$F2P= 0
##$FCOR= 1
##$FTSIZE= 16384
##$FT_mod= 6
##$GAMMA= 0
##$GB= 0
##$INTBC= 1
##$INTSCL= 0
##$ISEN= 128
##$LB= 0.24
##$LEV0= 0
##$LPBIN= 0
##$MAXI= 10000
##$MC2= 0
##$MEAN= 0
##$ME_mod= 0
##$MI= 1.114404
##$NCOEF= 0
##$NC_proc= -5
##$NLEV= 6
##$NOISF1= 3.799351
##$NOISF2= 2.8
##$NSP= 0
##$NTH_PI= 0
##$NZP= 0
##$OFFSET= 15.79867
##$PC= 1
##$PHC0= -18056.88
##$PHC1= 7.800677
##$PH_mod= 1
##$PKNL= yes
##$PPARMOD= 0
##$PSCAL= 0
##$PSIGN= 0
##$REVERSE= no
##$SF= 200.129994568365
##$SI= 16384
##$SIGF1= 3
##$SIGF2= 2
##$SINO= 5.538805
##$SIOLD= 16384
##$SREGLST= <1H.CDCl3>
##$SSB= 0
##$STSI= 16384
##$STSR= 0
##$SW_p= 3612.71676300578
##$SYMM= 0
##$S_DEV= 0
##$TDeff= 16384
##$TDoff= 0
##$TI= <>
##$TILT= no
##$TM1= 0
##$TM2= 0
##$TOPLEV= 0
##$USERP1= <user>
##$USERP2= <user>
##$USERP3= <user>
##$USERP4= <user>
##$USERP5= <user>
##$WDW= 1
##$XDIM= 16384
##$YMAX_p= 292639254
##$YMIN_p= -262399
$$ End of Bruker specific parameters
$$ ---------------------------------
##NTUPLES= NMR SPECTRUM
##VAR_NAME=  FREQUENCY,     SPECTRUM/REAL,   SPECTRUM/IMAG
##SYMBOL=    X,             R,               I
##VAR_TYPE=  INDEPENDENT,   DEPENDENT,       DEPENDENT
##VAR_FORM=  AFFN,          ASDF,            ASDF
##VAR_DIM=   16384,         16384,           16384
##UNITS=     HZ,            ARBITRARY UNITS, ARBITRARY UNITS
##FACTOR=    0.220516191357247, 1,           1
##FIRST=     3161.78770427605, 0,            0
##LAST=      -450.929058729735, 0,           0
##MIN=       -450.929058729735, -262399,     0
##MAX=       3161.78770427605, 292639254,    0
$$ Real data points
##PAGE= N=1
##DATA TABLE= (X++(R..R)), XYDATA
$$ [...]
7323D4118n2194k2066l9557J7657k430O1885r190n1965L424J2822K299K2455J5481
$$ 44118 -8076 -30142 -69699 -52042 -54472 7413 -1777 -53742 -50318 -37496 -35197 -12742 2739
7310B739l3082Q302J6804M6203j3054j8165j9709j3084m964M730k802j548m8767
$$ 2739 -30343 -22041 -5237 40966 27912 9747 -9962 -23046 -28010 -23280 -26082 -27630 -76397
7297g6397K9412R006K3338N7051j594l3270k2439L931l5025P390l8977j8616N5636
$$ -76397 -46985 -37979 -14641 42410 40816 7546 -14893 -10962 -45987 -38597 -77574 -96190 -40554
7284d0554K5241M4224K2154l1963K731j5221l4291P744j0995q742Q059K8080j3894
$$ -40554 -15313 28911 51065 19102 21833 6612 -27679 -19935 -30930 -39672 -31613 -3533 -17427
7271a7427L8087k228j7095k3693J7896K4012J6396J4103l6526K402m6137K74O8352
$$ -17427 20660 18432 1337 -22356 -4460 19552 35948 50051 13525 15927 -30210 -29936 38416
7258C8416J4069m2903o561M0M9J2647j5904n5137r241O936R531J1219K0783l1838
$$ 38416 52485 9582 3021 3061 3110 15757 -147 -55284 -64525 -57589 -48058 -36839 -16056 -47894
7244d7894p109k8707M0764N4506l0806J7871K5857l1694r501j7282K0569K7843
$$ -47894 -55003 -83710 -42946 11560 -19246 -1375 24482 -7212 -16713 -33995 -13426 14417
7232A4417k2794K708j5961K6933j7666K7834l5321k0420L8852l627j2288m5306
$$ 14417 -8377 -5669 -21630 5303 -12363 15471 -19850 -40270 -1418 -5045 -17333 -62639
7220f2639L7225L4351r921j3579m9795k8342r517J6099K9371L6514j5340J7547
$$ -62639 -25414 8937 -984 -14563 -64358 -92700 -102217 -86118 -56747 -20233 -35573 -18026
7208a8026j375o1301R470N0985O3M1631j9667K5593O448j3378k3074K6654k9279
$$ -18026 -19401 -80702 -71232 -20247 -20184 21447 1780 27373 33821 20443 -2631 24023 -5256
7195e256o4614K1127L6494m177o3953j2073K8494N153r954K7957N2014K1438p1074
$$ -5256 -69870 -48743 -12249 -16426 -80379 -92452 -63958 -58805 -68759 -40802 11212 32650 -38424
7182c8424l4476L8188p902K4738L532l0231K3239l8634Q521L8684R173q563Q300
$$ -38424 -72900 -34712 -42614 -17876 -14344 -44575 -21336 -59970 -51449 -12765 -3592 -12155 -3855
7169c855m4747K5292J1476n015K8196M2791k4764k8223j8164k48K6807n0542l755
$$ -3855 -48602 -23310 -11834 -16849 11347 54138 29374 1151 -17013 -17261 9546 -40996 -44751
7156d4751J9488R165M5022p0412k7414M3945P703k2885k489L4478K024j9268P758
$$ -44751 -25263 -16098 28924 -41488 -68902 -24957 -17254 -40139 -42628 -8150 -6126 -25394 -17636
7143a7636R993R038o419J1475l8317J856K015L250J7086j9503J2669k76o611K5817
$$ -17636 -7643 1395 -5024 6451 -31866 -30010 -27995 -24745 -7659 -27162 -14493 -14769 -21380 4437
7129D437J1844k6712k1813M3144m6574o042Q270J8957L010l43L2011J4657J771
$$ 4437 16281 -10431 -32244 10900 -35674 -41716 -33446 -14489 -11479 -11822 20189 34846 36617
7116C6617l8503J3056p60l7093k8079M3414L7586j621j2137P270j5206j6670J4194
$$ 36617 -1886 11170 10410 -26683 -54762 -11348 26238 24617 12480 19750 4544 -12126 2068
7103B068L1049j5393p1146R791M0160L5016J6589m3652J8963k5473l2952K8727
$$ 2068 33117 17724 -53422 -43631 -3471 31545 48134 4482 23445 -2028 -34980 -6253
7091f253J5241O483k7238J4784k725m921k6104J6416L3321o3569n158J7243P1100
$$ -6253 8988 15471 -11767 3017 292 -4629 -30733 -14317 19004 -44565 -49723 -32480 38620
7078C8620K3254k8283P488L322j7508O96m294L6971M262J8242k0531M6721N080
$$ 38620 61874 33591 41079 44401 26893 27589 23295 60266 64528 82770 62239 108960 114040
7065A14040q067J6123K8962J5066O8788K8680l0186N0351O3204K0193R390o9404
$$ 114040 105973 122096 151058 166124 234912 263592 233406 283757 346961 367154 376544 307140
7053C07140l7949l7239j6311l85o6911m5925P115L5194n7716j0608j583o461K484
$$ 307140 269191 231952 215641 215256 148345 102420 109535 144729 87013 76405 74822 68361 70845
7040G0845J996k6839M768j4704k2247O8809k7135k1804L1705o512R409m5595K0041
$$ 70845 72841 46002 50770 36066 13819 82628 55493 33689 65394 58882 68291 22696 42737
7027D2737M8040J1031J0584M454K3001K1164J6150J6449k6802l8270L0344l9372
$$ 42737 90777 101808 112392 116846 139847 161011 177161 193610 166808 128538 158882 119510
7015A19510l5202j4060L5075n431k1502K843l6651p439M6316j4977J0685M0856
$$ 119510 84308 70248 105323 99892 78390 81233 44582 37143 83459 68482 79167 120023
7003A20023n0419l0202p731k422J820r730M542N08m571J0537M882K0539K3403
$$ 120023 69604 39402 31671 29249 31069 21339 25881 26389 21818 32355 37237 57776 81179
6990H1179n0458j3488L3039k547L8277l924k8892J0214M6518o1374L6142k5708
$$ 81179 30721 17233 50272 47725 86002 82078 53186 63400 109918 48544 84686 58978
6978E8978N378J0047k6941j3584J0940m6474L3579K6219K6929k325P73j8394j4455
$$ 58978 64356 74403 47462 33878 44818 -1656 31923 58142 85071 82746 83519 65125 50670
6965E0670n809J8077K5839J9152m5508m3894K7942l0613P3463j7900l677L0215
$$ 50670 44861 62938 88777 107929 62421 18527 46469 15856 89319 71419 67742 97957
6953I7957J5428o769J8003k0216l3552P2249K137j3995q132J3933J0553K3825
$$ 97957 113385 106616 124619 104403 70851 143100 145237 131242 123110 137043 147596 171421
6941A71421Q52j9154j0163l1419k429M3491N3614k9008K4059j0770J4029l4528
$$ 171421 172273 153119 142956 111537 109108 152599 206213 177205 201264 190494 204523 169995
6929A69995J8562k8046L7401J5286n223L319J0515r63m3565K9007J2889j657J3005
$$ 169995 188557 160511 197912 213198 207975 211294 221809 220846 177281 206288 219177 217520 230525
6916B30525m573l5022K4595P1639k4054J9417K4711j6675M2973R53j8225M1584
$$ 230525 225952 190930 215525 287164 263110 282527 307238 290563 333536 334489 316264 357848
6904C57848L4238k6536N630j0018K0691L6257k0843N45N7442J2761L2716j8450
$$ 357848 392086 365550 371180 361162 381853 418110 397267 397812 455254 468015 500731 482281
6892D82281K8663N4992M7158O580J7253P3115L768j0525R5162Q7774Q2716Q1482
$$ 482281 510944 565936 613094 619674 636927 710042 713810 703285 798447 886221 968937 1050419
6880A050419J22826J15029O3156J49260J95433K01529J82606K19283L06879L43186
$$ 1050419 1173245 1288274 1351430 1500690 1696123 1897652 2080258 2299541 2606420 2949606
6870B949606N17441N69157M56300K14990L1461l03447p60357p48573n76640m25206
$$ 2949606 3467047 4036204 4492504 4707494 4738955 4435508 3675151 2926578 2349938 1924732
6860A924732k82729k18179k11183j43142j64568o0248o2456n2380q8439n3522
$$ 1924732 1642003 1423824 1212641 1069499 904931 844683 782227 729847 641408 587886
6850E87886j9915o6649l8769l2695k6373j4889k4005k9391n662m0394j6276l1934
$$ 587886 567971 501322 462553 429858 403485 388596 364591 335200 329538 289144 272868 240934
6838B40934K203j8302K4480N56o8801l84l5584j5487j3338K7167K0085K2032j6236
$$ 240934 243137 224835 249315 249871 181070 180686 145102 129615 116277 143444 163529 185561 169325
6825A69325l4979j1504K7445J0261J508l1406k6603p637k0755J5586l690K6292
$$ 169325 134346 122842 150287 160548 162056 130650 104047 96410 75655 91241 87551 113843
6813A13843J4561q407l7019J7949q199p3756L9211O3143l8120l6379K1864O886
$$ 113843 128404 119997 82978 100927 92728 18972 58183 121326 83206 46827 68691 75577
6801G5577K9088k9564l2383M3616j6965P007p376l8689J7400L6038O151k4777
$$ 75577 104665 75101 42718 86334 69369 76376 69000 30311 47711 83749 89900 65123
6789F5123j0687N4108j7221P528p521n790n239k4294R565K614n047j8345j6564
$$ 65123 54436 108544 91323 98851 91330 85540 80301 56007 65572 68186 63139 44794 28230
6776B8230j6844k3794K8863K2263J330L4073j9860K8713j6402l2551l6483L5190
$$ 28230 11386 -12408 16455 38718 40048 74121 54261 82974 66572 34021 -2462 32728
6764C2728J3004k0495j9938K2221j7870j2537K5453J2750N4419L4501k5221k4657
$$ 32728 45732 25237 5299 27520 9650 -2887 22566 35316 89735 124236 99015 74358
6752G4358J4551k5390k1539M7204J9105k7100m5469J6529l187j3620O500k0375
$$ 74358 88909 63519 41980 89184 108289 81189 35720 52249 49062 35442 41942 21567
6740B1567L2860J1353J273k5430K1168k5789j4819J2499r461O313K3989l9666
$$ 21567 54427 65780 67053 41623 62791 37002 22183 34682 25221 31534 55523 15857
6728A5857J0717J5007O7824m8265k0705P360L303k6614q74o4888M1895P4216j1483
$$ 15857 26574 41581 109405 61140 40435 47795 51098 24484 23610 -41278 617 74833 63350
6715F3350j7421p000m333j7458J8651p837k1973M9386m873j200R572j7672J6156
$$ 63350 45929 38929 34596 17138 35789 27952 5979 55365 50492 49292 58864 41192 57348
6702E7348l9660K9124k0242L3611m4210J7849j9042J1196P0061M0474q5417k7579
$$ 57348 17688 46812 26570 60181 15971 33820 14778 25974 96035 136509 51092 23513
6690B3513n234k8421K7899k7623L8539M4792k383O923l6784m729j2546O9522l2
$$ 23513 18279 -10142 17757 -9866 28673 73465 71082 78005 41221 36492 23946 93468 93436
6677I3436l7125J0471o6981n920o39L4440L775l7122K8097K0593R33j9310P796
$$ 93436 56311 66782 -199 -6119 -6758 27682 31457 -5665 22432 43025 43958 24648 32444
6664C2444k0150N7289L364k0179j7857p1279J3198O8865J8788k4825J9003L584
$$ 32444 12294 69583 72947 52768 34911 -36368 -23170 45695 64483 39658 58661 62245
6652F2245L1779k8235j2219k4928r101j8607j6024O182p843M7809p639J6940j9018
$$ 62245 94024 65789 53570 28642 19541 934 -15090 -8908 -16751 31058 23419 40359 21341
6639B1341j8357j277j2929K2709N0505Q002l6484P7671k6021j5462k3406L2516
$$ 21341 2984 1707 -11222 11487 61992 69994 33510 111181 85160 69698 46292 78808
6627G8808j2585k139P369l3173n397j6366K2912j3258j232M3919k659m624q744
$$ 78808 66223 64084 71453 38280 32883 16517 39429 26171 24939 68858 66199 61575 52831
6614E2831K8577k4192J3964m435j5697K132n255M2577k0682N323o262k690m356
$$ 52831 81408 57216 71180 66745 51048 53180 47925 90502 69820 75143 68881 66191 61835
6601F1835p66j9463k740J2854j3672q522L985J4862k7259k9827J1834M497L4163
$$ 61835 61069 41606 38866 51720 38048 29526 33511 48373 21114 -8713 3121 7618 41781
6588D1781k833m1273k0571J0581P4157O0457o4976l2275K4396j6597J8033m498
$$ 41781 38948 -2325 -22896 -12315 61842 122299 57323 25048 49444 32847 50880 46382
6576D6382m727n489k3565O605k8814Q695J4857m454Q594k297l6407L156K8862
$$ 46382 41655 36166 12601 19206 -9608 -913 13944 9490 18084 15787 -20620 -17464 11398
6563A1398K2829Q230N762j9J2476j2678K9349k5096m7189J9648J0889k9050N0313
$$ 11398 34227 42457 48219 48200 60676 47998 77347 52251 5062 24710 35599 6549 56862
6550E6862r894J5733Q518o37K3307L4235k6464k1910q1045Q15M4313R347L6695
$$ 56862 46968 62701 71219 70582 93889 128124 101660 79750 -1295 -480 43833 53180 89875
6537H9875J5356l278P979j4104l6702M438j8890M5986q712o9624J5866M0675j228
$$ 89875 105231 101953 109932 95828 59126 63564 44674 90660 81948 12324 28190 68865 67637
6524F7637n0747p796L5911J6928K3767j3493k7717l6074L0108K2337k622q161
$$ 67637 16890 9094 45005 61933 85700 72207 44490 8416 38524 60861 58239 50078
6512E0078K1134N351l0098j3336J6732r24j8590k1708L0244j270N7377n4894J9132
$$ 50078 71212 76563 46465 33129 49861 48937 30347 8639 38883 37613 94990 40096 59228
6499E9228j632J8597L6422m75m4084O137K546R784p30k7409k457n50L3495j8149
$$ 59228 57596 76193 112615 112140 68056 74193 76739 86523 85793 58384 55927 55377 88872 70723
6485G0723m188J1614j8540J5661J3709K928l3255J12K503N002j4195J254p75j862
$$ 70723 66535 78149 59609 75270 88979 91907 58652 58764 61267 66269 52074 53328 52553 50691
6471E0691L6754k5617J5593l1701j5656O882n6677L721K379m9276R807J8097K4642
$$ 50691 87445 61828 77421 45720 30064 36946 -19731 -16010 -13631 -62907 -53100 -35003 -10361
6458a0361M0016M571j1409k3881m943j618k614K7816J8692k168J7374O050m8651
$$ -10361 29655 34226 22817 -1064 -6007 -7625 -10239 17577 36269 34101 51475 57525 8874
6445H874j8941O941J0521K4008k4996r712j5672J3938O115J8609m523n459N1955
$$ 8874 -10067 -3126 7395 31403 6407 -3305 -18977 -5039 1076 19685 15162 9703 61658
6432F1658k3035l1618R547J2049m9634n82J5601L2074O975O319Q932J2925o3773
$$ 61658 38623 7005 16552 28601 -21033 -21615 -6014 26060 33035 39354 48286 61211 -2562
6419b562R82Q972K7284L4995K1219j5262n8948k638K2964m8375M6520J762L8900
$$ -2562 -1580 7392 34676 69671 90890 75628 16680 14042 37006 -11369 35151 36913 75813
6406G5813n2872L8320L3079n9828p140j2697J0756K9502M308j4178K6993n0143
$$ 75813 22941 61261 94340 34512 27372 14675 25431 54933 59241 45063 72056 21913
6394B1913K1981L5437k2614j766N473l1704p961N712p154L982k4490m8263O6372
$$ 21913 43894 79331 56717 54951 60424 28720 20759 26471 19317 23299 -1191 -49454 16918
6381A6918L0635l8249M9092J8820k1551N909j354L0745l9655M22K290j7570N579
$$ 16918 47553 9304 58396 77216 55665 61574 60220 90965 51310 51732 54022 36452 42031
6368D2031p201p948k3830m992M3054J1468k2384o5837j4537O0329K352p736N8594
$$ 42031 34830 26882 3052 -1940 41114 52582 30198 -35639 -50176 10153 12505 4769 63363
6355F3363M609L313m347l3133k4376j2284J3281j2858K1301J8138O99K8664j5939
$$ 63363 67972 71285 66938 33805 9429 -2855 10426 -2432 18869 37007 37706 66370 50431
6342E0431n644J6391J4139L3148p8739J8778r647K3800Q948l2191L9491k4694
$$ 50431 44787 61178 75317 108465 29726 48504 38857 62657 71605 39414 78905 54211
6330E4211j4844J3787j1890L1348K1389m9172l720M9210j137m3659j0262r90K5596
$$ 54211 39367 53154 41264 72612 94001 44829 41109 90319 89182 45523 35261 34271 59867
6317E9867k1478K6341k1273j3836n109N1204L3398J0992J0214j4957k9613K2597
$$ 59867 38389 64730 43457 29621 24512 75716 109114 120106 130320 115363 85750 108347
6305A08347L5991k8475J1157n950k1895l541J4666J833N5114J6558J2419J3180
$$ 108347 144338 115863 127020 121070 99175 95634 110300 112133 167247 183805 196224 209404
6293B09404K4951P2767l1188o5290o1736k3034j7673P579j6931l13j3158K0872
$$ 209404 234355 307122 275934 210644 148908 125874 108201 115780 98849 98536 85378 106250
6281A06250L4369j3074J7801l4150l4129P259Q201Q65N786n314l7711K7320l540
$$ 106250 140619 127545 145346 111196 77067 84326 92527 93392 99178 93864 56153 83473 79933
6268G9933J1615K9524m3153J4744M3932m2008q452j543J379L0936k3673l7930
$$ 79933 91548 121072 77919 92663 136595 94587 86135 84592 85971 116907 93234 55304
6256E5304J4499J7535k2309K8279k8233j3336N2112L6906k4730j3212L1877j980
$$ 55304 69803 87338 65029 93308 65075 51739 103851 140757 116027 102815 134692 132712
6244A32712j7411m593K7164l714l8547p7218O3822P4422n2406K5993J3857o2919
$$ 132712 115301 110708 137872 134158 95611 18393 82215 156637 104231 130224 144081 81162
6232H1162p972K0875n255k6138L57J3237j2460L7270p70N790J3519k2217Q357
$$ 81162 73190 94065 88810 62672 63029 76266 63806 101076 100306 106096 119615 97398 105755
6219A05755k2796O943j022N56M5170m8292J9775R078j16L7145J6756l6147j2733
$$ 105755 82959 89902 88880 89436 134606 86314 106089 115167 115051 152196 168952 132805 120072
6206A20072Q637k5375J24k791P51j0805R635L0934k2240K230O786o101P373L8157
$$ 120072 128709 103334 103458 100667 101418 90613 100248 131182 108942 111172 117958 111857 119230 157387
6192A57387O754K1835j3822n1825J1502j3978k4450k6854j6077M6727Q398K2094
$$ 157387 164141 185976 172154 120329 131831 117853 93403 66549 50472 97199 105597 127691
6180A27691j4806J1423q833j3382j6883l3011M6551M5792m007j3629j4153J0414
$$ 127691 112885 124308 115475 102093 85210 52199 98750 144542 140535 126906 112753 123167
6168A23167l7894r979L1723K1507l3961J0005O374J7686K818Q338J4131K9007
$$ 123167 85273 75294 107017 128524 94563 104568 110942 128628 131446 139784 153915 182922
6156A82922J2884n3412L1391J7009M9029k0122m3677j7736K552j0675L2422m347
$$ 182922 195806 142394 173785 190794 239823 219701 176024 158288 160840 150165 182587 178240
6144A78240j6380j5556q090k0116K2525K6480l5489M0187K2684P224J5855j5426
$$ 178240 161860 146304 138214 118098 140623 167103 131614 171801 194485 201709 217564 202138
6132B02138n54K8187J4367p573J1258N9830K9197o3873K1272o553l4083K3711
$$ 202138 201584 229771 244138 236565 247823 307653 336850 272977 294249 287696 253613 277324
6120B77324K346l2072j6319J2124j5420L9962L8977l1881J3550K6801P062Q519
$$ 277324 279670 247598 231279 243403 227983 267945 306922 275041 288591 315392 322454 330973
6108C30973J2149l2020K3681M4805M2225k4789P1111P1277P508J436Q166L9847
$$ 330973 343122 311102 334783 379588 421813 397024 468135 539412 546920 548356 556522 596369
6096E96369Q097n7302m3587m0925r701k1788l0521m1663j1187M5213K2084P216
$$ 596369 604466 547164 503577 462652 452951 431163 400642 358979 347792 393005 415089 422305
6084D22305o6619K8670K2906L4119J4953j3204K1576O8084M1841J86J3636N4969
$$ 422305 355686 384356 407262 441381 456334 443130 464706 532790 574631 574817 588453 643422
6072F43422M2490J763M296m554l0120l2094l0863j7616n0096l1885o5989m0356
$$ 643422 685912 687675 691971 687417 657297 625203 594340 576724 526628 494743 428754 388398
6060C88398j5086l7481m6204L4050M1716K2629r769J2572N4201q395m1740K3069
$$ 388398 373312 335831 289627 323677 365393 388022 378253 390825 445026 436631 394891 417960
6048D17960M9534L1335N5230k2505K4458j4289Q839k720n1339m9423m6108m7681
$$ 417960 467494 498829 554059 531554 556012 541723 550562 547842 496503 447080 400972 353291
6036C53291m4921k1517J4931j6397j301J0587K5816k9517O564K3266k5667n3584
$$ 353291 308370 286853 301784 285387 284086 294673 320489 290972 297536 320802 295135 241551
6024B41551o107L9926r79Q035j4698J8285J0609l288J1381J6394o1796m82q806
$$ 241551 235444 275370 274391 282426 267728 286013 296622 293334 304715 321109 259313 258831 250025
6011B50025l6332j0095J3162r842m7225j23N0254P843l4897k1590L4548r277N420
$$ 250025 213693 203598 216760 206918 159693 159570 209824 217667 182770 161180 195728 186451 191871
5998A91871J4642J8155J5860m0915J6499l8415P787J5462j282L9447p811K6955
$$ 191871 206513 224668 240528 199613 216112 177697 185484 200946 199664 239111 231300 258255
5986B58255j6294k0387j9249q540J1008R199o5586M7646M144L3282j7281m1235
$$ 258255 241961 221574 202325 193785 204793 213992 148406 196052 200196 233478 216197 174962
5974A74962O4625P110m1293l4448J5385o0317M6964k978L5293k315l826P216m228
$$ 174962 239587 246697 205404 170956 186341 126024 172988 170010 205303 202988 199162 206378 202150
5961B02150P33j2256J7368J1006J0548K5975l7349J012M924J1053j5306K0130
$$ 202150 202883 190627 207995 219001 229549 255524 218175 219187 224111 235164 219858 239988
5949B39988K0935l9702J5393j4810o736j5147L2868K7398K318m166m0180r676
$$ 239988 260923 221221 236614 221804 215068 199921 232789 260187 262505 258339 218159 208483
5937B08483J1437P290M4330K3179m7838k5208O311N999J5887N761J5787J4030
$$ 208483 219920 227210 271540 294719 246881 221673 227984 233983 249870 255631 271418 285448
5925B85448j4791l2086J9692l2479P746P5m49k0483L0436K068n430J5793n1804
$$ 285448 270657 238571 258263 225784 233530 233605 233156 212673 243109 245177 239747 255540 203736
5912B03736N3499K1706j7517L841J7317K3692k8334k8226m585K3955k871n5203
$$ 203736 257235 278941 261424 265265 282582 306274 277940 249714 245129 269084 266213 211010
5900B11010r021J4235J8687j2663r215J8304J0539k3618M3197k6292k5387L0604
$$ 211010 201989 216224 234911 222248 213033 231337 241876 218258 261455 235163 209776 240380
5888B40380L013K4769j2484m469n561l6103J6170j8702J555O5763L5483j3325
$$ 240380 243393 268162 255678 251209 245648 209545 225715 207013 208568 274331 309814 296489
5876B96489M927n434L082L2126K4237j3573j624j086o1044J9962k7449J5249L22
$$ 296489 301416 295982 299064 331190 355427 341854 340230 339144 278100 298062 270613 285862 286184
5863B86184P03O102P8107k6576k1367K6593l5956r502L4436O7251K9702l8440
$$ 286184 286887 292989 371096 344520 323153 349746 313790 304288 338724 405975 435677 397237
5851C97237o0798N808q188k6125K311N8301l0209k2187L646J4999k8753J3440
$$ 397237 336439 342247 334059 307934 310245 368546 338337 316150 319796 334795 306042 319482
5839C19482J6727q564Q871j2704k811P2001l3460n658K0763l8694k0601K7374
$$ 319482 336209 327645 336516 323812 321001 393002 359542 353884 374647 335953 315352 342726
5827C42726N2584k0663N845N1907k369L246J5355m5636J406L5131m8198K932N1244
$$ 342726 395310 374647 380492 432399 430030 433276 448631 402995 404401 439532 391334 394266 445510
5814D45510l8217j4527j4104J2089L363J0187k1419J3532k9949K1729J02914j9265
$$ 445510 407293 392766 378662 390751 394114 404301 382882 396414 366465 388194 491108 471843
5802D71843j6039j9963K8159k1243r175n313L3243K1897K5968O366J0385j119
$$ 471843 455804 435841 464000 442757 433582 428269 461512 483409 509377 515743 526128 525009
5790E25009m377N6295q022l9478K125k2706k4074K8423L3607l4921m0353J9007
$$ 525009 520632 576927 568905 529427 531552 508846 484772 513195 546802 511881 471528 490535
5778D90535L5191M2132n801L3533o0331Q536N7224M8984K2914J3298P852J9486
$$ 490535 525726 567858 562057 595590 535259 543795 601019 650003 672917 686215 694067 713553
5766G13553M0283j1337n1868j1870m240K4797j986k4176l7215J6200l536j2298
$$ 713553 753836 742499 690631 678761 674521 699318 697332 673156 635941 652141 648605 636307
5754F36307k0592J6182N5783m8761J2156M1381J0689L410K6062N7369K6838L3791
$$ 636307 615715 631897 687680 638919 651075 692456 703145 706555 732617 789986 816824 850615
5742H50615o3208l6822j1540n5006n551l2686k0506p553j6043j9054r743l707
$$ 850615 787407 750585 739045 684039 678488 645802 625296 617743 601700 582646 572903 569196
5730E69196l63j1739j6411K8203P430j5819k3552m8511L2982K0998l1943m1869
$$ 569196 568833 557094 540683 568886 576316 560497 536945 488434 521416 542414 510471 468602
5718D68602Q301M995J3473j0899K4693m457K8064j3460j9514K3762J4828J5531
$$ 468602 476903 481898 495371 484472 509165 504708 532772 519312 499798 523560 538388 553919
5706E53919L4503j0416j586j997m4331J8775K9801k1016n9476q573j0258K4270
$$ 553919 588422 578006 576420 574423 530092 548867 578668 557652 498176 489603 479345 503615
5694E03615J5660l3786N6003l379k1551K2541P247J4164l793p439L8358j0711
$$ 503615 519275 485489 541492 538113 516562 539103 546350 560514 556721 549282 587640 576929
5682E76929l507L8001l2940k0563l6984K2254R300R570L2512j5440l4788Q979
$$ 576929 573422 611423 578483 557920 520936 543190 552490 562060 594572 579132 544344 553323
5670E53323J2437M850L0102K2955m7065r617Q062N5814K410l5847M1859o7608
$$ 553323 565760 570610 600712 623667 576602 566985 575047 630861 633271 597424 639283 571675
5658E71675m437K4219L813K6633K3472O150j855N2648p1132J9196l2085M2083
$$ 571675 567238 591457 595270 621903 645375 651525 649670 702318 631186 650382 618297 660380
5646F60380N4456k8198K314j3984K3990l8450J180N2581m0772J2103M1938m7378
$$ 660380 714836 686638 688952 674968 698958 660508 661688 714269 673497 685600 727538 680160
5634F80160J3022N803j0296L6299K3063l5395J3369M863K0919Q193j450K5791
$$ 680160 693182 698985 688689 724988 748051 712656 726025 730888 751807 760000 758550 784341
5622G84341m363k7622L257j4460L2862N4277R434k3109L556K4390J4591k6050
$$ 784341 779978 752356 755613 741153 774015 828292 837726 814617 818173 842563 857154 831104
5610H31104k4843N340Q54l5528J8776j7573k1660L0757M4000M7907m4009q942
$$ 831104 806261 811601 812455 776927 795703 778130 756470 787227 831227 879134 835125 826183
5598H26183j7857j9098K1997M0365m6895l345K2376L808L2123k660K2352j1192
$$ 826183 808326 789228 811225 851590 804695 801350 823726 827534 859657 856997 879349 868157
5586H68157J4856K44j6987N9264o471m1518J4914k3178o107j3047N1666K6941
$$ 868157 883013 883257 866270 925534 919063 877545 892459 869281 863174 850127 901793 928734
5574I28734K0003n579k5778r522J0332K7788o42n774J4314N782r41J6238J4605
$$ 928734 948737 943158 917380 907858 918190 945978 945336 939562 953876 959658 958717 974955 989560
5561I89560J4667K1508J1915k9329N9049k3948j5398J7279K6772M0035J5672J0366
$$ 989560 1004227 1025735 1037650 1008321 1067370 1043422 1028024 1045303 1072075 1112110 1127782 1138148
5549A138148j1102k0156K8532K5287L7272M5492m7872P096J6034O1819k0615N594
$$ 1138148 1127046 1106890 1135422 1160709 1197981 1243473 1195601 1202697 1218731 1280550 1259935 1265529
5537A265529K7588j5417M1586m615Q046o927K3056N5583k36o7630J6166P0075
$$ 1265529 1293117 1277700 1319286 1314671 1322717 1315790 1338846 1394429 1394193 1326563 1342729 1412804
5525A412804K3453Q084N0234j1470J8190L9031K4267J6655J4558j0926K5727m62
$$ 1412804 1436257 1444341 1494575 1483105 1501295 1540326 1564593 1581248 1595806 1584880 1610607 1610145
5513A610145M7430L9298O3784L0839k5562K1466J2841K4168M6514J3197L1700
$$ 1610145 1657575 1696873 1760657 1791496 1765934 1787400 1800241 1824409 1870923 1884120 1915820
5502A915820L2436M082N9645O358M4416R1092K2415L6936j4353L2027R0115j9360
$$ 1915820 1948256 1952338 2011983 2018341 2062757 2153849 2176264 2213200 2198847 2230874 2320989 2301629
5490B301629O2365L6626M0722J1229J5162M6069N4415P3396M5390L5768P5366
$$ 2301629 2363994 2400620 2441342 2452571 2467733 2513802 2568217 2641613 2687003 2722771 2798137
5479B798137L1313J10195R3539P7756Q3258N1884R1528J42667J40978J39037J33033
$$ 2798137 2829450 2939645 3033184 3110940 3194198 3246082 3337610 3480277 3621255 3760292 3893325
5468C893325J19464J27352J57756K08179J74673K43983K53889L34457L09589K67126
$$ 3893325 4012789 4140141 4297897 4506076 4680749 4924732 5178621 5513078 5822667 6089793
5458F089793K61976P7491M5073j2699k7303o7428K299O2501J37682J50348K47493
$$ 6089793 6351769 6429260 6474333 6461634 6434331 6366903 6369202 6431703 6569385 6719733 6967226
5447F967226K92958L30296M27836M29204M95693M09265K39628J15150p3531k54091
$$ 6967226 7260184 7590480 8018316 8447520 8943213 9352478 9592106 9707256 9633725 9379634
5437I379634l07181l28729k19742j26873j0681Q498J20258J94294L07565L58107
$$ 9379634 9072453 8743724 8523982 8397109 8386428 8394926 8515184 8709478 9017043 9375150
5427I375150M38597N06067N63912N55475M10971K47793P1482j3745j17317j07293
$$ 9375150 9813747 10319814 10883726 11439201 11850172 12097965 12169447 12155702 12038385 11931092
5417A1931092j20976m0750J2586M991m9289J7628R7960J92342L83481M91714N13304
$$ 11931092 11810116 11769366 11781952 11786943 11737654 11755282 11853242 12045584 12429065 12920779 13434083
5406A3434083M79234L94143L07766J47922m9855j41415k46895k37230l59947m37687
$$ 13434083 13913317 14307460 14615226 14763148 14713293 14571878 14324983 14087753 13727806 13290119
5396A3290119n14330m59445l69730k59655j41946K0968O2559L3044J11659N7143
$$ 13290119 12775789 12316344 11946614 11686959 11545013 11565981 11628540 11661584 11773243 11830386
5386A1830386K596o257L4460j1995q1992j40382k72038l67886n06825o20253n36520
$$ 11830386 11832982 11826725 11861185 11849190 11767198 11626816 11354778 10986892 10480067 9859814 9323294
5375I323294m57859l26632j76941q9362K807J07352J74394K17680L55141M04680
$$ 9323294 8865435 8538803 8361862 8272500 8275307 8382659 8557053 8774733 9129874 9534554
5365I534554M12961K71507J04405j94091m00185n55174o48468n77862n13126m50000
$$ 9534554 9947515 10219022 10323427 10129336 9729151 9173977 8525509 7947647 7434521 6984521
5355F984521l20330j28782j84555r7861M6538q34P7000J57257J6380r2537j50157
$$ 6984521 6664191 6535409 6350854 6252993 6299531 6298697 6375697 6532954 6549334 6456797 6306640
5344F306640k76051l57379l30175l38941l89602l56548k35160k62341k18688j40362
$$ 6306640 6030589 5673210 5343035 5004094 4614492 4257944 4022784 3760443 3541755 3401393
5334C401393j11681j38385j05981p0162o5118r3805j4189l1867j04293p1354l7052
$$ 3401393 3289712 3151327 3045346 2975184 2910066 2816261 2802072 2770205 2665912 2594558 2557506
5323B557506q5456j5936j2073m3785j7770m4065k6200o9227n2179P63k4467l4570
$$ 2557506 2472050 2456114 2444041 2400256 2382486 2338421 2312221 2242994 2190815 2191578 2167111 2132541
5311B132541l7889m7149m8296J3608O232j5744k8335j1380k1135M0038K5755p5596
$$ 2132541 2094652 2047503 1999207 2012815 2019047 2003303 1974968 1963588 1942453 1982491 2008246 1932650
5299A932650l3346j0121k427J0866j59r894J2884o6371o4793L167j0697l7147
$$ 1932650 1899304 1889183 1886756 1897622 1897463 1887569 1900453 1834082 1769289 1772456 1761759 1724612
5287A724612k3804k1690j9522m466K7735k2586m3076m6171m4154N0093P143n266
$$ 1724612 1700808 1679118 1659596 1655130 1682865 1660279 1617203 1571032 1526878 1576971 1584114 1578848
5275A578848L1405k4105o559j91K2711m0698L8086m47m8680l979K0470l3599R0
$$ 1578848 1610253 1586148 1579589 1579398 1602109 1561411 1599497 1599050 1550370 1546391 1566861 1533262 1533352
5262A533352k6231J8278J0651q560M5740j7239M1j5000l9318K4248K7301O126
$$ 1533352 1507121 1525399 1536050 1527490 1573230 1555991 1556032 1541032 1501714 1525962 1553263 1559389
5250A559389j2622k1768K2371r350j2645p850O388l3487k379J4324J022j2405
$$ 1559389 1546767 1524999 1547370 1538020 1525375 1517525 1523913 1490426 1488047 1502371 1503393 1490988
5238A490988L746J319J5014q267m5497k9975M9614K0559k3808q232J5858K627
$$ 1490988 1494734 1496053 1511067 1502800 1457303 1427328 1476942 1497501 1473693 1465461 1481319 1483946
5226A483946J5785o260J0617k3462J2073K5842J5933m4004K2667K8780K347K2656
$$ 1483946 1499731 1493471 1504088 1480626 1492699 1518541 1534474 1490470 1513137 1541917 1544264 1566920
5214A566920j2774R069l8651J2359P868o637n480r532K0487K8883l8013K2688
$$ 1566920 1554146 1563215 1524564 1536923 1544791 1538154 1532674 1523142 1543629 1572512 1534499 1557187
5202A557187m541N6101R617l6630L1754K7589L0953j447n3467P4946R6001O249
$$ 1557187 1552646 1608747 1618364 1581734 1613488 1641077 1672030 1670583 1617116 1692062 1788063 1794312
5190A794312J0003N1132M1501l3403L2489M1526Q0646K8524L4180R0216M1658
$$ 1794312 1804315 1855447 1896948 1863545 1896034 1937560 2018206 2046730 2080910 2171126 2212784
5179B212784J09209J01376Q3146K8844Q5318o351L1302j4411o5922R656q5243
$$ 2212784 2321993 2423369 2506515 2535359 2620677 2614326 2645628 2631217 2565295 2574951 2489708
5168B489708o7689m1035l8695l9129j1533l4159N9687m3964N964Q4087L8055M3427
$$ 2489708 2422019 2380984 2342289 2303160 2291627 2257468 2317155 2273191 2279155 2363242 2401297 2444724
5156B444724L103J56720J28358P5803J00831J11045R0143K4515O3404m9299p4775
$$ 2444724 2447827 2604547 2732905 2808708 2909539 3020584 3110727 3135242 3198646 3149347 3074572
5145C074572n9606p6845l4699l5139j4740k1883p5934q2362p8191j14165n1809
$$ 3074572 3014966 2938121 2903422 2868283 2853543 2831660 2755726 2673364 2595173 2481008 2429199
5134B429199o9010o9754k5254K3229L5525K7296P628M8880N2644M6505R6607M6224
$$ 2429199 2360189 2290435 2265181 2288410 2323935 2351231 2358859 2407739 2460383 2506888 2603495 2649719
5122B649719J1121J0405l8816l9068n9165j7386J7367J1155l6779k4726N1595
$$ 2649719 2660840 2671245 2632429 2593361 2534196 2516810 2534177 2545332 2508553 2483827 2535422
5111B535422m868q6641o3344o6572m2928l0121m1598L4821M8478L4476K5510K2323
$$ 2535422 2530554 2443913 2380569 2313997 2271069 2240948 2199350 2234171 2282649 2317125 2342635 2364958
5099B364958n2385n473n9703r9334l4115l3812r0008k9173k1097n431K7319j804
$$ 2364958 2312573 2307100 2247397 2148063 2113948 2080136 1990128 1960955 1939858 1934427 1961746 1959942
5087A959942j0974l3063j435m4282j9660N2812m955K2745o0330Q157M2511j0169
$$ 1959942 1948968 1915905 1914470 1870188 1850528 1903340 1898385 1921130 1860800 1868957 1911468 1901299
5075A901299L975L8454j1087n7472M007o807l7968K5915k3864J3280K1760K6982
$$ 1901299 1905274 1943728 1932641 1875169 1879176 1872369 1834401 1860316 1836452 1849732 1871492 1898474
5063A898474j4806j9545M2566j1509M6065L3500L0881K7251j8159L4455M5567
$$ 1898474 1883668 1864123 1906689 1895180 1941245 1974745 2005626 2032877 2014718 2049173 2094740
5052B094740J355L6535J01150O3305M9545Q7698P8801J29648J17652K2091k7875
$$ 2094740 2096095 2132630 2233780 2297085 2346630 2434328 2513129 2642777 2760429 2782520 2754645
5041B754645o4728p3028j22805j17104o1238q7243o9528p3936K7405l7476m7627
$$ 2754645 2689917 2616889 2494084 2376980 2315742 2228499 2158971 2085035 2112440 2074964 2027337
5030B027337j459M6983k0637l8393N015J7004L60m9133J9928L9206j0311k3511
$$ 2027337 2025878 2072861 2052224 2013831 2018846 2035850 2036210 1987077 2007005 2046211 2035900 2012389
5018B012389N82M4816O556j5021R648o72n389K9980j7155j9369N2986L5165m2261
$$ 2012389 2012971 2057787 2064343 2049322 2058970 2058298 2052909 2082889 2065734 2046365 2099351 2134516 2092255
5005B092255k2752J1107L8966O2764o9957p318M4700j8337K6424j9981M4331J3119
$$ 2092255 2069503 2080610 2119576 2182340 2112383 2105065 2149765 2131428 2157852 2137871 2182202 2195321
4993B195321m8038K277J7239L8874k0872Q0657M0243K1499L6455j0560L8665O8738
$$ 2195321 2147283 2149560 2166799 2205673 2184801 2265458 2305701 2327200 2363655 2353095 2391760 2460498
4981B460498O1477N4015N2804J02490P7922J27392J03787J05198K5945n0914k2926
$$ 2460498 2521975 2575990 2628794 2731284 2809206 2936598 3040385 3145583 3171528 3120614 3097688
4970C097688r2440j16981o6081n4679o5096o4579o7413J6103l9321J7785M141
$$ 3097688 3005248 2888267 2822186 2767507 2702411 2637832 2570419 2586522 2547201 2564986 2569127
4959B569127N0944J7482M740m3174J5588J9446O2925L2666M5489L6997k760K5135
$$ 2569127 2620071 2637553 2642293 2599119 2614707 2634153 2697078 2729744 2775233 2812230 2809470 2834605
4947B834605O471Q264k1261L3737N1040L2795J3775m679L2962L7887R357K241
$$ 2834605 2841076 2849340 2828079 2861816 2912856 2945651 2959426 2954747 2987709 3025596 3034953 3037194
4935C037194K7689K9647K0350j0560P05R811P952M3690K513J942L2503N4277M0244
$$ 3037194 3064883 3094530 3114880 3104320 3105025 3114836 3122788 3166478 3168991 3170933 3203436 3257713 3297957
4922C297957K2605p261O147M3402M1126O626M0518Q6145O9934P8552Q6237J5624
$$ 3297957 3320562 3313301 3319448 3362850 3403976 3410602 3451120 3537265 3607199 3685751 3771988 3787612
4910C787612M6488M4500P3343N377N159o7009J3366M7631k7594M3010P259L2946
$$ 3787612 3834100 3878600 3951943 3957320 3962479 3895470 3908836 3956467 3928873 3971883 3979142 4012088
4898D012088r962R130Q93Q6430P7588k2840m686M1421P3113O3209M9189O2616
$$ 4012088 4002126 4011256 4012149 4098579 4176167 4153327 4148641 4190062 4263175 4326384 4375573 4438189
4886D438189J21097J19917J11133O6376O7000M4926M9118K6383q486k3376J7975
$$ 4438189 4559286 4679203 4790336 4856712 4923712 4968638 5017756 5044139 5035653 5012277 5030252
4875E030252N5475N7499j2372J0470o9876n2906k8787J451J5604K2975J834L9963
$$ 5030252 5085727 5143226 5130854 5141324 5071448 5018542 4989755 4991206 5006810 5029785 5031619 5071582
4863E071582M5816J129K9029O0714q511O892K8150O4354M6104Q1181R8367J5881
$$ 5071582 5117398 5118527 5147556 5208270 5199759 5206651 5234801 5299155 5345259 5426440 5524807 5540688
4851E540688L9161N4005Q5604O1904N1224M8206M0186j107j1348q41L529P7892
$$ 5540688 5579849 5633854 5719458 5781362 5832586 5880792 5920978 5919871 5908523 5907682 5911211 5989103
4839E989103O2642L4239J4746O2565J11344O3473Q0151J02790Q2028R2338Q8541
$$ 5989103 6051745 6085984 6100730 6163295 6274639 6338112 6418263 6521053 6603081 6695419 6783960
4828F783960R7167J43271Q2475J12017N9674O9358J48088R0205Q4165R3215J03621
$$ 6783960 6881127 7024398 7106873 7218890 7278564 7347922 7496010 7586215 7670380 7763595 7867216
4817G867216J50386J53704K7036L5962J34162J30867J01347J19894P5096Q6878
$$ 7867216 8017602 8171306 8198342 8234304 8368466 8499333 8600680 8720574 8795670 8882548
4807H882548J54306J22621J68432J63587P3774J25973J29495J80715J74298K02093
$$ 8882548 9036854 9159475 9327907 9491494 9565268 9691241 9820736 10001451 10175749 10377842
4797A0377842K12833J73019J95103J95278J73314J99722J90298J55488K29703
$$ 10377842 10590675 10763694 10958797 11154075 11327389 11527111 11717409 11872897 12102600
4788A2102600J91621K06990J53515K01007K48216K53075K55216L14823L31044
$$ 12102600 12294221 12501211 12654726 12855733 13103949 13357024 13612240 13927063 14258107
4779A4258107L77914L13952L99155M16276M23125L43233L82362L35829M14441
$$ 14258107 14636021 14949973 15349128 15765404 16188529 16531762 16914124 17249953 17664394
4770A7664394M41788M10374M34933M96848M23044M39854N93653N29211N92840
$$ 17664394 18106182 18516556 18951489 19448337 19871381 20311235 20904888 21434099 22026939
4761B2026939P16962P28872Q67718R36892J028178J071012J168900J246437J378310
$$ 22026939 22743901 23472773 24340491 25277383 26305561 27376573 28545473 29791910 31170220
4752C1170220J547988J710483J871753K137116K528858K937323L392629M068372
$$ 31170220 32718208 34428691 36300444 38437560 40966418 43903741 47296370 51364742
4744E1364742M780059N435101O167822O934200P738498R462828J2286449J5557752
$$ 51364742 56144801 61579902 67747724 74681924 82420422 91883250 104169699 119727451
4736A19727451J7741109J7556993J3666757P279007k935739j2756057j8701733
$$ 119727451 137468560 155025553 168692310 175971317 173035578 160279521 141577788
4729A41577788k2447667k0467711j5963721j1760122q589882o616500n327677
$$ 141577788 119130121 98662410 82698689 70938567 62348685 55732185 50404508
4722E0404508m362961l679891l085910k656026k187098j865122j594100j264189
$$ 50404508 46041547 42361656 39275746 36619720 34432622 32567500 30973400 29709211
4714B9709211j068059r68717p63036o26088n85198n25138m12013m38108l38615
$$ 29709211 28641152 27672435 26909399 26283311 25698113 25172975 24760962 24322854 23984239
4705B3984239k29013j99783j63815j44552j03995l0566m4089O0892M2420P4667
$$ 23984239 23755226 23555443 23391628 23247076 23143081 23112515 23068426 23129318 23171738 23246405
4695B3246405J74350K59302K45131K79364L91460M64620N21678O48126O88084
$$ 23246405 23420755 23680057 23925188 24204552 24596012 25060632 25582310 26230436 26918520
4686B6918520O69953Q01669R13838R79728J099044J260130J396492J584883J788383
$$ 26918520 27588473 28390142 29303980 30283708 31382752 32642882 34039374 35624257 37412640
4677C7412640K133796K519697K993146L640029M275463N005374N683956O548252
$$ 37412640 39546436 42066133 45059279 48699308 52974771 57980145 63664101 70212353
4669G0212353P551922R268647J2066785J4561426J5620883J5327123J2654741
$$ 70212353 77764275 87032922 99099707 113661133 129282016 144609139 157263880
4662A57263880P668384j753984j0626530j4474883j8634838k0039058j7014680
$$ 157263880 164932264 163178280 152551750 138076867 119442029 99402971 82388291
4655H2388291j3243983r806201p347592n806615m797704l944612l355779k804231
$$ 82388291 69144308 59338107 51990515 46183900 41386196 37441584 34085805 31281574
4647C1281574k413900k103907j747239j478739j250841j114446j054975r84650
$$ 31281574 28867674 26763767 25016528 23537789 22286948 21172502 20117527 19132877
4639A9132877q34317q19120p68880o89622o01644o80037n61662m75222m77095
$$ 19132877 18298560 17479440 16710560 16020938 15419294 14739257 14177595 13702373 13225278
4630A3225278m63240m04959m08704l59589k94135k68360k95983j99021k23600
$$ 13225278 12762038 12357079 11948375 11588786 11294651 11026291 10730308 10531287 10307687
4621A0307687k06840j84386j45118j49479p9825j82706j48241j24479j44174j56997
$$ 10307687 10100847 9916461 9771343 9621864 9542039 9359333 9211092 9086613 8942439 8785442
4611H785442j27224j69690j52994j75588j22830r8927j57481j51205j04160j13982
$$ 8785442 8658218 8488528 8335534 8159946 8037116 7938189 7780708 7629503 7525343 7411361
4601G411361j37656r8660j27145n6463l4462m5716q4949n9677m2667r2190o7197
$$ 7411361 7273705 7175045 7047900 6991437 6956975 6911259 6826310 6766633 6723966 6631776 6564579
4590F564579p2426l0647q9098m2881n6993p8925q3409o031m8384m7496J0312j10374
$$ 6564579 6492153 6461506 6372408 6329527 6272534 6193609 6110200 6104169 6055785 6008289 6018601 5908227
4578E908227l2119m846n373k9388o8321j4451L336k2558k1603m3218K1192l0741
$$ 5908227 5876108 5871262 5865889 5836501 5768180 5753729 5757065 5734507 5712904 5669686 5690878 5660137
4566E660137l8136N131o717l5995J0160r759K7515m5944m167l264J9129M7720
$$ 5660137 5622001 5627132 5620415 5584420 5594580 5584821 5612336 5566392 5562225 5558961 5578090 5625810
4554E625810o6734m5420n8722J7603j1535o7686n110p248N89L4786o604j0969
$$ 5625810 5559076 5513656 5454934 5472537 5461002 5393316 5388206 5380958 5381547 5416333 5409729 5398760
4542E398760j3769r402M7453p393j3874j3906L1902j0434j9714m542L9402K4062
$$ 5398760 5384991 5375589 5423042 5415649 5401775 5387869 5419771 5409337 5389623 5385081 5424483 5448545
4530E448545J7575O3294Q674M6156K6224n440Q0786J00154l4532J0684O7311K9312
$$ 5448545 5466120 5529414 5538088 5584244 5610468 5605028 5685814 5785968 5751436 5762120 5829431 5858743
4518E858743J10383O6943M6969K6210O1805K3111N7858P0068O6536O2424M1178
$$ 5858743 5969126 6036069 6083038 6109248 6171053 6194164 6252022 6322090 6388626 6451050 6492228
4507F492228Q6416O9018J40351J56192N8799J50003J39414J03305R2275Q8519
$$ 6492228 6578644 6647662 6788013 6944205 7003004 7153007 7292421 7395726 7488001 7576520
4497G576520J39912J36119J47338J90130K32559K72138L05417L40336L42162L96455
$$ 7576520 7716432 7852551 7999889 8190019 8422578 8694716 9000133 9340469 9682631 10079086
4487A0079086M86638N66160O80214O81977O45979N01290K61904K5740k55462m23276
$$ 10079086 10565724 11131884 11812098 12494075 13140054 13641344 13903248 13928988 13673526 13250250
4477A3250250n27567m02250k19125p6407M1390J37868K61105L02578M91858N38451
$$ 13250250 12722683 12320433 12101308 12024901 12066291 12204159 12465264 12767842 13259700 13798151
4467A3798151N83205M25689K03567k6590l63861n56286p37183o84154o18524m85575
$$ 13798151 14381356 14807045 15010612 14984022 14620161 14063875 13326692 12642538 12024014 11538439
4457A1538439k89139k24355j92377j08786p3078L2123M3566P4830J61243J35584
$$ 11538439 11249300 11024945 10832568 10723782 10650704 10682827 10726393 10801223 10962466 11098050
4447A1098050J81051K31624L39959L10159L26827M46200M79383N76211P18853
$$ 11098050 11279101 11510725 11850684 12160843 12487670 12933870 13413253 13989464 14708317
4438A4708317P91006Q65256J030579J149007J354751J529285J600660J473466
$$ 14708317 15499323 16364579 17395158 18544165 19898916 21428201 23028861 24502327
4430B4502327R81995M91479j51347q26579j273611j212554r53274o73410l62238
$$ 24502327 25484322 25975801 25824454 24997875 23724264 22511710 21558436 20885026 20522788
4421B0522788l5870J57118L66405N32346P46286Q87975Q33730N95585J24386l96746
$$ 20522788 20486918 20644036 21010441 21542787 22289073 23177048 24010778 24606363 24730749 24334003
4411B4334003r44109j450846j626312j522874j302017j044643q77142q03968p55394
$$ 24334003 23389894 21939048 20312736 18789862 17487845 16443202 15566060 14762092 14006698
4402A4006698o01159n77113m83379m29395l34215k98778k19142j89711j73310
$$ 14006698 13405539 12828426 12345047 11915652 11581437 11282659 11063517 10873806 10700496
4393A0700496j59334o1106l1363m6912N1068O9379Q5138J00615J45802J38424
$$ 10700496 10541162 10480056 10448693 10401781 10452849 10522228 10607366 10707981 10853783 10992207
4383A0992207J66716K45292L33329K92035L07074M53320M95047N73250O58186
$$ 10992207 11158923 11404215 11737544 12029579 12336653 12789973 13285020 13858270 14516456
4374A4516456P31551Q06510R78643J125985J338740J431355J351488J002468M69448
$$ 14516456 15248007 16054517 17033160 18159145 19497885 20929240 22280728 23283196 23752644
4365B3752644j70371q78554j406912j675136j552914j369584j087117q58851o28186
$$ 23752644 23582273 22703719 21296807 19621671 18068757 16699173 15612056 14753205 14125019
4356A4125019n41430m01273k75292j97587j56153m6613P144M1220P9976J83856
$$ 14125019 13583589 13182316 12907024 12709437 12553284 12506671 12513815 12555035 12635011 12818867
4346A2818867J72678J23888P1279K29434K92740L02492L68266M76903O16798P16393
$$ 12818867 12991545 13115433 13186712 13416146 13708886 14011378 14379644 14856547 15473345 16189738
4336A6189738P92463R89870J217243J258249J186019Q42269M06372k19480p78380
$$ 16189738 16982201 17972071 19189314 20447563 21633582 22475851 22882223 22662743 21884363
4327B1884363j225610j387632j278628j057253o87270n02572l33800j42819J7225
$$ 21884363 20658753 19271121 17992493 16935240 16247970 15745398 15411598 15268779 15286004
4318A5286004J67920K54253K82413K32134j4742l66256o15017p59957q01202p74179
$$ 15286004 15453924 15708177 15990590 16222724 16207982 15841726 15226709 14466752 13665550 12891371
4308A2891371o16069m85934m13917l77836k46084k05800j51624j06239j23584
$$ 12891371 12275302 11789368 11375451 10997615 10751531 10545731 10394107 10287868 10164284
4299A0164284r8586o8722m5607L5750P3981O5140N9544J20518J49494J47775K08398
$$ 10164284 10065698 9996976 9951369 9987119 10061100 10126240 10185784 10306302 10455796 10603571 10811969
4288A0811969K32500K10340L31649L61546L80997M69207O30336O39042N82439
$$ 10811969 11044469 11254809 11586458 11948004 12329001 12798208 13428544 14067586 14650025
4279A4650025M36904J80982q3913l49025n75191n60529n11644l81790k62618j35303
$$ 14650025 15086929 15267911 15183998 14834973 14259782 13699253 13187609 12805819 12543201 12407898
4269A2407898J8658L9963J34613K02720K74861L42283M55049O06168O92744O51452
$$ 12407898 12426556 12466519 12601132 12803852 13078713 13420996 13876045 14482213 15174957 15826409
4259A5826409O51344M44292P7234k84573n47906p42168q46780p65739o40540n52169
$$ 15826409 16477753 16922045 16999279 16714706 16166800 15424632 14577852 13812113 13171573 12619404
4249A2619404l78875k41935k50091j75332j25041j07482l1803p6113K1977N0084
$$ 12619404 12240529 11998594 11748503 11573171 11448130 11340648 11308845 11232732 11254709 11304793
4239A1304793N1111J12113J10643J12971J19097J48029J61470K09702J53042K22191
$$ 11304793 11355904 11468017 11578660 11691631 11810728 11958757 12120227 12329929 12482971 12705162
4229A2705162L11718L21966L39738M03523M50777M83282O08994O97467P39146
$$ 12705162 13016880 13338846 13678584 14082107 14532884 15016166 15625160 16322627 17061773
4220A7061773Q32199R02205Q87080P81319O64965M16965J77508j1523l8651k1054
$$ 17061773 17893972 18796177 19683257 20464576 21129541 21546506 21724014 21712491 21673840 21652786
4210B1652786J73387L95028O22839Q51353J039619J130485J052702Q50176L86152
$$ 21652786 21826173 22221201 22844040 23695393 24735012 25865497 26918199 27768375 28154527
4201B8154527k63841p81424j202577j367326j337437j210262r23373o73134m85526
$$ 28154527 27890686 27109262 25906685 24539359 23201922 21991660 21068287 20395153 19909627
4192A9909627l39391k65853k03956j28501m9827j6297N0422J66288J42606K33110
$$ 19909627 19570236 19304383 19100427 18971926 18922099 18905802 18956224 19122512 19265118 19498228
4182A9498228K77080K99553L24913L32762L17637L64700L70781M21862M49657
$$ 19498228 19775308 20074861 20399774 20732536 21050173 21414873 21785654 22207516 22657173
4173B2657173M91838N78392P09785P81708R15299R91578J175936J311535J469502
$$ 22657173 23149011 23727403 24437188 25218896 26134195 27125773 28301709 29613244 31082746
4164C1082746J483302J392199J159316O86454J94944l15258q53241j111620j160628
$$ 31082746 32566048 33958247 35117563 35804017 35998961 35683703 34830462 33718842 32558214
4155C2558214j061382q04435n34517l20811r7586R5644K25260K66276L27017M15307
$$ 32558214 31496832 30692397 30157880 29837069 29739483 29835127 30060387 30326663 30653680 31068987
4145C1068987M25326M92570O26051N24952O02850O48460O48993P37830P95534
$$ 31068987 31494313 31986883 32612934 33137886 33740736 34389196 35038189 35776019 36571553
4136C6571553Q44219R11351J075116J240706J434378J502547J680845J822410
$$ 36571553 37415772 38327123 39402239 40642945 42077323 43579870 45260715 47083125
4128D7083125J978865K169209K392991K602819K808725L172737L689648M079152
$$ 47083125 49061990 51231199 53624190 56227009 59035734 62208471 65898119 69977271
4120F9977271M685962N497304O270117P179074Q311064R584157J0780200J2001638
$$ 69977271 74663233 80160537 86430654 93609728 101920792 111504949 122285149 134286787
4112A34286787J3650647J6123886K0012965K4785526K7969905K6680766K0026630
$$ 134286787 147937434 164061320 184074285 208859811 236829716 263510482 283537112
4105B83537112R102142m257982j9107940l0888851l4353673l1013063k5243812
$$ 283537112 292639254 288381272 269273332 238384481 204030808 173017745 147773933
4098A47773933j9613721j5304733j2304012j0039347q278312o917621n964904
$$ 147773933 128160212 112855479 100551467 90512120 82233808 75316187 69351283
4091F9351283n168448m467780l862851l195282k669225k240746j825973j489257
$$ 69351283 64182835 59715055 55852204 52656922 49987697 47746951 45920978 44431721
4083D4431721j251987j052651q52478p33408m84859j60502J03385M59076M89514
$$ 44431721 43179734 42127083 41274605 40541197 40056338 39895836 39999221 40458297 40947811
4074D0947811K28182j93957p39311j392688j954231k031588j804064j401956j011229
$$ 40947811 41175993 40982036 40242725 38850037 36895806 34864218 33060154 31658198 30646969
4065C0646969o77705l90081j74426N8098K77359N07102Q17131R05534P18603K32087
$$ 30646969 29969264 29579183 29404757 29462855 29740214 30247316 31064447 31969981 32688584 32920671
4055C2920671l72133j046176j745918k128781k025530j833965j447840j169840
$$ 32920671 32548538 31502362 29756444 27627663 25602133 23768168 22320328 21150488
4047B1150488j030203q81388p12160n71188n58584m74069l46090k74245k31283
$$ 21150488 20120285 19238897 18526737 17955549 17396965 16922896 16576806 16302561 16071278
4038A6071278k04840k30576j30463j12341o0620m4868k0932N5734J16830Q8971
$$ 16071278 15866438 15635862 15505399 15393058 15332438 15287570 15266638 15322372 15439202 15528173
4028A5528173J33140K40288K37167K99602M14338M88558O33248P55677Q16616
$$ 15528173 15661313 15901601 16138768 16438370 16852708 17341266 17974514 18730191 19546807
4019A9546807O92703M82933J20724k99260o31932q03709p58524n64789l59020
$$ 19546807 20239510 20722443 20843167 20543907 19911975 19108266 18349742 17784953 17425933
4010A7425933j93201q0788k9476R2789J80395L44610N09007N25360N16879L87106
$$ 17425933 17232732 17151944 17122468 17215257 17395652 17740262 18249269 18774629 19291508 19678614
4000A9678614Q1355k76628o34409r06972r04007p80051o40389m51670l04652k99779
$$ 19678614 19759969 19483341 18848932 17941960 17037953 16257902 15617513 15165843 14861191 14561412
3990A4561412k79971j27812q9568n0187m4862K5590J6806J5538Q0902M3160J29414
$$ 14561412 14281441 14153629 14064061 14013874 13969012 13994602 14011408 14026946 14107848 14151008 14280422
3979A4280422J21360Q8883J60234J18986J44888J71452K51099L00655K42836L01458
$$ 14280422 14401782 14490665 14650899 14769885 14914773 15086225 15337324 15637979 15880815 16182273
3969A6182273L17578L27107L48216L74359M17326M35779M68263N16529N43994
$$ 16182273 16499851 16826958 17175174 17549533 17966859 18402638 18870901 19387430 19931424
3960A9931424N61271N67400O26234P35516P04160P38130Q43786Q55631R20252
$$ 19931424 20492695 21060095 21686329 22421845 23126005 23864135 24707921 25563552 26483804
3951B6483804R72766J001378J076147J056271J138636J172836J207979J258085
$$ 26483804 27456570 28457948 29534095 30590366 31729002 32901838 34109817 35367902
3943C5367902J296239J302113J297495J346539J365867J377340J435892J453820
$$ 35367902 36664141 37966254 39263749 40610288 41976155 43353495 44789387 46243207
3935D6243207J435115J445796J437014J441244J336962J311001J189906J088925
$$ 46243207 47678322 49124118 50561132 52002376 53339338 54650339 55840245 56929170
3927E6929170J001782R29796Q76845Q07184P10334O03986N74185N49389M91803
$$ 56929170 57930952 58860748 59737593 60544777 61255111 61859097 62433282 62982671 63474474
3918F3474474L77988K72969J75500L2360j55143l85707n76885o86383q00317q15440
$$ 63474474 63852462 64125431 64300931 64333291 64178148 63792441 63215556 62529173 61728856 60913416
3908F0913416q86213q84214r13469j008982j056224j147729j207385j323001j410106
$$ 60913416 60027203 59142989 58229520 57220538 56164314 55016585 53809200 52486199 51076093
3899E1076093j498771j554893j596318j636458j632424j601282j553295j521015
$$ 51076093 49577322 48022429 46426111 44789653 43157229 41555947 40002652 38481637
3891C8481637j508055j501077j407706j388954j385908j364405j305555j319039
$$ 38481637 36973582 35472505 34064799 32675845 31289937 29925532 28619977 27300938
3883B7300938j271203j219027j226146j158459j036282j018095r53238r47866
$$ 27300938 26029735 24810708 23584562 22426103 21389821 20371726 19418488 18470622
3875A8470622q51572p79627p28550o65542o91217o16076n56555n50340m98948
$$ 18470622 17619050 16839423 16110873 15445331 14754114 14138038 13581483 13031143 12532195
3866A2532195m90525l96219l83926l56233l26914k86118l47699l05241k29769
$$ 12532195 12041670 11645451 11261525 10905292 10578378 10292260 9944561 9639320 9409551
3857I409551k15398k14780k47923j58173j61287j87345j73192j46267j36844j33435
$$ 9409551 9194153 8979373 8731450 8573277 8411990 8224645 8051453 7905186 7768342 7634907
3847G634907j31949j10413o4171p7251j25970j00836j00435o1932q8118k8775
$$ 7634907 7502958 7392545 7328374 7251123 7125153 7024317 6923882 6861950 6773832 6745057
3837F745057l2040m2703q6175m7743k2968o4124l3839R02k9735L2398k8883j4441
$$ 6745057 6713017 6670314 6584139 6536396 6513428 6449304 6415465 6416367 6386632 6419030 6390147 6375706
3825F375706J0629L3741L2013o9408j0066O1087k1990J548P0195K2744l3327N1586
$$ 6375706 6386335 6420076 6452089 6382681 6372615 6433702 6411712 6413260 6483455 6506199 6472872 6524458
3813F524458M1120O059M0881N5087O128M9772R0722J17352J00715P2509R7781
$$ 6524458 6565578 6571637 6612518 6667605 6673733 6723505 6814227 6931579 7032294 7104803 7202584
3802G202584K4357m3617l4390r4505j80364j70674j91990k06452j31147j06275
$$ 7202584 7226941 7183324 7148934 7054429 6874065 6703391 6511401 6304949 6173802 6067527
3792F067527j18841r7293p3917j27639o5343p9128m8741j8008l0661m644o8875
$$ 6067527 5948686 5851393 5777476 5649837 5584494 5505366 5456625 5438617 5407956 5403312 5334437
3781E334437r0234j06057j1304k0394n4194o8566k2492M379o2158l0313k8463
$$ 5334437 5244203 5138146 5126842 5106448 5052254 4983688 4961196 4965575 4903417 4873104 4844641
3770D844641q285J6292N712l5214r955L5566L8728J1963n1542k7629L1769K2893
$$ 4844641 4836356 4852648 4858360 4823146 4813191 4848757 4887485 4899448 4847906 4820277 4852046 4874939
3758D874939L0136M2348J63p7421M6854K1100k962N0612k7621k0145L5578K7593
$$ 4874939 4905075 4947423 4947586 4870165 4917019 4938119 4935157 4985769 4958148 4938003 4973581 5001174
3746E001174k673O5548K6084p228O643j8543M3164P8418K5758K1694O217L2406
$$ 5001174 4998501 5064049 5090133 5082905 5089548 5071005 5114169 5192587 5218345 5240039 5246256 5278662
3734E278662L0703P7312M3831L0285l898Q0332R0892Q5853K1667K2534N4886O3329
$$ 5278662 5309365 5386677 5430508 5460793 5456895 5537227 5628119 5713972 5735639 5758173 5813059 5876388
3722E876388N8027M3151k1310O3534l4320J7696M508J5569N814M2353Q533K1156
$$ 5876388 5934415 5977566 5956256 6019790 5985470 6003166 6007674 6023243 6029057 6071410 6079943 6101099
3710F101099J0897K0025L1595J6571Q6037Q9585L544k0369J5814K2819Q4044j9161
$$ 6101099 6111996 6132021 6163616 6180187 6266224 6355809 6359353 6338984 6354798 6377617 6461661 6442500
3698F442500O9073Q5300M476L6119L1042O2440O3583J0493M7311O9849M8941M8022
$$ 6442500 6511573 6596873 6601349 6637468 6668510 6730950 6794533 6805026 6852337 6922186 6971127 7019149
3686G019149J05384R5578M8005K9511R2058O3165R1746O8361J02827J05843Q0122
$$ 7019149 7124533 7220111 7268116 7297627 7389685 7452850 7544596 7612957 7715784 7821627 7901749
3675G901749O2770O5960R0966R4935Q8592R2755J11187J02008Q9292J37071J11272
$$ 7901749 7964519 8030479 8121445 8216380 8304972 8397727 8508914 8610922 8700214 8837285 8948557
3664H948557R3745J09048J55927N4801P5828P0381J32541J74545J56354J48202
$$ 8948557 9042302 9151350 9307277 9362078 9437906 9508287 9640828 9815373 9971727 10119929
3654A0119929J42781J51827J79852J68905J88192J56289K07542J83455J69536
$$ 10119929 10262710 10414537 10594389 10763294 10951486 11107775 11315317 11498772 11668308
3645A1668308K17695K24234L02981K31140K67644K53957K29478L21442L17729
$$ 11668308 11886003 12110237 12413218 12644358 12912002 13165959 13395437 13716879 14034608
3636A4034608L64594M32732L94828L72329L04979K86764K77293K25183K05164
$$ 14034608 14399202 14831934 15226762 15599091 15904070 16190834 16468127 16693310 16898474
3627A6898474K88858L17687L28997L77096M60323M53790M64486N53971N15013
$$ 16898474 17187332 17505019 17834016 18211112 18671435 19125225 19589711 20143682 20658695
3618B0658695O15804O37319P00492P28954P47222P86953Q64829Q16919Q16413
$$ 20658695 21274499 21911818 22612310 23341264 24088486 24875439 25740268 26557187 27373600
3609B7373600Q28237Q42466Q67443Q76537R14964Q01877P85245P79345P38551
$$ 27373600 28201837 29044303 29911746 30788283 31703247 32505124 33290369 34069714 34808265
3600C4808265O87160P14623P49225P53217O99608P32247P04615P00396O23159
$$ 34808265 35495425 36210048 36959273 37712490 38412098 39144345 39848960 40549356 41172515
3591D1172515N92071N13623N03202N19790N22405M31907M39696N24238M48578
$$ 41172515 41764586 42278209 42781411 43301201 43823606 44255513 44695209 45219447 45668025
3582D5668025M68359M81556M97975M93439M97277N47247N47945N97859O84665
$$ 45668025 46136384 46617940 47115915 47609354 48106631 48653878 49201823 49799682 50484347
3573E0484347P26497P49855Q18276R27578J062152J191066J283176J384190J533325
$$ 50484347 51210844 51960699 52778975 53706553 54768705 55959771 57242947 58627137 60160462
3564F0160462J703913J820123K009683K177976K318629K485261K716998K890864
$$ 60160462 61864375 63684498 65694181 67872157 70190786 72676047 75393045 78283909
3556G8283909L052511L205593L322112L440540L492978L661587L782510L922667
$$ 78283909 81336420 84542013 87864125 91304665 94797643 98459230 102241740 106164407
3548A06164407M048556M245566M432066M631060M854762N022617N336557N471732
$$ 106164407 110212963 114458529 118890595 123521655 128376417 133399034 138735591 144207323
3540A44207323N678656N805028N891900O095196O130336O215830O331211O367367
$$ 144207323 149885979 155691007 161582907 167678103 173808439 180024269 186355480 192722847
3532A92722847O426267O326272O100902N798370N346294M785048M136959L382216
$$ 192722847 199149114 205475386 211576288 217374658 222720952 227506000 231642959 235025175
3524B35025175K587574J815660J105856L27062l69069j019806j600968k177407
$$ 235025175 237612749 239428409 240534265 240861327 240492258 239472452 237871484 235694077
3516B35694077k816704l513058m093214m734369n470678o195248o818033p424546
$$ 235694077 232877373 229364315 225271101 220536732 215066054 208870806 202052773 194628227
3508A94628227p886935q185884q397780q321759q217092p947854p709912p383045
$$ 194628227 186741292 178555408 170157628 161835869 153618777 145670923 137961011 130577966
3500A30577966p018596o768990o460443o163702n917863n533850n253336m868637
$$ 130577966 123559370 116790380 110329937 104166235 98248372 92714522 87461186 82592549
3492H2592549m486409m116125l688379l281970k908217k538983k251484k004009
$$ 82592549 78106140 73990015 70301636 67019666 64111449 61572466 59320982 57316973
3484E7316973j776413j540488j469443j311520j133179r96337q35568p61684o36341
$$ 57316973 55540560 54000072 52530629 51219109 50085930 49089593 48254025 47492341 46856000
3475D6856000n30966m85373m67425m94098m52551m80041m97302n70940n22108
$$ 46856000 46325034 45839661 45372236 44878138 44425587 43945546 43448244 42877304 42355196
3466D2355196m99353m57776m29780m73507m21522m11946m16495m15725m36138
$$ 42355196 41855843 41398067 40968287 40494780 40073258 39661312 39244817 38829092 38392954
3457C8392954m99953m96632n30709m63703m12376m88296m11931l47827k95924
$$ 38392954 37893001 37396369 36865660 36401957 35989581 35501285 35089354 34741527 34445603
3448C4445603k72996k11163k12692k23801j86156l66352m24439m57599n40639
$$ 34445603 34172607 33961444 33748752 33524951 33338795 32972443 32548004 32090405 31549766
3439C1549766o18380o42081o51605p08079p00283o52143o08137n60542n33697
$$ 31549766 30931386 30289305 29637700 28929621 28229338 27577195 26969058 26408516 25874819
3430B5874819n08353n33442n03072o21308n95758o65019o82713p54508p61976
$$ 25874819 25366466 24833024 24329952 23708644 23112886 22447867 21765154 21010646 20248670
3421B0248670p86184q04389p33343p52749o99311o23957n24756n74626m94020
$$ 20248670 19462486 18658097 17924754 17172005 16472694 15848737 15323981 14749355 14255335
3412A4255335l95098m17204m18869l14842l03932m13863k88767k34398k36016
$$ 14255335 13860237 13443033 13024164 12709322 12405390 11991527 11702760 11468362 11232346
3403A1232346k58477k49108k42721j62778k16951j62667j52276j21157j60426
$$ 11232346 10973869 10724761 10482040 10319262 10102311 9939644 9787368 9666211 9505785
3394I505785j36746j31240j70328j12644j48744j66709j24045j28332r4495j39667
$$ 9505785 9369039 9237799 9067471 8954827 8806083 8639374 8515329 8386997 8292502 8152835
3384H152835j33023j25251j44121j87103j14007j11422j24225j14293j45880r2670
$$ 8152835 8019812 7894561 7750440 7563337 7449330 7337908 7213683 7099390 6953510 6860840
3374F860840j45947j10461j27190q2272j27270q2933j09341p8762o2005n2695
$$ 6860840 6714893 6604432 6477242 6394970 6267700 6184767 6075426 5996664 5934659 5881964
3364E881964p2716p4788j21157m4325k4613k3094k5129m2294l1698k7076j8390
$$ 5881964 5809248 5734460 5613303 5568978 5544365 5521271 5496142 5453848 5422150 5395074 5376684
3353E376684j4904n0787q4173k7458j8585p4009l1343L5565L3500J4469Q9242
$$ 5376684 5361780 5310993 5226820 5199362 5180777 5106768 5075425 5110990 5144490 5158959 5248201
3342E248201L5543L5950N3364L4968K7249l591m6240j13113j36424r9711j10405
$$ 5248201 5283744 5319694 5373058 5408026 5435275 5431684 5385444 5272331 5135907 5036196 4925791
3331D925791l5223K0074J0291l1436P636L4756J0615N8273k7953l2240p6420j31320
$$ 4925791 4890568 4910642 4920933 4889497 4897133 4931889 4942504 5000777 4972824 4940584 4864164 4732844
3319D732844j33420j56636j70575q9109q0341n7317l5698o0614p1494k4968k2854
$$ 4732844 4599424 4442788 4272213 4183104 4102763 4045446 4009748 3949134 3877640 3852672 3829818
3308C829818k0575k5549n8392N610J2718M51n911R003j5015L9501K2181l9012
$$ 3829818 3809243 3783694 3725302 3730912 3743630 3744081 3738170 3747173 3732158 3771659 3793840 3754828
3296C754828j8825L6680O2022Q397r076l9142J2695M4377n7695k8565l7507J2953
$$ 3754828 3736003 3772683 3834705 3843102 3834026 3794884 3807579 3851956 3794261 3765696 3728189 3741142
3284C741142k3527R187L581J966n360j9121m846j4811L5429L8447K4474M217j2256
$$ 3741142 3717615 3726802 3730383 3732349 3726989 3707868 3703022 3688211 3723640 3762087 3786561 3790778 3778522
3271C778522J6568L3266N6470O5899j3153L4296M2899M7050J6971K3108P1570
$$ 3778522 3795090 3828356 3884826 3950725 3937572 3971868 4014767 4061817 4078788 4101896 4173466
3260D173466R2725J4223P2428o746L1186Q8626K7101K1325m058j465J8162N3178
$$ 4173466 4266191 4280414 4352842 4346096 4377282 4465908 4493009 4514334 4510276 4508811 4526973 4580151
3248D580151N6060Q4369P0062K9451L1797M1146R0119O2919N2533M2242N909N1300
$$ 4580151 4636211 4720580 4790642 4820093 4851890 4893036 4983155 5046074 5098607 5140849 5146758 5198058
3236E198058J4308P2988Q1770k7992K9352P0259J07153j8435K4757L4681P9079
$$ 5198058 5212366 5285354 5367124 5339132 5368484 5438743 5545896 5527461 5552218 5586899 5665978
3225E665978L6735L5876O4271O0917J9629L2545P1501Q8857O3612N8979J47606
$$ 5665978 5702713 5738589 5802860 5863777 5883406 5915951 5987452 6076309 6139921 6198900 6346506
3214F346506R7182J02876R1528O8390N1001M3571M7433K3412R4137J18923J38289
$$ 6346506 6443688 6546564 6638092 6706482 6757483 6801054 6848487 6871899 6966036 7084959 7223248
3203G223248J93607J87572K20187K21079L01715L40501L38258L22683L77387M31662
$$ 7223248 7416855 7604427 7824614 8045693 8347408 8687909 9026167 9348850 9726237 10157899
3193A0157899M06249L98441M43549M06135K72674J31266O1091j47218l23130n16200
$$ 10157899 10564148 10962589 11406138 11812273 12084947 12216213 12277304 12130086 11806956 11290756
3183A1290756n93278o98337o48722n52209n12017n09300m13307l56425k87932
$$ 11290756 10697478 9999141 9350419 8798210 8286193 7776893 7363586 7007161 6719229
3174F719229k70833k40498k26997j99653j70325j48112r9753j52925j65968j12088
$$ 6719229 6448396 6207898 5980901 5781248 5610923 5462811 5363058 5210133 5044165 4932077
3164D932077j44752o3813p9859q2368p5789r7387j02688q7472o6385p4040p8463
$$ 4932077 4787325 4723512 4643653 4561285 4485496 4388109 4285421 4197949 4131564 4057524 3979061
3153C979061j06569l3724p4729l6379p7499l8659j06552n5246o2270p6890l3064
$$ 3979061 3872492 3838768 3764039 3727660 3650161 3611502 3504950 3449704 3387434 3310544 3277480
3142C277480m2075o9414q7518n6666n0313p1994l8120o2282K0076j8790m0778
$$ 3277480 3235405 3165991 3078473 3021807 2971494 2899500 2861380 2799098 2819174 2800384 2759606
3131B759606n9102o1923n3655p4466l5865j930n227L86l6434n3206p4373k8689
$$ 2759606 2700504 2638581 2584926 2510460 2474595 2472665 2467438 2467824 2431390 2378184 2303811 2275122
3119B275122J2568o4694l9906K7415K986k8897k8480l3064P862j2562m7147k630
$$ 2275122 2287690 2222996 2183090 2210505 2213491 2184594 2156114 2123050 2130912 2118350 2071203 2068573
3107B068573o340m6738K6097m4388P416n4204M78l7274m0104L6601N90K5106l9263
$$ 2068573 2062233 2015495 2041592 1997204 2004620 1950416 1950894 1913620 1873516 1910117 1910707 1935813 1896550
3094A896550n6607m6565o54l3627k4566O850m660m109L4525J3613l1557o1185
$$ 1896550 1839943 1793378 1792724 1759097 1734531 1741381 1736721 1732612 1767137 1780750 1749193 1688008
3082A688008q920j8646n1119N7195j3147l5888m1994o1050R678N3180m1900J3451
$$ 1688008 1679088 1660442 1609323 1666518 1653371 1617483 1575489 1514439 1524117 1577297 1535397 1548848
3070A548848l2135n252K672K0388j3272p0299R972l124m2389J7260M1856k3872
$$ 1548848 1516713 1511461 1514133 1534521 1521249 1450950 1460922 1457798 1415409 1432669 1474525 1450653
3058A450653j2057j0388K030o64k8749l86M3812k884j1980j5895q601j0209N019
$$ 1450653 1438596 1428208 1430238 1429574 1400825 1400439 1444251 1441367 1429387 1413492 1404891 1394682 1399701
3045A399701j2215K4352k0411k1361k7759M4350K2277m3283O260L573K6366J8454
$$ 1399701 1387486 1411838 1391427 1370066 1342307 1386657 1408934 1365651 1371911 1375484 1401850 1420304
3033A420304j9897m4620m6772j9719O609j2388j6864M6753J5075m2475o9078J8685
$$ 1420304 1400407 1355787 1309015 1289296 1295905 1283517 1266653 1313406 1328481 1286006 1216928 1235613
3021A235613M5750n1569k2872J0237N771L1267j3158k8827m5751K7761K4681l7614
$$ 1235613 1281363 1229794 1206922 1217159 1222930 1254197 1241039 1212212 1166461 1194222 1218903 1181289
3009A181289k3217p311j1851j1409L0630Q1734o4374m9530J5552j9675l7251k7283
$$ 1181289 1158072 1150761 1138910 1127501 1158131 1239865 1175491 1125961 1141513 1121838 1084587 1057304
2997A057304N5662M185n1654m1593N2069L955j8761J8047j4096m2927K5895J0208
$$ 1057304 1112966 1117151 1065497 1023904 1075973 1079928 1061167 1079214 1065118 1022191 1048086 1058294
2985A058294j268M0906K8455P940n5535o513L673m3881j1380l893M7175K0611
$$ 1058294 1057026 1097932 1126387 1134327 1078792 1072279 1075952 1032071 1020691 1016798 1063973 1084584
2973A084584k6800o382J4019M240k5924k2834N1401p180J2818j8279J8471k8112
$$ 1084584 1057784 1051402 1065421 1069661 1043737 1020903 1072304 1065124 1077942 1059663 1078134 1050022
2961A050022O733P8295j166k0259r083o514J9572L9028j7026j6131J4141J6276
$$ 1050022 1056755 1135050 1133884 1113625 1104542 1098028 1117600 1156628 1139602 1123471 1137612 1153888
2949A153888j6890Q267M133J0564N650N3428K2080j4854K3258l1350R640N1039
$$ 1153888 1136998 1145265 1149398 1159962 1165612 1219040 1241120 1226266 1249524 1218174 1227814 1278853
2937A278853l1229M4974l7509J8483J0158l1260o886p855M3144k5679Q531J9057
$$ 1278853 1247624 1292598 1255089 1273572 1283730 1252470 1245584 1237729 1280873 1255194 1263725 1282782
2925A282782N3046K5954j2491j416J4413r632K381M4792L2158Q454k171J8555
$$ 1282782 1335828 1361782 1349291 1347875 1362288 1352656 1355037 1399829 1431987 1440441 1438270 1456825
2913A456825j9921k2332j3491L4956M7537k294L2719K3923n273l4135r353J7439
$$ 1456825 1436904 1414572 1401081 1436037 1483574 1481280 1513999 1537922 1532649 1498514 1489161 1506600
2901A506600J6525N359K022k3368N0846j1627k785J8441K1576K7966j0205j9638
$$ 1506600 1523125 1528484 1530506 1507138 1557984 1546357 1543572 1562013 1583589 1611555 1601350 1581712
2889A581712P5703K8109l61K2889N3004P4703j6187L0334J7246J8243L9256M8860
$$ 1581712 1657415 1685524 1685163 1708052 1761056 1835759 1819572 1849906 1867152 1885395 1924651 1973511
2877A973511j5432M0006j88P3590J6246j6366N2090N3463J0144N9650n6139K3467
$$ 1973511 1958079 1998085 1997897 2071487 2087733 2071367 2123457 2176920 2187064 2246714 2190575 2214042
2865B214042P5294L04J854M3797N3102j76o006J3434M2856J0792J05666K7878
$$ 2214042 2289336 2289640 2291494 2335291 2388393 2388217 2382211 2395645 2438501 2449293 2554959 2582837
2853B582837P6940P8528M1060J21202P2511P3850O9265k4394N3056J6118J727
$$ 2582837 2659777 2738305 2779365 2900567 2973078 3046928 3116193 3091799 3144855 3160973 3162700
2842C162700o3015r5388m1003r5389m8062l7442o2727j4530k091l541j0622L0206
$$ 3162700 3099685 3004297 2963294 2867905 2819843 2782401 2719674 2705144 2703053 2699512 2688890 2719096
2830B719096k868k1782P3079P7781J9699r035J069O5322q621M91K7932L8776M8545
$$ 2719096 2716228 2694446 2767525 2845306 2865005 2855970 2857039 2922361 2913740 2914231 2942163 2980939 3029484
2817C029484j3786j7136j7108m4099p2920l0027o6139n1667m3630o5871o8080
$$ 3029484 3015698 2998562 2981454 2937355 2864435 2834408 2768269 2716602 2672972 2607101 2539021
2806B539021q146J8315n4216m1034J9062n8482j10183l9911k8290q8302m2699
$$ 2539021 2530875 2549190 2494974 2453940 2473002 2414520 2304337 2264426 2236136 2147834 2105135
2795B105135j0223k6634k5501r8357m7732p3441o2450q0306j4262p3821p0733
$$ 2105135 2094912 2068278 2042777 1944420 1896688 1823247 1760797 1680491 1666229 1592408 1521675
2784A521675j1764p5822l7267n5683o5522J05J8899l4610l0001o1128k0142j8188
$$ 1521675 1509911 1434089 1396822 1341139 1275617 1275722 1294621 1260011 1230010 1168882 1148740 1130552
2772A130552l1144n0788m7432q354n816l2780J1001k8046m9417j3917M3523n8549
$$ 1130552 1099408 1048620 1001188 992834 987018 954238 965239 937193 887776 873859 917382 858833
2760H58833l105m7874j9878K3847k9316K4145m2694k8908R35J8045m7995j4027
$$ 858833 855728 807854 787976 811823 782507 806652 763958 735050 735985 754030 706035 692008
2748F92008P296m7891K2946L0842l5614k8185L9605K1440m3473l7279k6665j5596
$$ 692008 699304 651413 674359 705201 669587 641402 681007 702447 658974 621695 595030 579434
2736E79434k4218r934K2615j4896j0297j6627r050L5858K9320m9407p9980L4799
$$ 579434 555216 545282 567897 553001 542704 526077 517027 552885 582205 532798 452818 487617
2724D87617j6283N2119K1677j835l5855k1031L859m5192j5710k128R495K7139
$$ 487617 471334 523453 545130 543295 507440 486409 490268 445076 429366 427238 436733 463872
2712D63872l2330K115J5341n815J1534k7501l5529k4584J461M1992k6442k9102
$$ 463872 431542 433657 448998 443183 454717 427216 391687 367103 368564 410556 384114 355012
2700C55012J1847l436L1209j4652J267N30k6614k930o01j4108K9426r788J2896
$$ 355012 366859 363423 394632 379980 381247 381777 355163 352233 351632 337524 366950 357162 370058
2687C70058j6932P083L550j0714j1675j0476K6199M225q4p2221J4011J4167k3337
$$ 370058 353126 360209 363759 353045 341370 330894 357093 361318 361234 289013 303024 317191 293854
2674B93854J6593j1479L2767J8631R55l1913k5052M0723j629j1700m2162k8121
$$ 293854 310447 298968 331735 350366 351321 319408 294356 335079 333450 321750 279588 251467
2662B51467j7978K7662P319j3632o398J8360J2172k4934J7550l9212L2773K6013
$$ 251467 233489 261151 268470 254838 248440 266800 278972 254038 271588 232376 265149 291162
2650B91162k7657j8898K9466o5909k276N3879l7336P989M3049q573m6700L2340
$$ 291162 263505 244607 274073 208164 205888 259767 222431 230420 273469 264896 218196 250536
2638B50536k7471l3611K4990K7565j3797k4853R400J6388M887L442j1235k3077
$$ 250536 223065 189454 214444 242009 228212 203359 212759 229147 234034 237476 226241 203164
2626B03164K3299n649m1346j800K0482L3830j9724m78Q069j1371l2848K7627N3716
$$ 203164 226463 220814 179468 177668 198150 231980 212256 211778 219847 208476 175628 203255 256971
2613B56971k7112j405l4213p837J3536L9326l925j3139q513l2049j788L0740L8987
$$ 256971 229859 228454 194241 186404 199940 239266 235341 222202 213689 181640 179852 210592 249579
2600B49579k1598r917N6096J5140j6474j8890l6848p265l9316k014N0978n3997
$$ 249579 227981 218064 274160 289300 272826 253936 217088 209823 170507 168493 219471 165474
2588A65474J47Q953L783J4201j939L7450O962J7825k0228M140j8814l9497P1843
$$ 165474 165621 174574 178357 192558 190619 228069 235031 252856 232628 236768 217954 178457 250300
2575B50300K5701J8735k0853n2633q396L203J2210J7827m4249J9751j1737n447
$$ 250300 276001 294736 273883 221250 212854 216057 228267 246094 201845 221596 209859 204412
2563B04412N6625p147j0899k244K4110J6684M5868m672n4367k589J6524k7647
$$ 204412 261037 253890 242991 240747 264857 281541 327409 322737 268370 265781 282305 254658
2551B54658K306J7562Q945m8639j2431J6255L4327k5959j6619O552j8088O666
$$ 254658 256964 274526 283471 234832 222401 238656 272983 247024 230405 236957 218869 225535
2539B25535K9211K2823K7295Q210N749l4892m100j3894j9836p894J9963K7105
$$ 225535 254746 277569 304864 313074 318823 283931 279831 265937 246101 238207 258170 285275
2527B85275k4768K036K8079k1422n5340l42L7504j8019L834j6482K1688J5165
$$ 285275 260507 262543 290622 269200 213860 213518 251022 233003 236837 220355 242043 257208
2515B57208k6471J9413K825m9157K2925J3861k4583J9090J7980k6947n1705N1094
$$ 257208 230737 250150 252975 203818 226743 240604 216021 235111 253091 226144 174439 225533
2503B25533L554m4568J3188J7638K4896j9656n2417J7294m364J4989J8814k2984
$$ 225533 229087 184519 197707 215345 240241 220585 168168 185462 181098 196087 214901 191917
2491A91917K1384j7300l063M3096l7946j7899l9920l5210P21M7237K0554k2947
$$ 191917 213301 196001 192938 236034 198088 180189 140269 105059 105780 153017 173571 150624
2479A50624j1168k4265L293J605r669N3786Q543n0552O894J4318J594l8333L4267
$$ 150624 139456 115191 118484 120089 110420 164206 172749 122197 129091 143409 145003 106670 140937
2466A40937j1334l6471N0796n6953K6707K299J4500l236k9911L2421J8742l5064
$$ 140937 129603 93132 143928 86975 113682 115981 130481 127245 97334 129755 148497 113433
2454A13433K3703q063q164j4136k3790q662O549k13J5486l63l2513n226L9248
$$ 113433 137136 129073 120909 106773 82983 74321 80870 80657 96143 95780 63267 58041 97289
2441I7289n187j6347j6091J0403K3624J7063r801n696P2199k5962l9161L0408
$$ 97289 92102 75755 59664 70067 93691 110754 100953 95257 167456 141494 102333 132741
2429A32741K9368j4465m7545J011o352p472K1234j855j313j2383m45j5066K2670
$$ 132741 162109 147644 100099 101110 94758 87286 108520 106665 105352 92969 92524 77458 100128
2416A00128K6256l9107J6948j2368m203L1704J725J0900n7529m573K7734J6825
$$ 100128 126384 87277 104225 91857 87654 119358 121083 131983 74454 69881 97615 114440
2404A14440M288K4570j8237n553j5455k0479J1411K1584R321J0155n0352l0209
$$ 114440 118728 143298 125061 119508 104053 83574 94985 116569 125890 136045 85693 55484
2392E5484M6262J6441m3413k6295J2892P755J4937J3380l794J6723j7481l8045
$$ 55484 101746 118187 74774 48479 61371 69126 84063 97443 93649 110372 92891 54846
2380E4846m1871N017L421L4205K5545J6888N757j2826m198j03j2005m288J7213
$$ 54846 12975 17992 21413 55618 81163 98051 103808 90982 86784 86681 74676 70388 87601
2367H7601N015J1222M8974m0274k797l309l9237o318j5417n575P3338o350j8144
$$ 87601 92616 103838 152812 112538 109741 106432 67195 60877 45460 39885 113223 106873 88729
2354H8729j8209m1610j0551K2255O5552m3402k2867q562P2954Q018l2792k4883
$$ 88729 70520 28910 18359 40614 106166 62764 39897 31335 104289 112307 79515 54632
2342E4632L2452K7832m1683l2062K1257K7497l2679p825J0053o840j6683K0756
$$ 54632 87084 114916 73233 41171 62428 89925 57246 49421 59474 52634 35951 56707
2330E6707L8625m5423k2491J1065K1706K0186L3700M7751j9684k5564k9997M8491
$$ 56707 95332 49909 27418 38483 60189 80375 114075 161826 142142 116578 86581 135072
2318A35072J7603l8360J3729k4229K8451j5434%M9061j5650p061m1482J314l44
$$ 135072 152675 114315 128044 103815 132266 116832 116832 165893 150243 143182 101700 103014 102670
2305A02670j7363J5647O82j6903K3442l109o4114J4291J095J0362j1762J1762
$$ 102670 85307 100954 101636 84733 108175 105066 40952 55243 56338 66700 54938 66700
2293F6700N0226j2490L141L3712k5910l4468K5445j1986p248J4277l3329m645
$$ 66700 116926 104436 107577 141289 115379 80911 106356 94370 87122 101399 68070 63425
2281F3425R961J3031q629K4601J3772l0030l8453M3258J324l3235M8013J0352
$$ 63425 73386 86417 77788 102389 116161 86131 47678 90936 92260 59025 107038 117390
2269A17390m2017j1321j4599p823N3084K7331m2026k2146N9680M0795l5994K6172
$$ 117390 75373 64052 49453 41630 94714 122045 80019 57873 117553 158348 122354 148526
2257A48526n728K4155l0693m0111J5564o326m009r894m817q491j6515K2244k141
$$ 148526 142798 166953 136260 96149 111713 105387 101378 91484 86667 78176 61661 83905 81764
2244H1764M4056K696k9589K1418j1146L229m752j1430j6872n81Q880L2868l5711
$$ 81764 125820 128516 98927 120345 109199 112428 107676 96246 79374 78793 87673 120541 84830
2231H4830k3919L3312J9795K6955J799l7419k2040j3769P372k3106L6537M1188
$$ 84830 60911 94223 114018 140973 142772 105353 83313 69544 76916 53810 90347 131535
2219A31535L5238n1790k4697O661M6416L8k0207N318J9846J2410K9086l6361l6167
$$ 131535 166773 114983 90286 96947 143363 143401 123194 128512 148358 160768 189854 153493 117326
2206A17326l2388O8696J3233J7766p970l8161O409k4511J8189k83K2178L867l1073
$$ 117326 84938 153634 166867 184633 176663 138502 144911 120400 138589 138306 160484 164351 133278
2193A33278L1120P400j4129k0087L395O5250j2212l2474M374L148j8423o285k6300
$$ 133278 164398 171798 157669 137582 140977 206227 194015 161541 165915 169063 150640 144355 118055
2180A18055J2713K5841j0485q017K7308J2694n1201K003O9047l7846N5415j6645
$$ 118055 130768 156609 146124 138107 165415 178109 126908 128911 197958 160112 215527 198882
2168A98882j4068q758K2027j2295m907K5743k6566L3740J0462J5008J9973k9745
$$ 198882 184814 176056 198083 185788 180881 206624 180058 213798 224260 239268 259241 229496
2156B29496K3189n7766L2886J9161K5269N618J1240j533l51l1178J8702M2333
$$ 229496 252685 194919 227805 246966 272235 277853 289093 287560 287209 256031 274733 317066
2144C17066J2467O4547n2187P259l8917r96k4063M1073M2450K4227J7853q972
$$ 317066 329533 394080 341893 349152 310235 309239 285176 326249 368699 392926 410779 401807
2132D01807J5508L6725m973J7151k8542k7513K5408K0894K0947K9993M9727k1526
$$ 401807 417315 454040 449067 466218 437676 410163 435571 456465 477412 507405 557132 535606
2120E35606k5905L1497J7057K2343l966J3514K940L2800k2730J1422O5715m029
$$ 535606 509701 541198 558255 580598 576632 590146 593086 625886 603156 614578 680293 676264
2108F76264J7637J265k6984M3662K8823P986J4069P613O0569L3571l0577r480
$$ 676264 693901 695166 668182 711844 740667 748653 762722 770335 830904 864475 833898 824418
2096H24418J7944J0952O9040K5875M6391N5213J9176J1840M7707L9185K5734K7365
$$ 824418 842362 853314 922354 948229 994620 1049833 1069009 1080849 1128556 1167741 1193475 1220840
2084A220840J8199J9953K7995N4973L3430J6648J02121Q4007R431M4910L9156
$$ 1220840 1239039 1258992 1286987 1341960 1375390 1392038 1494159 1578166 1587597 1632507 1671663
2073A671663M0464R1770J30197J08143P8787R1491J77895J75567J71376J60019
$$ 1671663 1712127 1803897 1934094 2042237 2121024 2212515 2390410 2565977 2737353 2897372
2063B897372J63041K23168K41494K26273K20153K79573L67638M13863M83975O02058
$$ 2897372 3060413 3283581 3525075 3751348 3971501 4251074 4618712 5032575 5516550 6118608
2053F118608O92660P36968R68843J330318J842267J991348J725012J047043J83727
$$ 6118608 6811268 7548236 8517079 9847397 11689664 13681012 15406024 16453067 16636794
2044A6636794p09425k369834k634534k168637j627235j091213q50549o76174n12364
$$ 16636794 15927369 13557535 10923001 8754364 7127129 6035916 5185367 4509193 3996829
2035C996829m13666k97213k37935k18394j56328k18773j87618j77476j52925j82400
$$ 3996829 3583163 3285950 3048015 2829621 2673293 2454520 2266902 2089426 1936501 1754101
2025A754101j14691j45227q6942p5157m5026o5569p2383q0961r2182l1462j2618
$$ 1754101 1639410 1494183 1407241 1332084 1287058 1221489 1149106 1068145 975963 944501 931883
2014I31883k9126q5597m3730j6957l4863m4994m8837k4560n9573M224O659K7650
$$ 931883 902757 817160 773430 756473 721610 676616 627779 603219 543646 547870 554529 582179
2002E82179L1326j65n1613p8624m4385q878J3918J0450m3527k0679k2372O515
$$ 582179 613505 613340 561727 483103 438718 429840 443758 454208 410681 390002 367630 374145
1990C74145J3955k3520m919l2320J009k9722k9094J7617L794l3431L9937o762
$$ 374145 388100 364580 359661 327341 328350 298628 269534 287151 290945 257514 297451 290689
1978B90689k7416J0253j2803J6445k1081O795L8310l804m7022q099l0065J3009
$$ 290689 263273 273526 260723 277168 256087 262882 301192 297388 250366 242267 212202 225211
1966B25211k9451l0843m9733M2167M991M0918J634l9669k4325j9716j3134k7838
$$ 225211 195760 164917 115184 157351 162342 203260 204894 165225 140900 121184 108050 80212
1954H0212K3353K8962K0939o280L215o823J0186q351J2263k0737K072j8891J4653
$$ 80212 103565 132527 153466 147186 150401 143578 153764 145413 157676 136939 139011 120120 134773
1941A34773m5669k4082J6823l308L0453K0312k479m53j2059M0215k2816r1852
$$ 134773 89104 65022 81845 78537 108990 129302 126823 126370 114311 154526 131710 39858
1929C9858p063L5385r506k0445K6757M112m2802j1164L6084K4799k3304J5177
$$ 39858 32795 68180 58674 38229 64986 69098 26296 15132 51216 76015 52711 67888
1917F7888j583j7325M0192O419k5294R342j3690k8252Q918p600m495P6345J0620
$$ 67888 66305 48980 89172 95591 70297 79639 65949 37697 46615 39015 34520 110865 121485
1904A21485o4881J5148l000K813J3985k0583j9378k17j6877l386m627J0827K4725
$$ 121485 56604 71752 68752 71565 85550 64967 45589 45372 28495 25109 20482 31309 56034
1891E6034J9595n2705n520k555J4856L7245m8721L5434k6891J8608k9678K9085
$$ 56034 75629 22924 17404 14849 29705 66950 18229 53663 26772 45380 15702 44787
1879D4787K2182J4058l5510k8875O366j1604p326J6715N62N057O820n0027N6399
$$ 44787 66969 81027 45517 16642 23008 11404 4078 20793 21355 26412 33232 -16795 39604
1866C9604M8792n3797J3047K707p17K8761o4632L919K0581O45l8146L3528M3400
$$ 39604 88396 34599 47646 50353 49636 78397 13765 17684 38265 38910 764 34292 77692
1853G7692j0488j5976j0504p7j5430N120l2743J0829K8384j1702n34N087m0316
$$ 77692 67204 51228 40724 40647 25217 30337 -2406 8423 36807 25105 24571 29658 -10658
1840a0658n5480M1339j0609M1065N3021k7568l8149j8513q59L2686k3928m0925
$$ -10658 -66138 -24799 -35408 5657 58678 31110 -7039 -25552 -26411 6275 -17653 -58578
1828e8578L6634N6356K076J546k1942l054M1527q272j6541J395l5316J6868o964
$$ -58578 -21944 34412 36488 38034 16092 13038 54565 46293 29752 31147 -4169 12699 5735
1815E735K0447K8317J463j9086l2311J1859k9757j7015N0509k3439J9277j2636
$$ 5735 26182 54499 55962 36876 4565 16424 -13333 -30348 20161 -3278 15999 3363
1803C363j4257O775K962k142k972L1442k9418K0320m651L0238l677m1316k4823
$$ 3363 -10894 -4119 -1157 -3299 -6271 25171 -4247 16073 11422 41660 37983 -3333 -28156
1790b8156K2783K0173k9905j1983M3642m759L0686j6550k2646j4803J479N6654
$$ -28156 -5373 14800 -15105 -27088 16554 11795 42481 25931 3285 -11518 -10039 46615
1778D6615N6137K0909r212J5853l012k2887n8950K395q587j7523J0625l2632M635
$$ 46615 102752 123661 114449 130302 127290 104403 45453 47848 39261 21738 32363 -269 4366
1765D366M493r908K207L1840l3195n3550J283L6989j5947J8054M3538K9438j1148
$$ 4366 8859 -1049 1158 32998 -197 -53747 -52464 -15475 -31422 -13368 30170 59608 48460
1752D8460k23r778k3018Q888j2958J1369k8019o030n3804Q140M089q323O730L8764
$$ 48460 48237 38459 15441 24329 11371 22740 -5279 -11309 -65113 -56973 -52884 -61207 -54477 -15713
1738a5713L8635r349N212Q358k2813K1049k1782k5318k3431O5947J6823k7876
$$ -15713 22922 13573 18785 27143 4330 25379 3597 -21721 -45152 20795 37618 9742
1726I742l242l4053l0105J1537M9225L1855k6800J0921M6523n7000j7038O258
$$ 9742 6500 -27553 -57658 -46121 3104 34959 8159 19080 65603 8603 -8435 -2177
1714b177k9445K4644L2907p759l839m7129K89O643n3228L4058M7158M7739L5044
$$ -2177 -31622 -6978 25929 18170 14331 -32798 -32509 -25866 -79094 -45036 2122 49861 84905
1701H4905k6034j9065j5513K3362k9724N379J4788k0854j9681l7386J6794M8192
$$ 84905 58871 39806 24293 47655 17931 23310 38098 17244 -2437 -39823 -23029 25163
1689B5163k3240j739K3052p979r7350K357P9171j544j9568J132k8076K0914M9248
$$ 25163 1923 184 23236 15257 -82093 -79736 -565 -2109 -21677 -20545 -48621 -27707 21541
1676B1541m3841j9764K4459l001L2561K8901k5924k8910J3152M810p3689j3953
$$ 21541 -22300 -42064 -17605 -20606 11955 40856 14932 -13978 -826 3984 -69705 -83658
1664h3658N3302p047M2960m9169L1575K0338l1087K925K0204M322K2980k2906
$$ -83658 -30356 -37403 5557 -43612 -12037 8301 -22786 -19861 343 4665 27645 4739
1652D739j6463K987j3615J0522J7061j5039J2667L3315l9868o0188j4251L0009
$$ 4739 -11724 -8737 -22352 -11830 5231 -9808 2859 36174 -3694 -63882 -78133 -48124
1640d8124r577J4973k9372L4295M3936M1983k2097K5244k9660k1017r119j8484
$$ -48124 -57701 -42728 -72100 -37805 6131 48114 26017 51261 21601 584 -8535 -27019
1628b7019j1100j1329K7325L2705Q834k3744K1467K2619k3519o1267q19J0536
$$ -27019 -38119 -49448 -22123 10582 19416 -4328 17139 39758 16239 -45028 -45847 -35311
1616c5311j5811O3355J5918k1033K6472j9065j6760J0738k9341J5878P854j9011
$$ -35311 -51122 12233 28151 7118 33590 14525 -2235 8503 -20838 -4960 2894 -16117
1604a6117L9003l2038l6107K7136N485l7607k3866m328k24N5871K4278K256J4107
$$ -16117 22886 -9152 -45259 -18123 -12638 -50245 -74111 -78439 -78663 -22792 1486 3742 17849
1591A7849j9891j3206K037j2504J656l9186R317N2887J6991l935K4935L285k0465
$$ 17849 -2042 -15248 -13211 -25715 -24059 -63245 -53928 -1041 15950 12015 36950 40235 19770
1578A9770l9765j3034j5082k0401M1480M5130m135j441n1754K7265J7807q205
$$ 19770 -19995 -33029 -48111 -68512 -27032 18098 13963 12522 -39232 -11967 5840 -2365
1566b365j2732k469K7066k1871q481k3216R901j7717j643O3800J2586l6040n030
$$ -2365 -15097 -17566 9500 -12371 -20852 -44068 -34167 -51884 -53527 10273 22859 -13181 -18211
1553a8211n8901l5221L1039P9608o154o845k1072r936q947N4772L8580R885j9294
$$ -18211 -77112 -112333 -81294 -1686 -7840 -14685 -35757 -45693 -54640 132 38712 48597 29303
1540B9303J02l1042l0649J0877n89J9771J0765L8705k300j4514n7938L7000J4103
$$ 29303 29405 -1637 -32286 -21409 -21998 -2227 8538 47243 44943 30429 -27509 9491 23594
1527B3594L544r369K4045l9387k5742J7118L6786N919k8063n871K2161k52l1637
$$ 23594 27138 17769 41814 2427 -23315 -6197 30589 36508 8445 2574 24735 24483 -7154
1514g154J7256m4139l8875J432k64L0146J8505j9583N9743j1587p93j5576l8921
$$ -7154 10102 -34037 -72912 -71480 -71744 -41598 -23093 -42676 17067 5480 4687 -10889 -49810
1501d9810m198L049J5826O0041M467n0786J1612j2503J7101j0262p382N765N674
$$ -49810 -54008 -50959 -35133 24908 29375 -21411 -9799 -22302 -5201 -15463 -22845 -17080 -11406
1488a1406M041j0966m6001j3165O5423j762m514K4518K3876l9208M207m8379K4838
$$ -11406 -7365 -18331 -64332 -77497 -12074 -13836 -18350 6168 30044 -9164 -4957 -53336 -28498
1475b8498K1930j1123M440p528N3258k1283m0701l4827L0026R750m227L2054m1849
$$ -28498 -6568 -17691 -13251 -20779 32479 11196 -29505 -64332 -34306 -24556 -28783 3271 -38578
1462c8578m3051r970M0884k750K2098j3812j7621J6600J4242j1262k8141j5315
$$ -38578 -81629 -91599 -50715 -53465 -31367 -45179 -62800 -46200 -31958 -43220 -71361 -86676
1450h6676J3999K7278L1838l539l4277n738l266r94L9504J7656j6491l524P876
$$ -86676 -72677 -45399 -13561 -17100 -51377 -57115 -60381 -61375 -21871 -4215 -20706 -24230 -16354
1437a6354k6248k5010J6878p503N430M0292j1915J648j7321q384L8686p499R466
$$ -16354 -42602 -67612 -50734 -58237 -52807 -12515 -24430 -22782 -40103 -48487 -9801 -17300 -7834
1424g834j6178J5680j1711k3287j9819J1729K6253M8778K7073j0484l9143k7477
$$ -7834 -24012 -8332 -20043 -43330 -63149 -51420 -25167 23611 50684 40200 1057 -26420
1412b6420L3184M7471o0816l7434m952Q498K5210J5530P129q725J205L3888j3941
$$ -26420 6764 54235 -6581 -44015 -48967 -40469 -15259 271 7400 -1325 -120 33768 19827
1399A9827l9930K6456N564O596l3k0608P513m0380K7167m5388q81N6984M048L0094
$$ 19827 -20103 6353 11917 18513 18480 -2128 5385 -34995 -7828 -53216 -54097 2887 6935 37029
1385C7029o9503l9059K1728J5189k7872K8304K6465J6983J2964j4443k7822m3452
$$ 37029 -32474 -71533 -49805 -34616 -62488 -34184 -7719 9264 22228 7785 -20037 -63489
1373f3489K397J3846P3927l5846l2838J8075k8079j9309R681L0603L7248j4177
$$ -63489 -61092 -47246 26681 -9165 -42003 -23928 -52007 -71316 -61635 -31032 6216 -7961
1361g961k5788l0508J3956M4044r90j4504J7682J6668j6111k3905L5537J202j1959
$$ -7961 -33749 -64257 -50301 -6257 -7247 -21751 -4069 12599 -3512 -27417 8120 9322 -2637
1348b637l4027L2127K907j2919P203m4794j594L7340N7547k5780n4800L7879j0399
$$ -2637 -36664 -4537 -1630 -14549 -7346 -52140 -53734 -16394 41153 15373 -39427 -1548 -11947
1335a1947l6069O092J9367J9040l1082j714K0866L2740j6140K5833J2759n9700
$$ -11947 -48016 -41924 -22557 -3517 -34599 -36313 -15447 17293 1153 26986 39745 -19955
1323a9955j4207J4791k5280L6672j0746l3952J778J9235r480K85J9584j185j6872
$$ -19955 -34162 -19371 -44651 -7979 -18725 -52677 -50899 -31664 -41144 -40859 -21275 -22460 -39332
1310c9332l662n777k01r190K091M4702j9656j7405N0469j3186M8161m8222J4502
$$ -39332 -42994 -48771 -48972 -58162 -56071 -11369 -31025 -48430 2039 -11147 37014 -11208 3294
1297C294J9835K0145m6638k5647J3404q629j376J7516m1139o853N2073j0499l0304
$$ 3294 23129 43274 -3364 -29011 -15607 -24236 -25612 -8096 -49235 -56088 -4015 -14514 -44818
1284d4818j110p596M5702n860j5447p315L3475j2467l1Q896j268M2773p0387m0712
$$ -44818 -45928 -53524 -7822 -13682 -29129 -36444 -2969 -15436 -15467 -6571 -7839 34934 -35453 -76165
1270g6165K9246L1087J283K6521l6476L9654m0658J8171L5030J4091k9335m7992
$$ -76165 -46919 -15832 -14549 11972 -24504 15150 -25508 -7337 27693 41784 12449 -35543
1258c5543K2233j8838k462l5338N0348R641p3734O0746q322P74k7407K2032J446
$$ -35543 -13310 -32148 -34610 -69948 -19600 -9959 -83693 -22947 -31269 -30495 -57902 -35870 -34424
1245c4424j3462L3988L0017j3178j1283o434K2982L137J2762n442K2913j0520
$$ -34424 -47886 -13898 16119 2941 -8342 -14776 8206 11343 24105 18663 41576 31056
1233C1056j1285J2406o9364J8408M068j7351J2290j739J6651k1676j5975l214
$$ 31056 19771 32177 -37187 -18779 -14711 -32062 -19772 -21511 -4860 -26536 -42511 -45725
1221d5725m6586k7694Q9182R525l6534J245K7000K391j500k2780J9801K8717l7343
$$ -45725 -92311 -120005 -30823 -21298 -57832 -56587 -29587 -27196 -28696 -51476 -31675 -2958 -40301
1208d0301O124l616r724L4433O0242l7083l806j4068J1438J5481P702k3637l4882
$$ -40301 -34177 -37793 -47517 -13084 47158 10075 6269 -7799 3639 19120 26822 3185 -31697
1195c1697K0524K8571k6601n9171J6727M6745q728o313J0364p027L285M2756j3357
$$ -31697 -11173 17398 -9203 -68374 -51647 -4902 -13630 -19943 -9579 -16606 -13321 29435 16078
1182A6078o421j9220j2331J1690k5355J09614N0366n3543m5235k5142k303QO674
$$ 16078 9657 -9563 -21894 -10204 -35559 74055 124421 70878 25643 501 -1802 -1794 4880
1169D880M732J9528R778q502k8648m4810k5107j1921Q491L9412l931M602l3636
$$ 4880 9612 29140 38918 30416 1768 -43042 -68149 -80070 -71579 -32167 -36098 -31496 -65132
1156f5132J1779N6357m7479J8386J5686j7590k4746L7830K771j5183J4031l2510
$$ -65132 -53353 3004 -44475 -26089 -10403 -27993 -52739 -14909 -12138 -27321 -13290 -45800
1144d5800m664O933L6937m2067M8169K0140O397m6092l509K0900m0764K2615J5270
$$ -45800 -50464 -43531 -6594 -48661 -492 19648 26045 -20047 -23556 -2656 -43420 -20805 -5535
1131e535j8490l3951O1542K8728K4262l3511J9246m4989J2062J15k1546J9490
$$ -5535 -24025 -57976 3566 32294 56556 23045 42291 -2698 9364 9479 -12067 7423
1119G423L2436j3717l6065K2461l8529K5060n3114M2247K0959j806k7988n5397
$$ 7423 39859 26142 -9923 12538 -25991 -931 -54045 -11798 9161 7355 -20633 -76030
1107g6030N9968L503j5595R883k671q353j6459Q117L7894L8715j7026m1189l4595
$$ -76030 -16062 -12559 -28154 -18271 -20942 -29295 -45754 -37637 257 38972 21946 -19243 -53838
1094e3838K6143J101J8111j1771K0845l2855P34K4581j9037N7135l1156o0311
$$ -53838 -27695 -26594 -8483 -20254 591 -32264 -31530 -6949 -25986 31149 -7 -60318
1082f0318J9050K4000m9453L765K9655j8624O8355n153l239l7742j8353L1971
$$ -60318 -41268 -17268 -66721 -62956 -33301 -51925 16430 11277 8038 -29704 -48057 -16086
1070a6086K7951J1315n7400J5280L927j6786K4271k0128n3873L1176J1035K1597
$$ -16086 11865 23180 -34220 -18940 -15013 -31799 -7528 -27656 -81529 -50353 -39318 -17721
1058a7721k2133N639j7941k86M6858q106j0560J954R249l9863p674L4478n0933
$$ -17721 -39854 -34215 -52156 -52442 -5584 -13690 -24250 -22296 -13047 -52910 -60584 -26106 -77039
1045g7039p538K4161M8676J057K9408k88l0380M9148j4342l57m131j815k8591
$$ -77039 -84577 -60416 -11740 -10683 18725 18437 -11943 37205 22863 22506 18375 16560 -12031
1032a2031n6257M4512J4596m152L742k2593M3136n6426n1287L5967p344N9396
$$ -12031 -68288 -23776 -9180 -13332 -9590 -32183 10953 -45473 -96760 -60793 -68137 -8741
1020h741J518l1584J7671r94j8924L9115m608j8959M027m7762K1954K1149r414
$$ -8741 -7223 -38807 -21136 -22130 -41054 -1939 -6547 -25506 -21479 -69241 -47287 -26138 -35552
1007c5552j208K1435J5913j6126N9188R6m7267r841R892L4242R010O352L858m129
$$ -35552 -36760 -15325 588 -15538 43650 43746 -3521 -13362 -3470 30772 39782 46134 49992 45863
993D5863k5448l4026j0697P284K992J420O755k9733j6639M502K3078j345L5387
$$ 45863 20415 -13611 -24308 -17024 -14032 -12612 -5857 -35590 -52229 -47727 -24649 -25994 9393
980I393L9620J328k1685k6169K0819K0336n0421j5448J8478l2100K2936j8731
$$ 9393 49013 50341 28656 2487 23306 43642 -6779 -22227 -3749 -35849 -12913 -31644
968c1644p068L5476P116l230j0007k598p451j120L3618k8723k179K5300L4279
$$ -31644 -38712 -3236 3880 650 -9357 -11955 -19406 -20526 13092 -15631 -17810 7490 41769
955D1769r759n5300j5988j1020N6818K4497k4767K9247j5710J425l777o7767O135
$$ 41769 32010 -23290 -39278 -50298 6520 31017 6250 35497 19787 21212 17435 -50332 -44197
942d4197K5710j0423K1181Q49l7959L2928R770J331N515r001r519k3002N601M87
$$ -44197 -18487 -28910 -7729 -6880 -44839 -11911 -2141 -810 4705 -4296 -13815 -36817 -31216 -30729
928c0729N741j9427K4517J7361n242J5923M1508k6773n435L017n1591r857L6340
$$ -30729 -24988 -44415 -19898 -2537 -7779 8144 49652 22879 17444 20461 -31130 -40987 -4647
915d647J376J1963k2382K0022J3395K634M1463n571o6798j2674j957J1162j042
$$ -4647 -3271 8692 -13690 6332 19727 22361 63824 58253 -8545 -21219 -23176 -12014 -13056
902a3056l2822P26j1366N3412M4781J624q1732J9988O659L8406J2392l4864J7488
$$ -13056 -45878 -45152 -56518 -3106 41675 43299 -38433 -18445 -11786 26620 39012 4148 21636
889B1636q916q74k6102l376K7082o337n135L866k7217o759L1072j5099L0559Q730
$$ 21636 12720 11846 -14256 -17632 9450 3113 -2022 1844 -25373 -32132 -1060 -16159 14400 23130
875B3130nm5796j8333M5978P0640n0159k1996j75k4162K4679M411l2751q886M1044
$$ 23130 23125 -22671 -41004 4974 75614 25455 3459 3284 -20878 3801 8212 -24539 -33425 7619
861G619q49J9476P104l6615n5364J8727m088L9673K3225K059k3768J6747l836
$$ 7619 6770 26246 33350 -3265 -58629 -39902 -43990 -4317 18908 20967 -2801 13946 10110
$$ [...]
##END NTUPLES=NMR SPECTRUM
##END=
