##TITLE=1H_CA-9031x1
 DMSO
 8 sc, 
 7.07.2022
##JCAMPDX= 6.0         $$ Bruker NMR JCAMP-DX V2.0
##DATA TYPE= NMR SPECTRUM
##DATA CLASS= NTUPLES
##ORIGIN= UXNMR, Bruker Analytische Messtechnik GmbH
##OWNER= root
$$ XWIN-NMR		Version 3.5
$$ Thu Jul  7 14:02:41 2022 Russian Standard Time (UT+4h)  she@DPX200
##.OBSERVE FREQUENCY= 200.1313499994
##.OBSERVE NUCLEUS= ^1H
##.ACQUISITION MODE= SIMULTANEOUS
##.ACQUISITION SCHEME= undefined
##.AVERAGES= 8
##.DIGITISER RES= 18
##SPECTROMETER/DATA SYSTEM= spect
##.PULSE SEQUENCE= zg30
##.SOLVENT NAME= DMSO
##.SHIFT REFERENCE= (INTERNAL, DMSO, 0, 15.7568)
##AUDIT TRAIL= $$ (NUMBER, WHEN, WHO, WHERE, WHAT)
$$ ##TITLE= Audit trail, XWIN-NMR		Version 3.5
$$ ##JCAMPDX= 5.01
$$ ##ORIGIN= Bruker BioSpin GmbH
$$ ##OWNER= she
$$ F:/spectra/data/she/nmr/H-F/1/pdata/1/auditp.txt
$$ ##AUDIT TRAIL=  $$ (NUMBER, WHEN, WHO, WHERE, WHAT)
(   1,<2022-07-07 14:01:35.82 +0400>,<she>,<DPX200>,
      <created by zg, POWCHK disabled, PULCHK disabled
       configuration hash MD5:
       00 E9 B6 7A A2 85 ED C7 34 08 36 98 17 FE 4E 26
       data hash MD5: 16K
       5A 71 E6 C4 A5 5F 47 25 07 2D 59 C2 D2 88 6B CA>)
(   2,<2022-07-07 14:01:38.28 +0400>,<she>,<DPX200>,
      <Start of raw data processing
       efp BC_mod = 2 LB = 0.24 FT_mod = 6 PKNL = 1 PHC0 = -18070.99 PHC1 = 27.40068 SI = 16K 
       data hash MD5: 16K
       C0 D1 03 4A FC 54 2B 46 E0 6B 39 E8 C0 CE 24 88>)
(   3,<2022-07-07 14:01:58.98 +0400>,<she>,<DPX200>,
      <pk PHC0 = 5.375315 PHC1 = -14.8 
       data hash MD5: 16K
       80 34 C4 E2 EC BE F5 E3 F7 69 93 41 39 75 73 13>)
(   4,<2022-07-07 14:02:02.14 +0400>,<she>,<DPX200>,
      <abs ABSG = 5 
       data hash MD5: 16K
       14 45 01 AA 1E 72 82 96 37 54 39 05 13 C4 83 9E>)
$$ ##END=
$$ 
$$ hash MD5
$$ D2 F0 71 D9 AB C7 0A 1D 04 DD 79 75 BD 09 63 1B
##$RELAX= 
##$RELAX= 
##$RELAX= 
##$RELAX= 
##$RELAX= 
##$RELAX= 
$$ Bruker specific parameters
$$ --------------------------
##$DU= <F:/spectra>
##$EXPNO= 1
##$NAME= <H-F>
##$PROCNO= 1
##$TYPE= <nmr>
##$USER= <she>
##$AMP= (0..31)
100 100 100 100 100 100 100 100 100 100 100 100 100 100 100 100 100 100 
100 100 100 100 100 100 100 100 100 100 100 100 100 100 
##$AQSEQ= 0
##$AQ_mod= 1
##$AUNM= <au_zg>
##$AUTOPOS= <>
##$BF1= 200.13
##$BF2= 200.13
##$BF3= 200.13
##$BF4= 200.13
##$BF5= 200.13
##$BF6= 200.13
##$BF7= 200.13
##$BF8= 200.13
##$BYTORDA= 1
##$CFDGTYP= 0
##$CFRGTYP= 5
##$CHEMSTR= <none>
##$CNST= (0..31)
1 1 145 1 1 1 1 1 1 1 1 1 1 1 1 1 1 1 1 1 1 1 1 1 1 1 1 1 1 1 1 1 
##$CPDPRG= <>
##$CPDPRG1= <>
##$CPDPRG2= <>
##$CPDPRG3= <>
##$CPDPRG4= <mlev>
##$CPDPRG5= <mlev>
##$CPDPRG6= <mlev>
##$CPDPRG7= <mlev>
##$CPDPRG8= <mlev>
##$CPDPRGB= <>
##$CPDPRGT= <>
##$D= (0..31)
0 1.2 0 0 0 0 0 0 0 0.06 0 0.03 0 0 0 0 0.0002 0 0 0 0 0 0 0 0 0 0 0 0 
0 0 0 
##$DATE= 1657188095
##$DBL= (0..7)
120 120 120 120 120 120 120 120 
##$DBP= (0..7)
150 150 150 150 150 150 150 150 
##$DBP07= 0
##$DBPNAM0= <>
##$DBPNAM1= <>
##$DBPNAM2= <>
##$DBPNAM3= <>
##$DBPNAM4= <>
$$ [...]
##$SUBNAM2= <"">
##$SUBNAM3= <"">
##$SUBNAM4= <"">
##$SUBNAM5= <"">
##$SUBNAM6= <"">
##$SUBNAM7= <"">
##$SUBNAM8= <"">
##$SUBNAM9= <"">
##$SW= 18.0517283424941
##$SWIBOX= (0..15)
0 0 2 0 0 0 0 0 0 0 0 0 0 0 0 0 
##$SW_h= 3612.71676300578
##$TD= 16384
##$TD0= 1
##$TE= 0
##$TE2= 300
##$TE3= 300
##$TEG= 300
##$TL= (0..7)
0 120 120 120 120 120 120 120 
##$TP= (0..7)
150 150 150 150 150 150 150 150 
##$TP07= 0
##$TPNAME0= <>
##$TPNAME1= <>
##$TPNAME2= <>
##$TPNAME3= <>
##$TPNAME4= <>
##$TPNAME5= <>
##$TPNAME6= <>
##$TPNAME7= <>
##$TPOAL= (0..7)
0.5 0.5 0.5 0.5 0.5 0.5 0.5 0.5 
##$TPOFFS= (0..7)
0 0 0 0 0 0 0 0 
##$TUNHIN= 0
##$TUNHOUT= 0
##$TUNXOUT= 0
##$USERA1= <user>
##$USERA2= <user>
##$USERA3= <user>
##$USERA4= <user>
##$USERA5= <user>
##$V9= 5
##$VALIST= <valist>
##$VCLIST= <CCCCCCCCCCCCCCC>
##$VD= 0
##$VDLIST= <DDDDDDDDDDDDDDD>
##$VPLIST= <PPPPPPPPPPPPPPP>
##$VTLIST= <TTTTTTTTTTTTTTT>
##$WBST= 1024
##$WBSW= 4
##$XGAIN= (0..3)
0 0 0 0 
##$XL= 0
##$YL= 0
##$YMAX_a= 188167
##$YMIN_a= -211814
##$ZGOPTNS= <>
##$ZL1= 120
##$ZL2= 120
##$ZL3= 120
##$ZL4= 120
##$ABSF1= 15.73918
##$ABSF2= -2.31267
##$ABSG= 5
##$ABSL= 3
##$ALPHA= 0
##$AQORDER= 0
##$ASSFAC= 0
##$ASSFACI= 0
##$ASSFACX= 0
##$ASSWID= 0
##$AUNMP= <proc_1d>
##$AZFE= 0.1
##$AZFW= 0.1
##$BCFW= 0
##$BC_mod= 2
##$BYTORDP= 0
##$COROFFS= 0
##$CY= -3
##$DATMOD= 1
##$DC= 0
##$DFILT= <>
##$DTYPP= 0
##$F1P= 0
##$F2P= 0
##$FCOR= 1
##$FTSIZE= 16384
##$FT_mod= 6
##$GAMMA= 0
##$GB= 0
##$INTBC= 1
##$INTSCL= 0
##$ISEN= 128
##$LB= 0.24
##$LEV0= 0
##$LPBIN= 0
##$MAXI= 10000
##$MC2= 0
##$MEAN= 0
##$ME_mod= 0
##$MI= 1.114404
##$NCOEF= 0
##$NC_proc= -8
##$NLEV= 6
##$NOISF1= 3.799351
##$NOISF2= 2.8
##$NSP= 0
##$NTH_PI= 0
##$NZP= 0
##$OFFSET= 15.75681
##$PC= 1
##$PHC0= -18065.62
##$PHC1= 12.60068
##$PH_mod= 1
##$PKNL= yes
##$PPARMOD= 0
##$PSCAL= 0
##$PSIGN= 0
##$REVERSE= no
##$SF= 200.130002948843
##$SI= 16384
##$SIGF1= 3
##$SIGF2= 2
##$SINO= 5.538805
##$SIOLD= 16384
##$SREGLST= <1H.CDCl3>
##$SSB= 0
##$STSI= 16384
##$STSR= 0
##$SW_p= 3612.71676300578
##$SYMM= 0
##$S_DEV= 0
##$TDeff= 16384
##$TDoff= 0
##$TI= <>
##$TILT= no
##$TM1= 0
##$TM2= 0
##$TOPLEV= 0
##$USERP1= <user>
##$USERP2= <user>
##$USERP3= <user>
##$USERP4= <user>
##$USERP5= <user>
##$WDW= 1
##$XDIM= 16384
##$YMAX_p= 389161968
##$YMIN_p= -1583748
$$ End of Bruker specific parameters
$$ ---------------------------------
##NTUPLES= NMR SPECTRUM
##VAR_NAME=  FREQUENCY,     SPECTRUM/REAL,   SPECTRUM/IMAG
##SYMBOL=    X,             R,               I
##VAR_TYPE=  INDEPENDENT,   DEPENDENT,       DEPENDENT
##VAR_FORM=  AFFN,          ASDF,            ASDF
##VAR_DIM=   16384,         16384,           16384
##UNITS=     HZ,            ARBITRARY UNITS, ARBITRARY UNITS
##FACTOR=    0.220516191357247, 1,           1
##FIRST=     3153.41046944753, 0,            0
##LAST=      -459.306293558251, 0,           0
##MIN=       -459.306293558251, -1583748,    0
##MAX=       3153.41046944753, 389161968,    0
$$ Real data points
##PAGE= N=1
##DATA TABLE= (X++(R..R)), XYDATA
$$ [...]
6787H59087J93475j7956o3888p8008Q2838j28194j86779L49911K93206l88254
6777I15438k94323J84767k56000K31561J26656j2843L70779k13389m8640j05618
6767H98388J56076L10087l62284j30723J51169K05715l23711n13018j14126J69399
6757D46972P03932L3314k76615l01065N5720j95139K72482L16514n1877l37447
6747F66791K2313j28226l62864O77335j48757k69098K78981l22598j03475j40450
6737A69952J21951J59937K60749N0334p7915k1638L0596J37559k07771J67561
6727G91315j38655j93275R3683L22188m60468l8190O3326O4489j21282J21915
6717E05046p7271j68431K74992k1529K21914n25837r6400L88710k30009L5057
$$ y = [859087, 1052562, 1034606, 970718, 892710, 975548, 847354, 660575, 1010486, 1303692, 915438, 621115, 805882, 549882, 781443, 908099, 895256, 1266035, 1052646, 1004006, 898388, 1054464, 1364551, 1002267, 871544, 1022713, 1228428, 904717, 391699, 277573, 446972, 1150904, 1184218, 907603, 606538, 662258, 467119, 739601, 1056115, 1004238, 666791, 689104, 560878, 198014, 875349, 726592, 457494, 736475, 413877, 310402, 169952, 291903, 451840, 712589, 762923, 685008, 663370, 693966, 831525, 623754, 791315, 652660, 459385, 553068, 875256, 414788, 376598, 439924, 504413, 383131, 505046, 427775, 259344, 534336, 512807, 734721, 208884, 112484, 501194, 271185, 306242]
6707C06242J99770K41855l32503o1214J86832L6192j65420l14910K28826j90664
6697A35006l72733N46331J34865j7614k11588P7271R7857j96014L1635n7774L92074
6686E59316j55010l17114L12257J52012L18359l41199m12756j4078J38069j31693
6676A08163k1567J42350j38412k83997k51325L39185J23460l6391K27160O9813
6666B78439l0875m141n3663Q2713q781j06431J68334P0421J45500N1688l53125
6655B40079l3080m240J035l621k05909j62787R6522k8246L21412k5854l33996
6644a38685J32665l74493q8433K30320N18375o2416Q9574r5327J57146k8366j19444
6633B20916O7176L0077J64957m42107J28414k8880L23032k57908l03625K76443
$$ y = [306242, 506012, 747867, 415364, 354150, 540982, 577174, 411754, 96844, 325670, 135006, -237727, 308604, 443469, 425855, 214267, 291538, 389395, 193381, 225016, 167242, 559316, 404306, 87192, 399449, 551461, 869820, 528621, 115865, 101787, 239856, 108163, 86596, 228946, 90534, -193463, -444788, -105603, 17857, -18534, 208626, 278439, 247564, 243423, 189760, 272473, 263692, 157261, 325595, 396016, 541516, 593204, 240079, 206999, 202759, 203794, 200173, -5736, -168523, -72001, -100247, 221165, 195311, -138685, -6020, -380513, -468946, -238626, 279749, 217333, 306907, 211580, 368726, 340360, 220916, 288092, 318169, 483126, 41019, 169433, 140553, 463585, 205677, -97948, 178495]
6623A78495j38963j01765O9870m04845L22834O3720m5809l17330O4083K79702
6613c0008K3173J23003k58343k00529J41423J76576j1928j43297N3669K5378j67823
6602b68706R7126J40968R7415J08084j49019L5245k879P6436k01869j39110L53577
6591A47268J58791n06938M9806J80913R619Q023l07560M94433k4401j90611J12890
6580A32233Q5972k66221m84704M10228K11991J1916l9286K18229k85543m1520
6570d6705J16767m5084n3557J47386N01839n67874k76489Q9887J07528k217J55313
6559A26794j66376j99856K26060J0779R5815P6117k42994K07407N3709K84142
6549D71597k74404m46388J83741J89292j43562j25331J51078k57715j10817M97129
$$ y = [178495, 39532, -62233, 7637, -397208, -74374, -10654, -56463, -373793, -309710, -30008, -6835, 116168, -142175, -342704, -201281, -24705, -36633, -179930, -126261, -100883, -268706, -171580, -30612, 66803, 174887, 25868, 61113, 58234, 134670, -67199, -206309, 147268, 306059, -200879, -151073, 29840, 39459, 47482, -260078, 234355, 209954, 19343, 132233, 218205, -48016, -532720, -122492, 89499, 101415, 62129, 280358, -5185, -46705, 70062, 24978, -28579, 118807, 620646, 52772, -223717, -133830, -26302, -28519, 126794, -39582, -239438, -13378, -2599, 93216, 169333, -73661, 133746, 187455, 471597, 197193, -249195, -65454, 123838, -19724, -145055, 6023, -251692, -362509, 134620]
6539A34620K38388M2541l56133J65363j97973j51357L77578J19009J60064k08071
6529C24029k14024K8006L6569k66604j06029l3708l73317M1678L18651J46235
6519i8514j44472q6401r4828J80202p2578j5409M89099q3673K883j80564O7831
6508c6424k34716O5686K39707k3540m23965N10504j5938j40566L49397k87403
6498B742k54752j02119J1745q2343L5781N6482p084o4287J46509n5639R6700J81789
6486c4476j58775p5068P2959j1524M1736j03344O9333J2340J01826j24297n2524
6475b61814p097k72984M9917M8377k65783J4462M00978J84324j88799K42545j5599
6464g1473n344m7055k01642m0009K74243P3081o996l62018J49541J64385J03023
$$ y = [134620, 373008, 415549, 59416, 224779, 26806, -124551, 253027, 372036, 532100, 324029, 110005, 138011, 174580, -92024, -198053, -231761, -605078, -563400, -244749, -98514, -242986, -329387, -424215, -244013, -316591, -332000, 157099, 73426, 76309, -104255, -36424, -271140, -205454, 34253, 10713, -413252, 97252, 81314, -59252, 290145, 2742, -252010, -354129, -342384, -424727, -388946, -332464, -339548, -403835, -257326, -312965, -216265, -34476, -193251, -268319, -195360, -206884, -165148, -268492, -199159, -186819, -84993, -209290, -261814, -268911, -541895, -491978, -443601, -709384, -694922, -293944, -109620, -298419, -55874, -71473, -76817, -123872, -325514, -365523, -91280, -18199, -25195, -387213, -237672, -73287, 29736]
6453B9736j36649Q0126m02611M0706P7735l59548M20638J94803P1370K9232o5403
6442a9865k3000J25921j33402K97162l78017j91646R8263m7155o1465j3620P0559
6431b76265j60488M9644J07707l16929J79996l1092L18465P8289k86878M2633
6421b94918J36113J58544l01863J7063N4779j00072L01813O9249j34984m2836
6411a37112J6436m6118N4347K24308n69519n82304M79047M77044j7676R663N3197
6400c8687m15109J40535j09897p0196j10798J7182R3628J07853J21486j11065
6390c75068k18738J30925J11231l05911N8441j0821l4114J51604K17718n8836
6380c33569K5193K14383m5126J52713P2032j6744O5178k18877k73734J73066r7563
$$ y = [29736, -106913, -26787, -429398, -388692, -310957, -670505, -249867, -55064, 16306, 45538, -19865, -42865, 83056, -50346, 246816, -131201, -322847, -224584, -271739, -333204, -346824, -276265, -436753, -387109, -279402, -596331, -416335, -447427, -128962, -50673, -337551, -294918, -158805, -261, -302124, -285061, -230282, -330354, -28541, 40708, -94276, -137112, -120676, -166794, -112447, 111861, -457658, -1039962, -560915, -83871, -101547, -91884, -38687, -453796, -313261, -423158, -493354, -604152, -586970, -493342, -385489, -264003, -375068, -593806, -462881, -351650, -657561, -599120, -609941, -644055, -492451, -274733, -333569, -308376, -93993, -139119, 13594, 85626, 68882, 134060, -84817, -358551, -185485, -283048]
6369b83048J13614j15399l03727j10162R8684J40471r3412J5102J3290M79127
6359d5460K15169l18056L08304n9875m16207Q8828J82660l38109n3277K18876
6349b17147j41465p1150r3779o5081L39536R8219k0931P4284m99542Q8948K42411
6338b65697K74083o4212K4125k35665m6689K11161j34351k49996K66542j78648
6328c99347J87963M423m3508O5410k0829M7490k13643j01241K82247Q6500r6436
6317b00971K5155k8702j78297L22838j00516k23716n7642K14692l20515m98460
6307a046134Q6772J64660N70915r6606j6806L02435J25355j52967m59500Q0203
6297d41673k44804n0414K63257j5865K20415Q0450o0811j10704k274k3013j975
$$ y = [-283048, -169434, -284833, -588560, -698722, -600038, -459567, -552979, -537877, -524587, -45460, 169709, -148347, 159957, 100082, -316125, -227297, -44637, -382746, -436023, -217147, -358612, -429762, -523541, -588622, -249086, -150867, -171798, -97514, -597056, -508108, -265697, 8386, -55826, -31701, -267366, -314055, -102894, -237245, -487241, -220699, -399347, -211384, -206961, -250469, -185059, -205888, -158398, -372041, -473282, -191035, -104535, -200971, -175816, -204518, -382815, -59977, -160493, -384209, -441851, -227159, -547674, -1046134, -959362, -794702, -223787, -320393, -337199, -34764, 90591, -62376, -521876, -441673, -686477, -736891, -473634, -489499, -269084, -188634, -249445, -360149, -362423, -385436, -387411]
6286c87411K9686r1148N8355n65384L36548j76942r4170P73167o4289k23178J01597
6275c03169K68429l60178K1919Q6392L21878j21904K91289j11458j58125j4256
6265g9183j00746L67665j5171j61472M14831j07380l78907J39777j85528n9695
6255a65809k7081O9457j88859j74915M36482N6545R6863j28584J0387l49709J53147
6244b12076Q927K5866J52878Q4209J4666L60252n2958m55625J76089k49740j98936
6233c46448K494J43123r50j52429L38006K51777M9608q3268K83064k57233L7475
6222B65219J21909n36359j18293J830R1393L67819J68205J1259p2982j59219o9094
6211G1687j45600j27112O1037Q0818J7601r739P3756L670j5453k9088R655J25942
$$ y = [-387411, -357725, -448873, -390518, -955902, -619354, -796296, -890466, -117299, -181588, -404766, -303169, -34740, -394918, -372999, -286607, 35271, -86633, 204656, 93198, -64927, -79183, -179929, 187736, 172565, 11093, 425924, 318544, -60363, 79414, -106114, -165809, -192890, -123433, -312292, -487207, -50725, 5820, 102683, -25901, -15514, -365223, -212076, -203149, -177283, -24405, 59804, 74470, 434722, 381764, -73861, 102228, -147512, -346448, -343954, -200831, -201781, -354210, -16204, 235573, 285181, 201913, 484977, 227744, 265219, 387128, -149231, -267524, -265694, -174301, 193518, 361723, 372982, 300000, 140781, 71687, -73913, -201025, -139988, -59170, -41569, -51308, 22448, 26118, 10665, -18423, -8768, 117174]
6199A17174r0933J61365J96194k82341l56885j94436J67912j47058l9664J41373
6189c27299J31577K45644J08636J70797j5910k43524K55952j53903j61830j19828
6179a09688j3500L18360l96852L49041l45328k02247n32394P3567K89711M43707
6169a25623L06370K53389j85951k30578n5559j01752K09675j26028J03166J73692
6159B20801l14733J63463J03164J32036J39509l39149l1874k98174j35054K4742
6149c35269K23601N8974q7532p5116j04598l2717j39331J44905O9775J18976j14457
6138b72789J76524O0718m28157n4356N45577L9881J90156r8861l11275l16888
6128d69470N5266N8136O6457L67672n7398m53441N0949L72890j42998J379K68327
$$ y = [117174, 26241, 187606, 383800, 101459, -255426, -449862, -281950, -429008, -468672, -327299, -195722, 49922, 158558, 329355, 313445, 69921, 325873, 171970, 10140, -109688, -123188, 195172, -201680, 147361, -197967, -400214, -932608, -859041, -569330, -125623, 180747, 434136, 248185, 17607, -37952, -139704, 69971, -56057, 47109, 220801, -93932, 69531, 172695, 304731, 444240, 105091, 73217, -224957, -360011, -335269, -111668, -52694, -140226, -215342, -319940, -352657, -491988, -347083, -277308, -158332, -272789, -96265, -35547, -463704, -518060, 27517, 67398, 257554, 158693, -152582, -469470, -414204, -356068, -289611, 78061, 20663, -432778, -381829, -8939, -151937, -150558, 117769]
6117A17769m45789j01160K01323j63602J33993r9431k5495K2916k6573j45783
6107e31832K90243J96499j62750K62868j46983o9100J73714L37416l77068m66495
6097d93488K21787j07333M4819l21527J12075m8785n2879J22583M8902Q0898J26615
6086b66333R1419J46974k82889k49453K23574M34253m69896j02019m0809k6416
6076e41595l9740J20255k02201K79989L50111m3438o3390m9276l3749J14783r3523
6065b01774K69006Q5434l43469k50588J0205K26440J65410L0953J65948M4659
6055B02224K2083n04337O777L03088k07441j3332m1129Q0955J61621J29359r0853
6044D9015L6504j27435p827k6110J46000l01431j13733K00823K56277j89514k27580
$$ y = [117769, -328020, -429180, -227857, -391459, -257466, -356897, -382392, -359476, -386049, -531832, -241589, -45090, -207840, 55028, -91955, -161055, 12659, 350075, -26993, -493488, -271701, -379034, -334215, -655742, -543667, -592452, -645331, -522748, -473846, -392948, -266333, -174914, -27940, -310829, -560282, -336708, 97545, -372351, -474370, -515179, -541595, -581335, -461080, -663281, -383292, -33181, -76619, -140009, -189285, -223034, -108251, -201774, 67232, 152666, -190803, -441391, -431186, -204746, -39336, -8383, 157565, 202224, 224307, -280030, -273253, 29835, -177606, -190938, -232067, -151112, 10509, 139868, 49015, 85519, -41916, -49743, -75853, 70147, -231284, -345017, -144194, 112083, -77431, -305011]
6033c05011K60374k73199J3929R7483L45918l22473j943J16787N1139J77882n49804
6022c88918J2540L66235K03517k65130R0413r8239O0407N1703n35109K52280M15912
6011A65611K6459j59524P0093P8498n69088J17503M20248J69309l84381k36772
6001c02044J06665j96511L56114N2390q6413M21715j00839O6439j71309R2914
5991B39121j46742k54043L52345r9093M4525R0441l00750L00894K97424N4131
5981E78253q2197j20977R2865m8015K09248j19681j65312p8118j63563M88706
5971E91209q9503J51934N0388l01664q1439L86485k10357o3250l50904j1544J89884
5960B61239J29362l21219m0891K72139K09766J21580j36992j75220P4296K14623
$$ y = [-305011, -44637, -317836, -303907, -206424, 139494, -182979, -184922, -68135, -16996, 160886, -388918, -376378, -10143, 193374, -71756, 18657, -79582, -19175, 32528, -502581, -250301, 165611, 192070, 32546, 102639, 181137, -387951, -270448, 149800, 319109, -65272, -302044, -195379, -391890, -35776, 16614, -69799, 351916, 251077, 317516, 146207, 239121, 92379, -161664, 190681, 91588, 136113, 226554, -74196, 226698, 524122, 578253, 496056, 375079, 467944, 419929, 629177, 509496, 344184, 266066, 102503, 591209, 501706, 653640, 704028, 402364, 320925, 707410, 497053, 433803, 82899, 71355, 261239, 390601, 69382, 28491, 300630, 510396, 631976, 494984, 319764, 394060, 608683]
5950F08683m09530r5805J77141J36096J34197K98684J5412P4798o2463l47885
5940E29328j32438K41327L11R9266J22893M1780m5003l4440q2793k18807J75345
5929F96769j44612K9898M2581k0105j76864J01056J7043K50733K42682k78711
5919G60470k22795K50327k53001k18067K80801j4926j07644N6751J79877K5724
5909G37517n9292k51036M9905l24833N76108K25874j75291m8354m63910l67559
5899a00871N83127J70791l2946J23760k89077j34048L50031K45029k14180j28493
5889E73123L31867k81595j7765N71793n9788m66856j57678N266p8004J8217n797
5878D32783o8081O16115l37242j16026N36474K10472j52668q4115m01481k82638
$$ y = [608683, 199153, 103348, 280489, 416585, 550782, 849466, 864878, 939676, 877213, 529328, 396890, 638217, 638528, 737794, 860687, 902467, 857464, 823024, 740231, 521424, 696769, 552157, 582055, 624636, 604531, 427667, 528723, 545766, 796499, 1039181, 760470, 537675, 788002, 535001, 316934, 597735, 582809, 475165, 531916, 711793, 737517, 678225, 427189, 477094, 152261, 728369, 954243, 778952, 730598, 266688, -100871, 482256, 653047, 620101, 743861, 454784, 320736, 670767, 915796, 701616, 573123, 904990, 623395, 605630, 1177423, 1117635, 650779, 493101, 498367, 420363, 438580, 432783, 364702, 980817, 643575, 527549, 1064023, 1274495, 1121827, 1037712, 636231, 353593]
5868C53593O4848K18128K56959k06719K74124J66485k36994q3169O7429L0287
5858I04971l38408k974K66254j42817N8103j09289J6632J76574M20814n3628j63603
5847A032629J57358j58785k57479n0705R1469R8058p2702j93161L52618J01443
5837A100743J86488J67561l555p16475O4507L79659k85429j49426M00053J12708
5827A256834j71098q3090K83184K03506m86971k10235K38437N48093k2380R8354
5817A654634j97657l15930j53309J71099K28418k7631o353j67890m30651P577
5807G62307L34983L05125k25010k69281L96250P8863j09088l9813L45075q8830
5797A490581k66103K76761K96040J33730O9593l39829K6755R1041p8298M24160
$$ y = [353593, 418441, 636569, 893528, 686809, 960933, 1127418, 890424, 807255, 874684, 904971, 566563, 563589, 829843, 687026, 745129, 635840, 652472, 829046, 1249860, 1196232, 1032629, 1189987, 1031202, 773723, 723018, 814487, 912545, 839843, 646682, 999300, 1100743, 1287231, 1454792, 1451237, 734762, 799269, 1178928, 893499, 744073, 1144126, 1256834, 1085736, 1002646, 1285830, 1489336, 1002365, 792130, 1030567, 1578660, 1556280, 1654634, 1456977, 1141047, 987738, 1158837, 1387255, 1359624, 1353271, 1185381, 754730, 762307, 1097290, 1402415, 1177405, 908124, 1304374, 1383237, 1274149, 1234336, 1579411, 1490581, 1224478, 1501239, 1797279, 1931009, 2000602, 1660773, 1687528, 1778569, 1700271, 2124431]
5787B124431m75305Q0804o9745L5470L30487k16287J80669K6746j17370R3401
5777A993301k34144j83840K28409J8120J76629L4907k02514K39442j92428K04569
5767B082451J98413P6269J21915P65l58701J16677L66253n6339l67767M00751
5757B580687R511j68906j22082Q6591K9192J40400N15564R2796L630K9802j55117
5746C042068j16642K15964J29591j35433O1860L25540O4930N45220Q8615k83694
5736C938019N2274l70655L56704J30503K61245j14305J16004J29790l8614L14402
5726D775367K26458J95003m74668J04142J03358J48007O4353K74085J43392J02293
5716E661790J81521K76349K45351P1276R92K81624l4727l46710K5007L25265L14443
$$ y = [2124431, 1649126, 1729930, 1660185, 1695655, 2026142, 1809855, 1990524, 2017270, 1899900, 1993301, 1759157, 1575317, 1803726, 1821846, 1998475, 2033382, 1830868, 2070310, 1877882, 2082451, 2280864, 2357133, 2479048, 2479813, 2121112, 2237789, 2604042, 2547703, 2179936, 2580687, 2590198, 2421292, 2299210, 2385801, 2414993, 2555393, 3070957, 3163753, 3167383, 3197185, 3042068, 2925426, 3141390, 3270981, 3135548, 3197408, 3522948, 3587878, 4133098, 4221713, 3938019, 3990293, 3619638, 3976342, 4106845, 4368090, 4253785, 4369789, 4499579, 4460965, 4775367, 5001825, 5196828, 4722160, 4826302, 4929660, 5077667, 5142020, 5416105, 5559497, 5661790, 5843311, 6119660, 6365011, 6436287, 6437279, 6718903, 6684176, 6337466, 6362473, 6687738, 7002181]
5705G002181K31954N39050K61333p4155K959K01756o2080L38203M80951L10028
5695I232180j19204j44876N53385N54459K44640J61709L3816J87618M92450K78505
5685A1474682J39836N53838P98324J12208J28938P75427L47448J84500M83513
5676A4998714L41936M60441N35942N45333O62773O87635K40524O49700N70630
5667A9693628P18478O43143R62392R12951J188268P29452P71738J252602J512146
5658B8384798J204874J642056J471154J263519J598372J912200J827194J751083
5650D1055250K088018J918388K447674K063748J678493J897701J520213K075666
5642E6745151J780398J681959J188239P37511Q19582J066585Q22393P52898P46200
$$ y = [7002181, 7234135, 7773185, 8034518, 7960363, 7963322, 8165078, 8102998, 8441201, 8922152, 9232180, 9112976, 8968100, 9521485, 10075944, 10320584, 10482293, 10516109, 10703727, 11196177, 11474682, 11614518, 12168356, 12966680, 13078888, 13207826, 13983253, 14330701, 14515201, 14998714, 15340650, 15801091, 16337033, 16882366, 17545139, 18232774, 18473298, 19122998, 19693628, 20412106, 21055249, 22017641, 22930592, 24118860, 24848312, 25620050, 26872652, 28384798, 29589672, 31231728, 32702882, 33966401, 35564773, 37476973, 39304167, 41055250, 43143268, 45061656, 47509330, 49573078, 51251571, 53149272, 54669485, 56745151, 58525549, 60207508, 61395747, 62133258, 62952840, 64019425, 64841818, 65594716, 66340916]
5633F6340916R89223N57212L10090K75638L78069R63931M00707O84259M22822
5624G1322867J71970M53820K45121l063L44021L32400L75673k36151K55192L15001
5614G3576851k43525j26089k05474l74712j50712p6155m48287l50549l02976r55147
5604G0343225p00307o84926n03020m77425p65980o57495p49926q31173l93524
5595F4579449n99169q80997o77578r77941p09655p76852j029796j204672r91081
5586E6731708j122419j254697j702385j908297j496883j968190j973688k596371
5578D2708778k408290k178566j731032k188405j818306j486388j878356j785502
5570B7233933j543777j125561j483307j005616j064853j126969j106368n78601
$$ y = [66340916, 67330139, 67887351, 68197441, 68473079, 68851148, 69815079, 70215786, 70900045, 71322867, 71494837, 71948657, 72193778, 72190715, 72534736, 72867136, 73242809, 73006658, 73261850, 73576851, 73333326, 73207237, 73001763, 72627051, 72476339, 72400184, 71951897, 71601348, 71298372, 70343225, 69642918, 68957992, 68454972, 67977547, 67211567, 66554072, 65804146, 64972973, 64579449, 63980280, 63099283, 62421705, 61443764, 60734109, 59957257, 58927461, 57722789, 56731708, 55609289, 54354592, 52652207, 50743910, 49247027, 47278837, 45305149, 42708778, 40300488, 38121922, 36390890, 34202485, 32384179, 30897791, 29019435, 27233933, 25690156, 24564595, 23081288, 22075672, 21010819, 19883850, 18777482, 18198881]
5562A8198881n99606r04389m67961j039072o58775k79202p54107k02415J51488
5553A3444842q56179q85176p36811l73734j18870q42521l88538j26742l86470
5544H729801J39190m25972l85658l00603q6153j86633k76711p5083j41408j99086
5534F791684J78936r7201m13161k45671j85560l31378j05255q9254j19273k91370
5524E092497P0442J42691l08704j50311l05105N607j08026q8388l6620l8698M08228
5513D683613n81455n30669j660l10602J72860J56066j92189k54775o5417o487
5503C069285J21026J48570n1436r8037j17579k73648Q9025J5184J01880j04121
5493B900149K3224j93255j71638K24465j21681q1151k78629j98380L0254k6643
$$ y = [18198881, 17599275, 16694886, 16226925, 15187853, 14529078, 14249876, 13495769, 13293354, 13444842, 12588663, 11703487, 10966676, 10592942, 10474072, 9631551, 9243013, 9116271, 8729801, 8868991, 8443019, 8057361, 7756758, 7670605, 7483972, 7207261, 7132178, 6990770, 6791684, 6970620, 6873419, 6460258, 6214587, 6029027, 5697649, 5592394, 5503140, 5383867, 5092497, 5162939, 5305630, 4996926, 4846615, 4541510, 4547117, 4439091, 4350703, 4314083, 4275385, 4683613, 4102158, 3571489, 3569829, 3259227, 3432087, 3588153, 3395964, 3141189, 3075772, 3069285, 3190311, 3338881, 3287445, 3189408, 3071829, 2798181, 2887206, 2902390, 3004270, 2900149, 2923373, 2730118, 2558480, 2782945, 2661264, 2580113, 2301484, 2103104, 2133358, 2106715]
5483B106715K73150k66439K1342J21536j28634P0294j0417l8030o94581j5697
5473A439239L79449L3311K68059m72766k5108o0937j79002Q8877j89229J43536
5463A425429M9790k21724j9314j03182M71781J35837j84824k7053j39339J72662
5453A560063J20509J51160M9465n5314n29275j23362J46946J11234k67131K20556
5443A384851k3388n05079K91013j77983n9414l6392J36343L79729k66397l30812
5433G92471O2324j91772K36498K05058n857k52004q106J8097k9j03516K10590
5422I63754R2018r9093q9917L790o266l61052M3230P6729o6582j04717J20951
5411E72845K5247K52241j79241M6026J60824k91344K01215m4066k70789r5132
$$ y = [2106715, 2379865, 2113426, 2134768, 2256304, 2127670, 2197964, 2187547, 2149517, 1454936, 1439239, 1818688, 1851999, 2120058, 1647292, 1622184, 1561247, 1382245, 1471122, 1281893, 1425429, 1475219, 1253495, 1234181, 1130999, 1602780, 1738617, 1553793, 1526740, 1387401, 1560063, 1680572, 1831732, 1881197, 1825883, 1296608, 1173246, 1320192, 1431426, 1164295, 1384851, 1361463, 856384, 1147397, 969414, 910000, 873608, 1009951, 1389680, 1123283, 792471, 854795, 663023, 899521, 1104579, 1098722, 846718, 838612, 856709, 856680, 753164, 963754, 1055772, 956679, 866762, 870552, 864286, 503234, 546464, 623193, 556611, 451894, 572845, 598092, 850333, 671092, 717118, 877942, 586598, 787813, 743747, 472958, 377826]
5401C77826K39624k95776j84446K36307L81756k2235k22921r5203N25781j33179
5391H07534j55969M9702l34782K91692N6805k62346k06323K25281O15479m93600
5381E93473m17882j06196j83252L91439L28349j45768j35130L3094M4367J27489
5371E29983k98342J04223m391K02687L43878l1389k5341J89485j82814m14167
5361D13812j4150K86091K22241o8705p979l59029k9948r447J638J20487j62320
5350C92691K9064k73517K70807K08990k54823K31932R623k64109k11732J36287
5340B75213O8701k32715K97797L45947L7168j58982M98410k44998k56798q6870
5330E42873M91474l02890q3038K5951J33591k20221M7660J1439L0255J43572L09705
$$ y = [377826, 617450, 321674, 137228, 373535, 755291, 733056, 510135, 414932, 940713, 807534, 651565, 701267, 366485, 658177, 714982, 452636, 246313, 471594, 1087073, 593473, 175591, 69395, -113857, 277582, 605931, 460163, 325033, 358127, 402494, 529983, 231641, 335864, 331473, 534160, 878038, 846649, 821308, 1010793, 827979, 413812, 399662, 685753, 907994, 839289, 831310, 472281, 442333, 432886, 434524, 555011, 392691, 421755, 148238, 419045, 628035, 373212, 605144, 614767, 350658, 138926, 275213, 343914, 111199, 408996, 754943, 792111, 633129, 1131539, 886541, 629743, 542873, 1034347, 731457, 648419, 674370, 807961, 587740, 635400, 646839, 677094, 820666, 1130371]
5319A130371R1945l07646k9154j18325j47262J91799K06872k80464J42353j11939
5309G68550Q1169J75467K89813N8487m2160k53229j50729K25987l60318k20928
5299E72109L51202M75141k47725j29314j39554r0269l97232L35708M56670j86529
5289A000207k70854L51851l3638k93847L1190J43170K16516q5587Q116K18772
5279A285896R4074P4863k20672q5262J56229L8700K75875l07464K64141j76265
5269A400115j09766L1003M43974p8295l69983k09119N84339J13209j81900J56354
5259A779931M83642K5857K31551O7852m0914p6852n92402k49820L75143P0167
5249B074155l78624m22289K70798K28037J30959J70931Q765J52177l42976m00109
$$ y = [1130371, 1222316, 914670, 885516, 767191, 619929, 811728, 1018600, 738136, 880489, 768550, 849719, 1025186, 1314999, 1373486, 1331326, 1078097, 927368, 1153355, 793037, 572109, 923311, 1398452, 1150727, 1021413, 881859, 791590, 394358, 730066, 1186736, 1000207, 729353, 1081204, 1047566, 753719, 784909, 928079, 1144595, 1059008, 1067124, 1285896, 1379970, 1454833, 1234161, 1148899, 1305128, 1343828, 1619703, 1312239, 1576380, 1400115, 1290349, 1321352, 1765326, 1687031, 1317048, 1107929, 1692268, 1805477, 1623577, 1779931, 2263573, 2289430, 2520981, 2588833, 2547919, 2471067, 1878665, 1628845, 2003988, 2074155, 1695531, 1273242, 1544040, 1772077, 1903036, 2073967, 2082732, 2234909, 1891933, 1491824]
5239A491824M7827J35229J93722j00675M72178J12160j76553J3961M01079K81036
5229B871788k21913M78477J47369m8576M52601k74513j00419j60003k12755m16954
5219B515102k69562j25963j27215m6720k94085L03206k3457Q9105M51279j01382
5209B370308j08045p7384m5902M5509R7289K20738Q24L10746l20095J03209N30672
5198C127869M26993o075M81517J09926j54293N30625j58225l04148l21594j67978
5188C564617K7051M7585l25574j34367J04253j24269K63702Q6699K58157q6285
5178C681569M08433L06006J20326L21562K28539M13846q1900M50514O33474L60343
5168F842712M63245K41707K34961N48908P38543J05394Q63677M06556M15135L82841
$$ y = [1491824, 1539651, 1674880, 1868602, 1767927, 2240105, 2352265, 2175712, 2189673, 2590752, 2871788, 2649875, 3128352, 3275721, 3227145, 3679746, 3405233, 3304814, 3144811, 2932056, 2515102, 2245540, 2119577, 1992362, 1945642, 1651557, 1954763, 1931306, 2020411, 2471690, 2370308, 2262263, 2184879, 2138977, 2184486, 2281775, 2502513, 2503337, 2814083, 2493988, 2597197, 3127869, 3554862, 3548787, 4030304, 4140230, 3985937, 4516562, 4358337, 4054189, 3732595, 3564617, 3591668, 3639253, 3313679, 3179312, 3283565, 3159296, 3422998, 3509697, 3767854, 3681569, 4090002, 4396008, 4516334, 4837896, 5066435, 5480281, 5398381, 5848895, 6482369, 6842712, 7305957, 7547664, 7782625, 8331533, 9070076, 9175470, 10039147, 10445703, 10860838, 11243679]
5158A1243679J35225K8763o904N3262m15088l35054o62410n50587r91532m80274
5148H019080p7217p34739o14911l88915n33134k88967l65248o62326m91697l9790
5138C822136k13298n25584m9376K28717m16284o4289J11930j27882j15181m45705
5128B205184m7383L1581k40314L01916J59630m36117q2637N0474p568k42739q3451
5117A608576j62563l68740J08534J62468p8773l39579p9263J80999q3501J63386
5107A111544K38749L8049l16147K0151j24765j50330L83771Q3871k13206R94k70106
5096H02575k7435q5743J54854K41969n7658k61432j70737k20037J35216L99246
5086I10818j97240M31566l7377o57792p2467k2886O6632M66340o2227k15791j45969
$$ y = [11243679, 11378904, 11407667, 11400763, 11454025, 11038937, 10703883, 10041473, 9490886, 8499354, 8019080, 7941863, 7207124, 6592213, 6203298, 5670164, 5381197, 5015949, 4353623, 3861926, 3822136, 3608838, 3083254, 3033878, 3262595, 2846311, 2782022, 2893952, 2766070, 2650889, 2205184, 2157801, 2189382, 1949068, 2250984, 2410614, 1974497, 1891860, 1942334, 1934766, 1692027, 1608576, 1446013, 1077273, 1185807, 1348275, 1269502, 929923, 850660, 1031659, 948158, 1111544, 1350293, 1388342, 1072195, 1092346, 967581, 817251, 1201022, 1284893, 1071687, 1072681, 802575, 775140, 689397, 844251, 1086220, 1028562, 767130, 596393, 376356, 511572, 910818, 713578, 1145144, 1107767, 449975, 377508, 354622, 421254, 887594, 825367, 609576, 463607]
5075D63607R1143J77631J96602K50729k48934l27154o1697O27593O611l53287
5065H22844L53746J23999k67750l09720Q1584J4153k10813o5645k66032J92J40972
5054D17530k19415N6444K60289l0835k1949k07271J92321J68627P3947J8113j649
5043G06152J71490j90735j20050j05436M73585n7073J38895K18117k96299J5412
5033I54058k9201J40134q2201l52882M31897K19322k67809j33438L88692j19552
5023A149020K71626n3794n12625j56360j35171L03919l7466k92063J07603l6220
5013F08469L00087o7571k8667N4973R6323J36850n26313q299k4449R6160Q1467
5002G19030k22917j68397J58161O6626r7452l4794K41433M96080o1704k58800
$$ y = [463607, 554750, 732381, 928983, 1179712, 930778, 603624, 541927, 1169520, 1176131, 822844, 1176590, 1300589, 1032839, 723119, 804703, 818856, 608043, 542398, 276366, 276558, 417530, 198115, 254559, 514848, 484013, 462064, 254793, 447114, 615741, 689688, 707801, 706152, 877642, 686907, 566857, 461421, 935006, 877933, 1016828, 1234945, 938646, 954058, 924857, 1064991, 982790, 629908, 1061805, 1281127, 1013318, 879880, 1268572, 1149020, 1420646, 1366852, 854227, 697867, 562696, 866615, 829149, 537086, 644689, 608469, 908556, 840985, 812318, 867291, 963614, 1100464, 574151, 565852, 541403, 637563, 719030, 496113, 327716, 485877, 552503, 455051, 420257, 661690, 1157770, 1096066, 837266]
4992H37266K73218j51668j27132Q9096n05236j49377J78619L49617l4596j38789
4982F21018Q9374k52402J30388J65565L2606J77424M3000j18708J74568J03732
4972A166565O0414l47263j04470n6111J08895J22239J76082k47106j10964J66370
4962I34651j47262J04570j58828J63244M33960j35119j27361n29962j16291J76077
4952E97679K93511r3467l40847K53521l37831K47478L95966j63312n17743r8548
4942B36407N6698L0597J45410K72187j98923J83747j12627L31403l24487J64873
4932G85285L29808j56069j71859k8506L6162Q2655j89573K01756O4263J654n5048
4921I00528n99053L29503J54069l98105K78236J19255j77309N69184l63320L05552
$$ y = [837266, 1110484, 958816, 831684, 920780, 415544, 266167, 444786, 794403, 759807, 621018, 710392, 457990, 588378, 753943, 786549, 963973, 1006973, 888265, 1062833, 1166565, 1226979, 879716, 775246, 719135, 828030, 950269, 1126351, 879245, 768281, 934651, 787389, 891959, 733131, 896375, 1330335, 1195216, 1067855, 537893, 421602, 597679, 891190, 797723, 456876, 710397, 372566, 620044, 1016010, 852698, 334955, 236407, 293105, 323702, 469112, 741299, 542376, 726123, 613496, 944899, 620412, 785285, 1115093, 959024, 787165, 758659, 794821, 877476, 687903, 889659, 953922, 955576, 900528, 301475, 630978, 785047, 386942, 665178, 784433, 607124, 1176308, 812988, 1118540]
4911A118540L3572n2625j21156l0197J11197k09678j63372K70937L09490j55390
4901A111318k24991l01228K19977K71139M3198J40869p4374K29699j06843l44848
4891I63916j08940M3317k71115p1709J52888J68673N04827k69296j39669L24834
4881A297726n9691p3773l24354K66928Q2115k07501n9149N83842o8316j89937
4871A247890m34731k67375K32381j5371L07722L80823j66735j99112O9854J31028
4861A286374K50288M7042q670k01581j19637k35853N4172O27927k63280n01208
4851I35574j35391P0546L47261M05790j29324k48776j02413L3008K8408L31325
4841A536008O5186j25354k47149q5218K26549n950J81123j08825K7296k63092
$$ y = [1118540, 1152112, 1099487, 978331, 948134, 1059331, 849653, 686281, 957218, 1266708, 1111318, 886327, 585099, 805076, 1076215, 1119413, 1260282, 1185908, 1415607, 1308764, 963916, 854976, 898293, 627178, 555469, 708357, 877030, 1381857, 1112561, 972892, 1297726, 1238035, 1164262, 839908, 1106836, 1188951, 981450, 922301, 1506143, 1437827, 1247890, 813159, 545784, 778165, 762794, 1070516, 1451339, 1284604, 1085492, 1155346, 1286374, 1536662, 1583704, 1575034, 1373453, 1253816, 1017963, 1072135, 1700062, 1436782, 935574, 800183, 870729, 1217990, 1623780, 1494456, 1245680, 1143267, 1176275, 1204683, 1536008, 1601194, 1475840, 1228691, 1143473, 1370022, 1364072, 1545195, 1436370, 1463666, 1200574]
4831A200574M820O5275K29114o3791n8954P6058K67371K85117l26347k7711L18209
4820A969735p776k07639j29805K7183Q4730J93542j45996J75645J67337M6954
4810B173910L74919r8529k59058l9147J98601j6465L03609k03090L16010k65256
4800B485504m70918K48871Q5742M20958k21698K3572j16248k5822l7597J13533
4790B505897J06419n761p3885q5652j49406Q9376j78753J60517R7130P1465q1465
4779B455882J33565J27261k21025L5116J38233p3662L3756J76252j54758J71855
4769B822475j01295m41658K63560j52522M59071J06897l03604k20246J61211j1693
4759B582196q3954l62927J06504P16617k48429r8426J49599J03878k96396J67390
$$ y = [1200574, 1205394, 1270669, 1499783, 1435992, 1377038, 1453096, 1720467, 2005584, 1679237, 1651526, 1969735, 1961959, 1754320, 1624515, 1651698, 1736428, 1929970, 1783974, 1959619, 2126956, 2173910, 2548829, 2450300, 2191242, 2152095, 2350696, 2334231, 2637840, 2434750, 2750760, 2485504, 2014586, 2263457, 2349199, 2770157, 2548459, 2572031, 2455783, 2429961, 2392364, 2505897, 2612316, 2606555, 2532670, 2447018, 2297612, 2386988, 2208235, 2368752, 2465882, 2537347, 2455882, 2589447, 2716708, 2495683, 2530799, 2669032, 2595370, 2629126, 2805378, 2650620, 2822475, 2721180, 2279522, 2543082, 2390560, 2849631, 2956528, 2652924, 2432678, 2593889, 2582196, 2498242, 2135315, 2241819, 2958436, 2710007, 2611581, 2761180, 2865058, 2568662, 2736052]
4749B736052j40910k29827N27214J3646j79723K26296j32068j79472J7702k47998
4739B410912L7396J22072j37017q3419O8281J71077l26219J51143J06847m9119
4729B471954m93183J25002J45681j30853J69365l36214o3547M7933k86298m8457
4719A601383j48211Q0890J75029r2600l3032k32893L0419N42320k1058j73354
4709A728893m5620j35285j39627L04444M28371j16035j29470K85498P5864m3927
4699B213106L57309L18871l17286J03011m7160k40782q4986Q2884p0166j79801
4689B135000K82171j10099k29034J23616k298P3342j45532L59803j50202k42793
4679B093974N35317l65114k12694N3900r6694O6249j64735J14877L05503n798
$$ y = [2736052, 2595142, 2365315, 2892529, 2906175, 2726452, 2952748, 2820680, 2641208, 2658910, 2410912, 2448308, 2570380, 2433363, 2349944, 2418225, 2589302, 2263083, 2414226, 2521073, 2471954, 1978771, 2103773, 2249454, 2118601, 2287966, 1951752, 1888205, 1936138, 1649840, 1601383, 1453172, 1534062, 1709091, 1616491, 1583459, 1350566, 1380985, 1923305, 1902247, 1728893, 1683273, 1547988, 1408361, 1712805, 2141176, 2025141, 1895671, 2181169, 2257033, 2213106, 2570415, 2889286, 2572000, 2675011, 2627851, 2387069, 2302083, 2384967, 2314801, 2135000, 2417171, 2307072, 2078038, 2201654, 2199356, 2272698, 2127166, 2486969, 2336767, 2093974, 2629291, 2264177, 2051483, 2105383, 2008689, 2074938, 1910203, 2025080, 2330583, 2324785]
4669B324785k80785K534K38869l55534M80194j63032m02783j00575K11591M61720
4659B416984k76397k68734J57521l0897j16668l50156j89176L6339R0399O9896
4649A539111j62132L08212J08059o8804j2168O7782o2488o0739j48187j89954
4639A318692M43126J50781j79717P1592Q6497j00385k63808J62168l6284l648
4629A649014P3920J34726J04643K9699j88837l07951L32069J00157m49656K31731
4619A709515P6731j17831l50534K35854R7511o9755L28956k34297J09843K15955
4609B001948j27518R359l28428j3524P7072r6356K65385r5550j21670N10515J91657
4598B272890l60208J93318L7672k24125J29825j15486L0078M04152j42571k48169
$$ y = [2324785, 2044000, 2046534, 2285403, 1929869, 2410063, 2247031, 1844248, 1743673, 1955264, 2416984, 2140587, 1871853, 2029374, 1998477, 1881809, 1531653, 1342477, 1378816, 1469215, 1539111, 1376979, 1685191, 1793250, 1724446, 1712278, 1780060, 1717572, 1656833, 1508646, 1318692, 1761818, 1912599, 1732882, 1804474, 1890971, 1790586, 1526778, 1688946, 1652662, 1649014, 1722934, 1857660, 1962303, 1992002, 1803165, 1495214, 1827283, 1927440, 1477784, 1709515, 1786246, 1668415, 1317881, 1553735, 1651246, 1581491, 1910447, 1676150, 1785993, 2001948, 1874430, 1883789, 1555361, 1541837, 1618909, 1522553, 1787938, 1692388, 1570718, 2081233, 2272890, 1912682, 2106000, 2143672, 1919547, 2049372, 1933886, 1963964, 2368116, 2225545, 1977376]
4588A977376J6929j28784Q6175K9862j03080J27867m244k57097m5895P5001m2362
4577A731748r8514R9533L40098k23216k86072Q5272K86725K32262P2839r9442
4567B141233k08178j02233K04939l79445K94682L53310K26336o02131N383J41043
4557B074939K500L523k08652J91641L24570L08631j90725j93107k78748K35413
4547B269985p5196j53960K17852l3282K77782p6613m0446J08511k26204M3606
4537B312035j76007J67140q4437o0377J48249J89265L74276J64386k02115k03468
4527B628947O2984k44855K2494k04345m2857J44169j0592K79009K78526J71358
4517C084838K14650k94208j23400N47657R7088m0841J14791j4599Q326q8600k54260
$$ y = [1977376, 1994305, 1865521, 1951696, 1981558, 1878478, 2006345, 2002101, 1745004, 1699109, 1774110, 1731748, 1633234, 1732767, 2072865, 1849649, 1563577, 1648849, 1935574, 2167836, 2240675, 2141233, 1933055, 1830822, 2035761, 1656316, 1950998, 2304308, 2530644, 1928513, 1933896, 2074939, 2077439, 2080962, 1872310, 2063951, 2388521, 2697152, 2506427, 2313320, 2034572, 2269985, 2194789, 2040829, 2258681, 2225399, 2503181, 2426568, 2386122, 2494633, 2268429, 2312035, 2136028, 2303168, 2218731, 2158354, 2306603, 2495868, 2870144, 3034530, 2832415, 2628947, 2691931, 2447076, 2469570, 2265225, 2222368, 2366537, 2355945, 2634954, 2913480, 3084838, 3299488, 3005280, 2881880, 3429537, 3526625, 3485784, 3600575, 3585976, 3594302, 3505702, 3251442]
4506C251442J80955j49284j08696m8005j25647L57444j96469P2240j58377k4124
4496C051479N26342M01119m4463k52271j96308k51497J7546R7555M65712J34130
4486C949344k13860K32800j52590J41365O05802m32088k13550R5609n0080R0887
4476D053639l33752K26701K28893P9727J52697j11550J09343J15065J74675l19717
4466D375721J21010M85099J33154K78493J81602j88507J7246M3475k0579k34572
4456E192142k1624k76384N04097O81368m8746j53555L45754L19744l6092K33972
4446F740676J52126j02802J64978M68535J27681l00218J16560L32247N0014K38815
4436G988612K69500J87697M1675L5525M04657j25075K00591j8135K41203P79713
$$ y = [3251442, 3432397, 3283113, 3174417, 3126412, 3000765, 3358209, 3161740, 3233980, 3075603, 3051479, 3577821, 3978940, 3934477, 3682206, 3485898, 3234401, 3251947, 3349502, 3815214, 3949344, 3735484, 3968284, 3815694, 3957059, 4562861, 4130773, 3917223, 4012832, 3962752, 4053639, 3719887, 3946588, 4175481, 4255208, 4407905, 4296355, 4405698, 4520763, 4695438, 4375721, 4496731, 4981830, 5114984, 5393477, 5575079, 5386572, 5403818, 5447293, 5426714, 5192142, 5170518, 4894134, 5398231, 6079599, 6030853, 5877298, 6223052, 6542796, 6506704, 6740676, 6892802, 6790000, 6954978, 7423513, 7551194, 7250976, 7367536, 7699783, 7749797, 7988612, 8258112, 8445809, 8487484, 8523009, 8927666, 8802591, 9003182, 8985047, 9226250, 10005963]
4426A0005963j63005J58187R13280k51799k0826N00624K20882M46326Q9704N67475
4416A2466811J87795K60707L95451N88869L54501O75070N46748J95250M53853
4407A6125055N41793L77153O04469Q59447N31637N79836O27861O66537L47835
4398B1261623O29428O79054N09533P36853J618689Q45651R05530J403976J740583
4389C0330920J873556J686589K251143K716721L390431L479513L888668M219103
4381E3836644L698502L328165L021246L060179L101877L476906L743867M893194
4373H2160580M696877L832653K701274J284719J101282J417535J859853K643977
4365A01698750K785874J832657J25895k649362l774322l639918l381257k453042
$$ y = [10005963, 9842958, 10001145, 10914425, 10662626, 10641800, 11142424, 11363306, 11809632, 11899336, 12466811, 12654606, 12915313, 13310764, 13899633, 14254134, 14929204, 15475952, 15671202, 16125055, 16666848, 17044001, 17648470, 18507917, 19039554, 19619390, 20247251, 20913788, 21261623, 21891051, 22570105, 23079638, 23816491, 25435180, 26280831, 27186361, 28590337, 30330920, 32204476, 33891065, 36142208, 38858929, 42249360, 45728873, 49617541, 53836644, 57535146, 60863311, 63884557, 66944736, 70046613, 73523519, 77267386, 82160580, 86857457, 90690110, 93391384, 94676103, 95777385, 97194920, 99054773, 101698750, 104484624, 106317281, 106443176, 103793814, 100019492, 96379574, 92998317, 90545275]
4357I0545275j966993j762085k219887l855268m855770n495967m699345m061877
4349F1628083l139675l211770k983486l171898l379104l600169l686441l754923
4341C4700617l325268k279142j529466j767062j303076j075473j284175p99679
4333B1337276q92327r19116m50481p52725m70875l30489p82258l77771l56180
4324A6005054k30410l69972n09183J13159l59932k61298Q7127j31376j31922j22989
4314A4088258k51764l44835M2951J58137m14417q0498k50546l07830r2580n98587
4304A1948289j1235J64733J17445L2947K09256K71088N1448q3041k00586N99394
4294A3099738M82753o49j78318J21720j87064o34904J74207k38586k26430k19152
$$ y = [90545275, 88578282, 86816197, 84596310, 80741042, 75885272, 70389305, 65689960, 61628083, 58488408, 55276638, 52293152, 49121254, 45742150, 42141981, 38455540, 34700617, 31375349, 29096207, 27566741, 25799679, 24496603, 23421130, 22136955, 21337276, 20444949, 19525833, 19075352, 18322627, 17851752, 17521263, 16739005, 16361234, 16005054, 15774644, 15404672, 14895489, 15008648, 14648716, 14387418, 14474545, 14343169, 14211247, 14088258, 13836494, 13491659, 13534610, 13692747, 13278330, 13197832, 12947286, 12639456, 12546876, 11948289, 11937054, 12101787, 12219232, 12252179, 12461435, 12732523, 12783971, 12700930, 12500344, 13099738, 13582491, 13581842, 13403524, 13525244, 13338180, 12703276, 12877483, 12638897, 12412467, 12193315]
4284A2193315l30090j93798N90L5450j84096J31525k76414J06867J60069K31926
4274A1875344M34359m02859l5534K86466j19637k99260M37217K87176J17671J39496
4264A2720439M53614K35110k11661M00619K75105R9976J35240J57566L36160Q8780
4254A4690948K28392K27026L18271L28158M47620J50715K23497J39224j14929
4245A6638922M38365O13725K5914M89056K44871R09895L47488O64005R65307N33820
4235B1871368O79429Q07824J096315J000305J280840J823890J804566J476155
4227C1840692K134219K616850K497843K533206L344644L871298L870991L540699
4219E6250442K787816J323068n3338k325613l475889l785992m052190l651558
$$ y = [12193315, 11863225, 11669427, 11670017, 11705467, 11521371, 11652896, 11376482, 11483349, 11643418, 11875344, 12309703, 11906844, 11871310, 12157776, 12038139, 11738879, 12176096, 12463272, 12580943, 12720439, 13174053, 13409163, 13197502, 13598121, 13873226, 13973202, 14108442, 14266008, 14602168, 14690948, 14919340, 15146366, 15464637, 15792795, 16240415, 16391130, 16614627, 16753851, 16638922, 17077287, 17691012, 17716926, 18205982, 18450853, 19360748, 19708236, 20372241, 21337548, 21871368, 22550797, 23358621, 24454936, 25455241, 26736081, 28559971, 30364537, 31840692, 33974911, 36591761, 39089604, 41622810, 44967454, 48838752, 52709743, 56250442, 59038258, 60361326, 60307988, 57982375, 54506486, 50720494, 46668304, 43016746]
4211D3016746l019558k874948k305209j852172j496111j614538j064007k45021
4203B8545182j023496o63926K98599l01275o85256n06403p5575q569p4418J54639
4193B5659502l35517r8215L10287J91159L80749K21471q0251r4042M0583o8266
4183B6127460L86366M58452k83853O3639L88377M61187P67630O31369L18220M42895
4173B9761742N58387M59032J97148L94350J90357L92699Q24786O38832Q54697
4164C4272030J078197P72904O98485P45929L67644O74438Q69638J164669J178100
4155D1822034J224957J235543J259006J277935J289673J201644J310327J529070
4147E2150189J779484J410404J351664J899347J838397K360296J921848K334337
$$ y = [43016746, 39997188, 37122240, 34817031, 32964859, 31468748, 29854210, 28790203, 28545182, 27521686, 26857760, 27156359, 26855084, 26169828, 25663425, 25587850, 25579281, 25504863, 25659502, 25323985, 25225770, 25536057, 25727216, 26107965, 26329436, 26249185, 26155143, 26195726, 26127460, 26513826, 26972278, 26688425, 26752064, 27140441, 27601628, 28369258, 29000627, 29318847, 29761742, 30320129, 30779161, 30976309, 31370659, 31561016, 31953715, 32778501, 33417333, 34272030, 35350227, 36123131, 36821616, 37567545, 37935189, 38609627, 39479265, 40643934, 41822034, 43046991, 44282534, 45541540, 46819475, 48109148, 49310792, 50621119, 52150189, 53929673, 55340077, 56691741, 58591088, 60429485, 62789781, 64711629, 67045966]
4139F7045966K391787K496222L042573L473597L891224M152049M892613N010133
4131I6396164N290062O359645P330273P990540Q804910J0668499J2472053J3876555
4123A69188701J5834341J8943379K2124861K4944479K7996850L1024354L1246483
4116C41303448K7400967J8101218K356335j4625766k8424815l6594597l7431782
4109B72085008l3649351k8808205k3762503j9593376j4881367j2951994j0869844
4102A27568368q816804p880943o360036n219913m916109m368202m224193l377999
4094H2404169k694911k581477j952373k153063j766979j046811j408559q90102
4086F7909894r96319o00004r31071q75257J23841r7340p4919K83788L37439K86997
$$ y = [67045966, 69437753, 71933975, 74976548, 78450145, 82341369, 86493418, 91386031, 96396164, 101686226, 108045871, 115376144, 123366684, 132171594, 142840093, 155312146, 169188701, 185023042, 203966421, 226091282, 251035761, 279032611, 310056965, 341303448, 368704415, 386805633, 389161968, 374536202, 346111387, 309516790, 272085008, 238435657, 209627452, 185864949, 166271573, 151390206, 138438212, 127568368, 118751564, 110870621, 104510585, 99290672, 94374563, 90006361, 85782168, 82404169, 79709258, 77127781, 75175408, 73022345, 71255366, 70208555, 68799996, 67909894, 66913575, 66313571, 65382500, 64507243, 64631084, 64533744, 64458825, 64742613, 65080052, 65367049]
4076F5367049O79854O16636Q16094J247477J117515P28384J569909J619464J563730
4067G5326112J418838K244429K247681K408998K405265J952868K547421L231608
4059I3783220K784033K561150L447274L023039L264058L305749L489219L463114
4051A19120856L586587L150665L667609L877007L476046L778541L418885L067905
4043A47144101K892516K714468K816039K576886K148845K352756K194941K019998
4035A66860550J475177J501243Q51541M66867K41873j50937m92743n59313j556433
4026A68637825j523403j484803j791061j771818j877695k622726k481324k609048
4018A52475947l040976l319797l492066l505475l366897l553819l510758l489026
$$ y = [65367049, 66046903, 66663539, 67479633, 68727110, 69844625, 70573009, 72142918, 73762382, 75326112, 76744950, 78989379, 81237060, 83646058, 86051323, 88004191, 90551612, 93783220, 96567253, 99128403, 102575677, 105598716, 108862774, 112168523, 115657742, 119120856, 122707443, 125858108, 129525717, 133402724, 136878770, 140657311, 144076196, 147144101, 150036617, 152751085, 155567124, 158144010, 160292855, 162645611, 164840552, 166860550, 168335727, 169836970, 170688511, 171155378, 171397251, 171246314, 170753571, 170194258, 168637825, 167114422, 165629619, 163838558, 162066740, 160189045, 157566319, 155084995, 152475947, 149434971, 146115174, 142623108, 139117633, 135750736, 132196917, 128686159, 125197133]
4010A25197133l445206l257850l917505l541481l437485l162146l309240l478213
4002I7648007l813348l227987k519605k520684k277034k159736k158920k590054
3994G6380639k397060k032114j377453j612750j314696j437339j594134j273175
3986F3341918o01192m17254r27518k50978M6778K24050n4750p5802o90832j004394
3976E9590026j217718o15258o58712l73125j33409j97446j00328j8908L30852
3967E6605974L29490M16280J72265O60929M17626O03667J138556M37048O14094
3958F1395929R59482J442089R70244J162681J270757R36885Q14674Q42847O22767
3949G0418355O30513J276269P43403P63527J107945J533348J652185J362015K013382
$$ y = [125197133, 121751927, 118494077, 114576572, 111035091, 107597606, 104435460, 101126220, 97648007, 93834659, 90606672, 88087067, 85566383, 83289349, 81129613, 78970693, 76380639, 73983579, 71951465, 70574012, 68961262, 67646566, 66209227, 64615093, 63341918, 62740726, 62323472, 61395954, 61144976, 61191754, 61415804, 61361054, 61285252, 60594420, 59590026, 58372308, 57757050, 57098338, 56725213, 56591804, 56394358, 56294030, 56275122, 56605974, 56935464, 57351744, 57524009, 58184938, 58602564, 59206231, 60344787, 60781835, 61395929, 62355411, 63797500, 64767744, 65930425, 67201182, 68138067, 68952741, 69795588, 70418355, 71048868, 72325137, 73068540, 73832067, 74940012, 76473360, 78125545, 79487560, 81500942]
3940H1500942J943125J936602K097985K216025K674694K364713K617816L084146
3932A00436048L508536L113601L671872M119147M071556M345186M663020N378630
3924A33307596O025780O165775O858575P406593P666533Q401384R565807R955785
3916A95353828J0973614J1872189J3005701J3569530J4348283J4611829J4522101
3909B88257075J4896952J5016427J4050186J3262840J1722865R540996P742822
3902C74490163N332653L518843J897960J62056j348392l008789l757983m272957
3894C73013554n698195o092826p583164q439114j0150989j0953599j2484135j3117654
3886B98493878j4164569j4896746j4693107j4773806j4113102j3740574j3201415
$$ y = [81500942, 83444067, 85380669, 87478654, 89694679, 92369373, 94734086, 97351902, 100436048, 103944584, 107058185, 110730057, 114849204, 118920760, 123265946, 127928966, 133307596, 139333376, 145499151, 152357726, 159764319, 167430852, 175832236, 185398043, 195353828, 206327442, 218199631, 231205332, 244774862, 259123145, 273734974, 288257075, 303154027, 318170454, 332220640, 345483480, 357206345, 366747341, 374490163, 379822816, 383341659, 385239619, 385401675, 384053283, 381044494, 377286511, 373013554, 367315359, 361222533, 353639369, 345200255, 335049266, 324095667, 311611532, 298493878, 284329309, 269432563, 254739456, 239965650, 225852548, 212111974, 198910559]
3879A98910559j1882367j1254775j1113870r143236q962483q429216p304364p225923
3871A23594325o179610n594677n266455m837990m540239m314891l991911l235325
3863H5633227l276037l381658l181637l092530k499178k166518k471243k440807
3855F3123619k222312j753116j925898j945891j662383j376899j646081j728551
3847D8862488j322082j255029r37048j024771j045224j396510j087606j009431
3839C9784787r87964r70630r53987p17817q18732o89160o13185p13871n65527
3830C2753914m48958n55089l37925j93707l22683m61308m23428n7689l81778o70414
3820B8900935q16345o95656n89701n52302n07384k61243k85987n24395n45372
$$ y = [198910559, 187028192, 175773417, 164659547, 155516311, 146553828, 138124612, 130820248, 123594325, 117414715, 111820038, 106553583, 101715593, 97175354, 92860463, 88868552, 85633227, 82357190, 78975532, 75793895, 72701365, 70202187, 68035669, 65564426, 63123619, 60901307, 59148191, 57222293, 55276402, 53614019, 52237120, 50591039, 48862488, 47540406, 46285377, 45348329, 44323558, 43278334, 41881824, 40794218, 39784787, 38796823, 37826193, 36872206, 36154389, 35335657, 34646497, 34033312, 33319441, 32753914, 32304956, 31749867, 31411942, 31218235, 30895552, 30434244, 30010816, 29953127, 29571349, 28900935, 28084590, 27388934, 26799233, 26246931, 25739547, 25478304, 25192317, 24667922, 24122550]
3811B4122550m59027l88456j89187l95852m97462l85990n42934J0041j39662l27077
3801B0806944Q644k71467l93737k09112j98655m57038q1268l69556l29072j81196
3791A8324487j21947j31162l55352J38226k26389m95815n88651l18976m412J74736
3781A6394745l24849k28312n16790k16228L4432O8615j36797m0859M5916j31183
3771A4948690l48955P9505k77276j39762O26898l58834K33961J67271l82620k5349
3761A4523529k3906j46600q249L88828L11947O7720K22236m7199l88566J82680
3751A5082420L14094K43025n4502L43897R070M62917O7528K01323M92678J79075
3741A7341525O41265O53489N57460K84196M27502P22803Q37990O23678M05694
$$ y = [24122550, 23663523, 23275067, 23085880, 22690028, 22192566, 21806576, 21263642, 21273683, 21134021, 20806944, 20815588, 20544121, 20150384, 19941272, 19742617, 19285579, 19204311, 18834755, 18505683, 18324487, 18202540, 18071378, 17716026, 17854252, 17627863, 17132048, 16543397, 16224421, 16220009, 16394745, 16069896, 15841584, 15324794, 15108566, 15142998, 15211613, 15074816, 15033957, 15079873, 14948690, 14599735, 14679240, 14401964, 14262202, 14889100, 14530266, 14764227, 14931498, 14548878, 14523529, 14499623, 14353023, 14344774, 14733602, 15045549, 15113269, 15335505, 15288306, 14899740, 15082420, 15396514, 15639539, 15585037, 15928934, 15938004, 16400921, 16468449, 16669772, 17162450, 17341525, 17982790, 18636279, 19193739, 19477935, 19905437, 20628240, 21466230, 22089908, 22495602]
3732B2495602Q33557L22194J44805N07628l07174K03695M78314N29456l2304P9180
3722B5254953m36094l12390O264k32234k7245L27442J32143j01414m46154k83106
3712B3882165k16215o15813k86560j72235o34408l91983J02370k23502n5346j3037
3702B1375436K2463K5686M94982l69132n8111l0966J83536N74667L81163K3927
3692B2623651L20246N27494N96327K25728k56M65520M61928M41391N77203K47376
3682B6486608P30997M63421P96707J153299P16516O65190O00698J363297J149808
3673C4126541Q04289Q65253R46886J270407J361722J005470J437999J314602J238778
3664D4371947P82202J321253J461852J048322Q24863J088593R91271J005881J230182
$$ y = [22495602, 23329159, 23651353, 23796158, 24303786, 23996612, 24200307, 24678621, 25208077, 25175773, 25254953, 24818859, 24506469, 24512733, 24280499, 24253254, 24580696, 24712839, 24611425, 24165271, 23882165, 23665950, 23050137, 22763577, 22591342, 21956934, 21564951, 21667321, 21443819, 21388473, 21375436, 21397899, 21423585, 21918567, 21549435, 21491324, 21460358, 21643894, 22218561, 22599724, 22623651, 22943897, 23471391, 24067718, 24293446, 24293190, 24758710, 25220638, 25662029, 26239232, 26486608, 27217605, 27681026, 28477733, 29631032, 30347548, 31012738, 31613436, 32976733, 34126541, 34930830, 35796083, 36742969, 38013376, 39375098, 40380568, 41818567, 43133169, 44371947, 45154149, 46475402, 47937254, 48985576, 49810439, 50899032, 51890303, 52896184, 54126366]
3655E4126366J522424Q88688P91583P51225Q35733O37219M88865P73601J236639
3646F2052343O98013R7723M32360L61822N73576J075735N99445P19110M93591
3637F7103718M31865P30256R82447J191318J204271J081008J708107J104255J579007
3628G7116252J979425J833583K174004K307012K607879L183215L179928L469450
3620I7850748L451339M035249M190302M235726N292378N236777N423119N456065
3612A35171703N684978N900052O117333O300489O278573O464975O459188N816509
3604A84193800O254933O057111O244685N902602O031342N708762N647807N221506
3596B31262548M628607M454690M439315L764451L256913K334885K129879J692913
$$ y = [54126366, 55648790, 56537478, 57329061, 58080286, 58916019, 59553238, 60042103, 60815704, 62052343, 62750356, 62848079, 63280439, 63642261, 64215837, 65291572, 65891017, 66610127, 67103718, 67535583, 68265839, 69248286, 70439604, 71643875, 72724883, 74432990, 75537245, 77116252, 79095677, 80929260, 83103264, 85410276, 88018155, 91201370, 94381298, 97850748, 101302087, 105337336, 109527638, 113763364, 119055742, 124292519, 129715638, 135171703, 140856681, 146756733, 152874066, 159174555, 165453128, 171918103, 178377291, 184193800, 190448733, 196505844, 202750529, 208653131, 214684473, 220393235, 226041042, 231262548, 235891155, 240345845, 244785160, 248549611, 251806524, 254141409, 256271288, 257964201]
3588B57964201J519029L90912L57882K27008n12213r23078j417766j306618k030131
3579B54269226k313471k790240k929395l185917m229948m355012m409863m796871
3571B25258509n128064n445362n908623o001668n793129o173963o214931o352558
3563A78240211o097533n817577o008285o183900n700500o146835o006553n584044
3555A30694984n623053n525979n368879m937427m650970m318562m339650m244092
3547I1686372l777928k881824k889560l137080k538863j879824k164932k175873
3539G0240488j304420j420746j330609j237830j009030p99774p03395k93154o58466
3530F1483064j083998o72204n18742l49185q31167j116286l45486p21603o33288
$$ y = [257964201, 259483230, 259874142, 260232024, 260459032, 259946819, 259023741, 257605975, 256299357, 254269226, 251955755, 249165515, 246236120, 243050203, 238820255, 234465243, 230055380, 225258509, 220130445, 214685083, 208776460, 202774792, 196981663, 190807700, 184592769, 178240211, 172142678, 166325101, 160316816, 154132916, 148432416, 142285581, 136279028, 130694984, 125071931, 119545952, 114177073, 109239646, 104588676, 100270114, 95930464, 91686372, 87908444, 85026620, 82137060, 78999980, 76461117, 74581293, 72416361, 70240488, 68936068, 67515322, 66184713, 64946883, 63937853, 63138079, 62434684, 62141530, 61483064, 60399066, 59726862, 59208120, 58858935, 58027768, 56911482, 56565996, 55844393, 55211105]
3521E5211105p75560o60101n86089n06864r54932q72502j247020j120918j032138
3512D7454981j302686j265873j452617r02222j743253j392051j048215r82070
3504C7365994j397115j132958j173396j349974q04727j160257j032777j561418
3496B7753372j345971j131990r72338q00604j010348q44734o97641m36427p03762
3487A9809557l92849l91399n91023q51147m42446q10717l03453M066k52225n07929
3477A5270435m77019k39567q69344j23300k97761m42794j45480k53904l11596
3468A2109670m82703m15096k8280n22879O3813l17911k09446n8367m37832r4726
3458I606243l35617p3711j0521j44309p32315m23331J76855L781p03082j96596
$$ y = [55211105, 54435545, 53775444, 53189355, 52682491, 51727559, 50855057, 49608037, 48487119, 47454981, 46152295, 44886422, 43433805, 42531583, 40788330, 39396279, 38348064, 37365994, 35968879, 34835921, 33662525, 32312551, 31507824, 30347567, 29314790, 27753372, 26407401, 25275411, 24303073, 23502469, 22492121, 21647387, 20949746, 20513319, 19809557, 19416708, 19025309, 18434286, 17583139, 17140693, 16329976, 16026523, 16030589, 15778364, 15270435, 14793416, 14553849, 13684505, 13561205, 13263444, 12820650, 12675170, 12421266, 12109670, 11626967, 11211871, 11183591, 10660712, 10724525, 10406614, 10197168, 10138801, 9700969, 9606243, 9270626, 9196915, 9186394, 9042085, 8309770, 7886439, 8063294, 8067075, 7363993, 7167397]
3448G167397K55068J5262j07561J14883p3465m24442M353n39661l03819K61365
3438F369380k89189k12645m46600k56527N04614N3363k70061j30517k8854k41567
3428E051397k2684J14472k67456M9250j13991o3719n949k75829q870J00342Q5416
3417D642379j11492n80670L0892K34659J40533k54247l24712J38649J01745l26123
3407C691613j01044L777O8460J85159Q5311l40540m47653k01285L52996J79434
3397C476228K70859L2385p04958M7386J26108n12691n259j37259k00603L4209
3387B426405l5939M3629r6758j35862J89368q8706L00451M5848m19525K74127
3377B503038J99417k28892l12233j27152J65530j17126j75581J29567K58196K89335
$$ y = [7167397, 7422465, 7437727, 7330166, 7445049, 7371584, 6947142, 6951495, 6411834, 6108015, 6369380, 6080191, 5867546, 5420946, 5164419, 5669033, 5722396, 5452335, 5321818, 5292964, 5051397, 5028713, 5143185, 4875729, 4924979, 4810988, 4747269, 4741320, 4465491, 4456621, 4556963, 4642379, 4530887, 3950217, 3981109, 4215768, 4356301, 4102054, 3777342, 3915991, 4017736, 3691613, 3590569, 3594346, 3662806, 3847965, 3933276, 3592736, 3145083, 2943798, 3296794, 3476228, 3747087, 3779472, 3074514, 3121900, 3248008, 2735317, 2730058, 2592799, 2392196, 2426405, 2390466, 2434095, 2337337, 2201475, 2390843, 2302137, 2602588, 2648436, 2228911, 2503038, 2702455, 2473563, 2161330, 2034178, 2199708, 2082582, 1907001, 2036568, 2294764, 2584099]
3367B584099K42888O6113l12291l79134J53742j08868l55239O4798J55028j85153
3357A925983J07793R2872l18965r134j02826L18675j58087j81283N6677K77440
3347B009145j30489o7148j61995K68504k70457p7964l58599J71148O8485l5971
3337A414659K80909m28242m06719M60756R7943p868L31113m85914J95493K24691
3327A676821o7115O6252K02046J60129k53729K5860k32889q4188p9647m8717k7999
3316A336824J93418M69219L9676j13270L42390j95334r3304j36915k04701M71832
3306B109835O2639J5632j22564K2745n6471L1584j25933J54540j16653J14270
3296B089624J4751k6775j17783l31869O2703J71017L17096p2925l00810k84206
$$ y = [2584099, 2826987, 2893100, 2580809, 2201675, 2355417, 2246549, 1891310, 1956108, 2111136, 1925983, 2033776, 2126648, 1807683, 1798549, 1695723, 2014398, 1856311, 1675028, 1731705, 2009145, 1878656, 1811508, 1649513, 1918017, 1647560, 1569596, 1210997, 1382145, 1450630, 1414659, 1695568, 1267326, 860607, 1321363, 1419306, 1411438, 1742551, 1256637, 1452130, 1676821, 1609706, 1675958, 1878004, 2038133, 1784404, 1810264, 1577375, 1493187, 1413540, 1364823, 1336824, 1530242, 1999461, 2039137, 1925867, 2268257, 2072923, 1979619, 1842704, 1638003, 2109835, 2172474, 2188106, 2065542, 2088287, 2031816, 2063400, 1937467, 2092007, 1975354, 2089624, 2104375, 2077600, 1959817, 1627948, 1690651, 1861668, 2178764, 2105839, 1805029, 1520823]
3286A520823J68214J31171l15092L6921K9271l32710j2771P9221j86339J18102
3276A236811M5303j14758L04525J29276J54231l3312n84679j50015K22865p0166
3266A140081K13045j13238k82373L83908p3363L3884O3558J83779j59830j60707
3256A228744n4827p1955j0645J90499q914l23194k16333r696j39296j8432N3788
3245F19739j98159M03125n45j37658L478k80662P7723J26137J09864L5924K81107
3234A040073k30551m31758P6583M08357l98156j9293M30147l9111j74310k83K36584
3223H98282J71471j11367j12266J63108o8481K37780j02871j6870k40129K55282
3213A073939J1740l25740j94401J28909p2100p8243J74346O2534Q000m30742J83660
$$ y = [1520823, 1689037, 1820208, 1505116, 1542037, 1571308, 1238598, 1225827, 1305048, 1118709, 1236811, 1282114, 1167356, 1471881, 1601157, 1755388, 1722076, 1137397, 987382, 1210247, 1140081, 1353126, 1239888, 957515, 1341423, 1268060, 1301944, 1365502, 1549281, 1389451, 1228744, 1173917, 1101962, 1091317, 1281816, 1272902, 949708, 733375, 723679, 584383, 565951, 619739, 421580, 824705, 824160, 686502, 689980, 409318, 487041, 613178, 723042, 758966, 1040073, 809522, 377764, 454347, 862704, 464548, 445255, 875402, 836291, 661981, 661698, 898282, 1069753, 958386, 846120, 1009228, 940747, 1178527, 1075656, 1058786, 818657, 1073939, 1085679, 759939, 565538, 694447, 622347, 544104, 718450, 780984, 788984, 358242, 541902]
3202E41902m87589L02731M81918k10404l04614K03788K19124J14853k38527m78845
3192A44337L08170P2749J46134n85505j3959J90672m27900J72097j16907J02999
3182g113N70188r3473j92843J29782R502m67891J19348L39264j53822j07835K47856
3171C92963J10730R7015l26179J32997J65280j16747j35230j30678K66509k33687
3161B22973j11429o0525R0902J67827J8159j26639J7024p2602L11433J29684j38477
3150D48330k76473J99343J5376M2842p4921n2489K85701k57305j94732Q6052K21911
3139D43635J3148K25159L59782k19722k74095j17601L14758Q0950N375L2545J54933
3128A018867k73755L59455O591O1429L69448n37323m35792Q7949M03112l86962
$$ y = [541902, 54313, 357044, 838962, 628558, 323944, 527732, 746856, 861709, 623182, 144337, 452507, 525256, 671390, 85885, 71926, 262598, -165302, 6795, -110112, -7113, 563075, 469602, 276759, 406541, 416043, -51848, 67500, 406764, 252942, 145107, 392963, 503693, 600708, 274529, 407526, 572806, 456059, 320829, 190151, 456660, 222973, 111544, 51019, 141921, 309748, 327907, 201268, 218292, 145690, 457123, 586807, 448330, 171857, 371200, 386576, 429418, 354497, 302008, 587709, 330404, 135672, 221724, 443635, 456783, 681942, 1041724, 822002, 547907, 430306, 745064, 826014, 831389, 863934, 1018867, 745112, 1104567, 1111158, 1172587, 1542035, 1004712, 568920, 656869, 1059981, 673019]
3118F73019J00012j0374J88199k2754k59966Q7445J21574k15551N4599j40810
3108E75393Q8218L1204j28990k62271J98586L38949k1387l62287J52372j75300
3098D34487J93569j08733k00973J20160k1044Q0157j33280J03892j92853J85822
3088D61204O6484J11l86933M32268j36944n2565M83240L52737k1828J18527K92570
3077A608871l54664M99083K38965N9092N9205J53353p79650o03613n3578l79088
3067D47976k39653K57674k8587j88228O071m2734Q9962L43374k93282J14124J66594
3056F33291J80208K97011J94318m04418J48234M14262j660k9776L50755L65101
3046B147326N55191R10750J42697M9019m39029n15732p75952n80166l63081k31103
$$ y = [673019, 773031, 762657, 950856, 928102, 668136, 755581, 877155, 661604, 716203, 575393, 663611, 694815, 565825, 303554, 502140, 841089, 819702, 457415, 609787, 434487, 628056, 519323, 318350, 438510, 417466, 497623, 364343, 468235, 275382, 461204, 527688, 527799, 140866, 573134, 436190, 383625, 866865, 1219602, 1197774, 1316301, 1608871, 1254207, 1753290, 1992255, 2051347, 2110552, 2263905, 1484255, 880642, 827064, 447976, 208323, 465997, 437410, 249182, 255253, 212519, 302481, 645855, 352573, 466697, 633291, 813499, 1110510, 1304828, 900410, 1048644, 1462906, 1461246, 1431470, 1782225, 2147326, 2702517, 3613267, 3755964, 3804983, 3365954, 2850222, 2074270, 1494104, 1131023, 899920]
3036H99920N6701k7173K09080K3463k37707k74935n8471k3660j92199l33479N0657
3025I2197K38537Q4156m6607r1083K28911j6283L25437K35348K4202l2226R0842
3014A133431N2180O10539J16844j16679m04188n05061n42892J86279j14325L9429
3004D55557L2080k8486m2408M92553k29602m94480j79445L9728j01973q3307J11580
2993b8203N10465p9216l42103k10038j96235J70476K32124J99451j47015K40510
2983C50216r0764l01762L51774j00851j27911N6168J50884m8221q3138N3896j58675
2972E1616j60398J02639j45157j04458J01703k19892k28811K00162k7006m4698
2962d74300K24786j70554J93427q4883Q9778p1627k22743k02882L04901K97560
$$ y = [899920, 956621, 929448, 1138528, 1161991, 924284, 649349, 590878, 567218, 375019, 41540, 92197, 330734, 414890, 368283, 277200, 506111, 489828, 815265, 1050613, 1074815, 1042589, 1133431, 1185611, 1796150, 1912994, 1796315, 1392127, 887066, 344174, 530453, 416128, 455557, 487637, 459151, 416743, 909296, 679694, 185214, 5769, 45497, -56476, -139783, -28203, 482262, 403046, 60943, -149095, -345330, -174854, 57270, 256721, 109706, 350216, 259452, -42310, 309464, 208613, 80702, 136870, 287754, 239533, 156395, 210291, 51616, -108782, -6143, -151300, -255758, -154055, -373947, -602758, -402596, -429602, -474300, -249514, -420068, -226641, -311524, -221746, -293373, -516116, -718998, -414097, -116537]
2952a16537K00731j35732k37818j08432J39727P8732N5990j49657P1703J03020
2942i8273k97991k8266L42898j87034j80609n0558M3483L13634K35941k08206
2932a14981k59407k77022K37412P0238r4017k52019j8116K89557J26453k75167
2922e67069L54261k06305j30342j7988J84573N5873j57150Q0918o010J48049l0247
2911b91437L10657k71237P6269O8920j76743J01043M2006p6104l02687K8899J1940
2900d78474L38834j07721j23023J1090M6629L0494O2307J332l4656K2298P2668
2889a58222M9835k66472K48779k07055j20760J88828P0362N47917J00088k82392
2879A70908k27270P8364J03401k36120o0054R7260K38396l12306J37833q284m3878
$$ y = [-116537, 84194, -51538, -289356, -397788, -258061, -179329, -123339, -272996, -201293, -98273, -396264, -424530, -81632, -268666, -449275, -499833, -456350, -142716, 93225, -114981, -374388, -651410, -413998, -343760, -437777, -689796, -707912, -418355, -291902, -567069, -212808, -419113, -549455, -567443, -382870, -326997, -484147, -403229, -409239, -261190, -291437, 19220, -252017, -175748, -106828, -283571, -182528, -140522, -216626, -519313, -490414, -478474, -139640, -247361, -370384, -359294, -312665, -282171, -219864, -218532, -253188, -230890, -158222, -108387, -374859, -126080, -333135, -453895, -265067, -194705, 353212, 453300, 170908, -56362, 22002, 125403, -110717, -170771, -73511, 164885, -147421, -9588, -17872, -61750]
2868f1750l8210r9481o4900L77676K79659n223q7480r9780J92271p5580o0076
2857B57126m13524K8287N1476j9712K21810k5352k79446K62998l7467k13898K07432
2846C9730J04359j54195l1302J10259l55095N9306J63081r1584l05721K52790
2836b08372K87531J61208j43065l97772J39622J5036o2841K84227R6373K89893
2826D61840N3971J96049n22085j19772O8580m8323j2134m80441k70522L71908
2816c00929l9218l6297n6215L18073j18105k35612K55199r8312J89960J24010
2806B554J96357L314q9828l76294k37508J78610J10997J86107j08187j07096l53328
2795e94302J88988K67664j72207j1405J67378m70835n1315L78000L64116k36963
$$ y = [-61750, -99960, -199441, -264341, 113335, 392994, 387771, 300291, 200511, 392782, 317202, 257126, -156398, -128111, -76635, -96347, 125463, 100111, -179335, 83663, 46196, -167702, 39730, 144089, -10106, -41408, 68851, -286244, -226938, -63857, -155441, -461162, -208372, 79159, 240367, 97302, -300470, -160848, -145812, -208653, 75574, 171947, 461840, 515811, 711860, 189775, 70003, 138583, 90260, 78126, -402315, -672837, -300929, -340147, -376444, -432659, -114586, -232691, -468303, -213104, -311416, -121456, 2554, 198911, 202225, 112397, -263897, -501405, -322795, -211798, -25691, -133878, -240974, -594302, -405314, -137650, -309857, -321262, -153884, -624719, -676034, -298034, 66082, -170881]
2785a70881j74713p7086m06100M32423L07120r3715k53667K65788J47588k08835
2775b32078r6793O7765j3784L81922L4600j3943k1162k20125k69885L6348k179
2764c49314L45506j42497p9832K25600q1894j63103p6287k06281K04095J39093
2754a84914k28915J06018J58756l05600L5745k19689L80801Q3900J16192j96886
2744b54592N6382j27590m5964J53174l71745m2571J52962o7524l7215L02060j7189
2733b99812n6118l24440K29114m915K08927j33602J11520o5379J43856J99268
2723H419j69525R1590M1705J68198j50464l09093O790k51286P8602L30162M6938
2712a07964p1814j1590l3389l18223J25454M996K72313O6177k55685J12495J84966
$$ y = [-170881, -345594, -422680, -828780, -396357, -89237, -182952, -436619, -170831, -23243, -232078, -328871, -261106, -274890, 107032, 141632, 127689, 106527, -113598, -383483, -347135, -349314, -3808, -146305, -226137, -537, -82431, -245534, -321821, -528102, -324007, -184914, -413829, -307811, -149055, -454655, -418910, -638599, -257798, -173898, -57706, -254592, -198210, -325800, -371764, -218590, -590335, -632906, -479944, -547468, -584683, -282623, -299812, -355930, -680370, -451256, -456171, -247244, -380846, -269326, -334705, -190849, 8419, -161106, -69516, -27811, 140387, -10077, -319170, -312380, -563666, -485064, -154902, -107964, -179778, -191368, -224757, -542980, -417526, -412530, -140217, -74040, -329725, -217230, -32264]
2701c2264N4132j38986l18645j45861n0498J21400p1646m3321j40197M3113K56197
2690d66576K22099k39194j35613J67718n0833M23788J67895k53336j23983k94859
2680e82894j33960K32586q7422n5317J44964J90046j45670p3397K3301J54397
2670c33366o4244J26145J88989r8374j54104J47001J70966K66158J29259k20666
2660A57764j68428k05760k5207K55995k69296k65628n8068L12805J45635k4865
2650a45053Q7483J03788k69268j52595L6940K5221K53849J4074j34151p6525k16275
2639d72512L930k04971P4509k0614o1268j12607k26892M56124L42180K93500J58257
2628B29636l59577j01420l41766N6316N9648N9648N8008L50894l62668l30731
$$ y = [-32264, 21868, -117118, -435763, -581624, -632122, -510722, -582368, -625689, -765886, -722773, -466576, -244477, -483671, -619284, -451566, -502399, -78611, 89284, -164052, -288035, -582894, -716854, -484268, -571690, -627007, -482043, -291997, -437667, -511064, -487763, -333366, -397610, -271465, -82476, -180850, -334954, -187953, -16987, 249171, 378430, 157764, -10664, -216424, -241631, 14364, -254932, -520560, -578628, -265823, -120188, -145053, -57570, 46218, -223050, -375645, -338705, -313484, -59635, -45561, -179712, -256237, -472512, -468582, -673553, -599044, -619658, -680926, -793533, -1020425, -564301, -222121, 71379, 229636, -129941, -231361, -573127, -516811, -457163, -397515, -339507, 11387, -351281, -682012]
2618f82012J01394J54289N6834k33927K87614J2164j84517K1788j31122L7910
2608e59585M05322j78822K14401l44395p7425K4687l7250K61646K90380n56825
2598e57866k52737O16395K1139j80181l1243K68371o4900q1878j55981p835K37241
2587a89475j55789R837l10421K14697k80025l8591m6674N50391P8713j52547j32010
2576d51894l9907k88325R5261L16903M3300J1361K85625k58144m8492R7935J98691
2565c7686n0791r3233n0200m52229K114J44492K59474k50726j6351K60822L99698
2554A15384q6304p1628J80301k85942m54093m2761J10522K12260Q4915J84814
2544e2532q2795J1034J0817J29362j7112m29094j78409J8145j06224Q3129K0079
$$ y = [-682012, -580618, -426329, -369495, -603422, -315808, -303644, -488161, -466373, -597495, -559585, -154263, -333085, -118684, -463079, -540504, -515817, -553067, -291421, -1041, -557866, -810603, -194208, -173069, -353250, -384493, -116122, -181022, -262900, -418881, -426716, -189475, -345264, -335427, -645848, -431151, -711176, -749767, -796441, -246050, -167337, -319884, -451894, -491801, -780126, -684865, -367962, -324662, -313301, -27676, -285820, -334312, -236377, -37686, -88477, -181710, -231910, -684139, -682025, -537533, -278059, -528785, -545136, -284314, 115384, 29080, -42548, 137753, -148189, -602282, -645043, -534521, -322261, -237346, -52532, -135327, -124293, -113476, 15886, -1226, -430320, -608729, -590584, -696808, -613679, -593600]
2533e93600J85498J30924j56566L91480o3287j05553r9269n2036Q5478J91560
2523h5371N51580m05664N32789j67383l83245m53382k1677J6118P028M95495j36613
2512e0325l54547l38250o74613J30232Q03427O9560J7127j06871o8072K69864
2502c02468l56577j59619K79714L072l93235K20884J17480O39933j36305l54828
2492d41949K04778k71696J36994m17797N9275J9143K80774J28144N1432p5705
2482c26607R902M14206j719k59668k11656j24536J08175J46406k7055j34235k41606
2471f48393K97843J25462l65877j2590N4518J43119m0595J41930N14096k09999
2461d86O7884l60703k2935K22861p1330j00391j84498j57735j08202K78944J52255
$$ y = [-593600, -408102, -277178, -433744, -42264, -105551, -211104, -310373, -362409, -276931, -85371, 466209, 60545, 593334, 425951, 42706, -410676, -432353, -416235, -409207, 86288, -50325, -404872, -743122, -1417735, -1287503, -484076, -414516, -397389, -504260, -572332, -302468, -659045, -818664, -538950, -535878, -929113, -708229, -590749, 49184, -87121, -441949, -237171, -508867, -371873, -789670, -730395, -711252, -430478, -302334, -250902, -326607, -316705, 97501, 95782, -163886, -375542, -500078, -391903, -245497, -272552, -406787, -648393, -350550, -225088, -590965, -603555, -549037, -405918, -446513, -304583, 209513, -486, 67398, -293305, -316240, -93379, -164709, -265100, -449598, -607333, -715535, -436591, -284336]
2450b84336k73139j35913K12813k7215n2813K26633M94139j9033j05538J02306
2440A37904m2993J88472j76019m61690N5629k0508P7368K34992p0346K25159l609
2429A44359j81261r3591q6661J67779O2225l14299o0119K96144J64983J05490
2419B05049q2133j18782m81205J68242j90707J84077Q9013J2046k70236N724J85874
2408b93038P9926J00048j49997J60059L31726j74184o2976j90181l6960J37560
2398i8017Q2324P891j63482j0663k14005k22365J89944M98307O8431J07233m47288
2387b01690J27245L49483j37472J2521l53781J82905K58179j37033k34442j01272
2377b35357M2976j46514k24114L09535j92274k14009K38003K94600L29217p6053
$$ y = [-284336, -557475, -693388, -480575, -507790, -560603, -333970, 160169, 141136, 35598, 137904, 94911, 283383, 107364, -354326, -298697, -319205, -241837, -6845, -77191, 147968, 144359, -36902, -130493, -217154, -49375, 12850, -301449, -361568, -65424, 99559, 205049, 122916, 4134, -477071, -308829, -499536, -315459, -226446, -214400, -484636, -478912, -293038, -213112, -113064, -263061, -103002, 228724, 54540, -8436, -198617, -235577, -98017, -15693, -7802, -171284, -181947, -395952, -618317, -428373, 69934, 138365, 245598, -201690, -74445, 275038, 137566, 150087, -203694, -20789, 237390, 100357, -134085, -235357, -192381, -338895, -563009, -253474, -445748, -659757, -421754, -127154, 202063, 126010]
2367A26010k29452j79354K45944O2215j83029K65056j46963K8149K22008K20377
2357D30961r2743K06702p4053n21461j8349L42232J41858p3951m06595l29675
2347c95074M95740l87614l9002K10808L28449J48431p2378k04982j19145P2307
2337C7540O6303k77053o395J53720k44289M5365J44461J43499K1760J63161K94824
2326E42896j92548l4439q614l59844L4657J7840m47265K45293j09133J01627k36845
2315d46375L09441M20556q8927J13581j70448K59109q341j94588K41289n62743
2305a27446p4017L57765K05801k2034m1923j36314k40555J04298m99203k96164
2295g69792O24825K0720J56393J94349j94672Q7955j95579n8746L5421j33017
$$ y = [126010, -103442, -282796, -36852, 25363, -157666, 107390, -39573, -11424, 210584, 430961, 338218, 544920, 470867, -50594, -68943, 273289, 415147, 341196, -65399, -395074, 100666, -286948, -325950, -115142, 213307, 361738, 289360, 84378, -34767, 37540, 103843, -173210, -179605, -25885, -270174, -224809, -80348, 63151, 84911, 248072, 542896, 350348, 315909, 307295, -52549, -17892, -52, -447317, -202024, -311157, -209530, -446375, -136934, 283622, 194695, 308276, 137828, 396937, 388596, 194008, 435297, -127446, -201463, 156302, 362103, 340069, 298146, 161832, -78723, 25575, -473628, -769792, -144967, -124247, 32146, 226495, 31823, 119778, -75801, -134547, -99126, -232143]
2285b32143R6730J26125L4191K39254l46241R1352L37935J84542Q5890k27721
2275C89914j56932j69935L1403J40926k47958R789q4825J08650l2501m3942P5969
2264B0558m2687l3909k6903L35153k83269j58924l49551R9737J05172q8385L22523
2253a00485J47348n08054J13629Q3289j7990N55054J15125l41146N19061j70528
2243C95303l66220K23655k93766J63187m66980J25674L06718K25095n5741k5174
2233B31751m340L01496Q3962n1J4388j45241k09197j53562p6246J18397J14150
2222B75507M36302r9772k61539m68794K59849j05169J74029J87412m6171K20651
2212E72305k00503j02988p6577l0941J42149M87924k06938k32135j5632K92591
$$ y = [-232143, -135413, -9288, 24903, 264157, -82084, 9268, 347203, 531745, 617635, 389914, 232982, 63047, 94450, 235376, -12582, -2793, -87618, 21032, -11469, -55411, 20558, -22129, -56038, -82941, 252212, -31057, -189981, -539532, -439795, -334623, -423008, -100485, 46863, -461191, -347562, -264273, -282263, 272791, 387916, 46770, 565831, 395303, 29083, 252738, -41028, 122159, -344821, -219147, 87571, 312666, 256925, 231751, 227411, 528907, 612869, 612818, 627206, 481965, 272768, 119206, 42960, 161357, 275507, 711809, 612037, 350498, -118296, 141553, 36384, 210413, 397825, 351654, 572305, 371802, 268814, 192237, 161296, 303445, 791369, 584431, 352296, 336664, 629255]
2202F29255r7356L9945j51529j67208J05559j08717L19719Q9123r9687k72869
2192B86235O28807j26874k73500M12426j44426k4512Q4332J7280j7037M1756l48861
2181E35626j17419k5793L644k35474O58381L49335l78027q391L4644K19904l49457
2170F86973J32978J36805R4689L79277j76192j46110J30456J88950J58493J117
2160A587436j25380K20895p1921J74969J76043J24496J20658k7553j01747J56352
2150B234248j8507k83242j00763M50055n0367k1118k7661j07813q0103N28292
2140B523021J09251q9412L37756K0358k059M4023k6801j34807J91136K5699L06701
2129C304866R2339L32190K51465J83253L37784M5563L9741j43613p7047L79861
$$ y = [629255, 531899, 571844, 420315, 253107, 358666, 249949, 569668, 658791, 559104, 286235, 915042, 788168, 514668, 927094, 782668, 758156, 842488, 859768, 842731, 884487, 535626, 418207, 392414, 396058, 160584, 818965, 1168300, 790273, 781882, 816526, 1036430, 686973, 819951, 956756, 1051445, 1430722, 1254530, 1108420, 1238876, 1427826, 1586319, 1587436, 1462056, 1682951, 1611030, 1785999, 1962042, 2086538, 2207196, 2179643, 2077896, 2234248, 2215741, 1932499, 1831736, 2281791, 2231424, 2210306, 2182645, 2074832, 1994729, 2523021, 2632272, 2542860, 2880616, 2900974, 2898915, 2942938, 2916137, 2781330, 2972466, 2998165, 3304866, 3397205, 3729395, 3980860, 4164113, 4501897, 4547460, 4587201, 4443588, 4366541, 4746402]
2119D746402N35938P2893l4665M99756N08078J8608J00799M88745K2385M66917
2109G425856K97945N6962K97656J1674N57647Q84040P82231O09158R27407R96679
2099A2847255J223605R15806M04741J016253J634673J201517J961519L081235
2091B4286604L259432M044853N002091O122021Q284452R704102R553657O841111
2083G7098323j98812p204957j0986141j1475756r795611p185541n030771l916351
2075B1304383k388862j557103j780866j319898j001176q76231r39106n58950l61858
2066A0520333j132395r81469o09208p57773k81438o20788l82823k17029o98796
2057D838614j42640l12864L7908k44933m87179J520j59159J04033M5715l02071
$$ y = [4746402, 5282340, 5355233, 5320568, 5820324, 6328402, 6347010, 6447809, 6936554, 6958939, 7425856, 7723801, 7780763, 8078419, 8090093, 8647740, 9531780, 10314011, 10923169, 11850576, 12847255, 14070860, 14986666, 15391407, 16407660, 18042333, 19243850, 21205369, 24286604, 27546036, 31590889, 36592980, 42715001, 50999453, 60703555, 70257212, 77098323, 76899511, 69694554, 58708413, 47232657, 37437046, 30251505, 25220734, 21304383, 18915521, 17358418, 15577552, 14257654, 13256478, 12380247, 11441141, 10882191, 10520333, 9387938, 8406469, 7797261, 7039488, 6758050, 6137262, 5754439, 5537410, 4838614, 4695974, 4383110, 4421018, 4176085, 3688906, 3690426, 3531267, 3635300, 3681015, 3378944]
2047C378944r0902j74199n0518K4885l54968l2020j5932p4627l07945l8565j24848
2036B139305M6543J96716n3314k91555k92569J89021j4553K5430P5356k24025
2026A796355q3314r7220k12020m0317q9709l02655Q8342Q7127r3882L67126N8379
2015A478212k32065m00081r4193r6723J60664j05473N4564j60582j37998L07481
2005G73806r4355J27030l5168L09653j68647l57664J44185k81350o0138j41787
1995B15565J41911K54170R9968p9489r3081J7730j56853K45746o6483k30049n3958
1984B95177k32241N03830L74071l82752Q937M4528L10008l13316K50534p3400
1974G85376m75992m14199R3910K03582l25786K52679J05227k90297K43092N34176
$$ y = [3378944, 3288042, 3113843, 3063325, 3088210, 2733242, 2701222, 2685290, 2610663, 2302718, 2264153, 2139305, 2185848, 2382564, 2329250, 2037695, 1745126, 1934147, 1919594, 1945024, 2020380, 1796355, 1713041, 1615821, 1403801, 1363484, 1273775, 971120, 1059462, 1146589, 1052707, 1419833, 1478212, 1246147, 846066, 751873, 655150, 815814, 710341, 764905, 604323, 466325, 773806, 679451, 806481, 771313, 1080966, 912319, 554655, 698840, 417490, 357352, 215565, 357476, 611646, 711614, 632125, 539044, 556774, 399921, 645667, 579184, 349135, 295177, 62936, 566766, 940837, 558085, 567022, 611550, 921558, 608242, 858776, 785376, 309384, -104815, -10905, 192677, -133109, 119570, 224797, -65500, 177592, 711768]
1964G11768k1158k14174r9620q1478j30357l5127K32404M4138p7183j96548j4858
1953A17807k45194M223M90282J66028J30148m75450L01646J45354j72138o6053
1943C96653l17772l56308K61107J39788l20225j27687M97577J24481q8817J62679
1933C71476j39443j25713l6098L19864m3402o0077Q8871j3440j98443k12341m9201
1922i7947r9871K76204L80833p4108m02319l7628K35839O9285J17704j47325r8425
1911A22242k8290m28003K36748P4051M0308P6825k38181n6615K4228J34230j98955
1900b41412r2608M98076k37160M9623K2317M9831N3609l24146J25505L00432L27265
1889E31332n10164P8592k0083k99482j21228N36078o2738k65199l1248k1060j38648
$$ y = [711768, 690610, 476436, 376816, 295338, 164981, 129854, 362258, 406396, 329213, 132665, 117807, -127387, -123164, 367118, 533146, 663294, 187844, 489490, 634844, 462706, 396653, 78881, -277427, -16320, 123468, -196757, -324444, 173133, 297614, 208797, 371476, 232033, 106320, 70222, 390086, 346684, 286607, 375478, 362038, 163595, -48746, -97947, -197818, 78386, 459219, 385111, -17208, -54836, 181003, 250288, 367992, 220667, 122242, 93952, -334051, -97303, -23252, 17056, 93881, -144300, -200915, -176687, -42457, -241412, -334020, 164056, -73104, -23481, -1164, 48667, 102276, -221870, -96365, 204067, 531332, 21168, 99760, 79677, -219805, -341033, 195045, 132307, -132892, -164140, -185200, -323848]
1878c23848L09550J70796k01455o1734R4186k173j29133j91160L13871j55612
1868a76712J21389J22655l38490m3323p7438L13594L6795m155J2326k89050J39200
1857a83209J88780J14020j00959k40665M54356m0005l2255m88560M4976j6739
1847c00260L0867m01107L7155O36549L87967k40795k30825P6437J35314L27555
1837D58857l21905l67294l0533l66595K72104j2317N54K05022q7294J59390N0120
1826c9891L00764n7617k20214j80474r969j51553K7359J89483O0912j11317k28216
1815d20733M28533K82332K02472l4017J63488J38429n38829J5034J14678j45402
1805B05985n0805m0416K34951K21924l79599l43872J37389Q6668J88390L8184
$$ y = [-323848, -14298, 156498, -44957, -106691, -12505, -14678, -143811, -334971, -21100, -176712, -55323, 67332, -271158, -314481, -391919, -78325, -41530, -45685, -33359, -322409, -183209, 5571, 119591, 18632, -222033, 232323, 192318, 160063, -328497, -283521, -300260, -269393, -670500, -633345, 3204, 391171, 150376, -80449, -4012, 131302, 458857, 136952, -230342, -260875, -627470, -355366, -367683, -367129, -162107, -249401, -90011, -39891, 260873, 203256, -16958, -197432, -207401, -358954, -331595, -142112, -81200, -192517, -420733, 7800, 290132, 492604, 458587, 622075, 760504, 221675, 236709, 351387, 205985, 155180, 114764, 349715, 571639, 192040, -151832, -14443, 72225, 260615, 298799]
1795B98799m45026P7058j19065q3884J34457J8608k6997K20565J87050k63044
1785a479k9155J19558j7531J03095j31250r5342j9295J98700J92995k33852o7940
1774A8504q2713N4568n6659m1889l0649o6753k88587J37880L4266J59858m789
1763a66963J67284M10550k87920N9448l95852j70574M15592P3416J87463O5099
1753C57543k7008m79788L41462p8969m37777N64522k88504k06890J56329R1064
1743h016j27788j22479M9834K99752j4079j82726K40899K7433r3960m8549n5755
1732c5434K59412n1872J6588j19089k78864j24261J92337j40165M16629j6407
1722A18874L1479J88785k81395l82533L89693p073r5878l0629Q9214j27181J60517
$$ y = [298799, -146227, -69169, -188234, -272118, -137661, -119053, -146050, 74515, 261565, -1479, -30634, 88924, 71393, 174488, 43238, -52104, -71399, 127301, 320296, 86444, 18504, -64209, -9641, -66300, -108189, -138838, -205591, -494178, -356298, -322032, -162174, -166963, 321, 410871, 122951, 182399, -213453, -384027, 31565, 104981, 292444, 357543, 330535, -149253, 192209, 113240, -324537, 239985, -48519, -255409, -99080, -8016, -135804, -258283, -208449, 91303, 77224, -105502, 135397, 162830, 68870, 20321, -35434, 223978, 172106, 188694, 69605, -209259, -333520, -141183, -281348, 135281, 118874, 150353, 339138, 57743, -324790, 64903, 57830, -38048, -68677, 20537, -106644, 53873]
1711E3873K41777q1735k20175l94910L04272J24609J11958P522l06525q6538K51234
1700E362m6401j1943P8111k28902k30452p6776k4242J61887K03532J67518m8888
1689e1194Q2138j36520J98266j66366k03128J77503O2657n0683j16829K7105l0069
1678b07120j75029K10034n10K52895p6573J24028K05179l55829j3075j73532L69231
1667A59699K18186j93488J43490n4835J89626l45693k34770J12092l06337J67649
1657a44381K40722r6669J29719l2628j60649m00842J91210K99790j9593o3157
1647e6478K22042P4256J1302K11824k60281m12404P7880K91277k41874k40546
1637c23002P3870R6237l14235K02107L59776R9354l581j72754J07676K19216j17872
$$ y = [53873, 295650, 213915, -6260, -401170, -96898, 27711, 139669, 147191, -159334, -245872, 5362, -41039, -52982, 25129, -203773, -434225, -511001, -535243, -373356, -169824, -2306, -51194, 30944, -105576, 92690, -73676, -276804, -99301, -36644, -87327, -204156, -177051, -207120, -382149, -172115, -172625, 80270, 3697, 127725, 332904, -22925, -36000, -209532, 159699, 377885, 184397, 327887, 273052, 462678, 116985, -117785, -5693, -312030, -144381, 96341, -328, 129391, 96763, -63886, -464728, -273518, 26272, 6679, -56478, 165564, 239820, 251122, 462946, 202665, -209739, -131859, 159418, -82456, -323002, -249132, -152895, -467130, -265023, 94753, 194107, 190526, 17772, 125448, 344664, 226792]
1626B26792j18958Q2675M378K94742j1850m88138j62862J11934j79232K10423
1616c0096K8298l1081K43580l21965K48917J39017K72594m20955o51317M99078
1606b3930j84950j2819J71186j85306J77078K52256k97800r9378J34252k36174
1596c05585J3914K9115R6091L37303k0693J07883j11002l7828O8802k26000p9158
1585a27158R4593j05739p0207J15379R7951j48616k75571o2542J39014K26469
1575a16427m00864K91893M43414k67502k2868K747J80528j18753J72693J59364
1565C24225J19808j31375l80659k59443N9191J34426K38767Q1346l80536J33263
1555f0987M29187m9552N0850K2550m0314L4396m44179J79390l1697k32368o7970
$$ y = [226792, 107834, 190509, 194887, 489629, 477779, -10359, -173221, -61287, -240519, -30096, -1798, -32879, 210701, -111264, 137653, 276670, 549264, 128309, -523008, -23930, -208880, -221699, -50513, -235819, -58741, 193515, -104285, -203663, -69411, -305585, -291671, -262556, -166465, 170838, 150145, 258028, 147026, 109198, 178000, -48000, -127158, -32565, -138304, -208511, -93132, 4819, -143797, -419368, -481910, -342896, -116427, -517291, -225398, 218016, -49486, -72354, -69607, 110921, -7832, 164861, 324225, 444033, 312658, -68001, -327444, -268253, -133827, 104940, 186286, -194250, -60987, 368200, 318648, 369498, 392048, 351734, 386130, -58049, 121341, 89644, -142724, -210694]
1544b10694M9179k59531J54785K23489J64879L02569j72451k19362j6903k52481
1534b36521K46406o079k57806J57739J6805J39256k0820j46640o383L5357R8486
1523A9800l79915r8666J61653L14349j221J19818L2129k43634l28974O9854k2169
1512c56976P1999j65883J26471j48302j55897Q41549J16786j31158j57208M7096
1502H8477k07475o8828j46677O2995Q208J23996L91557k37994J07436n4167K34115
1491C01643P8803j52060K31600k55176n0671k78342J2274j8010J8321m941R0393
1480b6166Q0142n48609L9238O1195J71760q7418K24720J57135k82912L59268J9905
1469A68258O4427p7065k6636M00604j40966l47820l7026m9387J92646n6388J4355
$$ y = [-210694, -161515, -421046, -266261, -42772, 122107, 424676, 252225, 32863, 15960, -236521, 9885, 3806, -254000, -96261, -79456, 59800, 38980, -107660, -114043, -78686, 19800, -360115, -458781, -297128, 17221, 16000, 135818, 167947, -75687, -404661, -334807, -356976, -284977, -450860, -324389, -472691, -628588, 212961, 329747, 198589, 41381, 88477, -118998, -187826, -334503, -271508, -263300, -139304, 252253, 14259, 121695, 67528, 301643, 380446, 228386, 459986, 204810, 154139, -124203, -111929, -129939, -111618, -116559, -26166, 53976, -494633, -455395, -394200, -222440, -309858, -85138, 71997, -210915, 148353, 168258, 232685, 155620, 128984, 529588, 388622, 40802, 3776, -45611, 147035, 90647, 105002]
1458A05002L2126J01353j02134p2669j06232j31923L22122m0454k1354j25817
1448c9980p0364M8889o2106o3896L8709o6049l5366J63333K92244M7367p2628
1437A80153O4407j07826k17758K4854K3128K2680J95396m23074J50847J08007
1427B0814m0005j78144r046M0556l779N06700K66611m14835j64546j94078Q6537
1416h3215K46450O6137q3395j30746p0532k94335K96592K94633k88132k36003
1406b82546L06597L04304m879l55281J32574J12862j11067l2424L39748j49444
1396B60444k03503J02841m07943o3143J76521O1474M431L96890n832l8439j4962
1385B68779l31780L07863L0428M752K54854r9964k29701n11560L30482q2133J33790
$$ y = [105002, 137128, 238481, 136347, 63678, -42554, -174477, 147645, 107191, 85837, -39980, -110344, -61455, -123561, -187457, -148748, -214797, -250163, -86830, 205414, 252781, 180153, 244560, 136734, -81024, -56170, -33042, -10362, 185034, -238040, -87193, 20814, -19191, -197335, -206381, -165825, -169604, 337096, 603707, 188872, 24326, -169752, -83215, 163235, 229372, 145977, 15231, -55301, -349636, -53044, 241589, -46543, -282546, 24051, 328355, 323476, -31805, 100769, 213631, 102564, 70140, 409888, 260444, 56941, 159782, -248161, -311304, -134783, -73309, -68878, 328012, 322180, 283741, 268779, -63001, 244862, 275290, 280042, 534896, 434932, 205231, -306329, 24153, -57980, 75810]
1374G5810j64284n24331K65712K98445L0367r7579j51253K11536n4058k54127
1364c63762J80278K33761l35370K49820j49255J73926L42277l86519j37960K03148
1354A0344J45830k39167j82991M50533P1445n22196J31209o5230J82882k82267
1344b99608L36197L9988J16407k47798m883K3944l26364j56681N18468K01279
1334B00949k73961o2693Q0380j67L5088l74048j61083K14064M23502K46308m63759
1323a35420L1519J5428j302k04236K41639l7874j48488J24800k84957l3389r0240
1312e22520M9536k8289K75314K36168j42396k0941j42413P6523J16104k0541J09202
1301a4253J16801K7698n0689N17307l5688l80808k1180q029O056k67039j32165
$$ y = [75810, -88474, -612805, -347093, -48648, -18281, -115860, -267113, -55577, -109635, -363762, -183484, 50277, -285093, -35273, -184528, -10602, 331675, -54844, -192804, 10344, 156174, -82993, -265984, 184549, 255994, -266202, -134993, -200223, -17341, -299608, 36589, 76577, 192984, -54814, -59697, -35753, -362117, -518798, -330, 200949, -73012, -135705, -55325, -55492, -20404, -394452, -555535, -341471, 82031, 328339, -135420, -103901, -88473, -89775, -294011, -52372, -90246, -238734, -113934, -398891, -432280, -522520, -472984, -501273, -225959, 10209, -132187, -153128, -295541, -219018, -102914, -123455, -14253, 102548, 130246, 79557, 596864, 561176, 180368, 159188, 151159, 157215, -109824, -241989]
1290b41989K81121K9263j07762J45637l355K8143l71581N0575J41837J70731J43137
1279B65757m92058l0884K84476j99845k89572J65859l2023N9895R3341L33672
1269A58618j12888q6041L1493k18191J912j74021J16379J82328n3364Q1092K17646
1258A44963O2140n7511l31884j06898L15697k53298K94364L95030m34691k57169
1248b29257k7684l59964M29304R434M5183K04621k8981K07048l1644M39852m64056
1237A93856m28565O0178J06569l6332L62028M9045m1006j70999l49351j07720
1227c62297k0846J03075J49068q5974n6663J92882M9075O6904k13293j84238J48233
1216b14074K22700o1832j98875Q3068p7799K18334O5809J50031K36943l2268n2537
$$ y = [-241989, 39132, 68395, -39367, 106270, 102915, 131058, -240523, -189948, -48111, 122620, 265757, -226301, -257185, 27291, -172554, -462126, -296267, -328290, -268395, -175054, 158618, 45730, -40311, -8818, -227009, -225097, -399118, -282739, -100411, -153775, -72683, 144963, 207103, 149592, -182292, -289190, 26507, -226791, 67573, 462603, 27912, -229257, -256941, -616905, -187601, -178167, -132984, 71637, 42656, 249704, 218060, 657912, 193856, -234709, -174531, -67962, -104294, 257734, 306779, 265773, 94774, -254577, -362297, -383143, -280068, -131000, -216974, -273637, -80755, -31680, 35224, -178069, -362307, -214074, 8626, -53206, -252081, -169013, -246812, -28478, 37331, 187362, 424305, 392037, 339500]
1205C39500J70625O5318q5002k22280k12231J08969j4455l5693j43321l99725
1195d28295L06313j14883M73869J26685J69396j17745k35165Q733q6999O6952
1185A68861o3947j24560J3889J74111N1755j53198j60725R425j74964J67053L44731
1174B52431J3360l14932m28162O5059K26449K43023K70949P0300k51555k97845
1164a50923N4326K38799J26950n75199j03024L99813J52591n5667K09053L56515
1154F53234n51777o9903k2123j9009j71780k2113K18305n6402k6795J84534L47377
1143D63548m02852l22230k8635L56971J90569J60363n42179l08469L44206j52659
1133b41367j69472K90438M1476L99564K31476K43130n49145K32771L0016l00285
$$ y = [339500, 510125, 575443, 490441, 268161, 55930, 164899, 150444, 114751, -28570, -428295, -121982, -236865, 237004, 363689, 533085, 415340, 180175, 188908, 101909, 168861, 104914, -19646, -5757, 168354, 220109, 66911, -93814, -84389, -259353, -92300, 252431, 265791, -49141, -477303, -412244, -185795, 57228, 328177, 398477, 146922, -150923, -96597, 142202, 269152, -306047, -409071, -9258, 143333, 87666, 296719, 653234, 101457, 31554, 9431, -9578, -181358, -203471, 14834, -41568, -68363, 116171, 463548, 60696, -261534, -290169, 66802, 257371, 417734, -124445, -432914, -88708, -241367, -410839, -120401, -78925, 320639, 552115, 795245, 246100, 478871, 508887, 208602]
1123B08602j64436k2339J04000j41332m0149L55411J15784J73648N1636n85206
1113E5619k69162m2086K01653O5431N9540k12107l69970O9191m977L94768o8499
1102a20599J89551J19597j77309r7027Q1061n02958N4507M89884n39O4005L1752
1091A31925j63817O6839Q7659k73215R1723L31673r7903m60104K33829K6277n0515
1080g5629j48211L51906p4190j13805N5462j10837P5705N4559l24070j23242K56264
1069a76088Q7084L17682K29774l29862M7444P842k02701M890k26050J82693J66301
1058A09009m831j58825o6032N0551M18112j69036j93516J60073J35550k19252
1048F1803Q5482k2075k39462n5911R3414K01936m77518J3277Q0376J63961j6953
$$ y = [208602, 44166, 21827, 125827, -15505, -55654, 299757, 415541, 589189, 640825, 55619, -213543, -255629, -53976, 11455, 70995, -141112, -511082, -441891, -446868, -52100, -120599, 68952, 188549, 11240, -85787, -4726, -507684, -453177, 36707, 36168, 100173, 131925, -31892, 34947, 122606, -150609, -58886, 272787, 174884, -285220, -51391, -25114, -75629, -223840, 128066, 53876, -59929, -4467, -115304, -39599, 14960, -309110, -432352, -176088, -89004, 228678, 458452, 128590, 176034, 183876, -18825, -13935, -239985, -57292, 109009, 104178, -54647, -120679, -70128, 347984, 178948, -14568, 145505, 281055, 61803, 147285, 125210, -114252, -170163, -76749, 125187, -352331, -339054, -258678, -94717, -111670]
1037a11670l8034J9711J06791J85642J12669j17576P0220K1374J77988n87014
1027a59899L80039K46197l14662k56417K2820J77443M61260P6409j98909j90824
1017B43457J33087r5876j71601m54403J50017L82965j48343K65562L4093j82867
1007A56091R0484k3423K68963l97603k55792O66731o16289o9474L33739n5938
997I7489j00848J25223M5397k63061K07711K59862n5971k66401j14119L77219
987C12501l24475o283J33873j87189O9398j8172J47298k15321j33510J55135j01621
976a68366k97592K27534J67172j4662k61064L44751M24030k30136k1368j11636
966E8663J94062l15090j638O3955R7490P3148k6401m42338J78042L83214Q6024
$$ y = [-111670, -149704, -129993, -23202, 162440, 275109, 157533, 227753, 249127, 427115, -159899, 220140, 466337, 151675, -104742, -81922, 95521, 556781, 633190, 434281, 243457, 376544, 280668, 109067, -345336, -195319, 187646, 39303, 304865, 338958, 156091, 246575, 223152, 492115, 94512, -161280, 505451, -110838, -180312, 153427, 97489, -3359, 121864, 167261, -95800, 111911, 371773, 315802, 49401, -64718, 312501, -11974, -18257, 115616, -71573, -2175, -20347, 126951, -88370, -221880, -66745, -168366, -465958, -238424, -71252, -85914, -346978, -2227, 421803, 191667, 170299, 58663, 252725, -62365, -64003, -48, 97442, 170590, 144189, -298149, -120107, 263107, 349131]
955C49131L3058j35069L05627l67931q8356N3141r6680j18305K1608K41868l0366
944A67726N1831k59630j00192J91250J67150k66018m18141j83966L08036K03349
934a38605j51272K02414K75418J4178j47236r3602j05857O3799K01723o5876J70024
923B25108j5159l8079p0562K40168o6168j31907m02330K51715J35882j66572K14107
$$ y = [349131, 382189, 247120, 552747, 184816, 96460, 149601, 52921, -65384, -43776, 198092, 167726, 219557, -40073, -140265, 50985, 218135, -47883, -466024, -649990, -341954, -138605, -289877, -87463, 187955, 202133, 54897, -38705, -144562, -80763, 120960, 55084, 225108, 209949, 171870, 101308, 341476, 275308, 143401, -258929, -7214, 128668, -37904, 176203]
$$ [...]
##END NTUPLES=NMR SPECTRUM
##END=
