##TITLE=1H_CA-9031-3
 CDCl3
 8 sc, 
 7.07.2022
##JCAMPDX= 6.0         $$ Bruker NMR JCAMP-DX V2.0
##DATA TYPE= NMR SPECTRUM
##DATA CLASS= NTUPLES
##ORIGIN= UXNMR, Bruker Analytische Messtechnik GmbH
##OWNER= root
$$ XWIN-NMR		Version 3.5
$$ Thu Jul  7 13:54:44 2022 Russian Standard Time (UT+4h)  she@DPX200
##.OBSERVE FREQUENCY= 200.1313499994
##.OBSERVE NUCLEUS= ^1H
##.ACQUISITION MODE= SIMULTANEOUS
##.ACQUISITION SCHEME= undefined
##.AVERAGES= 8
##.DIGITISER RES= 18
##SPECTROMETER/DATA SYSTEM= spect
##.PULSE SEQUENCE= zg30
##.SOLVENT NAME= CDCl3
##.SHIFT REFERENCE= (INTERNAL, CDCl3, 0, 15.7392)
##AUDIT TRAIL= $$ (NUMBER, WHEN, WHO, WHERE, WHAT)
$$ ##TITLE= Audit trail, XWIN-NMR		Version 3.5
$$ ##JCAMPDX= 5.01
$$ ##ORIGIN= Bruker BioSpin GmbH
$$ ##OWNER= she
$$ F:/spectra/data/she/nmr/H-F/1/pdata/1/auditp.txt
$$ ##AUDIT TRAIL=  $$ (NUMBER, WHEN, WHO, WHERE, WHAT)
(   1,<2022-07-07 13:53:29.35 +0400>,<she>,<DPX200>,
      <created by zg, POWCHK disabled, PULCHK disabled
       configuration hash MD5:
       00 E9 B6 7A A2 85 ED C7 34 08 36 98 17 FE 4E 26
       data hash MD5: 16K
       8B A9 F5 B5 22 64 3C 77 D0 D2 2A 1F C5 BD 91 68>)
(   2,<2022-07-07 13:53:32.23 +0400>,<she>,<DPX200>,
      <Start of raw data processing
       efp BC_mod = 2 LB = 0.24 FT_mod = 6 PKNL = 1 PHC0 = -18052.86 PHC1 = 4.800691 SI = 16K 
       data hash MD5: 16K
       9E 87 7A 30 4E F8 50 E0 36 2A 48 C1 18 DA 3A B3>)
(   3,<2022-07-07 13:53:53.46 +0400>,<she>,<DPX200>,
      <pk PHC0 = -18.12767 PHC1 = 22.59999 
       data hash MD5: 16K
       E9 65 D0 8C 5E CF AD 59 F8 57 C0 C5 90 4F F7 70>)
(   4,<2022-07-07 13:53:58.09 +0400>,<she>,<DPX200>,
      <abs ABSG = 5 
       data hash MD5: 16K
       81 BC CB D1 60 2C D9 E7 61 94 5D 3D 51 5A D5 D5>)
$$ ##END=
$$ 
$$ hash MD5
$$ B0 72 A2 36 A4 49 4F 06 E8 BA A4 6B 30 6E 81 2F
##$RELAX= 
##$RELAX= 
##$RELAX= 
##$RELAX= 
##$RELAX= 
##$RELAX= 
$$ Bruker specific parameters
$$ --------------------------
##$DU= <F:/spectra>
##$EXPNO= 1
##$NAME= <H-F>
##$PROCNO= 1
##$TYPE= <nmr>
##$USER= <she>
##$AMP= (0..31)
100 100 100 100 100 100 100 100 100 100 100 100 100 100 100 100 100 100 
100 100 100 100 100 100 100 100 100 100 100 100 100 100 
##$AQSEQ= 0
##$AQ_mod= 1
##$AUNM= <au_zg>
##$AUTOPOS= <>
##$BF1= 200.13
##$BF2= 200.13
##$BF3= 200.13
##$BF4= 200.13
##$BF5= 200.13
##$BF6= 200.13
##$BF7= 200.13
##$BF8= 200.13
##$BYTORDA= 1
##$CFDGTYP= 0
##$CFRGTYP= 5
##$CHEMSTR= <none>
##$CNST= (0..31)
1 1 145 1 1 1 1 1 1 1 1 1 1 1 1 1 1 1 1 1 1 1 1 1 1 1 1 1 1 1 1 1 
##$CPDPRG= <>
##$CPDPRG1= <>
##$CPDPRG2= <>
##$CPDPRG3= <>
##$CPDPRG4= <mlev>
##$CPDPRG5= <mlev>
##$CPDPRG6= <mlev>
##$CPDPRG7= <mlev>
##$CPDPRG8= <mlev>
##$CPDPRGB= <>
##$CPDPRGT= <>
##$D= (0..31)
0 1.2 0 0 0 0 0 0 0 0.06 0 0.03 0 0 0 0 0.0002 0 0 0 0 0 0 0 0 0 0 0 0 
0 0 0 
##$DATE= 1657187608
##$DBL= (0..7)
120 120 120 120 120 120 120 120 
##$DBP= (0..7)
150 150 150 150 150 150 150 150 
##$DBP07= 0
##$DBPNAM0= <>
##$DBPNAM1= <>
##$DBPNAM2= <>
##$DBPNAM3= <>
##$DBPNAM4= <>
$$ [...]
##$SUBNAM2= <"">
##$SUBNAM3= <"">
##$SUBNAM4= <"">
##$SUBNAM5= <"">
##$SUBNAM6= <"">
##$SUBNAM7= <"">
##$SUBNAM8= <"">
##$SUBNAM9= <"">
##$SW= 18.0517283424941
##$SWIBOX= (0..15)
0 0 2 0 0 0 0 0 0 0 0 0 0 0 0 0 
##$SW_h= 3612.71676300578
##$TD= 16384
##$TD0= 1
##$TE= 0
##$TE2= 300
##$TE3= 300
##$TEG= 300
##$TL= (0..7)
0 120 120 120 120 120 120 120 
##$TP= (0..7)
150 150 150 150 150 150 150 150 
##$TP07= 0
##$TPNAME0= <>
##$TPNAME1= <>
##$TPNAME2= <>
##$TPNAME3= <>
##$TPNAME4= <>
##$TPNAME5= <>
##$TPNAME6= <>
##$TPNAME7= <>
##$TPOAL= (0..7)
0.5 0.5 0.5 0.5 0.5 0.5 0.5 0.5 
##$TPOFFS= (0..7)
0 0 0 0 0 0 0 0 
##$TUNHIN= 0
##$TUNHOUT= 0
##$TUNXOUT= 0
##$USERA1= <user>
##$USERA2= <user>
##$USERA3= <user>
##$USERA4= <user>
##$USERA5= <user>
##$V9= 5
##$VALIST= <valist>
##$VCLIST= <CCCCCCCCCCCCCCC>
##$VD= 0
##$VDLIST= <DDDDDDDDDDDDDDD>
##$VPLIST= <PPPPPPPPPPPPPPP>
##$VTLIST= <TTTTTTTTTTTTTTT>
##$WBST= 1024
##$WBSW= 4
##$XGAIN= (0..3)
0 0 0 0 
##$XL= 0
##$YL= 0
##$YMAX_a= 199768
##$YMIN_a= -182033
##$ZGOPTNS= <>
##$ZL1= 120
##$ZL2= 120
##$ZL3= 120
##$ZL4= 120
##$ABSF1= 15.74579
##$ABSF2= -2.30606
##$ABSG= 5
##$ABSL= 3
##$ALPHA= 0
##$AQORDER= 0
##$ASSFAC= 0
##$ASSFACI= 0
##$ASSFACX= 0
##$ASSWID= 0
##$AUNMP= <proc_1d>
##$AZFE= 0.1
##$AZFW= 0.1
##$BCFW= 0
##$BC_mod= 2
##$BYTORDP= 0
##$COROFFS= 0
##$CY= -3
##$DATMOD= 1
##$DC= 0
##$DFILT= <>
##$DTYPP= 0
##$F1P= 0
##$F2P= 0
##$FCOR= 1
##$FTSIZE= 16384
##$FT_mod= 6
##$GAMMA= 0
##$GB= 0
##$INTBC= 1
##$INTSCL= 0
##$ISEN= 128
##$LB= 0.24
##$LEV0= 0
##$LPBIN= 0
##$MAXI= 10000
##$MC2= 0
##$MEAN= 0
##$ME_mod= 0
##$MI= 1.114404
##$NCOEF= 0
##$NC_proc= -8
##$NLEV= 6
##$NOISF1= 3.799351
##$NOISF2= 2.8
##$NSP= 0
##$NTH_PI= 0
##$NZP= 0
##$OFFSET= 15.73918
##$PC= 1
##$PHC0= -18070.99
##$PHC1= 27.40068
##$PH_mod= 1
##$PKNL= yes
##$PPARMOD= 0
##$PSCAL= 0
##$PSIGN= 0
##$REVERSE= no
##$SF= 200.130006476297
##$SI= 16384
##$SIGF1= 3
##$SIGF2= 2
##$SINO= 5.538805
##$SIOLD= 16384
##$SREGLST= <1H.CDCl3>
##$SSB= 0
##$STSI= 16384
##$STSR= 0
##$SW_p= 3612.71676300578
##$SYMM= 0
##$S_DEV= 0
##$TDeff= 16384
##$TDoff= 0
##$TI= <>
##$TILT= no
##$TM1= 0
##$TM2= 0
##$TOPLEV= 0
##$USERP1= <user>
##$USERP2= <user>
##$USERP3= <user>
##$USERP4= <user>
##$USERP5= <user>
##$WDW= 1
##$XDIM= 16384
##$YMAX_p= 311878832
##$YMIN_p= -1402111
$$ End of Bruker specific parameters
$$ ---------------------------------
##NTUPLES= NMR SPECTRUM
##VAR_NAME=  FREQUENCY,     SPECTRUM/REAL,   SPECTRUM/IMAG
##SYMBOL=    X,             R,               I
##VAR_TYPE=  INDEPENDENT,   DEPENDENT,       DEPENDENT
##VAR_FORM=  AFFN,          ASDF,            ASDF
##VAR_DIM=   16384,         16384,           16384
##UNITS=     HZ,            ARBITRARY UNITS, ARBITRARY UNITS
##FACTOR=    0.220516191357247, 1,           1
##FIRST=     3149.88211752227, 0,            0
##LAST=      -462.83464548351, 0,            0
##MIN=       -462.83464548351, -1402111,     0
##MAX=       3149.88211752227, 311878832,    0
$$ Real data points
##PAGE= N=1
##DATA TABLE= (X++(R..R)), XYDATA
$$ [...]
8611 14366089 14916568 15499709 15815629 16425892 17142500 17232655 17748375 19027444 19488393
8602 19488393 19519745 19205592 19161589 19934073 19645617 19158668 18924807 19465705 19510751 19587086
8592 19587086 20407494 20315704 20029193 19618614 20008533 21013806 20964222 21362386 21964940 22529261
8582 22529261 22889615 23450204 23972237 24339304 25270436 25806191 26916709 27370445 28319386
8573 28319386 28923216 29325153 30925630 31465642 32405801 33264470 34250971 35531423 36623201
8564 36623201 37255326 36859563 37311184 37621655 37018186 37728864 37719978 37164013 36508393 36676432
8554 36676432 37435742 36542061 36098210 36417351 36702502 36436980 36151878 36867771 36714126
8545 36714126 36809117 36932717 37344861 38084341 38472739 38633239 39171632 39450958 39777619 40709453
8535 40709453 41267857 41001862 41287395 42158180 42845413 43082705 43398889 43138700 43803624
8526 43803624 44649244 44760268 44870949 45407653 45264592 44872797 44960161 44661086 44195620 43405875
8516 43405875 43011437 43095577 43420941 42742940 42376167 41934125 41650609 41780577 41181355 40347035
8506 40347035 40184439 40337549 39327287 39134450 39456479 39017361 38495556 38693116 38898938
8497 38898938 38670397 38795924 38773469 38428169 38298253 38169666 37570178 37272762 36951878 36816183
8487 36816183 36640970 36354113 36210415 35392219 35038401 34921971 34941311 34721339 34161147 34317026
8477 34317026 33649032 33115509 32905657 32633947 31995755 31303902 30417136 29946019 29878084 29405427
8467 29405427 28773489 28443481 27721743 26994203 27001986 26990282 25939666 25340796 25102134 24849078
8457 24849078 25006926 24455523 23950665 23260433 22984402 23300803 22397777 21624672 21468477
8448 21468477 21826646 21096823 20473223 20791207 20203876 19513512 19380882 19509069 19150677
8439 19150677 18623985 18759710 18226677 17616218 17273323 17202728 16532871 15840668 15978097 16095306
8429 16095306 15583841 14863030 14944114 14846079 14048225 14287484 14030279 13537778 12954289 12357973
8419 12357973 12774340 13155094 12889950 11988499 11667871 11785694 10795423 10646114 10801384
8410 10801384 10508594 10603053 10133270 10542948 10296226 10104156 10108262 9309923 9626303 8882277
8400 8882277 8857167 9088822 8708762 8481411 8202571 8545578 8474376 8102993 7570451 7515129
8390 7515129 8265130 7819309 7545828 7495231 6659754 7367627 6811097 6279956 6538583 6720483
8380 6720483 7292407 6893806 6841076 6392041 5517227 6108650 6348513 6437447 5217252 5452536
8370 5452536 5712451 5506622 5352519 4933973 5158398 4674671 4584219 5165489 4885082 4686344
8360 4686344 4593753 4635182 4316557 4603904 4749842 4236314 4186706 4498807 4393163 4582656
8350 4582656 4285543 4213651 4346807 4241884 3899794 3830591 4499047 3292929 3258055 3297897
8340 3297897 3233349 3560287 3037817 3236586 3425092 3821613 3695140 3761893 3777249 3292747
8330 3292747 3157643 3189527 3058293 3014933 2930392 2369034 2783204 3358157 2897807 2707100
8320 2707100 2633974 2335092 1700277 1990994 2324111 2365973 2670502 2337586 2015147 2526610
8310 2526610 3019787 2167928 2074241 2775381 2691433 2288161 1928515 1650546 1834830 1750934
8300 1750934 2045400 2443420 2518104 1633028 1414756 1952814 2367833 2107243 1947800 1799944
8290 1799944 2178899 1948074 1653276 1597883 1845800 1825954 2128858 1720404 1361859 2024293
8280 2024293 1909637 1198210 1387739 1518730 1515839 1615834 1577161 1733217 1378994 1385495 1374145
8269 1374145 1392811 1181137 1063672 1333768 1320175 683566 503076 860225 1229148 1420034
8259 1420034 1196378 546260 854655 1726198 1988441 1138355 846554 906365 1068704 1265103
8249 1265103 1409407 809409 505442 806795 44056 156323 745426 1135745 650919 -175483
8239 -175483 553872 888650 810411 563107 435548 706939 207007 509162 883559 360862
8229 360862 -40907 448966 1654714 1167712 517837 660392 1015467 1009671 494196 568510
8219 568510 822974 782508 107963 377406 1003374 437398 240079 375563 403947 478384
8209 478384 1014643 642160 110434 380942 323634 -224764 468216 800993 551019 -112319
8199 -112319 70557 224078 211148 35205 206357 534551 382594 1586865 1047080 605176
8189 605176 -204812 -566409 -272870 304323 -52337 -15843 4686 5837 418208 213738
8179 213738 420398 444680 167752 -73979 -451826 -112867 174927 -185750 -66222 680300
8169 680300 470159 -337298 -168063 128472 -87616 205472 351309 -57449 -436181 -108898
8159 -108898 194517 163565 162902 73825 -167160 -349415 377699 -110976 -218783 196280 612624
8148 612624 377742 -196355 129241 625584 57825 -271151 -38898 -76209 -318897 -258974
8138 -258974 -133882 -258376 48044 -217351 -455922 -259896 153997 -78095 -328291 96544
8128 96544 200075 14967 -706632 -121451 10281 -117219 -106706 -190410 142058 167944
8118 167944 -59143 -331896 -284253 133236 -158184 -121853 313843 657329 172446 -373422
8108 -373422 510264 388332 -274193 -508466 -266595 139883 -296036 -207530 75823 290478
8098 290478 -214917 -763677 -287214 -67626 -349258 -1006115 -555543 99977 374367 -182443
8088 -182443 -289018 -68716 -30913 -14356 148074 142962 31247 86184 -63228 -771628 -270614
8077 -270614 45277 -204855 -982351 -491290 -233856 -452691 -600789 -536107 -162579 -768065
8067 -768065 -683359 -72853 -32574 -413339 -393575 -273206 -424739 -749781 -694143 -847053
8057 -847053 -636684 -453149 -86920 -356859 -542835 -628587 -587564 -295360 -345059 41616
8047 41616 -89541 -387243 -609754 -459639 -281529 -748191 -471917 -294387 -334505 -413394
8037 -413394 -594876 -285937 -311820 -609303 -177994 -501992 -228892 285499 -91546 -210644
8027 -210644 -292280 -95053 10396 -570020 -435544 96749 199341 -427634 -501744 -484105
8017 -484105 -706547 -91681 9906 -831614 -379963 -44853 -216624 65052 144772 102834
8007 102834 -285859 -367787 -465719 -803343 -784215 -1028031 -480348 -517104 -314595 -178053
7997 -178053 -396888 -356590 -495638 -296528 -809120 -549414 -133918 -706246 -752637 -405588
7987 -405588 -408256 -338561 -759846 -372640 -63988 -460112 -742565 -565545 -154460 -624153
7977 -624153 -987570 -453569 -380726 -103022 -528972 -315392 -135091 -544678 -602051 -648151
7967 -648151 -455658 -705232 -949003 -686685 -358609 -230130 -47015 -514136 -791743 -180636
7957 -180636 -96969 -626436 -388657 -453345 -739259 -887684 -392437 -380852 -519057 -545699
7947 -545699 -1003785 -163667 -1270 -889930 -1199756 -607375 -608582 -1133108 -1039651 -609836
7937 -609836 -587403 -237657 -985574 -717238 26901 -320005 -354635 -407806 -268700 -608855
7927 -608855 -242493 -192901 -578100 -431576 -971303 -694141 -771417 -750472 -574397 -525421
7917 -525421 -847550 -774703 -351740 -929834 -918046 -437518 -877853 -482742 -510633 -466511
7907 -466511 -932525 -947917 -436016 -704980 -78735 -275707 -590953 -137659 -611213 -325190
7897 -325190 -98042 -597016 -564234 -528605 -8518 -427456 -475603 -23347 183978 -333300
7887 -333300 -712461 -269727 -196358 -738796 -644247 -520958 -29090 -841 -542611 -787643
7877 -787643 -533202 -692013 -508742 -200591 -110285 -633130 -699853 -526798 -251086 145829
7867 145829 -474515 -1029923 -265749 -93462 -124567 -107551 -525308 -973730 -697920 -208114
7857 -208114 74637 -34828 -208047 -489349 -424724 -38609 -127713 -399964 -94407 -49059
7847 -49059 -442552 -736819 -541748 -521809 -549605 -521568 -761265 -285928 -165747 -723210
7837 -723210 -1142824 -983101 -225900 88665 -160006 -58343 -287364 -559493 -539965 -296806
7827 -296806 -1066536 -1000170 -111609 -315798 -63404 -257976 -527556 -1402111 -1153995 -298786
7817 -298786 883397 1221764 -1191422 -671030 -473491 -467188 -391817 -534003 -728875 -549529
7807 -549529 -362910 -613002 -615303 -699924 -583540 -121024 57763 -225454 -519462 -438078
7797 -438078 -443044 -667918 -1041820 -711878 -754332 -761009 -518470 -1037247 -748259 -426167 -108559
7786 -108559 -524886 -1180369 -645351 -824819 -1195787 -995573 -511218 -214496 -777637 -568250
7776 -568250 -505651 -701640 -534461 -80477 -516262 -901949 -861952 -981008 -478785 -729690
7766 -729690 -1245758 -770780 -408852 -127982 -221415 -365867 -461824 -561351 -129586 -36689
7756 -36689 -435582 -924162 -575068 -69691 -671606 -1024940 -590726 40639 -187719 -428817
7746 -428817 -305659 -507305 -373412 89840 -358846 -637811 -440687 -856771 -730786 -444134
7736 -444134 -296604 -686975 -796735 -243364 -565817 -909212 -807410 -273648 -218288 -533836
7726 -533836 -230780 -374232 -384429 -724241 -625721 -230669 -538116 -431574 -453681 -400469
7716 -400469 -862973 -1155331 -866421 -881082 -90887 -222551 -255530 204905 -315181 -118435
7706 -118435 -326790 -849315 -503875 -313977 51150 -408430 -595318 -365455 216384 -121510
7696 -121510 -1335845 -1010818 -281382 -831026 -837133 -747029 -717911 -460352 -89856 -156048
7686 -156048 -1150110 -606375 -319144 -726280 -660833 -355971 -47233 -510704 -194630 -1533
7676 -1533 -892522 -542362 -117314 56583 -936912 -1055021 -250894 -480745 -1095766 -1138946
7666 -1138946 -854672 -638348 -501226 -253720 -458219 -815519 -379285 -30877 -666873 -1157938
7656 -1157938 -481865 -515738 -801783 -221714 181491 -232270 -711387 -769947 -410630 140441
7646 140441 -380201 -1006235 -157844 -193381 -929758 -868157 24083 -85542 -869603 -990295
7636 -990295 -980215 -201518 -626101 -937952 -542414 -205812 -183436 -185168 -88573 -657707 -495025
7625 -495025 -397360 -466633 -541747 -897547 -224149 -300253 -75357 133863 -500093 -645119
7615 -645119 -498991 75239 -38645 -380736 -309322 -106999 -157415 -545014 -1259073 -366716
7605 -366716 -724051 -1329798 -839627 -229466 95265 -833905 -197335 -293776 -676447 -368692
7595 -368692 -349239 -274302 -408526 -30765 -32556 -389321 -194617 -681474 -157419 188812
7585 188812 16158 -368809 -962721 -165722 -57715 46430 -56621 -574912 -85302 -427224
7575 -427224 -480610 -567825 -886760 -634936 -1093176 -1099565 -746844 293005 -220099 -811467
7565 -811467 -310181 -558702 -288278 -245888 -331738 -669062 -651984 -245641 -542960 -556969
7555 -556969 -527318 -553366 -371044 -949916 -401100 -341841 -435797 -757082 -1066489 -50304
7545 -50304 496174 -201960 -958829 -906479 -357311 -264472 -286530 -508291 -613169 -385171
7535 -385171 -1008999 77129 269738 -666835 -1114827 16999 250942 -162875 106101
7526 106101 -618034 -539497 -333076 -95520 151501 -759549 -773436 -472350 -585623 -679308
7516 -679308 -155755 -149422 -847215 -65745 -53817 -230546 -255721 -784223 -727697 -544025 -213364
7505 -213364 -339247 -382723 -447120 -874599 -649812 -621092 -436302 106830 -174773 102378
7495 102378 -116897 -122314 -53141 167364 -29301 -537408 -478348 -472144 -313418 -46582 -350287
7484 -350287 -962125 -198166 589069 -325504 -369076 -596612 -584076 -139070 -235475 75427
7474 75427 -194151 -312597 -645912 99037 246335 -586531 -243898 -180787 -515852 -5232
7464 -5232 354463 135235 -254245 -574110 -593372 60014 -14627 -611720 -476137 -87388
7454 -87388 -157149 -299089 -414126 -627429 -1139880 -613655 5442 459303 -27808 -896115
7444 -896115 -56202 223415 -63994 -2418 166333 -433519 -472938 225932 -366398 -463800
7434 -463800 26456 18339 -309423 -73008 -118453 -279287 -694905 -752585 -394383 78232
7424 78232 -809295 -1205655 -359319 -10683 -246682 -684908 145522 -53442 -608023 -352568
7414 -352568 6351 192424 -250911 -362025 -327569 -246751 -92900 -840156 47253 444064
7404 444064 89155 -406068 -722513 137180 -12811 -783416 -390048 254027 266237 -790461
7394 -790461 -439949 485425 319748 -261384 -1113204 118201 520796 -476012 -855862 -358393
7384 -358393 -116598 -1138263 -514800 166833 -27261 -37336 -312394 216666 -55575 -255347
7374 -255347 -618499 -596876 -137467 -569971 -613128 -502285 -60491 67392 -184000 64973
7364 64973 -12323 -53011 -470242 -755623 -303115 -338579 -590093 32706 232547 -31418
7354 -31418 -166121 -256066 -349815 29755 409478 -167947 -254832 -91525 5664 -292655 221554
7343 221554 191144 -160928 475184 363696 91477 -229665 -681999 -265463 -83979 -399327
7333 -399327 -46382 32092 -399946 -549107 -549837 -346572 -278754 -411481 -560145 -307998 74375
7322 74375 -92219 -65143 299664 135471 -630563 174652 399178 367591 96769 -203802
7312 -203802 -115893 -277596 -329732 -122697 164265 -303948 -469634 -24232 -128245 -116290
7302 -116290 -139353 -633407 -544104 41862 112613 -449687 -269588 -507235 -630562 -527139
7292 -527139 -522617 44308 18567 -82026 29475 680669 566455 12881 -118362 -331734
7282 -331734 113682 -180028 -224791 27337 -119214 -107670 19467 83377 -94462 -566872
7272 -566872 -235714 -205266 -439726 -672014 -433420 -390850 -915863 -496017 49850 -20122
7262 -20122 -4499 -357488 -137389 -381826 -736691 -557610 -323291 -578265 -532074 84951
7252 84951 173565 -347864 -2104 -434666 -64529 -121795 -936232 -680407 -292527 -244867
7242 -244867 -444738 -481450 -272834 -211835 -94235 -124217 170476 13783 -755792 -474803
7232 -474803 -356401 -50695 305802 127400 -407968 -748864 -993 21797 -497224 -115148
7222 -115148 -434576 170954 180280 124106 204256 -815226 -958419 -102189 312337 11278
7212 11278 -214020 335325 46876 170118 -6087 -339918 -218245 -239356 -210705 -167028
7202 -167028 146468 185993 -142435 -542217 -328327 153815 -78407 -674657 -554492 10407
7192 10407 330556 53864 -523023 -166473 -221803 -297024 -187598 -68676 -533966 -512440
7182 -512440 -133202 -30999 -182722 -520937 -225422 448797 13288 -174369 -153593 138100
7172 138100 82552 -79873 -373152 -78562 346208 -30407 -269635 170719 -204221 -491695
7162 -491695 -585980 -203305 162680 -576002 -332016 75352 250004 -501746 -614224 -365
7152 -365 -54758 -296890 -781776 -412015 -11369 -140200 -532876 -485707 -131633 -228194 -59240
7141 -59240 332447 296800 1795 -160268 152725 219558 -495185 -280974 -564512 -512520
7131 -512520 -654987 -338051 12212 -124388 674082 395141 -217003 -377973 -320738 -293180
7121 -293180 -373070 228567 87877 -37524 158166 251578 240068 -198782 -180827 -46939
7111 -46939 -28205 344239 76498 599304 -32637 -294828 -218731 -177890 66398 -194612
7101 -194612 -202341 -276542 -389784 261372 317526 -139544 -263616 41211 255128 -34228
7091 -34228 -401210 57326 239972 150482 115370 14954 98260 -83119 -631906 -802156
7081 -802156 -80865 460451 -203817 -44211 42304 -347399 81684 560052 242665 126793
7071 126793 653457 44081 -491026 -93264 498005 143534 -9213 338675 49940 -367054
7061 -367054 -249920 337263 423929 -164072 299880 606059 201044 -125771 162637 -17712
7051 -17712 61867 -84689 -262982 131859 -112181 -161533 -240019 -285846 187084 475922 964019
7040 964019 451940 -140246 -151358 203062 368516 -311442 -33398 260696 254640 204359
7030 204359 -139669 384535 382537 167841 32022 -42582 848637 241812 -177412 21591
7020 21591 121810 431672 -685769 -43202 605155 490875 136975 -4073 919974 239324
7010 239324 -358114 285049 368437 489809 -217900 -68150 215353 4773 -732 -321648
7000 -321648 541066 263837 -137419 -207969 39845 204493 -704539 -154713 83841 20443
6990 20443 383660 40088 220594 371705 663748 240036 -460431 356818 162159 321899
6980 321899 446239 -358912 5822 -380712 533261 675368 417705 115896 -208350 732966
6970 732966 818065 867713 -130261 -182344 457660 390906 485718 212374 773399 -35996 -219880
6959 -219880 550177 246997 -78212 -280731 38198 372848 230438 390149 317977 239144
6949 239144 623892 556442 662764 464809 125771 -261887 288396 695181 384246 223197
6939 223197 618114 399853 -107298 -196784 328402 -95298 -342206 -334269 -14457 646447
6929 646447 297193 404802 136731 395015 792446 157888 34595 296305 199865 -448165
6919 -448165 -63744 414688 90039 -645280 119460 638819 365222 18744 309120 1021051
6909 1021051 594443 66548 -237264 250141 323228 -223333 76150 155717 27267 -166858
6899 -166858 263953 335068 234200 678642 562091 842292 663372 806592 618541 564230
6889 564230 763365 571429 236132 610105 561150 459484 94022 536065 868333 245786
6879 245786 204361 543356 163068 389293 919279 573234 -246196 370403 923206 829271
6869 829271 775205 576143 1142201 427438 590823 975054 415892 766945 534696 405116
6859 405116 240148 274124 660051 172797 125587 363897 315337 472329 5267 84178
6849 84178 -68754 572513 765056 509063 353035 198502 487631 794522 687893 308145
6839 308145 -41014 229988 1132908 865486 377403 419348 959075 854071 793050 284026
6829 284026 313307 688053 930743 805460 467008 253877 479329 424141 359643 681508
6819 681508 726944 1067210 928619 1085456 669010 455271 1139164 1065819 524619 246438
6809 246438 915944 970897 137827 470043 670138 939594 529703 717378 1387036 1082400
6799 1082400 1106172 547001 634600 789615 338632 806707 836940 598622 364331 490906
6789 490906 892695 344396 568452 -635 201516 441561 626882 680972 538400 335625
6779 335625 473702 352060 298080 522216 617453 639216 661117 631559 474450 -92855 -256294
6768 -256294 319778 764490 398327 127114 971056 1195815 626312 390452 585193 1012525
6758 1012525 406165 -153347 244033 567184 66689 -198739 366016 434312 237162 102708
6748 102708 939584 726039 556887 176913 231182 1125451 1037211 462783 341651 1078367
6738 1078367 1408349 707813 785121 1098590 1561156 1030030 938008 1626012 1018999 618693
6728 618693 114741 556046 1049886 542084 655859 712717 1039037 702203 627260 1335165
6718 1335165 967025 602293 335725 629162 818242 603172 1012693 680128 362007 1063015
6708 1063015 1001524 1002216 612265 817520 863928 403097 579631 1249516 1286303 594328 208116
6697 208116 839493 1045459 978465 870127 936919 1103588 807724 1142191 685390 531285
6687 531285 562806 1017204 1161813 694492 798848 762934 811494 836317 1006796 1416988
6677 1416988 763570 591220 1152640 1301986 1144729 715899 1193130 872118 201133 773058
6667 773058 1326794 1654186 638992 934730 1763174 1389340 991902 1349686 1455299 1596255
6657 1596255 1450500 1415018 1075242 1178926 1870854 1226265 973313 839487 1027831 833189
6647 833189 387144 902826 875844 736021 678854 1140242 1539628 760672 825071 943694
6637 943694 1007403 983564 1034278 1536470 1237652 1116983 978941 1153347 1279132 500790
6627 500790 1075366 1558118 1351162 1034632 786335 1892921 1411638 1172992 1024185 941504
6617 941504 1234242 477574 1355202 1482267 897404 773685 1227720 1658686 689390 795736
6607 795736 1336793 1077510 1325278 1208133 1139563 1287752 812874 1007404 1370881 1709461
6597 1709461 1231225 907380 1472032 1610825 1818524 1647136 1327315 1142050 926994 1191746
6587 1191746 1399432 1874898 1219515 534946 1152791 1667603 1847633 1130546 777515 1327927
6577 1327927 1651874 1460419 1309707 1047904 1303713 890564 927135 1431697 1545738 723919
6567 723919 739066 1514718 1628363 1939791 1400807 1259798 1074134 1047398 2219190 2069697
6557 2069697 1420175 1152848 1795029 1749167 1472658 1515539 1275953 1438205 1777053 1872106
6547 1872106 1530956 1275267 1249685 1581673 1766627 1530077 1358750 1310381 1512188 1092691
6537 1092691 993056 1383281 1682907 1621205 1416066 1411333 1377112 1358785 1505202 859296 1118010
6526 1118010 1549870 1095834 974909 1471237 1724713 1148029 1116260 998017 1046547 1374551
6516 1374551 1692677 1625804 1882801 1412158 1644520 1841508 1722649 1681583 1716635 1444573
6506 1444573 1511852 2184947 1416331 1549106 2036799 1719834 1811391 1186444 1826269 2457121
6496 2457121 1800967 1568652 2003601 1890453 1158239 1179350 1422159 1568749 1570552 1214351
6486 1214351 1616663 1596500 1398141 1862429 2007871 1553163 1266249 1688745 1714546 1481322
6476 1481322 1550814 1188808 1769613 2135922 1737532 1972677 1886665 1899269 1515495 1827849
6466 1827849 1600287 1565909 1767631 1508677 1421231 1535772 1696223 1636512 1157083 1325403
6456 1325403 1905940 1514201 1579942 1444214 1929792 1728658 1361163 2131382 2361253 1881755
6446 1881755 914668 1522892 2127282 1945317 1939264 1990024 2266112 1684846 1110861 1534250
6436 1534250 2046222 2180791 1810845 2170394 2158045 1190634 1722948 2265196 1954537 1895577
6426 1895577 1749522 1844659 1562701 1920398 1996938 1523922 1570457 1907877 2301711 1721496
6416 1721496 1495007 2390998 2654306 1787250 1784977 2169420 1526398 1256925 2132447 2068443
6406 2068443 2285960 2145817 1760200 1653157 1876917 1871069 1688656 1966753 1782789 1568982
6396 1568982 2066747 2435650 2147568 1653472 1979517 2218773 2239838 2317519 1650392 1428788
6386 1428788 1948251 2629509 2145969 1896056 2068732 2754269 2869095 2682636 2579432 2206484
6376 2206484 1837835 2037073 2567746 2246091 2512515 2489643 1918550 2386797 2476089 1489782
6366 1489782 1781092 2123510 1932135 1886807 2423845 2321497 1760499 1973816 2068808 2401242
6356 2401242 2376489 1989748 2243880 2448268 2436230 2585233 2564244 1954449 1986324 2771800
6346 2771800 2517751 2562433 2743101 2606593 2238966 2008054 2003147 2303745 2379200 1926355
6336 1926355 2310274 3030115 2544945 2273541 2771079 2657370 2524155 3395611 3448218 2584856
6326 2584856 2466155 2686199 2559179 2793367 2461633 1892112 2533031 2772971 2673143 2501528
6316 2501528 2541830 2168893 2319461 2830670 2374898 2064977 2156893 2719205 2771417 2458239
6306 2458239 2709913 2792158 2869767 2397811 2853969 3129091 2175670 2733768 3453421 2930506
6296 2930506 2215548 2536233 2883484 2251185 2532563 2873358 2614050 2817538 2118098 1940304
6286 1940304 2157207 2562823 2976653 3056150 2366129 2011430 2212680 3013655 3079575 2773947
6276 2773947 2074390 2358187 3264532 2803612 2644711 2453008 2972939 3099915 3037887 3103022
6266 3103022 2422326 2780569 2720425 2706915 3112914 2899890 3052687 2562319 2753393 3249919
6256 3249919 2912964 2668316 2879098 2968263 2631145 2237194 2881606 3173858 2617755 2888304
6246 2888304 3288856 3039483 2749547 3157138 2978560 2671480 2753511 3054013 3103460 2940496
6236 2940496 3001360 2701624 3016379 2953355 2984160 3166695 3434828 3186046 2589501 2685404
6226 2685404 3460281 2635031 2870803 3685068 3455881 2708365 2527645 3107726 2946444 2506048
6216 2506048 3140190 3448669 3021171 2941831 2978719 3025916 3430767 3415628 2770035 3087652
6206 3087652 3035987 2827271 3288443 3609688 3621708 3757548 3560716 3525580 3694753 3234528
6196 3234528 3152668 3071170 2914853 3107136 2980328 3233313 3241151 3014055 3108752 3394757
6186 3394757 3435948 3123793 3106510 3426292 3043960 2914604 3062571 2891596 3036313 3181774
6176 3181774 3434370 3020580 2704692 2606369 2914742 3546933 3508179 3756019 3513173 3384876
6166 3384876 3899681 4045950 3339784 3396015 4029110 3378100 3603828 4523030 4214698 2969438
6156 2969438 3297361 4152618 3491288 3217712 3932252 3786411 2886630 3724005 4271590 4045617
6146 4045617 3345084 4219434 4000884 3513882 4279838 4218777 3506807 3184724 3819343 3668941
6136 3668941 3351433 3614134 3438576 3803670 4054956 4165809 3741202 3775346 4513359 4305144
6126 4305144 4328567 4498658 4693320 3749624 3864866 4733479 4694355 4022580 3298113 3535748
6116 3535748 4371020 4607242 4081775 4006363 4043393 3993791 3466016 3922820 4370712 3613469
6106 3613469 3881664 4135607 4342982 4013921 3680485 3655418 4037165 4599981 3985084 3893713
6096 3893713 4322422 3931177 4199193 4186524 4110878 4530321 4399978 3908735 3927488 4790169
6086 4790169 4046153 3348306 4116707 4350225 4589125 4122761 3612499 4176356 4171696 4184035
6076 4184035 4622568 4707986 4473874 4195982 4455182 4038238 3880341 3891541 3864872 4314134
6066 4314134 4105985 4170901 4504402 4480343 4117858 3722970 4475521 4268017 4282636 4841980
6056 4841980 4502197 4646666 4732652 5149882 4768771 4581847 4707341 4884049 5117994 4751459
6046 4751459 4799905 4793911 4493797 4443712 4290681 4512705 4546269 4391075 4287373 4292678 4406395
6035 4406395 4626281 4666424 4458228 4779132 4828583 4309175 4368577 4827919 4755332 4241234
6025 4241234 4483857 4652016 4643931 5352569 4848408 4442191 4946066 5234406 4504508 4665431
6015 4665431 5361020 5137512 5159760 4778425 5142086 5487743 4841569 4654691 5275460 5554180
6005 5554180 4721109 4896985 4979447 4700763 4990660 4945500 5108572 4687191 4560016 4370650
5995 4370650 5033357 5367508 4685630 4684630 5004190 5154985 5241741 5335979 5101105 4778835
5985 4778835 4780693 5006698 4664693 4935427 4779221 5438897 5846849 5354028 5307923 4979667
5975 4979667 5050393 5501268 5319743 5440752 5059200 5008651 4859091 4940831 5315532 4880226
5965 4880226 5172916 4925769 5030745 5763373 5047657 5056653 5066843 5409094 5619814 5458858
5955 5458858 5718266 5159578 4836788 4932105 5264835 5424469 5227183 5488312 5548020 5340126
5945 5340126 5612669 5768618 5732817 5253396 5528161 5127613 4957654 5231503 5217765 5273420
5935 5273420 5547785 5773291 5558006 5028844 5459691 5490618 5276889 5637656 5815336 5312269
5925 5312269 5075518 5257237 5548309 5840932 5904051 5578534 5785382 5977796 5327595 5100601
5915 5100601 5395987 5736910 5363305 5390202 5655447 5447768 5597100 5365240 5258668 5782166
5905 5782166 5377314 5382152 5832472 6070504 5873568 5431203 5140750 5562242 5842434 5304268
5895 5304268 4843503 5623212 5768558 5429269 5901893 5900243 6015681 5863958 6052642 6577137
5885 6577137 6160783 5558349 5941187 6333538 6374205 5663485 5753416 5771368 5602975 5699611
5875 5699611 5340305 5738945 5966091 6207370 5934079 6046590 5942966 5745108 6544986 6101322
5865 6101322 5960410 6126315 6244407 6068111 5473359 5456212 5203194 5830438 6100009 5951952
5855 5951952 5816673 5465189 6114232 5994535 6076717 6285087 5830726 5833148 5438276 6079157
5845 6079157 5947029 5764478 5753006 5636309 5993828 5977535 5996111 5794741 6009363 6073062
5835 6073062 5974948 5901724 6446739 5950529 5665676 6119533 5957475 5484354 5542113 5794464
5825 5794464 5497660 5327384 6308273 6454903 6100645 6420628 5690899 6040764 5944454 6006080
5815 6006080 6052839 5403998 6006999 6277282 6116436 5643380 5955641 5851408 5343485 6077699
5805 6077699 6044966 6417416 5779375 5976593 5958085 6084852 6171499 5191049 6211563 6450517
5795 6450517 6118154 5801522 5976950 6401494 5919812 6034124 5901337 6040250 6141451 5841451
5785 5841451 6043805 6039562 5929173 6642944 6522374 6275007 5791725 6113236 6738947 6543677
5775 6543677 6400786 5967994 6471725 6141281 6081147 5866343 6003310 5929163 5870772 6424076
5765 6424076 6112205 6653472 6589400 6310148 6223781 5855082 6164223 6486373 6137355 6025694
5755 6025694 6115675 6118894 6459733 6615254 6170013 5689584 6261881 7126889 7011412 5899326
5745 5899326 5695453 6199703 6234011 6121809 5748094 5927137 5848126 5793373 6256726 6837398
5735 6837398 6864560 5956064 6158238 6113076 6175128 6289940 6463414 6475251 6271896 6141513
5725 6141513 6504457 6639311 6486704 6241594 6141680 5956283 6709601 6827693 6289517 5922966
5715 5922966 5866766 6157590 6790511 6540797 6053027 6408288 6396371 6319889 6336184 6756591
5705 6756591 6238508 6130776 6368828 6240557 6256248 6103022 6891620 6451062 5890027 6311968
5695 6311968 6956632 7008053 5971743 6097059 6523289 6345947 6145449 6307563 6292504 6386191
5685 6386191 6233427 6516249 6406235 5849713 5352499 5830311 6386439 6436176 6072232 6165464
5675 6165464 6801014 6868609 6246313 6055964 6270695 6496740 6564568 6118893 6242459 6644517
5665 6644517 7127262 6610516 6190985 6737392 6618984 6622077 6670679 6631642 7007996 6513377
5655 6513377 6026096 6660514 6791304 6030505 5666279 6672733 6948984 6408384 6657962
5646 6657962 7100207 7243786 6456658 6100798 7087645 6783538 6160359 6160062 6393505 6478818
5636 6478818 6196182 6515097 6586659 6416624 6602298 6630905 7188449 6642034 6518221 6632646
5626 6632646 6577453 6631465 6989348 7328591 6493031 6674087 7135438 7021036 7050826 6546706
5616 6546706 6991292 7040789 6637274 6242983 6471335 6908329 6582590 7300484 6902996 6230042
5606 6230042 6462932 6526737 6675416 6594503 6432879 6688910 6877497 7044916 6399401 6946947
5596 6946947 7068913 6662872 6658385 6601600 6778750 6610805 7139049 7210132 6379618 7093685
5586 7093685 7301295 7034959 6838442 6256635 6469055 6972910 7149790 6563211 6720470 6727894
5576 6727894 6682460 7165625 6813056 6358270 6562999 6473459 6242991 6075707 6351786 6505988
5566 6505988 6378176 6479183 6233755 6640784 6157670 6241302 6545484 6946959 6829955 6415020
5556 6415020 6576237 6164269 6313513 6802328 6862110 6427139 6327229 6417109 6331088 6437783
5546 6437783 6345124 6290019 6440980 6219955 6203368 6715857 6928024 6542441 6912457 7432618
5536 7432618 7030582 6964181 6613178 6454957 6704927 6467527 6617854 7002988 7309585 7052929
5526 7052929 6640659 6903855 6767252 6456990 6752951 7113133 7274258 6527359 6310045 6792908
5516 6792908 6806619 6395598 6250174 6888088 6656419 6135942 6181250 6635882 6361543 6735970
5506 6735970 6718394 6899497 6900230 7002765 6987540 6524986 7034524 7404677 6901012 6882535 6889670
5495 6889670 7184530 7517854 6580131 6971132 7283261 7374896 6998556 6909013 6948391 6793870
5485 6793870 6995691 6505686 6728329 7307680 6691153 6669289 7156551 7171473 6547721 6214861
5475 6214861 6592097 7072035 7272859 7204217 6785760 6964784 7145373 7213396 6791035 7042804
5465 7042804 7648723 7514888 7108033 7741490 7660227 7425028 6637870 6658741 7545042 7064543
5455 7064543 7043757 7184182 7262769 6459977 6247835 7075093 7106644 7177546 6705043 6518205
5445 6518205 6969062 7117644 6806803 6584737 7026859 6987833 7259659 6878712 6779279 7391901
5435 7391901 7168746 6958332 6998199 6814864 7118559 6760555 6108430 7053796 7134537 6322704
5425 6322704 6487621 7481426 7365462 6473021 6910216 7062996 6937984 7036532 6742038 6915801
5415 6915801 7213337 6504701 6830303 7379273 7415264 7267459 6838555 7259597 7581490 7494998
5405 7494998 6769832 6957463 7196736 7069222 7447513 7709609 6849514 6735996 7241320 7428982
5395 7428982 8002177 7745878 7360651 7511119 7968629 7815977 8031812 8010188 7575636 7606408
5385 7606408 7961640 7839775 8199741 7913271 7457868 7919668 8119681 7990071 7711115 8031604
5375 8031604 7754596 7814709 7827045 8017166 8770059 8179219 7722914 7709101 8490886 8174186
5365 8174186 7379925 7638854 7662748 7747884 7794880 7320714 7531905 7600685 7122741 6807064
5355 6807064 7485710 7695837 7119563 7274056 7455540 6949971 6944361 7176316 7601977 7186252
5345 7186252 7056588 7449216 7072094 7076365 6927846 7185899 6786626 7122291 7099446 6891163
5335 6891163 6764528 6741742 7017687 6484903 6700419 6997667 6605544 6333477 6512990 6780672
5325 6780672 6509537 6224114 6156462 5911122 5665649 5961346 6893768 6804689 5925952 6076149
5315 6076149 6952535 6268397 6517078 6884954 7241431 6899164 6456515 6865458 6779269 5781303
5305 5781303 5729802 6370486 6442219 6191831 5886818 6453388 6538449 6177588 6026386 6204831
5295 6204831 6130939 6296571 6507109 6770876 6517926 6373471 5977173 6124160 6288388 5828016
5285 5828016 5483873 6032375 7260397 6947134 6456969 6182403 6130619 6498855 6416494 6404905
5275 6404905 6605439 6318266 6099774 6247011 6186697 6386841 5914235 6298200 6208797 5815884
5265 5815884 5861456 5796402 5854462 6059568 5685076 5688631 5879377 5767287 4905828 5129420
5255 5129420 5856217 5885323 6194598 5489030 5085525 5876507 5631647 5506998 5685049 5827188
5245 5827188 5571958 5624564 5809902 5339070 5628072 5434047 5234195 5598869 5744477 5647208
5235 5647208 5322927 5456263 5418560 5620740 5623775 5434632 5502717 5319192 5443720 5710595
5225 5710595 5572281 5254516 5401990 5181691 5359790 6119893 6135349 5496721 5883879 6363828
5215 6363828 5526821 5372111 5306311 5411920 5917484 5370934 5701858 6076869 5760149 5254546
5205 5254546 5386329 5791614 5208763 5074406 5217433 5256889 5376623 5114009 5696680 5599560
5195 5599560 5240357 4662456 5281820 5756553 4703121 4981696 5631729 5679080 5317951 4791102
5185 4791102 5359105 5257735 5679372 5393283 5018466 5186493 4916176 4918795 5518892 5542079
5175 5542079 5197880 5195615 5534624 5596364 5249012 5516514 5359845 5257926 4845007 5022700
5165 5022700 5196263 5047096 5090820 5268042 5372946 5603602 5841254 5088148 4469637 5702542
5155 5702542 5493910 5014401 5453006 5288749 5097887 4629778 4970777 5560066 5625640 4851529
5145 4851529 4952366 5907923 5420304 4801904 4967629 5048030 4915955 4657265 5072886 5192167
5135 5192167 5205510 5132534 5040115 5753053 5481178 4752771 4685773 4838657 5189428 5241211
5125 5241211 5449758 5152900 4964844 5093197 4972809 5207963 4818933 5195172 5268888 5437470
5115 5437470 5521446 5126509 5255704 5227082 5108275 5165989 5090613 5035356 4683670 4862560
5105 4862560 4994992 4884470 5088161 5068216 4957765 4523459 5667760 5589824 4794842 5146543
5095 5146543 5709095 5947232 5093075 5270096 5402625 4886229 4795909 4516975 4921742 5009255
5085 5009255 5027495 5345627 5218992 5625865 5437306 5153947 4914164 5081537 5237557 5316137
5075 5316137 5468756 5751004 5491464 5784097 6017728 5714337 5653656 5432764 5833997 5801154
5065 5801154 6070440 5777649 5593375 6070597 6293081 5583560 5175156 5651839 5749775 5905296
5055 5905296 5984573 6172474 6199679 5219496 5328031 6070600 6404508 6119937 5919355 6571158
5045 6571158 5940130 6132354 6179647 6055630 5895473 5492113 5995935 6097029 6298475 6265990
5035 6265990 6122421 6505856 6405071 6493374 6957402 6210551 5970133 6191942 6677922 6802670
5025 6802670 6155348 6593155 6689997 6430149 6372564 6406877 6693999 6122481 5928080 6813326
5015 6813326 7038634 6571091 6226185 6946990 6695262 6515038 6711894 6699964 7027276 6914797
5005 6914797 7558307 7557391 6854679 7205286 7355916 6706927 6613961 7525050 7513031 6480050
4995 6480050 6555905 7503571 7114878 7036035 7327454 7307021 6957798 7214831 7905686 7370490
4985 7370490 6811236 6993897 7761527 7394600 7285489 7793938 7937588 7360333 7110328 7884679
4975 7884679 7757349 7642454 7817132 7744658 8233725 8046338 7613776 8216992 8585132 8212731
4965 8212731 8317558 8396827 8864585 8267293 8021895 8828545 9021437 8729682 8189501 8693667
4955 8693667 8743976 8218004 7769624 8014352 8073661 7266008 7717236 7855326 7585993 7606932
4945 7606932 7696658 7568123 7383194 7695580 7550091 7401338 7370827 7331808 7203208 7386892
4935 7386892 7717043 7517014 6833421 7447748 7827056 7673036 7574153 7756399 8305022 7695332
4925 7695332 8104861 8181682 8287747 8454061 8197683 8635252 8799643 8808876 8479059 8803567
4915 8803567 9421223 8750585 9073844 9514972 9692465 9918274 9539093 10029921 9995099 9963945
4905 9963945 10544369 11078324 10974075 10987212 11798564 11774587 11398116 11615976 12147844 12337397
4895 12337397 12233822 12783226 12994681 12872600 13248453 13121003 13526508 13521671 13177494 13078487
4885 13078487 12730917 12369310 12378950 12055745 12220675 11627113 11315588 11431558 11166748 10361072
4875 10361072 10272502 11117360 10619208 10477141 10652249 10336936 9936529 9838175 10512606 10349246
4865 10349246 10140611 10488118 10063286 10625675 10542009 10259184 10537135 10394984 10329587 10416613
4855 10416613 10695719 10519762 10486547 11367974 10942445 11053663 11108322 11101940 11049414 10805941
4845 10805941 10830023 11154193 11669319 11389181 11981043 12103591 11591858 12012498 12423681 11756854
4835 11756854 11319337 12309551 12429338 12420832 12165133 12004944 12078594 12156190 12411335 12658813
4825 12658813 12404442 11653447 12060628 12446028 11746632 11472930 11671592 11492515 11413494 11464751
4815 11464751 11033434 11547209 11397186 11078210 10826766 10612643 11307137 10848335 10225587
4806 10225587 9871954 10306080 10746401 10172471 10116089 10450292 10358529 10238484 9959008 10145144
4796 10145144 10275839 10033720 10109735 10544807 10811360 9875114 9902461 10223986 9982604 9718210
4786 9718210 9547401 9746670 9519974 9757126 9585316 9083803 8881057 8303410 8659676 8498258
4776 8498258 8652021 8933900 8495653 8648895 8775117 8743001 8109197 8946501 8942294 8532860
4766 8532860 8460110 8415941 8698399 8787053 8437844 8139579 8336218 8688306 8713704 8903539
4756 8903539 9045174 9467073 9864820 9373615 9549042 9993947 9893725 9927330 10289702 10405674
4746 10405674 11169343 11517138 11147307 10853064 10819879 11050149 10611003 10955658 11104753 11220136
4736 11220136 11337675 10661027 10677332 10423934 9480296 10209646 10791349 10303356 9646285 10081615
4726 10081615 10268935 9464341 9887478 10010691 10075752 10394051 10512126 10243475 10245842 10341606
4716 10341606 10053387 10025202 10151753 10056801 10027918 10753504 10916860 10647045 10392206 10678921
4706 10678921 11464754 11402255 11293681 11494731 12046490 11482911 11827949 12434155 12322533 12428836
4696 12428836 12507625 13178631 13391509 12743433 12841364 12773858 13178176 13844475 13535236 13746952
4686 13746952 14339853 14749426 14273884 14188601 14623993 14792963 14988981 14914943 15662492 15887305
4676 15887305 15894604 16386773 16473378 16323734 16201860 16860414 16999076 17679269 18197092 17866622
4666 17866622 18207154 18470428 18408680 18532080 18726680 19476571 19774530 19612589 19741433 20410899
4656 20410899 20914222 20896959 20906795 21269260 21447008 21879516 22212119 22134051 22291843 22370148
4646 22370148 22790855 22870005 22812721 22703452 21975373 22296662 22371904 22126322 22232269 21287133
4636 21287133 20656900 20516732 20591287 20426563 20281475 20561334 19906323 19851032 19771326 19380966
4626 19380966 19652147 19134282 18671968 18837763 19133748 18694971 18127708 18186690 18274102 18237885
4616 18237885 18454387 18164016 17782224 17883327 17415989 17588950 17990694 18095715 17998018 18129393
4606 18129393 17583506 17402787 17946559 17830645 17575198 17631436 17734056 17649801 17954311 17322911
4596 17322911 17308936 17409090 17389714 17328881 17522645 16992556 16392947 16603071 16946761 16583600
4586 16583600 16657833 16810094 16323221 16631360 16297320 16090516 16023486 15835995 15971739 15856457
4576 15856457 15691249 15415824 15603467 15526701 15563399 15439957 15259371 15074525 15216873 15405436
4566 15405436 15503049 15718776 15561070 15555905 15840291 15386005 15330742 16093345 15755380 15186000
4556 15186000 15678492 15298649 14937584 15117270 15104394 15558154 15402483 15826744 15606004 15230080
4546 15230080 15200513 15486009 15740225 14899301 15315166 16200831 15810517 15847502 15629883 15326409
4536 15326409 15315056 16048869 16117733 15355869 16177886 15889812 15840646 16229324 16402201 16775650
4526 16775650 16276564 16786944 17059840 17094878 16936534 17052155 18515483 17526168 17409202
4517 17409202 18478876 18421387 18194759 17984452 18342223 18340016 18303590 18585699 18528441 18253368
4507 18253368 18249488 18658570 18729009 18236491 18339891 18662912 18510991 18088921 18384254 18188412
4497 18188412 17871346 17987297 18843142 18118448 18137442 18111013 18165549 18310562 18313285 18450948
4487 18450948 18306062 18720950 18613306 18702548 18363095 17515393 18243169 18377483 18034888 17825337
4477 17825337 17977133 17989317 17554282 17865433 18006589 18084770 18270214 18111383 18187685 17930128
4467 17930128 17629750 17679833 17888058 17818415 17364091 17159075 18070234 18919946 18445229 18107891
4457 18107891 18332964 19478343 19029304 18443492 19180484 19519513 19562925 19187865 19738632
4448 19738632 20369764 19955876 20188812 20349174 20483035 19725701 19479861 19628737 19206851
4439 19206851 18756287 18560690 19024778 18587282 18398602 18375332 17913650 17680109 17516172 18110189
4429 18110189 17122120 17237409 17268740 17120798 16883308 16183322 16819325 16648296 16347642 16303711
4419 16303711 16045603 16201320 15836153 15787067 15431354 15755271 15781501 15588515 15649190 15203810
4409 15203810 15720894 15688074 15322400 15210490 15408833 15389703 15090885 15560705 15501728 14888288
4399 14888288 14815185 14886629 15245369 14982734 14750555 14913051 14607484 14308450 14463323 14840782
4389 14840782 14743356 13985176 14083464 14204600 14701052 14395914 13590517 14241520 14367182 14455935
4379 14455935 13578197 13881910 14888858 14043647 13922732 13905540 13846427 13360257 13094847 13272551
4369 13272551 12387315 13076353 12748902 11870918 12060366 11440164 11782197 11683286 11873209 11260760
4359 11260760 11167630 11247437 10874906 11828265 11324756 11102387 10941152 10710365 11067378 10810195
4349 10810195 10738697 10407909 10605491 10905435 10417624 10884602 10620224 10549795 10639654 10298769
4339 10298769 10514814 10795229 10632104 9828675 10028066 11126204 10475989 10061579 10356056
4330 10356056 10453338 10760121 10430931 10644769 10753444 10769871 10081681 10504687 11075471 9952904
4320 9952904 9934890 10554633 10449977 10373511 10306655 10760877 10994533 11147632 10917342 10393385
4310 10393385 10928304 10706343 10718273 10994532 10506943 10772657 10338249 10506343 10804640 10990190
4300 10990190 10875168 10362695 10892347 11036802 11143841 11197586 10968258 11126856 11275746 12095812
4290 12095812 12756096 12160988 12108490 12149756 12915829 13114957 12911128 13303674 13286482 13848387
4280 13848387 13710551 13739890 13938625 14421341 14568673 14395116 15171063 15536732 15907791 15847510
4270 15847510 16091029 16481170 16476468 17412109 18317677 17741270 17719183 18521448 18527839 19049030
4260 19049030 19312018 19848673 20977288 21106133 22576344 23917286 24516256 25524194 27071594
4251 27071594 28926702 29856447 31264609 32303573 31965732 30534810 28981431 28096382 26239555
4242 26239555 24328214 23361317 22502901 21356861 20190607 19739408 19457384 19098457 18118583
4233 18118583 17957158 18171806 17384473 17250134 17149653 16320857 16227896 16092720 16561772 16566704
4223 16566704 16078843 16208219 16411552 16316877 16806326 16801368 16655815 16547701 17174874 17203430
4213 17203430 16600499 16757353 16863292 17148133 17129780 17518739 17919880 17485007 17511391 17379830
4203 17379830 17626950 17678153 17230710 17465925 17450635 17554190 16795625 17283883 17847610 17217548
4193 17217548 16993175 16912292 17159003 17355966 17155893 17536759 17153568 17471386 17692519 17446846
4183 17446846 17608460 17610312 18104108 18672446 18422826 18973797 19114019 19186860 19260984 19773507
4173 19773507 19821897 19187327 19317722 19812529 20190991 19862694 20057399 21343924 21134104
4164 21134104 21330206 21456388 22091363 22737021 22842226 23327841 23940506 24923112 24951841 25660789
4154 25660789 26712475 26682180 26907474 26858978 26574747 25945429 25268927 24650249 24739298 24831942
4144 24831942 24461535 24934075 25304077 25074775 24881707 25415139 25928235 25894493 26038597 26376399
4134 26376399 26604756 26908624 27130051 27594629 27927951 28649791 28647097 29240846 29775345 29627545
4124 29627545 29658808 29582108 29865958 30331816 30608095 31122054 30434947 30588019 31247696 31971852
4114 31971852 32141712 32229983 33230539 33568135 33916910 34476916 35259213 35985641 35886048 36133557
4104 36133557 36655844 37280134 37784062 38202359 38268232 38861524 39108796 39110399 39944468 41026992
4094 41026992 40738590 41237231 42111183 43212151 44041395 44015099 44459748 45443657 47278908
4085 47278908 47648855 47777131 49206944 50125880 50473182 50940687 51719278 52592192 52841580
4076 52841580 53528091 55325885 56886375 57000244 57865443 59709284 60574290 60898284 62006184
4067 62006184 63631087 64168263 63939401 65048554 66185331 66802730 67502504 68378470 69334981
4058 69334981 70032830 71784477 72515897 73277782 74825276 76237146 77540140 78827072 81227415
4049 81227415 82791149 83964814 85862462 87721364 89777111 91199879 92682982 93978394
4041 93978394 93800010 93819983 93668835 93264096 91565062 90515200 90095912 89540369 89060931
4032 89060931 87887808 87749466 87639678 86837002 86354978 85540298 85426646 84638226 84641304 84690484
4022 84690484 83964493 84194100 84442358 84295313 84209137 84541912 85059292 84836742 84809131 85483927
4012 85483927 86012839 86561507 86771967 87639822 88865999 89205077 90228473 91274564 92221415
4003 92221415 93703577 95167655 96805317 97953902 99822305 101451888 103188596 105218520
3995 105218520 106281366 108051614 109956599 111849396 113665085 115797188 116811922 117779860
3987 117779860 120404395 122390220 123624980 124907690 127000130 128943353 131028526 133190672
3979 133190672 135399863 137708350 139530745 142097225 145187588 147244432 149416983 152226618
3971 152226618 155324259 157955724 160614840 162884416 165469598 168704650 170908039 173033590
3963 173033590 175355615 177330307 179432159 181957519 183676681 185199962 187167838 188571756
3955 188571756 189607423 190904171 191583259 192255421 192791822 193307943 194239054 194485196 195181697
3946 195181697 195354795 195486257 195183919 195343234 196526289 196175529 195320293 193857211 191391607
3937 191391607 188706573 185125775 180907724 176793967 172781105 168986864 164896543 161503770
3929 161503770 157648868 153211233 149910924 146291523 142461694 138595976 135408000 131908447
3921 131908447 127846611 125064789 121814463 118971557 115923775 112357769 109956648 106896813
3913 106896813 104538526 101722635 99244587 96669632 94328702 92606216 89736012 87418231
3905 87418231 85867803 84580410 82790350 80928747 79524829 78091509 76766756 75485735
3897 75485735 73847428 72888519 71955899 71429106 69854634 68787159 68884891 68238490 67424973
3888 67424973 65839275 65495380 65670140 64823396 64667196 64470691 64106980 63728199 63847652
3879 63847652 64264794 64033584 63768659 63962605 63719112 64207685 64914409 64728026 64847159
3870 64847159 65050143 65751342 65395036 65951675 67284720 66990268 67421812 67791951 69508099
3861 69508099 70119494 69857092 70286038 70429324 70889791 70925815 71044671 71118496 70643549 70172303
3851 70172303 69817138 69778812 69326241 67999347 67313969 66500889 65804795 64869478 63400905
3842 63400905 62506123 61567418 60454538 60119258 59173146 58416211 57191886 56651234 55680928
3833 55680928 54917903 54495088 53469237 52621295 51903717 51808404 50459106 49785956 49665121
3824 49665121 48609729 47660309 47430315 47323570 46725477 46025334 46089802 45254259 44791771
3815 44791771 44535829 43580938 43253182 42409982 42793307 42615699 41747089 41579631 41395222
3806 41395222 41507256 40495920 40262571 40084425 39527713 39222899 38907472 39476425 39060857
3797 39060857 38645134 38415613 38656487 38454250 37978953 38843922 38489677 37755775 38118507
3788 38118507 38532594 38464924 38102982 38533400 38439565 38593307 38867663 39016259 39186791 38790880
3778 38790880 39183122 40112658 39352635 39321123 40028871 40009921 39919336 39568445 40480915 39993656
3768 39993656 40110866 40408162 40206029 40679931 40470832 40654157 40757197 40156719 40207473 40586027
3758 40586027 40871265 40305497 40148184 40935055 40311773 39673402 39506331 40080518 39956723
3749 39956723 39555382 39973539 39742282 39571321 39350765 39792284 40178456 39845046 39646879
3740 39646879 40110954 40567857 40297499 40253814 40243378 40630192 40838323 41117696 41024198 40776778
3730 40776778 41542166 41201110 41024383 41325406 42238581 42693275 41696560 42060000 43279932
3721 43279932 43798882 43267536 43302815 44150556 44592608 44685334 45000126 45851337 45838401 45855465
3711 45855465 46659966 47825202 48102593 47432490 48165007 49600722 50309343 50441544 51075863
3702 51075863 51584530 52147185 52799736 53390340 54312388 54690230 55189688 56352226 57911396
3693 57911396 58398972 58985193 59655453 60549465 61999140 63411602 63981886 64378300 65482285
3684 65482285 66806813 67184231 68323655 69838817 70058486 70722884 72314479 74137332 74888093
3675 74888093 75953509 77192442 78095097 79570829 80904154 82414816 83150395 83772118 85047739
3666 85047739 86436445 87936538 88912297 90002150 90872222 93299909 95597576 96549322 97756597
3657 97756597 99284583 101655851 102690730 104542710 106531444 107787073 109926927 111589069
3649 111589069 113459531 115174100 117326827 119423778 121599109 123571635 125716751 127897051
3641 127897051 129743438 132027536 134529950 136540145 138504470 140993145 143307192 145440782
3633 145440782 147905409 150883711 153261387 155131402 157386032 159799123 162326995 164254628
3625 164254628 166358551 168443246 170588288 172179874 173599656 175947599 177870071 179895536
3617 179895536 181056911 182501999 184365156 185772253 187161598 188645589 190500965 191772192
3609 191772192 193683969 194943639 196100944 197952727 199932050 201809176 203565698 205742472
3601 205742472 208361088 210528151 213244463 215869914 218029449 220953731 224384750 227503898
3593 227503898 229568000 232709582 236484852 239796457 243103256 246253256 249375740 253146832
3585 253146832 256732814 260183678 263437864 266834929 270583400 273932536 277245187 280501298
3577 280501298 283778085 286608423 289288860 292694460 295418425 297787585 300302712 302566327
3569 302566327 304444761 306544057 308527890 309122106 310395702 310907547 311184839 311656363 311878832
3560 311878832 311721476 311184865 310885575 309845610 308649675 307539871 306104999 305230756 303659608
3551 303659608 301594281 300198376 298275411 295728603 293768013 292186445 290415357 288280446
3543 288280446 286250095 284173185 282080092 280314281 278502223 276565648 274587976 273433664
3535 273433664 272623997 271026891 269563288 268358786 267061747 266203492 265505131 264686811 263258529
3526 263258529 262635751 262034465 261316057 260503666 259795866 258784168 258096789 256457225 256103137
3517 256103137 255102895 253671938 252366201 251166776 249865248 248332813 246659891 244424044
3509 244424044 242107991 240142464 238100407 235679823 233228045 229933648 227517851 224685820
3501 224685820 221377906 218437171 215634905 212331769 208452321 205270319 202187551 199111241
3493 199111241 195717468 191740309 188436813 184997207 182088279 179045151 175420488 171762742
3485 171762742 169196178 167010567 163928698 160836560 158005779 155427471 153628346 151276694
3477 151276694 149018827 146997196 144550798 142397589 140887222 139210690 137194422 135250547
3469 135250547 134293005 132836188 131170139 130569368 129400970 127614980 125728203 125563136
3461 125563136 124399313 122449820 121747207 120798854 119340881 118000695 116507694 115348568
3453 115348568 114000215 112897886 111384907 109467165 107638808 105853546 104596797 102402038
3445 102402038 100834478 99755105 97823744 95853871 94344071 92757620 90898313 88635475
3437 88635475 87279438 85776143 84172707 82396312 80790112 79253201 77578048 75944136
3429 75944136 74185594 73197493 71993459 70595849 69954480 68239332 66564975 65012694
3421 65012694 63971711 63285952 62029007 60839678 59829794 59020815 58018919 56889065
3413 56889065 55776156 55118936 54264130 53153638 52380926 51870513 51058151 50143371 49592805
3404 49592805 48425310 47806455 47567580 47225262 46487314 45466306 45040056 44723501 44459347
3395 44459347 43389164 42916696 42995618 42305576 41335909 40947440 40958965 40680582 39765724 39078861
3385 39078861 38972268 38875773 38311116 37883977 37784806 37238244 36170339 36209219 36061668 34909933
3375 34909933 34551775 34312474 33989132 33510229 33570981 33330914 33028516 33000707 32578190 32391692
3365 32391692 32019354 32248964 31599174 30837572 30591630 30977792 30941199 30002397 29791013 29929155
3355 29929155 29656457 29722343 29355271 29101161 29206968 29001519 29031801 28885407 29432259 28841510
3345 28841510 28677127 28523833 27988739 28317776 28497153 28085499 27451586 26989363 26798576
3336 26798576 27210730 26374763 25793518 25840003 25715138 25807770 25979276 25919364 25118507 25078753
3326 25078753 24757702 24588102 24905304 24546662 24254529 24140419 24046792 24186239 24200079 23818152
3316 23818152 23431435 23398966 23795605 23648181 23397911 23546244 22947333 23180627 23564150 23447065
3306 23447065 23220187 22821720 22829298 22749902 22952680 23077234 23003240 22649684 22696699 22616428
3296 22616428 22642710 22782518 22917833 22501610 22510933 23072606 22684555 22135444 22843829 22909186
3286 22909186 22688311 22842647 23135677 22777764 22300687 22804029 22492800 22877069 22672155
3277 22672155 22779068 23132333 23522833 23869955 24180623 24473245 24177080 24274347 24291760 24277342
3267 24277342 25157771 25366802 25076270 25778066 26134022 25652474 25548467 26086527 26430190
3258 26430190 27319739 26965401 27142840 27920774 28735583 29217484 29378215 30073854 30705316
3249 30705316 31818766 32755437 33366542 34646798 35494637 36494728 38235021 39447677 39865552
3240 39865552 40660643 41368751 41292590 40476817 39301538 38364142 36418693 34027430 32675808
3231 32675808 31675949 30334941 28911311 28197090 27544187 26878228 26284086 25684242 24943668
3222 24943668 24010720 24085451 23117729 21933445 21333414 20838058 20638255 20215168 20343240
3213 20343240 20317809 19416039 18878172 19052946 18982584 18481760 17985738 17495674 17626458 17688970
3203 17688970 17496038 16863641 16896776 16513466 16059246 16057182 16429277 15871761 15507035 15647465
3193 15647465 15567305 15736267 15244672 15040351 14771677 15020595 15430848 15040961 14701429 14943793
3183 14943793 15464593 15016434 14537823 15027592 14652924 14381312 14168538 14150885 13985260 13499339
3173 13499339 13690684 13085646 13084436 12463661 12059406 12561336 12411002 11689405 11346809 11864931
3163 11864931 11935574 11953128 11596216 11377988 11425568 11409252 11359518 10961471 11142114 11410429
3153 11410429 10845363 10390952 10494633 10597835 10630748 10142073 10467138 10765755 10211816 9942080
3143 9942080 9991510 10239921 9425438 8856387 9656997 9961359 9483906 8958217 9373984 9590956
3133 9590956 9549864 8866924 8604115 9322357 9363123 8954029 8727176 9365435 9414966 8579372
3123 8579372 8515892 8739913 9025507 8838579 8558281 9096441 8847739 8210909 8841131 9200544
3113 9200544 8753780 8196829 8815075 9623151 8958478 8881408 8726013 9017109 9080924 8764423
3103 8764423 8242412 8863000 8196724 7635231 8019814 8617313 8679253 8177422 7954012 8291510
3093 8291510 8533726 8748673 8342718 8315645 8348409 7946077 7505680 7818987 8013405 7660333
3083 7660333 7832288 8330507 8912593 8301299 7824618 7980438 8405669 8117544 7493546 7667461
3073 7667461 7735834 8001530 7991364 7530324 7790569 7680247 7480612 7288893 7552002 7588097
3063 7588097 7354442 7240349 7405293 7329180 6766240 6933172 7502342 7276591 6667751 6511741
3053 6511741 6637500 6836164 6831007 6146953 6671094 7234583 6809054 6996830 6867974 6789492
3043 6789492 6302293 6337076 6622613 6449076 6924053 6503636 6611434 6590610 6578670 6219349
3033 6219349 6209639 6799188 6207184 5484604 6019177 6729060 6663838 6027942 6378035 6503249
3023 6503249 6275157 5853366 6310684 6554943 6235300 6844027 6399805 6107043 6488741 6863329
3013 6863329 7020808 6572787 6752614 6798714 6741479 7321278 6790061 6733458 6966773 7121349
3003 7121349 6924500 6708668 7618582 7753340 7602746 7286056 7751372 7703093 7592973 8059793
2993 8059793 7798543 7421411 7447535 7540008 7738155 7478702 7064924 7422989 7277841 7147774
2983 7147774 7349825 7086498 6253040 6670236 7181016 7116125 7054412 7246443 7250534 7566581
2973 7566581 7571408 8182358 8378223 8024943 7372606 7831436 9038434 8881332 8788319 8737873
2963 8737873 8981069 9799784 10091225 10046354 9653515 9493331 9228955 9309320 10046787 8865774
2953 8865774 8364025 9033236 8678315 8694254 8172728 8184396 7905292 7863202 7818378 7373258
2943 7373258 7939470 7238130 6865767 7317599 7622300 7552572 7238684 7564965 7816428 7780837
2933 7780837 7780389 7708691 8367497 7956567 7978101 8729216 8985130 8477692 8003209 8080077 8462411
2922 8462411 8802418 8546126 7923824 8407421 8789710 8082081 7547294 8471814 8478351 7276604
2912 7276604 7606166 8275138 7723819 7088627 7259988 8191617 7847529 6738837 7436310
2903 7436310 8263980 7660249 7530489 7798160 7947808 7367913 7360240 7486669 7312607 7485392
2893 7485392 6617095 6427195 6742654 7090462 6880061 6587408 6384762 6397054 6930207 6827696
2883 6827696 6209723 6522046 6471894 6400176 6353470 6864861 7062801 6484963 6379203 6477196
2873 6477196 6287541 6061512 5980395 6276634 6359087 6034748 6321458 6717693 6507744 6263487
2863 6263487 5982664 5932962 5773779 5197748 5428549 5550480 5441724 5321373 5382128 5833029
2853 5833029 5261049 5249531 5350079 5471937 5016826 5128204 5242417 4745725 5190400 4747159
2843 4747159 4494868 4563159 4549336 4389238 4335891 4845187 4779868 4147602 3649340 4030489
2833 4030489 3914018 3428157 3272994 3743857 3533118 3477002 3720331 3977265 3446771 2531336
2823 2531336 3124973 3192662 3545769 3483050 3395936 3735778 2881431 3293550 3130749 3053335
2813 3053335 3179599 2873378 2830188 2478259 3088808 3016939 3079854 3075574 2788575 2778715 3076654
2802 3076654 2890425 2797199 2801926 2717430 2550700 2765937 2665207 2475081 2927837 3366799
2792 3366799 3488769 2867872 2215259 2584075 3020654 2982973 2425646 2654906 2363205 2077558
2782 2077558 2722876 2634557 2643923 2438226 2198544 2102353 2624109 3186836 2365841 1896866
2772 1896866 1869521 2538119 2373446 2223699 2525843 2381062 1776165 2502125 2641829 2306442
2762 2306442 1701726 1561401 2717198 2584792 1781000 1581552 2329167 1873150 1249437
2753 1249437 1778815 1587253 1970774 2253023 2126511 1828460 1829488 2192882 1965706 2503497
2743 2503497 2513764 2096961 1453401 1510531 1845109 1919311 1774886 1835750 2063718 2166298
2733 2166298 1667098 1817076 2120092 1526172 1497698 1624240 2021604 2075090 1884508 1963609
2723 1963609 1768578 1262596 1738153 2265563 1783169 1286143 1434924 1706290 1674142 1496056
2713 1496056 1535505 1504499 1341234 1470215 1637324 1816206 1481224 1691885 2012574 2350057
2703 2350057 2162120 1950078 1619939 1671289 1715277 2120500 1962657 1960365 1561531 1264694
2693 1264694 1348178 1493903 1587813 1300890 1438612 1760806 2051796 1663782 1255584 1762014
2683 1762014 1803472 1823558 1665472 1685012 1472082 959173 1175529 1912761 1808222 1537514
2673 1537514 1903942 1978206 2234246 2201756 1736558 1516401 1959237 1718987 1964726 1949608
2663 1949608 1785663 1331305 1532411 1675195 1169954 1438244 1820762 2021677 1439393 1691566
2653 1691566 2355777 2008157 1622424 2158973 2147299 2454373 2107976 1914612 1837009 1729958
2643 1729958 2301138 1834593 1799681 1971164 1627212 1986070 2289331 2010963 1944764 2078836
2633 2078836 2577666 2091877 2251837 1663344 1532196 2015505 1943145 2134461 2816199 2306079
2623 2306079 1755955 2229430 2882514 2976736 2691714 2552338 2360673 2741752 3133994 2682322
2613 2682322 2524125 2568871 2771568 2740272 2747737 2810186 2548795 2367029 2374012 2554137 2700500
2602 2700500 2681311 2870366 2574114 2409890 2349978 2638169 3082756 2463413 2212555 2458612
2592 2458612 2629353 2379289 2768051 2674709 2910051 3248331 3467181 3748348 2902563 2960520
2582 2960520 3375406 3378739 2981419 2390974 3557093 3006424 2660711 2900808 2759294 2908979
2572 2908979 2444904 2603032 1886299 2157302 2383207 2128376 2765521 2592085 2487096 2221793
2562 2221793 2654864 2931471 1840910 2065385 2262945 2301614 2387124 2806852 2307314 1898544
2552 1898544 2147939 2341747 2621936 2341979 2336177 2187781 2330147 2213213 2259020 2049859
2542 2049859 1711213 2038094 2127400 1844237 1876596 1913010 1753961 1853485 1339946 1635810
2532 1635810 2218187 1901004 1413202 1693435 2312748 1548684 1246502 1778594 1655927 669348
2522 669348 1119832 1554559 1337504 1279814 1280728 1264107 1178338 856016 736830 795843 904201
2511 904201 1167583 1017296 990804 1255617 1533666 1106330 1348466 1945977 1441607 959823
2501 959823 566932 927971 1306381 1460574 1088031 690431 1026180 1107032 1097613 1011981
2491 1011981 794865 1051328 702582 909291 1146071 1086995 877660 603979 1144914 616324
2481 616324 226046 866862 1214270 1140269 517668 964104 1323960 950741 412483 198456
2471 198456 698915 182633 266065 765424 853990 659114 539624 273318 161895 690896
2461 690896 842258 1050193 673197 290366 894861 851498 552172 727385 937925 841267
2451 841267 853249 1096961 1217384 504343 -49682 369710 1087066 200917 232122 1156842
2441 1156842 720841 630460 630152 605029 400148 321975 721230 597216 777354 338746 520958
2430 520958 1004398 345822 -58425 691929 950449 -3951 -244113 607568 414037 400836
2420 400836 704375 432954 428293 305329 718401 591315 83463 -149656 -178360 563716
2410 563716 454484 381897 670335 330255 200189 -146276 376848 608388 494069 669399
2400 669399 661465 586864 671499 1390608 1264375 440499 679670 1392133 1304816 17041
2390 17041 186242 1122162 407762 276278 686064 702173 39455 -82825 1079845 755504
2380 755504 567977 518988 402947 359475 501012 1011699 922936 984071 1023838 825528 736553
2369 736553 860333 1416610 955333 289276 993408 1485111 1640932 1219554 1048928 977937
2359 977937 800211 748282 527465 1356541 1106470 344670 954838 922579 963683 450224
2349 450224 584438 1059613 1238423 1182455 749301 606788 269077 593969 1175998 688007
2339 688007 123159 558764 1355925 685385 505470 762916 722952 659766 761346 940847
2329 940847 340102 344340 584920 581680 611040 836603 1079235 996625 508820 564558 436853
2318 436853 581058 616901 276920 603383 928045 885261 1124730 1140200 539097 100977
2308 100977 924410 783932 765096 840035 276426 821237 639521 752713 857718 918367
2298 918367 387882 -286001 859706 788261 667340 636639 370691 777766 807596 587075
2288 587075 703683 892287 759035 240435 843420 684325 579708 1129910 856828 1073954
2278 1073954 908192 1054932 678183 467476 933940 239038 562646 827845 814339 528149
2268 528149 379289 1360080 634905 -16856 287230 1159171 1382079 681762 745471 928638
2258 928638 1048165 739653 385273 1227828 630735 389133 816947 1138172 1192766 226716
2248 226716 633164 1157950 1141012 682369 239545 946018 1265706 726351 468095 287767
2238 287767 1075474 787690 452064 783304 1183842 1054893 689800 1481904 1676893 919045
2228 919045 800760 1281235 1465256 1267965 739591 1311492 1503514 1683546 1586765 1863205
2218 1863205 1582532 1190028 1567140 1124035 975051 1147770 1600294 1714971 1511972 1284045
2208 1284045 1224744 2100826 2054493 1413317 1899099 2081409 2200696 2208020 2373540 2631559
2198 2631559 1914049 1934074 2433500 2452970 2295116 2665108 2895172 3252647 2833289 2613524
2188 2613524 3110402 3214530 2534673 2248386 2729795 3071777 3305691 3072487 3015251 3661225
2178 3661225 4214164 3467103 2994119 4402423 4140264 3831963 3987712 3963014 3370235 3001260
2168 3001260 3342394 3134260 3698677 3414900 4011125 4471753 4385013 4282758 4461961 5304695
2158 5304695 5235668 5452560 5323750 5337074 5218319 5688728 6261108 6093970 6351301 6374539
2148 6374539 6714270 6794766 6779132 7420290 7764306 7669817 7613210 8219387 8917379 8998857
2138 8998857 9486215 9470811 10578039 10774258 10584213 11030313 11703448 12480533 12382135 12496968
2128 12496968 13176591 14119491 14675602 15083397 16737065 17279709 17488703 18208689 20105783
2119 20105783 21838133 22652814 23926584 25833078 27700135 29753847 32047463 34787393
2111 34787393 37332663 40532729 44493407 49004319 55282841 62431666 71139019 81841240
2103 81841240 94204449 108758430 125123122 141761025 153484131 153819508 139447347
2096 139447347 116555492 96053771 80126951 68090370 58558360 51070563 45327037
2089 45327037 40814083 36793308 34202264 31539394 29570085 27822773 25610326 23966295
2081 23966295 22176955 21155405 19399848 17956591 17298895 16204997 14949024 14138053
2073 14138053 14354047 14013700 12737428 11717403 11882617 11847855 11192114 10550596 9820814
2064 9820814 9493231 9420189 9332422 9146660 8646196 8137988 8060680 8203671 7768192 7655599
2054 7655599 6890463 6266793 6402560 6823904 6329315 5545807 6277221 5998920 5528115 5664093
2044 5664093 5619638 5501132 4789883 5323271 5622497 5035939 4456025 4512428 4698833 4809444
2034 4809444 5014015 4847629 4212981 3930163 3768618 4189119 4386581 3466389 3302129 3050439
2024 3050439 3507830 3118964 3670097 4098410 3269924 3223738 2862708 3133169 2663638 2524851
2014 2524851 2953325 3072023 3212266 2719413 2929572 2806226 2310622 2337714 2442906 2654446
2004 2654446 2379378 2542163 2072215 1748159 2240370 2309100 2141691 2073842 2165605 2039635
1994 2039635 2098579 2121440 2632686 2483246 2155616 2267876 2295036 2160350 2119103 1768261
1984 1768261 1398280 2065512 2029733 1847604 2114099 2291412 1535012 1096217 2140571 1883677
1974 1883677 1315170 1124751 1100282 1262324 1103515 1268096 1787964 1633406 1483929 1367714
1964 1367714 1197283 1632244 1392844 745089 984139 1662339 1507448 1334572 1484884 1395485
1954 1395485 1385527 1511748 1848334 1332944 819761 966327 1541279 1019151 565238 1661624
1944 1661624 1403659 1389065 1550309 945470 1183986 1767924 1687000 810281 802514 1271450
1934 1271450 1315465 1224788 832360 1058114 1488028 1425440 1087584 940817 1166256 1370305
1924 1370305 1405487 1208391 1285438 699327 589776 919248 683056 427149 196723 930886
1914 930886 1271131 410355 823772 671046 551879 627392 1012483 1378994 624036 456029
1904 456029 255952 538764 838745 750327 636823 790621 1547753 717736 284886 981596
1894 981596 1014143 987061 332405 807246 821712 934749 1397906 965825 590846 847690
1884 847690 1013609 820895 315845 896071 937610 769567 1109595 670418 765089 269635
1874 269635 979143 944066 346698 577637 546873 840803 -144 68565 464351 428767
1864 428767 536504 78710 83155 134674 580356 900062 469647 542351 558394 936269 575356
1853 575356 257586 677183 438826 570228 865605 636220 438190 365346 877775 1105979
1843 1105979 903316 1210111 927333 830327 747822 795199 1136552 1243641 1664168 1214850
1833 1214850 1304221 1630566 1289245 1447319 1521078 1415408 998655 735007 912971 818039
1823 818039 971546 471573 298574 588838 570323 724560 444657 560632 761085 636067
1813 636067 697951 493343 430548 99622 580786 697904 392805 745490 651377 129262
1803 129262 77826 1054881 553436 47564 384411 5161 407868 409947 624149 514540
1793 514540 224263 393517 -19532 735121 185978 -76771 6786 194984 340854 723224
1783 723224 285156 -3255 225962 475211 315437 775464 233327 198371 627744 1081695
1773 1081695 866604 121403 445104 24397 69329 35221 172197 455505 658239 795829
1763 795829 258090 231696 354486 384360 532778 212150 1168678 729984 -129048 87838
1753 87838 627219 329199 56262 547115 648309 212001 -168161 269293 616791 250237
1743 250237 -70468 194244 493638 208252 88430 448893 489542 -86391 478603 550470
1733 550470 943210 832407 309360 269437 269648 730792 289605 154960 661068 664323 489645
1722 489645 -154308 151711 -18701 96859 501243 -418631 -129765 265617 -128349 -167545
1712 -167545 268731 145735 345621 549918 397145 374110 194879 126963 613365 521778
1702 521778 311649 124338 107005 488781 -225067 145680 242243 294916 181800 -277957
1692 -277957 -282045 -306878 184403 154159 1139 509726 213606 -99278 -231081 247902
1682 247902 411819 -336562 -83672 -199465 82292 -60604 -507247 -531923 568789 492031
1672 492031 -514551 -395749 398912 267204 -365850 187312 327236 -11353 -264620 -36117
1662 -36117 412255 -250108 -142086 422604 141058 224092 585080 383793 629535 346653
1652 346653 -140016 -74889 620421 663136 -220143 -21139 278929 623285 321999 -783211
1642 -783211 -62093 674373 389989 -67592 -11234 172272 -622793 -122034 423583 5159
1632 5159 -676791 -551495 660948 617516 -311350 -634575 -162665 380884 -290957 -33153
1622 -33153 561176 541194 81806 253577 865932 119079 382999 394356 -381765 60465
1612 60465 94464 -4891 -318784 162283 420655 -236153 469845 528022 54821 367295
1602 367295 49823 732740 702211 -68783 -131146 -80538 440594 -376344 -46258 152084
1592 152084 7513 167161 -480945 178652 314137 -11478 -23536 -49875 342549 179847
1582 179847 264543 -154865 -88363 523003 440486 147332 234197 392637 209228 286
1572 286 -2485 7527 186087 -66311 -107577 775848 418565 -192234 62493 277896 172798
1561 172798 -80761 -149954 -270300 243252 32277 -626212 -159161 621794 683453 -197509
1551 -197509 -163246 623690 525310 -49973 -629447 297449 527382 -513691 -387269 166290
1541 166290 -318871 -651085 -151718 -284412 -433213 -234570 -110908 -205536 235037 47092
1531 47092 -310889 13057 -205852 -445477 332059 -162976 -589478 51845 122691 -285825
1521 -285825 249151 333413 -227263 -273167 389662 343366 65946 -329049 -400678 -16014
1511 -16014 -31751 -607699 -11554 381158 392967 -219011 -7153 121735 304066 -102999
1501 -102999 -875296 -211810 -189670 34367 -258346 -513908 -347428 -20785 -29559 -243618
1491 -243618 -46164 -33227 -134297 -56715 -56331 48037 -438555 -218645 -134120 53149 -303179
1480 -303179 -102922 301691 154350 -823259 -274496 477102 -185139 -289726 91093 25532
1470 25532 -235717 -321638 -142319 -268295 189645 -136293 302015 382726 -342631 -389609
1460 -389609 -252097 244758 390875 284635 -321238 77355 187669 -579877 -173011 -325
1450 -325 -203526 454477 18332 -6504 -258405 -62933 241035 368171 104120 -583313
1440 -583313 -175740 -45633 123888 -768 -95719 149462 -283087 118255 179725 220834
1430 220834 186360 -15381 156119 -280553 394347 993748 363161 -163816 -40614 78362
1420 78362 -217389 -364801 -276048 -374967 -196105 -228491 227778 177554 -331003 -335425 105186
1409 105186 590926 123508 -317797 -24012 141977 -20219 24552 -28771 -89147 207499
1399 207499 -135453 -97275 367769 -294046 -392852 -902042 -207103 -24892 36263 2233
1389 2233 -74142 521335 219485 151329 -60452 -540043 -274302 225910 204167 -240422 -193298
1378 -193298 -163321 -378492 -65319 106030 53676 -239663 129931 60469 -359155 -339837
1368 -339837 -139229 277453 -155752 -428237 353771 58418 -347798 -474297 -366000 -292103
1358 -292103 -106908 41124 -130099 -325964 -435055 -105795 24512 200221 147821 260925
1348 260925 -222517 13183 349929 -225770 -617672 -95924 377260 -590696 -463291 -629827
1338 -629827 -663330 -421795 -609316 -306806 -366172 272321 -79071 -4780 463155 -21963
1328 -21963 147691 183530 -185548 2064 -10160 -616106 -308258 -292410 -483537 52898
1318 52898 240839 152032 481650 232427 131404 328657 686381 466528 -104938 406355
1308 406355 495483 183220 -83352 20268 226907 469791 514614 184698 -69183 -56498
1298 -56498 39995 55817 -272483 -183585 307743 -331375 -532576 -244890 -7230 -303595
1288 -303595 -426291 -237197 -76997 17296 -394360 -95378 -87833 -194506 -162323 65292
1278 65292 285523 118087 381660 428180 403243 481398 64075 28068 47096 -182597 -412167
1267 -412167 -788615 -298167 435782 270276 -20854 102299 -394264 -1011087 -321226 139904
1257 139904 -241246 -191761 -218031 -341457 -163771 128536 -223324 -462459 -278601 -179335
1247 -179335 -135441 2555 -22910 153544 -5387 -91158 314483 302002 83818 -62341
1237 -62341 34096 -195523 -129755 170443 118954 531931 193086 -489969 -107639 82853
1227 82853 -224857 -513975 -540408 310726 -203714 -230490 210981 411077 429700 -648023
1217 -648023 -107880 319656 -333596 -566307 -260355 -204515 -377049 -218143 123742 -64548
1207 -64548 -429316 -203475 -273449 -238849 -182053 -247170 -348119 -601069 -298621 -515138 -708922
1196 -708922 -792132 -42225 -339811 -857964 -516237 -355892 188141 -81583 -273836 -104963
1186 -104963 31792 -47693 -333913 321141 117530 -458139 -329678 205330 122905 -1987
1176 -1987 40206 479707 58531 -429775 -444013 -309174 -476452 -550709 -423530 -547848 -614010
1165 -614010 -513471 -178211 -248723 -117939 442236 242032 172206 53086 -520450 -355289
1155 -355289 -373608 -21493 79337 67636 -29364 7607 -226056 -793500 -740907 -241489 -327087
1144 -327087 -409824 -40102 33254 117769 159967 314023 394524 345137 -192907 -145622 575349
1133 575349 574616 -305012 -819045 249891 159167 -342699 -39004 255607 -21012 -78979
1123 -78979 37528 336823 -242423 -397412 -243857 -256762 83300 29211 -806017 -681403
1113 -681403 -226234 489625 216242 -124671 -252763 -34492 98937 -109707 11159 468586
1103 468586 511248 346980 114992 156544 63450 -207141 32652 -17297 31454 -1419 -269437
1092 -269437 -368879 -631648 -414154 199913 557320 228533 113088 51478 101181 1043455
1082 1043455 271730 -545004 -611698 13620 110033 -528268 -663043 -155558 236137 -85264
1072 -85264 -613400 -22023 -137251 -233087 -916548 -640301 -144491 -482019 -521474 -605619
1062 -605619 -150646 91838 -544255 72932 184268 -173915 -291423 310814 596049 370392
1052 370392 437143 418921 309220 46390 -410377 -279330 -369512 112859 -106689 -621902
1042 -621902 1145 1511 -159628 -471956 -580272 32053 -225449 -327008 -197748 556025
1032 556025 245043 -605772 221386 292958 403682 -482907 -189999 408564 -334856 -262888
1022 -262888 -583144 -90133 -38274 -479343 135885 -140524 340324 -550515 -930972 -343706
1012 -343706 -440057 114683 -233002 -208585 225034 209878 -16164 -947386 72055 252321
1002 252321 -91485 -31857 69324 153654 -419308 -680787 -199234 -254439 -123785 -375574
992 -375574 130023 520735 -58274 -168152 -137364 -62123 298558 130541 -74214 144883
982 144883 -126580 -204080 -250404 2426 -520635 -347096 -19074 -229505 -109185 -385686
972 -385686 -350179 -37705 -258008 -804920 -531746 430082 -87314 -913585 -359415 -119720
962 -119720 219617 220867 -395779 134356 431431 153613 -17047 324892 99420 -391036
952 -391036 -28338 53629 -147323 40831 -129697 183286 204477 24620 -268287 -201696
942 -201696 -178101 -319241 -36332 -187238 315295 161689 -638840 -134928 479796 382105
932 382105 -604155 -515562 400344 -96911 -45347 -445302 -266519 136828 -297888 156124
922 156124 222036 -555906 -397006 -103466 456142 181771 -7588 -164276 -144436 608570
912 608570 172830 -170190 -590016 -225665 349445 84483 104219 143197 140077 188757 -52477
901 -52477 -33933 91964 235680 160479 122176 258796 187848 38887 172199 335024 271098
890 271098 -344713 -789224 -248061 388160 75378 -843732 47161 144657 -1001133 -397268
880 -397268 -26471 -64100 -728053 -293201 645855 230912 -197558 -508647 -210984 -79281
870 -79281 -264914 222015 -129200 -325879 293518 309391 -291033 -205713 301836 -537880
860 -537880 -420553 272454 111983 -467873 -393471 52454 312653 267447 -13388 578479
850 578479 349661 -339398 166994 129878 -22769 -104776 -166022 187997 146863 -37429 -244111
839 -244111 -98333 -215056 -663225 -211823 412243 -32153 -287471 -243529 -71637 32660
829 32660 -64659 -138979 -672082 -288469 191684 342480 264941 -117665 -161029 -101738 -309947
818 -309947 -624448 18144 -209094 -598531 -183087 504929 255058 -185715 -324552 -208555
808 -208555 -403520 -200103 -177996 -97074 -623504 -782880 -112755 -500355 -256954 -82717
798 -82717 -359237 7087 499074 46828 -497502 -625890 -112336 -75281 -333910 140490
788 140490 49840 -343544 -424174 -49917 67079 -340714 -32568 -307208 -220020 -187593 -480102
777 -480102 -361564 -450586 -81319 300585 -68674 218445 -323157 -256885 141068 174350
767 174350 608377 -307559 -148464 -43992 -75676 191278 -221807 -123318 -307692 -117564
757 -117564 170950 -11520 461476 102913 -316076 46994 411012 623816 87411 -314757
747 -314757 -2909 452827 87140 -261640 359631 279393 -265825 -20427 141331 -372033
737 -372033 -539132 -188245 -233142 -38318 38721 -308663 -587405 -92735 -310724 -165991
727 -165991 -524019 -385111 -231169 -352427 196313 82313 -129727 -406248 -174684 -60698
717 -60698 82620 16383 -686252 -116559 360421 317244 31658 -477911 307435 214459 -403407
706 -403407 -219770 -114549 52632 -150104 -80901 63348 -260840 425842 348469 217412
696 217412 82950 -18611 142989 -22145 -385209 -182486 569771 113143 -276648 128287
686 128287 235783 -100013 -70815 -147143 -408790 -387059 -96595 318296 55773 -204205
676 -204205 291377 652550 102070 -172907 221198 31402 -300518 328701 203166 -494110
666 -494110 -298392 492822 553245 15427 -241678 -141501 -31927 -432424 -124699 290814
656 290814 -280239 -692437 158598 234794 180525 271754 350041 575894 -142868 -167425 -200342
645 -200342 -161205 -245319 -259068 214311 334777 194590 -378815 -426909 556619 -108803 -403521
634 -403521 142960 268047 -138034 -609575 -350018 -306574 -300984 -226348 -61957 -143320 -415504
623 -415504 -19814 20032 -252743 6876 -32928 -210158 131297 683423 243453 45028
613 45028 503571 766268 413088 22308 98553 118712 13431 -55336 187670 -132743 -376141
602 -376141 -367195 -333928 280515 34208 -380668 -297091 12981 233355 48735 85300 157458
591 157458 302489 221951 499932 -472313 -497365 153996 20490 -307824 -548507 -116042
581 -116042 -407038 -649989 -292316 388052 17553 -490201 77461 9138 -406614 -505899
571 -505899 -448142 -356015 -363158 -638741 -259695 629274 -143783 -449562 -36912 645187 51246
560 51246 -665018 2033 -45136 86864 234419 -280733 -317252 -656532 -361971 21262
550 21262 50096 107757 -86042 -658168 -454851 225341 -519597 -988186 -319890 233280
540 233280 161371 -556241 -88114 245028 -115608 -323658 80680 544678 -214259 -639942
530 -639942 -171687 166296 27433 -137716 -502864 -334981 -42201 36020 -113969 290418
520 290418 169654 -314340 -96734 574511 709999 11939 -608348 -153894 80400 -122191
510 -122191 -534260 -570014 -487340 -590424 62743 340019 132649 337284 217159 -387972
500 -387972 -73578 316438 230734 -126961 151996 239464 209753 168804 155808 -249464 -459334
489 -459334 318763 680127 187700 -38318 101315 749115 -22711 -7033 14377 -183977
479 -183977 16949 -346990 244665 198440 398682 444122 174113 248259 88772 -218856
469 -218856 279445 100064 -44642 -123973 474601 188334 -197148 160401 -24339 264365
459 264365 73721 365442 459003 166867 16240 382219 656751 225530 98584 277264
449 277264 275864 4612 -320941 -214930 -248074 -453437 -163458 153438 -3359 -124768
439 -124768 -130626 522608 6038 -377052 67050 6673 -273179 -406536 81104 377928
429 377928 404103 55429 362946 225946 -249290 -139457 182230 -161294 -8858 -58868
419 -58868 87634 471691 639540 337142 -270804 -208642 30301 384563 260884 -564070
409 -564070 -99936 -56795 49592 216918 -202687 -148664 -31834 14544 -572882 -478398 280632
398 280632 13129 209515 -48514 -405075 34938 -60895 116822 -125052 322097 420983
388 420983 287576 516678 107688 221988 228111 71712 -84012 52887 523402 322861
378 322861 684934 180802 158962 48233 -292356 272277 534095 396920 145887 205886
368 205886 456266 497972 202753 -543731 -99712 366343 -162991 205102 216477 160091
358 160091 -48981 280659 604652 -48374 -203735 -229591 -2383 162298 -743133 -384260
348 -384260 -66262 -68439 -9286 180699 339103 -93834 -21428 132821 -34086 336163 -215359
337 -215359 47150 533658 -538103 -305558 147595 -24221 -75727 -173519 5771 449539
327 449539 443454 67810 -37379 118658 -395 255543 174652 -192456 100796 601678
317 601678 72381 100095 307395 143428 -188324 309295 546689 -76710 -265159 -80972
307 -80972 250571 82825 183799 327686 191550 -120195 -320493 331939 399824 223933
297 223933 -230649 -338934 381032 62052 529910 355062 -375363 123291 -107680 428170
287 428170 88245 320698 -31436 -180878 570657 535102 14240 -357890 315367 354693
277 354693 -381326 149350 -126824 -485639 -178475 -156509 3953 240628 504976 -263338
267 -263338 144871 677738 118822 -6471 -284076 200385 89090 -119183 184413 287517
257 287517 5888 -115577 476826 194591 -40080 32329 292398 419367 399393 359018
247 359018 195482 -370094 -25015 302711 497157 -15320 -39263 -438754 -480863 58202
237 58202 506695 -140122 -288443 130821 -86529 -262753 402440 312255 -404514 -399369 134046
226 134046 86898 -336398 -336066 94252 -21489 -355964 385783 451809 139926 -175855 -318604
215 -318604 257968 231288 212610 -179614 93207 422173 340948 674459 674729 359600 86249
204 86249 160520 227898 123288 978 331945 446967 354413 177963 173787 240340 29281
193 29281 296979 643229 645835 758271 576544 276251 325304 383099 264038 98172 76091
182 76091 -177067 27193 616335 207272 259926 229694 683556 839574 542412 387618
172 387618 376861 459985 307362 549555 -354175 -767524 46862 229571 -233113 -413970
162 -413970 225022 242479 -244783 81960 545853 574966 12445 -497839 338927 262943
152 262943 314855 122307 -330578 -232143 -101105 124117 638613 500986 245398 -248739
142 -248739 418135 494985 5082 -266714 -258702 510804 281877 -52642 -74522 117794 137237
131 137237 -214881 311884 477207 301482 44927 191429 489226 151395 -114510 -89112
121 -89112 -32520 103483 97848 -26760 -104950 264103 -107853 -356801 -223135 -161455 286080
110 286080 22863 40519 -54834 162268 61746 304950 183766 48375 256481 619856
100 619856 670277 388375 169665 207357 462773 44946 -400470 171683 72798 363048
90 363048 496037 416230 185301 504462 576197 237821 157090 -270241 -90236 395789 -12341
79 -12341 47372 334554 633138 252177 -26005 395013 282667 -92668 -98247 474067 105353
68 105353 -155784 288694 382990 -160544 69955 227903 30929 -88293 438512 160245
58 160245 -193078 356623 573657 239387 -77728 469998 673445 -68322 -256139 424452
48 424452 568073 306628 120970 122714 194078 -88370 -220468 154210 332544 -116407 10522
37 10522 427061 74087 14238 246921 565512 327274 114796 302766 355190 605434 652246
26 652246 379807 33945 361909 424887 155903 -41123 19555 390127 349556 125512 141733
15 141733 269481 250236 -115174 152904 313241 478549 433874 124908 -144443 -60946 304866
4 304866 237855 285638 176874 70938
0 70938
$$ Imaginary data points
##PAGE= N=2
##DATA TABLE= (X++(I..I)), XYDATA
16383 -2923171 -2909482 -2945213 -3016514 -2811686 -2859194 -2689650 -2828953 -2754447 -2512929 -2153385
16373 -2153385 -1824396 -2311034 -2331069 -2114459 -2258978 -2220097 -2185101 -1870616 -2333540 -2043266
16363 -2043266 -1898090 -1885287 -1742406 -2130843 -2006822 -2020490 -1823949 -1737373 -1331136 -1469312
16353 -1469312 -1853206 -1622389 -1563315 -1137292 -1366918 -1886595 -1255164 -962514 -767413 -717712
16343 -717712 -849386 -842768 -682157 -735933 -1344066 -941773 -461632 -1288000 -964309 -840026
16333 -840026 -714116 -621954 -461142 -163965 -585206 -485869 -459743 -163737 -400781 -837353
16323 -837353 -366737 -284535 -197706 -244598 -78771 102783 100546 282580 -325383 -155417
16313 -155417 179374 180857 70644 140141 193693 221503 332457 683766 224024 305777 549434
16302 549434 354848 539411 273987 552699 408986 650169 1037741 1049177 1353247 896464
16292 896464 962047 815585 1028219 1643756 1524376 1520965 1012117 1268188 1419065 1279579
16282 1279579 1699971 1036149 1043978 1219711 1470072 1941042 1760617 1687228 1483402 2187758
16272 2187758 1974971 1633401 2037719 1681800 1845824 1775596 1798560 1781819 1465262 1960375
16262 1960375 2060100 2023491 1891692 2371561 2170377 1999266 2783847 2569546 2404284 2383599
16252 2383599 2414645 2347123 2160058 2252785 2936087 2683444 1898196 2639608 2938584 2543219
16242 2543219 2665692 2695472 2630547 2817144 2715572 2433061 2413669 2650843 2446771 2319536
16232 2319536 2941282 2985944 2887367 2952050 3010631 2815348 2689335 3077089 3088550 3112299
16222 3112299 2752420 2925737 3138067 3571508 3251316 3237743 3117378 2635756 2958919 3049681
16212 3049681 3303148 3033348 2578396 3165991 3173139 3282033 3551750 3315585 3336035 3030553
16202 3030553 3257399 3154261 3124668 3325486 2958300 3012538 3707531 4329172 3644401 2670584
16192 2670584 3909059 4053797 3711114 3676578 3511687 3790212 3641769 4223752 4278577 3851515
16182 3851515 3480015 3801734 4665204 3950413 3342200 3590563 3580565 3686319 3981183 3881202
16172 3881202 3068164 3194547 3823049 3783410 3526038 3561499 3723904 3914154 3872338 4059591
16162 4059591 4009319 3690241 3466268 3737000 4221320 3760929 3481999 3599219 4360823 3980406
16152 3980406 3813044 4356702 4570539 3685695 3196769 4334316 4731137 3927228 3356755
16143 3356755 3470687 4056255 3974396 3943913 3837125 3910142 3866267 3865527 3861153 4047870 4176702
16132 4176702 3866152 3735467 3997143 4618659 3832721 3276278 3696467 4469679 4224648
16123 4224648 3612608 3933013 4392711 4101797 3462251 3974441 4400301 3977185 3298168
16114 3298168 4040963 4926165 4464122 4152678 4176108 4279995 3822048 3885375 4172906 4232580
16104 4232580 4265868 4285043 4396169 4424960 4433723 4753005 4389500 4463191 4856123 4364814
16094 4364814 4244561 4422426 4721137 4379407 4283457 4510259 4287369 4446618 4307508 4169099
16084 4169099 4543359 4599156 4067577 4199276 4292243 4407736 4404001 4219116 4100818 4424754
16074 4424754 4713205 4255404 4465605 4641851 4939166 4501212 4099060 4038426 4468317 4469069
16064 4469069 4308530 4565802 4286949 4281356 4388420 4084650 3850099 4318846 4370954 4417621
16054 4417621 4590731 4394102 4249556 4450729 4166732 4150510 4322839 4243404 4349793 4290202
16044 4290202 3995037 3996597 4190142 4736408 4533233 4571625 4239011 4488633 4490141 4610176
16034 4610176 5222233 4453524 4281251 4607064 5157215 4453096 4169488 4402670 4045177
16025 4045177 4541929 4481127 4216950 4223271 4616228 4790103 4063530 4445395 4338087 4284857
16015 4284857 4901866 4825187 4446955 4003785 4075139 4898027 4788534 3866652 4169920 4348657
16005 4348657 4015540 3716227 4926184 4753180 4468654 4080150 3673050 4611063 4564798
15996 4564798 4394482 4153218 4600500 4545960 4333580 4459218 4114792 3755581 4153700 4696513
15986 4696513 5122541 4703142 4091201 4119579 4105641 4500851 4049289 4178995 4343085 4311187
15976 4311187 4276666 4229073 5051148 4720584 4581263 4282436 4528378 4232791 3798345 4308338
15966 4308338 4036460 4133770 4476841 4318200 4538820 4129831 4168209 4326318 4893680 4886448
15956 4886448 4521795 4551915 4772025 4936517 4219880 4501437 4733097 4069857 3753477 4134644
15946 4134644 4456842 4078241 4100651 4861809 5351602 4826597 4851298 4748855 4573255 4729660
15936 4729660 4564083 3983165 4148786 5202686 4710879 4319561 4195395 4462504 4650576
15927 4650576 4426894 4310415 5015320 4782561 4272295 4760890 4867887 4378565 4463585 4712981
15917 4712981 4426786 4594165 4143532 4069423 4757593 4936359 4472982 4625691 5210777 4906165
15907 4906165 4860011 4861149 4075642 4473781 4515413 4529059 4630264 4568712 4334649 4581878
15897 4581878 4519949 4094669 4212788 4426242 4602252 4585736 4949432 4463703 4257638 3984880
15887 3984880 4401502 4900546 4300194 4594742 4588575 4544830 4696140 4279372 4694050 3966127
15877 3966127 4126543 4436568 4251528 4610275 4142918 4562912 4427712 4475752 4942567 4532054
15867 4532054 4527029 4303993 4457279 4543948 4261886 4722973 4613396 4272178 4291101 4405316
15857 4405316 4852406 4652250 4434840 4119453 4351693 4338212 3979793 4511989 4318313 4231038
15847 4231038 4210204 4402607 5041823 4012331 4051927 4417724 4733923 4586336 4320888 5112304
15837 5112304 4672227 4620357 4985723 4492252 4358336 4601380 5051783 4377308 4513900 5198215
15827 5198215 4644383 4427603 4549322 4693903 4750725 4315015 4368739 4295179 4629240 4687862
15817 4687862 3805904 3538388 3692691 4381908 4090792 4390399 4781297 4572646 4472669 4401425
15807 4401425 4840982 4695193 3987031 4129374 4373354 4585115 4499619 4282018 4331096 4878880
15797 4878880 5164079 4323286 4209489 4854516 5169261 4382182 3993343 4881823 5230636
15788 5230636 4587754 4423254 4705511 4523443 4719256 4867488 4508950 4384206 4539662
15779 4539662 4611879 4779493 4127958 4176848 4162714 4381435 4908627 4188088 3954607 4259352
15769 4259352 4440377 4689041 4431934 4190082 4315564 4784399 3938199 4150896 4648851
15760 4648851 4799720 4278054 3697004 4581418 4655574 5344856 4968481 4472077 4554143 4022215
15750 4022215 4723389 4393582 3881781 3976560 4560557 5172411 4364914 5094255 5040850 4111588
15740 4111588 4481933 4750367 4933387 4330643 4898228 5235910 3909477 4801971 4521437
15731 4521437 4790451 4445108 4221376 4920584 4247748 4900506 4426599 4702175 5310525
15722 5310525 4858093 4873748 4631024 4879405 4495213 4296226 4851435 4857162 4966342 5060513
15712 5060513 4919142 4679910 3908595 4684523 4855441 4019399 4578591 4766431 4690994 4473540
15702 4473540 5058821 4731193 4442266 4591161 4735288 4515284 4574910 4620084 4407513 4196678
15692 4196678 4529161 4592316 4922619 4960869 4575803 4908520 4722702 4967360 5228938 4599382
15682 4599382 4639219 4827934 4631205 4799148 4664660 4505031 4092945 4237472 4080030 4158448
15672 4158448 4411814 4599899 4599991 4360885 4227858 4443857 4370398 4240098 4156957 4415268
15662 4415268 5054182 4950737 4381836 4746152 4742405 4594282 4375038 4633282 5049135 4569490
15652 4569490 4202421 4396067 4964999 4790711 5066880 5245020 4826049 4951588 5141855
15643 5141855 5036772 4702470 4710238 4881262 4666909 4838993 4546790 4094746 4802271 4770490
15633 4770490 5178647 4847286 4470912 4844023 5090219 4994852 4246378 4778318 4613731 4313007
15623 4313007 4413223 4425446 4872822 3978869 4044433 4422700 4634833 5203465 4556230 4594413
15613 4594413 4846000 4640402 4700688 4171460 4353673 4613520 4225149 4564246 4583441 4387437
15603 4387437 4403036 4212468 4438556 4845098 4840410 4528984 4828064 5048213 4631667 4791636
15593 4791636 4652973 5009824 4884727 4387224 4215822 4630032 5116469 4128180 4227807 5104333
15583 5104333 4382928 4275391 4489773 4864795 4964523 4329242 4861155 5235682 4636892 4319204
15573 4319204 4603586 4740819 4337894 4490795 4484566 4588928 4628592 4138715 4565914 5142595
15563 5142595 5124801 4881130 4958649 5097706 4605533 4351643 4290496 5144667 5228075 4786447
15553 4786447 4656223 4747762 5141281 4967867 4424596 4317030 4351370 4591088 4605193 5030563
15543 5030563 4661703 4786801 4832248 4605544 4617996 4343730 4326366 4356120 4821067 4607066
15533 4607066 4122457 4219830 4693342 5335136 4467051 4351389 5403971 4937306 4835220
15524 4835220 4430735 4899305 4093383 4292119 5062013 4962550 4757972 4492226 4364446 4198656
15514 4198656 4401626 4771621 4711384 4228199 4121856 4245661 4353640 4802291 4690008 4978798
15504 4978798 4680523 4500812 4740014 4585936 4959025 4416180 4532082 4756200 4437653
15495 4437653 4469976 4439047 4474960 4211141 4300140 4857977 4733890 4614725 4274299 4508123
15485 4508123 4573819 4149038 4860497 4370887 4203558 4505738 4625530 4564955 4324092 4839353
15475 4839353 4513785 4542165 4583544 4535936 4753428 4409182 4494173 4831463 4708196 4865241
15465 4865241 4020286 3971202 4684047 4530034 4215989 4264741 4570581 4170243 4568779 4758128
15455 4758128 4711570 4791900 4304284 4348592 4214212 4199962 4796433 4605107 4171847 4253033
15445 4253033 4794364 4870012 4729829 4814828 4124094 4243063 4349835 5121839 5143093 4462236
15435 4462236 4453272 4802125 5079670 4952895 4779304 4933553 4731644 4610501 4696236 5187268
15425 5187268 5114501 4339559 4312815 4422225 5060734 4946310 4948234 5047758 4534964 4743730
15415 4743730 5045925 4990461 4431164 4427448 5318724 4974896 5138995 5073938 4527454 4523019
15405 4523019 4715264 4970124 4661868 4634978 4579102 4267799 5009275 4481612 4802765 4919919
15395 4919919 4277910 4032314 4294604 4933025 4758801 4581702 4491059 4687250 4845488 4326372
15385 4326372 4438332 4311830 3870209 4491974 5243667 5136154 4372244 4357754 4487814 4386004
15375 4386004 4939989 5349006 4700123 4294348 4515611 5145662 4541236 4906628 5400453
15366 5400453 4771824 4539887 4717517 5261002 5038641 4530771 4562390 4885627 5144162 4497698
15356 4497698 5029908 4618538 4164021 4466112 4955632 5094341 4347130 4229955 4494394
15347 4494394 5182992 5070368 4694600 5176254 4791353 4336118 4469876 4743089 4892351
15338 4892351 4110153 4617915 4951889 4486232 3883199 4186130 4910740 4552540 4432936
15329 4432936 5073436 4850652 4668857 4425294 4808583 4951365 4398925 4514804 5175476
15320 5175476 5100863 4033553 4296588 4866394 4801518 4748895 4647442 4558429 4862062 4720784
15310 4720784 4647343 4348755 4244622 4408256 4919958 4769585 4709520 5023536 4692083 4796948
15300 4796948 5225894 5172082 4895380 4816567 4795234 5348925 5478450 4680551 4863996 5420284
15290 5420284 4660980 4148500 4591672 5159535 4939514 4616349 4832159 5168022 4399417
15281 4399417 4284875 5027349 4923667 4960402 5631173 5467952 4720570 4607916 4738482 4973187
15271 4973187 5144199 5317151 4996645 4847315 4756618 4672324 4594415 4576335 4970451 4848988
15261 4848988 5322703 5548272 4546996 4280993 4696064 4798568 4556521 4532029 4686183
15252 4686183 4422917 4484442 4647352 4931276 4925120 4748428 4882065 4656721 4792678 5084326
15242 5084326 5080305 5132826 5160234 5226570 4852111 4666139 5030661 5124761 4992780 5029313 4696361
15231 4696361 4788993 4816088 4640227 4281201 4798263 5497934 5040553 4529810 4500526 5160117
15221 5160117 4736122 4722227 5520294 5307671 4762528 4699613 5219805 5049933 4662257 4850723
15211 4850723 4565625 4681291 4699841 4797432 4117688 4515840 4957913 5161731 4837170 4631328
15201 4631328 5573985 4967781 4291995 5029890 5421430 5342486 4460359 4785334 5170428 4922759
15191 4922759 4780969 4606393 5524200 4700776 4651589 4995577 5107574 4771761 4116439 4410600
15181 4410600 4879368 5191936 4998383 4586920 4407712 4880668 5228454 4895020 4869278 4359531
15171 4359531 4471090 4709768 4924630 4742392 4441154 4445584 4274925 4624891 4691763 4864676
15161 4864676 4748543 4585009 4899821 4718065 5000930 5317541 5086876 4813889 4667483
15152 4667483 4613000 5059012 4564290 4585487 4730105 5473175 5523545 4513015 4749868 5213277
15142 5213277 5389198 4706911 4796656 5144218 4868530 4655117 4490718 4389467 4929395 5365215
15132 5365215 5162686 4450918 4571928 4916014 5093249 4713162 5287232 5315464 5253320 4726465
15122 4726465 4483775 4738852 4615359 4449898 4318576 4721465 4623993 4800735 5144149 4974131
15112 4974131 4217307 4285384 4760729 5115258 5131840 4607916 4857085 5078194 5165494 4805667
15102 4805667 4448087 4440827 4645762 5137575 5254338 4915682 4834432 4963984 5401779 5451516
15092 5451516 4499103 5257673 5309644 4850841 4796324 5071682 5278782 4688995 5234797 5066553
15082 5066553 4712512 4830938 4409741 4834742 4658123 4332042 4607430 4987188 4638802
15073 4638802 3840650 4671753 4952555 4888873 4997798 4861479 4306187 4808186 5188919 4788974
15063 4788974 4622853 4415036 4711631 4783213 4466445 4643043 4848063 4508839 4758068 5013660
15053 5013660 5138562 4415258 4489572 4836606 4942090 4874883 4650711 4635257 4824809 4717053
15043 4717053 4819067 4959967 4939692 4966716 4920854 5011059 5165127 5186460 4810210 4793875
15033 4793875 4878553 5023469 4896625 4836212 4622498 4932973 5068372 4921696 4795104 4601739
15023 4601739 5114632 5018827 4853269 5102869 4757080 4743886 4740138 4901562 4962544 4952016
15013 4952016 5274205 4605769 4463529 4802582 5114673 4724788 4939557 5590604 4999777
15004 4999777 4604902 4634157 5120343 4598852 4673527 5051219 4947015 4894173 4512113 4938985
14994 4938985 5138939 4873890 4755108 4671032 4867596 4645916 4623953 4971238 4575563 4964857
14984 4964857 4882133 4854340 4621863 4571482 5015576 5172246 5296438 4968697 4964706 4922178
14974 4922178 4775234 4829631 4105468 4445040 5146304 4792192 4777778 5088357 5523181 4760137
14964 4760137 4635842 4720603 4643613 5256680 4687796 4648456 5284451 5048487 4551457 5254782
14954 5254782 5496145 4247405 4226174 4772780 4944446 5312436 4741916 4579711 5032347
14945 5032347 4733723 4711083 5038279 5169718 5191969 5241540 4885285 5527841 5466537 4683871
14935 4683871 4847353 5544390 4923114 4520800 5365133 5233913 4615529 4614223 4853689 4914129
14925 4914129 4849549 5091890 4711164 4949367 5407617 5387440 5376875 4761648 5455077 5602213
14915 5602213 5127317 5075241 4531718 4838383 4620022 5162387 5576877 5246655 5208904 4557212
14905 4557212 5572168 5575671 4655776 5158647 5017598 5407553 5083466 5292614 5608659 5736417
14895 5736417 5619531 4866725 5381895 4815287 4833129 4967404 4510053 4939295 5122242 4920748
$$ [...]
##END NTUPLES=NMR SPECTRUM
##END=
