##TITLE=1H_CA-9031-2
 CDCl3
 8 sc, 
 6.07.2022
##JCAMPDX= 6.0         $$ Bruker NMR JCAMP-DX V2.0
##DATA TYPE= NMR SPECTRUM
##DATA CLASS= NTUPLES
##ORIGIN= UXNMR, Bruker Analytische Messtechnik GmbH
##OWNER= root
$$ XWIN-NMR		Version 3.5
$$ Wed Jul  6 14:08:46 2022 Russian Standard Time (UT+4h)  she@DPX200
##.OBSERVE FREQUENCY= 200.1313499994
##.OBSERVE NUCLEUS= ^1H
##.ACQUISITION MODE= SIMULTANEOUS
##.ACQUISITION SCHEME= undefined
##.AVERAGES= 8
##.DIGITISER RES= 18
##SPECTROMETER/DATA SYSTEM= spect
##.PULSE SEQUENCE= zg30
##.SOLVENT NAME= CDCl3
##.SHIFT REFERENCE= (INTERNAL, CDCl3, 0, 15.7348)
##AUDIT TRAIL= $$ (NUMBER, WHEN, WHO, WHERE, WHAT)
$$ ##TITLE= Audit trail, XWIN-NMR		Version 3.5
$$ ##JCAMPDX= 5.01
$$ ##ORIGIN= Bruker BioSpin GmbH
$$ ##OWNER= she
$$ F:/spectra/data/she/nmr/H-F/1/pdata/1/auditp.txt
$$ ##AUDIT TRAIL=  $$ (NUMBER, WHEN, WHO, WHERE, WHAT)
(   1,<2022-07-06 14:07:27.82 +0400>,<she>,<DPX200>,
      <created by zg, POWCHK disabled, PULCHK disabled
       configuration hash MD5:
       00 E9 B6 7A A2 85 ED C7 34 08 36 98 17 FE 4E 26
       data hash MD5: 16K
       3B A1 0E 94 1A 77 C2 DC 7E 92 49 85 1E FF D8 9E>)
(   2,<2022-07-06 14:07:30.40 +0400>,<she>,<DPX200>,
      <Start of raw data processing
       efp BC_mod = 2 LB = 0.24 FT_mod = 6 PKNL = 1 PHC0 = -18057.93 PHC1 = 10.60069 SI = 16K 
       data hash MD5: 16K
       ED 57 21 39 F2 8E 9E 87 86 53 7A A6 64 B5 42 9F>)
(   3,<2022-07-06 14:07:53.57 +0400>,<she>,<DPX200>,
      <pk PHC0 = -2.551269 PHC1 = 5.2 
       data hash MD5: 16K
       20 69 E7 F1 8D 74 1A 9E FE D9 58 6B 61 1B AD C0>)
(   4,<2022-07-06 14:07:58.15 +0400>,<she>,<DPX200>,
      <abs ABSG = 5 
       data hash MD5: 16K
       30 48 A3 41 4A 98 E8 BC 32 77 4E 37 9F 30 55 D7>)
$$ ##END=
$$ 
$$ hash MD5
$$ 64 C3 B8 B0 97 27 D7 5D 3A CB 5D AD 27 61 23 14
##$RELAX= 
##$RELAX= 
##$RELAX= 
##$RELAX= 
##$RELAX= 
##$RELAX= 
$$ Bruker specific parameters
$$ --------------------------
##$DU= <F:/spectra>
##$EXPNO= 1
##$NAME= <H-F>
##$PROCNO= 1
##$TYPE= <nmr>
##$USER= <she>
##$AMP= (0..31)
100 100 100 100 100 100 100 100 100 100 100 100 100 100 100 100 100 100 
100 100 100 100 100 100 100 100 100 100 100 100 100 100 
##$AQSEQ= 0
##$AQ_mod= 1
##$AUNM= <au_zg>
##$AUTOPOS= <>
##$BF1= 200.13
##$BF2= 200.13
##$BF3= 200.13
##$BF4= 200.13
##$BF5= 200.13
##$BF6= 200.13
##$BF7= 200.13
##$BF8= 200.13
##$BYTORDA= 1
##$CFDGTYP= 0
##$CFRGTYP= 5
##$CHEMSTR= <none>
##$CNST= (0..31)
1 1 145 1 1 1 1 1 1 1 1 1 1 1 1 1 1 1 1 1 1 1 1 1 1 1 1 1 1 1 1 1 
##$CPDPRG= <>
##$CPDPRG1= <>
##$CPDPRG2= <>
##$CPDPRG3= <>
##$CPDPRG4= <mlev>
##$CPDPRG5= <mlev>
##$CPDPRG6= <mlev>
##$CPDPRG7= <mlev>
##$CPDPRG8= <mlev>
##$CPDPRGB= <>
##$CPDPRGT= <>
##$D= (0..31)
0 1.2 0 0 0 0 0 0 0 0.06 0 0.03 0 0 0 0 0.0002 0 0 0 0 0 0 0 0 0 0 0 0 
0 0 0 
##$DATE= 1657102047
##$DBL= (0..7)
120 120 120 120 120 120 120 120 
##$DBP= (0..7)
150 150 150 150 150 150 150 150 
##$DBP07= 0
##$DBPNAM0= <>
##$DBPNAM1= <>
##$DBPNAM2= <>
##$DBPNAM3= <>
##$DBPNAM4= <>
$$ [...]
##$SUBNAM2= <"">
##$SUBNAM3= <"">
##$SUBNAM4= <"">
##$SUBNAM5= <"">
##$SUBNAM6= <"">
##$SUBNAM7= <"">
##$SUBNAM8= <"">
##$SUBNAM9= <"">
##$SW= 18.0517283424941
##$SWIBOX= (0..15)
0 0 2 0 0 0 0 0 0 0 0 0 0 0 0 0 
##$SW_h= 3612.71676300578
##$TD= 16384
##$TD0= 1
##$TE= 0
##$TE2= 300
##$TE3= 300
##$TEG= 300
##$TL= (0..7)
0 120 120 120 120 120 120 120 
##$TP= (0..7)
150 150 150 150 150 150 150 150 
##$TP07= 0
##$TPNAME0= <>
##$TPNAME1= <>
##$TPNAME2= <>
##$TPNAME3= <>
##$TPNAME4= <>
##$TPNAME5= <>
##$TPNAME6= <>
##$TPNAME7= <>
##$TPOAL= (0..7)
0.5 0.5 0.5 0.5 0.5 0.5 0.5 0.5 
##$TPOFFS= (0..7)
0 0 0 0 0 0 0 0 
##$TUNHIN= 0
##$TUNHOUT= 0
##$TUNXOUT= 0
##$USERA1= <user>
##$USERA2= <user>
##$USERA3= <user>
##$USERA4= <user>
##$USERA5= <user>
##$V9= 5
##$VALIST= <valist>
##$VCLIST= <CCCCCCCCCCCCCCC>
##$VD= 0
##$VDLIST= <DDDDDDDDDDDDDDD>
##$VPLIST= <PPPPPPPPPPPPPPP>
##$VTLIST= <TTTTTTTTTTTTTTT>
##$WBST= 1024
##$WBSW= 4
##$XGAIN= (0..3)
0 0 0 0 
##$XL= 0
##$YL= 0
##$YMAX_a= 90951
##$YMIN_a= -96237
##$ZGOPTNS= <>
##$ZL1= 120
##$ZL2= 120
##$ZL3= 120
##$ZL4= 120
##$ABSF1= 15.73367
##$ABSF2= -2.318179
##$ABSG= 5
##$ABSL= 3
##$ALPHA= 0
##$AQORDER= 0
##$ASSFAC= 0
##$ASSFACI= 0
##$ASSFACX= 0
##$ASSWID= 0
##$AUNMP= <proc_1d>
##$AZFE= 0.1
##$AZFW= 0.1
##$BCFW= 0
##$BC_mod= 2
##$BYTORDP= 0
##$COROFFS= 0
##$CY= -3
##$DATMOD= 1
##$DC= 0
##$DFILT= <>
##$DTYPP= 0
##$F1P= 0
##$F2P= 0
##$FCOR= 1
##$FTSIZE= 16384
##$FT_mod= 6
##$GAMMA= 0
##$GB= 0
##$INTBC= 1
##$INTSCL= 0
##$ISEN= 128
##$LB= 0.24
##$LEV0= 0
##$LPBIN= 0
##$MAXI= 10000
##$MC2= 0
##$MEAN= 0
##$ME_mod= 0
##$MI= 1.114404
##$NCOEF= 0
##$NC_proc= -9
##$NLEV= 6
##$NOISF1= 3.799351
##$NOISF2= 2.8
##$NSP= 0
##$NTH_PI= 0
##$NZP= 0
##$OFFSET= 15.73477
##$PC= 1
##$PHC0= -18060.48
##$PHC1= 15.80069
##$PH_mod= 1
##$PKNL= yes
##$PPARMOD= 0
##$PSCAL= 0
##$PSIGN= 0
##$REVERSE= no
##$SF= 200.130007358893
##$SI= 16384
##$SIGF1= 3
##$SIGF2= 2
##$SINO= 5.538805
##$SIOLD= 16384
##$SREGLST= <1H.CDCl3>
##$SSB= 0
##$STSI= 16384
##$STSR= 0
##$SW_p= 3612.71676300578
##$SYMM= 0
##$S_DEV= 0
##$TDeff= 16384
##$TDoff= 0
##$TI= <>
##$TILT= no
##$TM1= 0
##$TM2= 0
##$TOPLEV= 0
##$USERP1= <user>
##$USERP2= <user>
##$USERP3= <user>
##$USERP4= <user>
##$USERP5= <user>
##$WDW= 1
##$XDIM= 16384
##$YMAX_p= 355026203
##$YMIN_p= -2114113
$$ End of Bruker specific parameters
$$ ---------------------------------
##NTUPLES= NMR SPECTRUM
##VAR_NAME=  FREQUENCY,     SPECTRUM/REAL,   SPECTRUM/IMAG
##SYMBOL=    X,             R,               I
##VAR_TYPE=  INDEPENDENT,   DEPENDENT,       DEPENDENT
##VAR_FORM=  AFFN,          ASDF,            ASDF
##VAR_DIM=   16384,         16384,           16384
##UNITS=     HZ,            ARBITRARY UNITS, ARBITRARY UNITS
##FACTOR=    0.220516191357247, 1,           1
##FIRST=     3148.99960010064, 0,            0
##LAST=      -463.717162905142, 0,           0
##MIN=       -463.717162905142, -2114113,    0
##MAX=       3148.99960010064, 355026203,    0
$$ Real data points
##PAGE= N=1
##DATA TABLE= (X++(R..R)), XYDATA
$$ [...]
6241B247611J24900j106662K92663N759J0010P0995O12965K97374m71421J70874
$$ 2247611 2372511 1265849 1558512 1564271 1574281 1645276 2258241 2555615 2084194 2255068
6231B255068L68451n17424j06326k62985o41529O12344l4960R2433l25909M91527
$$ 2255068 2623519 2106095 1999769 1736784 1095255 1707599 1672639 1765072 1439163 1930690
6221A930690O81530o14860l66724p0011K20433M26501l84196L35380J27906m68227
$$ 1930690 2612220 1997360 1630636 1560625 1781058 2207559 1823363 2158743 2286649 1818422
6211A818422N37048j69599J42894J08142J98958n56163J39460K39350j16933N08940
$$ 1818422 2355470 2185871 2328765 2436907 2635865 2079702 2219162 2458512 2341579 2850519
6201B850519J32284m17913P3299m85202R0373k49847l02213j3154j76411M34343
$$ 2850519 2982803 2564890 2638189 2152987 2243360 1993513 1691300 1678146 1501735 1936078
6191A936078L2162l03164N83084M03805J97177J30215m03145L25942o76772P4909
$$ 1936078 1968240 1665076 2248160 2651965 2849142 2979357 2576212 2902154 2225382 2300291
6181B300291p2951R03938L49761m36345k62941k78532j89523J291609p47551o56284
$$ 2300291 2227340 3131278 3481039 3044694 2781753 2503221 2313698 3605307 2857756 2201472
6171B201472j18652K14176j58070j033N29080L32112l16612m83187l01913M08449
$$ 2201472 2082820 2296996 2138926 2137893 2666973 2999085 2682473 2199286 1897373 2305822
6161B305822K03532J019111o24454j76836j30137K85888J009363q16585M27316
$$ 2305822 2509354 3528465 2904011 2727175 2597038 2882926 3892289 3075704 3503020
6152C503020n9423m73356n61115J59167K57116M05584o93912m21400m367K85090
$$ 3503020 3443597 2970241 2409126 2568293 2825409 3230993 2537081 2115681 2111314 2396404
6142B396404J094258M6600j14979J45054j10885j134355L67821Q68151m32369
$$ 2396404 3490662 3537262 3422283 3567337 3456452 2322097 2689918 3558069 3125700
6133C125700p05808J96586l37282m04394P65257m6404O1904K3778j2557l43846
$$ 3125700 2419892 2616478 2279196 1874802 2640059 2593655 2655559 2679337 2666780 2322934
6123B322934j22851p0873P27194L95460m27518K2307k60098J994R52415n786m00502
$$ 2322934 2200083 2129210 2856404 3251864 2824346 2846653 2586555 2588549 3540964 3535178 3134676
6112C134676o09874l06783K25662J22379l95728k77212M21030J54113n49815N20386
$$ 3134676 2524802 2218019 2443681 2566060 2170332 1893120 2314150 2468263 1918448 2438834
6102B438834o26196O55191P34610K28348q51842n97862j45105N30784Q30856k77350
$$ 2438834 1812638 2467829 3202439 3430787 2578945 1981083 1835978 2366762 3197618 2920268
6092B920268L84026l30713M9855J88782j119046Q21906M32979j82726j8825o8801
$$ 2920268 3304294 2973581 3023436 3212218 2093172 2915078 3348057 3165331 3146506 3077705
6082C077705p2984K60611N82214n10991l34355p64449l6674O42961j99466O76342
$$ 3077705 3004721 3265332 3847546 3336555 3002200 2237751 2201077 2844038 2644572 3320914
6072C320914J71531j96955j98973r35316J01366N90119m67724l8236J010180M71145
$$ 3320914 3492445 3295490 3096517 2161201 2262567 2852686 2384962 2346726 3356906 3828051
6062C828051j68455M6017n00976N64243K33159n61704N69408j30508j47704J1761
$$ 3828051 3659596 3705613 3204637 3768880 4002039 3440335 4009743 3879235 3731531 3743292
6052C743292n54346l41463k9141M53923J11596J70942l38736l66785n0705k07565
$$ 3743292 3188946 2847483 2818342 3272265 3383861 3554803 3216067 2849282 2798577 2591012
6042B591012N89785K9474K88054J68015k76503q87367k52142m23825O07085N62198
$$ 2591012 3180797 3210271 3498325 3666340 3389837 2502470 2250328 1826503 2433588 2995786
6032B995786q63925M67185K95556O8826K18059M62685N1169l898K97565k11502
$$ 2995786 2131861 2599046 2894602 2963428 3181487 3644172 3695341 3691443 3989008 3777506
6022C777506J89100m87145L92165J02732M50848o34601l15489K29046j314142
$$ 3777506 3966606 3479461 3871626 3974358 4425206 3790605 3475116 3704162 2390020
6013B390020O97208J35702o3839o2876k52598O66937J096212k69932m13507M0081
$$ 2390020 3087228 3222930 3159091 3096215 2843617 3510554 4606766 4336834 3923327 3963408
6003C963408j231365M87913P30753l51134M1387k26946K52064L2538j11526N05114
$$ 3963408 2732043 3219956 3950709 3599575 3640962 3414016 3666080 3698618 3587092 4092206
5993D092206M2483n47264n7858O01613k66676L72501N3969N0370k90275l8183
$$ 4092206 4134689 3587425 3529567 4131180 3864504 4237005 4290974 4341344 4051069 4012886
5983D012886p13154j94166j08464K39856R3100K33666j30567j43071K60837n59011
$$ 4012886 3299732 3105566 2997102 3236958 3330058 3563724 3433157 3290086 3550923 2991912
5973B991912k621Q14057l21420j28962O92126j76780o92736L87760M83490K55334
$$ 2991912 2989291 3803348 3481928 3352966 4045092 3868312 3175576 3563336 4046826 4302160
5963D302160R2203l40976J24804M54245j33153j77617J19936L57423J4072K37087
$$ 4302160 4394363 4053387 4178191 4632436 4499283 4321666 4441602 4799025 4813097 5050184
5953E050184p99555k47860N64190L53016k56809l62305L4975L2675L37888K08578
$$ 5050184 4250629 4002769 4566959 4919975 4663166 4300861 4335836 4368511 4706399 4914977
5943D914977r40645L8304J33688m73461M59755j40178L78902L07841o87113o40148
$$ 4914977 3974332 4012636 4146324 3672863 4132618 3992440 4371342 4679183 3992070 3351922
5933C351922Q88201J91479M51588J23116n59714K10989K17188M42982k06053n68394
$$ 3351922 4240123 4431602 4883190 5006306 4446592 4657581 4874769 5317751 5111698 4543304
5923D543304M98804r8892n13915Q8019l61555O4501K91096J30666K23695K64160
$$ 4543304 5042108 4943216 4429301 4517320 4155765 4220266 4511362 4642028 4865723 5129883
5913E129883M53067m35722J78892j92294l31518o10787O27942q9525m31141l03017
$$ 5129883 5582950 5147228 5326120 5133826 4802308 4191521 4819463 4729938 4298797 3995780
5903C995780L7887l3717J71948L01483K45571k75711K10927n42258l16533N26612
$$ 3995780 4033667 3999950 4171898 4473381 4718952 4443241 4654168 4111910 3795377 4321989
5893D321989M24876K09579P4111J3872K89926j21869k29863m52351P68312k62313
$$ 4321989 4746865 4956444 5030555 5044427 5334353 5212484 4982621 4530270 5298582 5036269
5883E036269k68020j62507l68761J12404N03655L41863j62590J59264O376l44772
$$ 5036269 4768249 4605742 4236981 4349385 4853040 5194903 5032313 5191577 5197953 4853181
5873D853181k51548J201221j90620k16675M51061q98069p02695j4699J0954P11747
$$ 4853181 4601633 5802854 5612234 5395559 5846620 4948551 4245856 4231157 4242111 4953858
5863D953858M58180l82529n79234O05293L07051Q7929J36932J21355m51051o35903
$$ 4953858 5412038 5029509 4450275 5055568 5362619 5450548 5587480 5708835 5257784 4621881
5853D621881r910J015873Q1744p20189k50011J52199N64952L11224j11511p18189
$$ 4621881 4611971 5627844 5709588 4989399 4739388 4891587 5456539 5767763 5656252 4938063
5843D938063k13468R38880k55641J52714J51723l25920K70162J10133j1025J93450
$$ 4938063 4724595 5663475 5407834 5560548 5712271 5386351 5656513 5766646 5755621 5949071
5833E949071M1580l87395l17148j7003j6349M19474k90722o1626L38511j73990
$$ 5949071 5990651 5603256 5286108 5269105 5252756 5672230 5381508 5319882 5658393 5484403
5823E484403M25235N11712K69070n38253q10288j29475M58554J587L6906j76597
$$ 5484403 5909638 6421350 6690420 6152167 5341879 5212404 5670958 5672545 5709451 5532854
5813E532854J66086n38047N42740J98941j14551O87420l25606M3548m65326K82748
$$ 5532854 5698940 5160893 5703633 5902574 5788023 6475443 6149837 6193385 5728059 6010807
5803F010807N05236q08079Q2150M00386l78698K36017M31109j92333P0935m51639
$$ 6010807 6516043 5707964 5790114 6190500 5811802 6047819 6478928 6286595 6357530 5905891
5793E905891O9563j58375K84964l7268j67985K02587K17674M06976o33630L20992
$$ 5905891 5975454 5817079 6102043 6064775 5896790 6099377 6317051 6724027 6090397 6411389
5783F411389J8083n45167l8644l04383L40364J260043k11492j93036k12772N12790
$$ 6411389 6429472 5884305 5845661 5541278 5881642 7141685 6930193 6737157 6524385 7037175
5773G037175J94336M29343o12620m58539j81723M6412n4068K45987l59058M03816
$$ 7037175 7231511 7660854 7048234 6589695 6407972 6454384 6400316 6646303 6287245 6691061
5763F691061q0283J71799k4211l20570n1459K72878R94546L36032o6008q99745
$$ 6691061 6610778 6782577 6758366 6437796 6386337 6659215 7653761 7989793 7923785 7024040
5753G024040q7864J76895P59768q5939l01438L14937L0684K98033m72905j45935
$$ 7024040 6936176 7113071 7872839 7786900 7485462 7800399 7831083 8129116 7656211 7510276
5743G510276k82779n89395K31290P67948M79712n70537n74704R7593p15475K51446
$$ 7510276 7227497 6638102 6869392 7637340 8117052 7546515 6971811 7069404 6353929 6605375
5733F605375K50574m8730q7949j65064N93396r2648L54825L67545R81356J70112
$$ 6605375 6855949 6807219 6719270 6554206 7147602 7054954 7409779 7777324 8758680 8928792
5723H928792q79584m61248k48001J08585l08863K01946J03299J72972M35953l28445
$$ 8928792 8049208 7587960 7339959 7448544 7139681 7341627 7444926 7617898 8053851 7725406
5713G725406M98859J04923n52813l63392L01926K31280J7973l89451J07557k31981
$$ 7725406 8224265 8329188 7776375 7412983 7714909 7946189 7964162 7574711 7682268 7450287
5703G450287r8452L13130j12286l36669L8459P60428R2352n06577r135j74760
$$ 7450287 7351835 7664965 7552679 7216010 7254469 8014897 8107249 7600672 7591537 7416777
5693G416777j45420L08754K57802L22608k50930n29463M71407J85973R2725m76588
$$ 7416777 7271357 7580111 7837913 8160521 7909591 7380128 7851535 8037508 8130233 7653645
5683G653645J08945J51934L99335M70668K5378m19255l21809O35697l55341n4160
$$ 7653645 7762590 7914524 8313859 8784527 8809905 8390650 8068841 8704538 8349197 8295037
5673H295037k88119O52278n58619P726j45344o73149L83106J035785P60498l47705
$$ 8295037 8006918 8659196 8100577 8108303 7962959 7289810 7672916 8708701 9469199 9121494
5663I121494K04792o01876K69698j050363l7640L45433M44791j82460K87467Q9809
$$ 9121494 9326286 8724410 8994108 7943745 7906105 8251538 8696329 8513869 8801336 8891145
5653H891145K51709l99025O83973j93754O6048K3247p38076L72375J04721O93217
$$ 8891145 9142854 8743829 9427802 9234048 9300096 9323343 8585267 8957642 9062363 9755580
5643I755580r69802k14889N24343l41954R59311K43768p38412n22791L39250k01465
$$ 9755580 8785778 8570889 9095232 8753278 9712589 9956357 9217945 8695154 9034404 8832939
5633H832939O86647N88361l19810j72834l31413O1906j74859L74897J38713j08422
$$ 8832939 9519586 10107947 9788137 9615303 9283890 9345796 9170937 9545834 9684547 9576125
5623I576125M45500K29997o27912M30238K72751L6065j98673m05916r0454k77449
$$ 9576125 10021625 10251622 9623710 10053948 10326699 10362764 10164091 9758175 9667721 9390272
5613I390272O4533O88930m31114n30281J76624P42503J79370K01870M6484j14754
$$ 9390272 9454805 10143735 9712621 9182340 9358964 10101467 10280837 10482707 10529191 10414437
5603A0414437l9237R1363M39109n96769J26084N16801n54309j6256l45998J015008
$$ 10414437 10375200 10466563 10905672 10308903 10434987 10951788 10397479 10381223 10035225 11050233
5593A1050233L91588k09224m8156r2751K33024n2957Q143k90827k85995l52803
$$ 11050233 11441821 11232597 11184441 11091690 11324714 11271757 11279900 10989073 10703078 10350275
5583A0350275P1763L06006p1885K23460m40258k02748M57884L3320R758j71128
$$ 10350275 10422038 10728044 10656159 10879619 10439361 10236613 10694497 10727817 10737575 10566447
5573A0566447l65752M7102M97547M59780p30348q6172K5845L27829L80990m3115
$$ 10566447 10200695 10247797 10745344 11205124 10474776 10388604 10414449 10742278 11123268 11080153
5563A1080153l56816K41360M12756N64801o83060k43437j56116o97534l40210
$$ 11080153 10723337 10964697 11377453 11942254 11259194 11015757 10859641 10162107 9821897
5554I821897Q61969L92296K7597P64756M49291l30492l55727O24029l72782o24503
$$ 9821897 10683866 11076162 11103759 11868515 12317806 11987314 11631587 12255616 11882834 11258331
5544A1258331J61640J99733k76875L01466N99606l33049l76721P35586o76494
$$ 11258331 11419971 11619704 11342829 11644295 12243901 11910852 11534131 12269717 11593223
5535A1593223m36877N95868P3274O00302n64955k07142J60876K47069K7387k42839
$$ 11593223 11156346 11752214 11825488 12425790 11860835 11653693 11814569 12061638 12089025 11846186
5525A1846186Q3916L58048L57377p25628L27642Q45813k52974j76016k17287K98270
$$ 11846186 11930102 12288150 12645527 11919899 12247541 13093354 12840380 12664364 12447077 12745347
5515A2745347l23439j75859P314L83246O64253l22630n63494n72163K1220N27965
$$ 12745347 12421908 12246049 12253363 12636609 13300862 12978232 12414738 11842575 11863795 12391760
5505A2391760Q17763j47998l21662l78860P07111K55144m65523m25793O56456
$$ 12391760 13209523 13061525 12739863 12361003 13068114 13323258 12857735 12431942 13088398
5496A3088398K79949l0767M06972L67486r6937N35540O19829L13343k86684l44943
$$ 13088398 13368347 13337580 13744552 14112038 14015101 14550641 15170470 15483813 15197129 14852186
5486A4852186n77360p55555o16987L83758M69877l73961l64587O01208N86998
$$ 14852186 14274826 13519271 12902284 13286042 13755919 13381958 13017371 13618579 14205577
5477A4205577o43486m27022O00901n4848P43258k73244p13197J36568K32725K29602
$$ 14205577 13562091 13135069 13735970 13681122 14424380 14151136 13437939 13574507 13807232 14036834
5467A4036834m14249n2693Q06375r6368m00052n33117N31624R64029m26810M05481
$$ 14036834 13622585 13569892 14376267 14279899 13879847 13346730 13878354 14842383 14415573 14821054
5457A4821054M26780M26699p20452j34783K46n62133l80949j73503j72072K46707
$$ 14821054 15247834 15674533 14954081 14819298 14819544 14257411 13876462 13702959 13530887 13777594
5447A3777594j18651J1274m60002q0510L90323r9418K24122N80875m64970n13992
$$ 13777594 13658943 13670217 13210215 13129705 13520028 13420610 13644732 14225607 13760637 13246645
5437A3246645O39059q60985K3624m4103K69965M24580K06048j27701p6658N34780
$$ 13246645 13885704 13024719 13048343 13004240 13274205 13698785 13904833 13777132 13700474 14235254
5427A4235254j50611j27923Q29119j87833r4854j74327o11019p93573j70257O60629
$$ 14235254 14084643 13956720 14785839 14598006 14503152 14328825 13717806 12924233 12753976 13414605
5417A3414605J022898J94149q41654L10376j98210P81723l35625m94410J40853
$$ 13414605 14437503 14631652 13789998 14100374 13902164 14683887 14348262 13853852 13994705
5408A3994705K38613M40971O23465j44505r58043r33509M58496L37821o2444J08210
$$ 13994705 14233318 14674289 15297754 15153249 14195206 13261697 13720193 14058014 13995570 14103780
5398A4103780J35388m59260L10255j96361p5785M70906m32446p69131M21460L76293
$$ 14103780 14239168 13779908 14090163 13893802 13818017 14288923 13856477 13087346 13508806 13885099
5388A3885099l77810Q94570M49379l45210m13247m31966l5397K20902K25359N27735
$$ 13885099 13507289 14401859 14851238 14506028 14092781 13660815 13625418 13846320 14071679 14599414
5378A4599414m48002m97747k64979O37124J23715J82408l70963M6782Q34700L8301
$$ 14599414 14151412 13653665 13388686 14025810 14149525 14331933 13960970 14007752 14842452 14880753
5368A4880753q92682M12344L09812O3592J86664l50825K70299J09636n86090J57596
$$ 14880753 13988071 14400415 14710227 14773819 14960483 14609658 14879957 14989593 14403503 14561099
5358A4561099j59664k07250o362L30221J29477j05802j29264p13510L32792N15309
$$ 14561099 14401435 14194185 14187823 14518044 14647521 14541719 14412455 13698945 14031737 14547046
5348A4547046j95766j48028j03014M6297P18370m17186L10191l55107l42273m11693
$$ 14547046 14351280 14203252 14100238 14146535 14864905 14447719 14757910 14402803 14060530 13648837
5338A3648837N86885J06818J72813P5399k75244L03314m85841M18205m68428k55776
$$ 13648837 14235722 14342540 14515353 14590752 14315508 14618822 14132981 14551186 14082758 13826982
5328A3826982j29582O48701L18919p81932K74633j17200O17907m60741l35617
$$ 13826982 13697400 14346101 14665020 13883088 14157721 14040521 14658428 14197687 13862070
5319A3862070k90423J87318L27300l80709J82812j32108O29897K06200l31639
$$ 13862070 13571647 13758965 14086265 13705556 13888368 13756260 14386157 14592357 14260718
5310A4260718P5850Q0174m73871J03954N89014N11238o21266m34032j18429K89926
$$ 14260718 14336568 14416742 13942871 14046825 14635839 15147077 14525811 14091779 13973350 14263276
5300A4263276K21543l7550l51286q23419L47979L22301J05708O64062M66499o42249
$$ 14263276 14484819 14447269 14095983 13272564 13620543 13942844 14048552 14712614 15179113 14536864
5290A4536864l8119J38923l61694n4150l59455L48332L05025l26985q743o7273
$$ 14536864 14498745 14637668 14275974 14221824 13862369 14210701 14515726 14188741 14179998 14112725
5280A4112725O24210n50862L47640O6386j25842k95545q85583L47670N40631p2031
$$ 14112725 14736935 14186073 14533713 14600099 14474257 14178712 13293129 13640799 14181430 14109399
5270A4109399K6938n8529m71655K18022K72133m5485J11608l36974n2212o2627
$$ 14109399 14136337 14077808 13606153 13824175 14096308 14050823 14162431 13825457 13773245 13710618
5260A3710618m60303J37662J079556K62414n34615j14308J79738M06375n08943
$$ 13710618 13250315 13387977 14467533 14729947 14195332 14081024 14260762 14667137 14158194
5251A4158194j64518o36282L69263O72652m69899k91212r8641N98376j07414K57380
$$ 14158194 13993676 13357394 13726657 14399309 13929410 13638198 13539557 14137933 14030519 14287899
5241A4287899q11552k2111O43742n91916k13998N40311M46963o53457k20728K00073
$$ 14287899 13476347 13454236 14097978 13506062 13292064 13832375 14279338 13625881 13405153 13605226
5231A3605226K46789k74967K96409M71106l31946m00094n59301J51507o9118K08936
$$ 13605226 13852015 13577048 13873457 14344563 14012617 13612523 13053222 13204729 13135611 13344547
5221A3344547J16716J81495n52953k06487J102051J13845j25210n87851P2310
$$ 13344547 13461263 13642758 13089805 12883318 13985369 14099214 13974004 13386153 13458463
5212A3458463j46393r9534J59355L12032J66836R673m59547Q5340j26473J71743
$$ 13458463 13312070 13212536 13371891 13683923 13850759 13860432 13400885 13486225 13359752 13531495
5202A3531495j26679J1507K6782N15136j5915J77554o50769o8007j63667M28641
$$ 13531495 13404816 13416323 13443105 13958241 13942326 14119880 13469111 13401104 13237437 13666078
5192A3666078k26982K7283j09910l54869J19516Q21663p11362L31165L41784n96431
$$ 13666078 13439096 13466379 13356469 13001600 13121116 13942779 13231417 13562582 13904366 13307935
5182A3307935k25336K4769N18355Q65876m48575l42504L03544r74913j6107k20919
$$ 13307935 13082599 13107368 13625723 14491599 14043024 13700520 14004064 13029151 13013044 12792125
5172A2792125Q23334l36930l77161j6344Q2091M65071M27967o87147l76953n20501
$$ 12792125 13615459 13278529 12901368 12885024 12967115 13432186 13860153 13173006 12796053 12275552
5162A2275552L22243j65655l46411J28569J19552k15916M32124N84145n6654q81568
$$ 12275552 12597795 12432140 12085729 12214298 12333850 12117934 12550058 13134203 13077549 12195981
5152A2195981m73407N0370N27985m23310J92496N68843o68590k48631O21020r0653
$$ 12195981 11722574 11772944 12300929 11877619 12070115 12638958 11970368 11721737 12342757 12252104
5142A2252104m11653N84160k84281K20110K68554j34222j93475J68970j30641
$$ 12252104 11840451 12424611 12140330 12360440 12628994 12494772 12301297 12470267 12339626
5133A2339626R84582o92605r32954P51505q24125k79857M08167M20517j12614
$$ 12339626 13324208 12631603 11698649 12450154 11626029 11346172 11754339 12174856 12062242
5124A2062242k48536n1814M81613J63841m7701K80202J81374j5277k79522m6467
$$ 12062242 11813706 11761892 12243505 12407346 12359645 12639847 12821221 12805944 12526422 12479955
5114A2479955L34257q34080J4024K44206M2525n53514Q8909N2166n6222M8610
$$ 12479955 12814212 11980132 11994156 12238362 12280887 11727373 11816282 11868448 11812226 11860836
5104A1860836P7814n40677K40370m32321J142457m29951k98166J55772p99816
$$ 11860836 11938650 11397973 11638343 11206022 12348479 11918528 11620362 11776134 10976318
5095A0976318J008109J88602j42631j64344r02689O33642L59428q80679M11801
$$ 10976318 11984427 12173029 12030398 11866054 10963365 11597007 11956435 11075756 11487557
5086A1487557M05354J07357k47659O85238L24837N1462k05014m48249l20374m20851
$$ 11487557 11892911 12000268 11752609 12437847 12762684 12814146 12609132 12160883 11840509 11419658
5076A1419658J30506K54505M15770J05129j66513j89802J56743N90261p66974
$$ 11419658 11550164 11804669 12220439 12325568 12159055 11969253 12125996 12716257 11949283
5067A1949283K67516m78691M54350k77302k11594l0055l72897N97311j92401n9917
$$ 11949283 12216799 11738108 12192458 11915156 11703562 11673507 11300610 11897921 11705520 11645603
5057A1645603J14962P37263l87794m39250Q970L58583K91699o63933o50660N67016
$$ 11645603 11760565 12497828 12110034 11670784 11679754 12038337 12330036 11666103 11015443 11582459
5047A1582459P63527r48644o4771J72630q4923m42447L63933K68995L99893K2098
$$ 11582459 12345986 11397342 11332571 11505201 11420278 10977831 11341764 11610759 12010652 12032750
5037A2032750o78191M20143M06779J32244l05731J13878K06808k80039n70252
$$ 12032750 11354559 11774702 12181481 12313725 12007994 12121872 12328680 12048641 11478389
5028A1478389o23895P14155P99381l18639K07349O2905j6063q0912M23086j86485
$$ 11478389 10854494 11568649 12368030 12049391 12256740 12319645 12303582 12222670 12645756 12459271
5018A2459271N88059P86038q60832L16691m29827r4561N7188j02101r6163P43680
$$ 12459271 13047330 13833368 12972536 13289227 12859400 12764839 12822027 12719926 12623763 13367443
5008A3367443j1694p8941K13261l18210P05592J97815Q7909m94755J9799L73309
$$ 13367443 13355749 13276808 13490069 13171859 13877451 14075266 14163175 13668420 13688219 14061528
4998A4061528j67444m74400j09481L61184L04842Q69316P0923M44366j68357N44608
$$ 14061528 13894084 13419684 13310203 13671387 13976229 14845545 14916468 15360834 15192477 15737085
4988A5737085O12309P01796N78069M34172M6647p1503P16230J77829P10941J692430
$$ 15737085 16349394 17051190 17629259 18063431 18110078 18038575 18754805 18932634 19643575 21336005
4978B1336005J040152J275352J278314O12192J830192K743082K808756L534556
$$ 21336005 22376157 23651509 24929823 25542015 27372207 30115289 32924045 36458601
4970C6458601K532108J940222R90638M45446j631819l013814l399359l452131
$$ 36458601 38990709 40930931 41921569 42367015 40735196 37721382 34322023 30869892
4962C0869892j953117j500451j417415k466584j450937m94220q46491j111881
$$ 30869892 28916775 27416324 25998909 23532325 22081388 21587168 20740677 19628796
4954A9628796j188134L20422j122006o05675j47115l432j46362n22346N93463
$$ 19628796 18440662 18761084 17639078 17033403 16886288 16882856 16736494 16214148 16807611
4945A6807611l91532L31246n33474m2186q85099m8646J2063k92422j82783m85819
$$ 16807611 16416079 16747325 16213851 16171665 15286566 15237920 15249983 14957561 14774778 14288959
4935A4288959N1846Q85900m50048K08518Q30095j96029n96355N72560Q5239L35765
$$ 14288959 14340805 15226705 14776657 14985175 15815270 15619241 15022886 15595446 15680685 16016450
4925A6016450N2071L36007J024730j34117L4913Q43686O7101k28282J1973q6475
$$ 16016450 16068521 16404528 17429258 17295141 17330054 18173740 18240841 18012559 18024532 17938057
4915A7938057J48960J366945J319571Q17648J50805R19470J277903R86291J277508
$$ 17938057 18087017 19453962 20773533 21591181 21741986 22661456 23939359 24925650 26203158
4906B6203158J227231J684131K169132L104061K999027L712626L422026L151144
$$ 26203158 27430389 29114520 31283652 34387713 37386740 41099366 44521392 47672536
4898D7672536J728881P91306p45551k766940l600726l630181l086029k907248
$$ 47672536 49401417 50192723 49447172 46680232 43079506 39449325 36363296 33456048
4890C3456048k910179k699047j521333k182373j448736o57064n21506j089802
$$ 33456048 30545869 27846822 26325489 24143116 22694380 22037316 21515810 20426008
4882B0426008l34364j152405j160827j88133r83543j55771L7561j7469o24709
$$ 20426008 20091644 18939239 17778412 17590279 16606736 16450965 16488526 16471057 15846348
4873A5846348J07743m38124q01442r89974j42698q220N67891l21598m3778o54366
$$ 15846348 15954091 15515967 14714525 13724551 13581853 13573633 14141524 13819926 13776148 13121782
4863A3121782q09186o5163L77587K87440m64957K65567l167O04485P8031j017629
$$ 13121782 12312596 12247433 12625020 12912460 12447503 12713070 12709903 13314388 13392419 12374790
4853A2374790M33558k01457p08383J71605L28683M75217j63082O59348j26983
$$ 12374790 12808348 12606891 11898508 12070113 12398796 12874013 12710931 13370279 13243296
4844A3243296l34876K61696j72965k4826K80284n65304j51221R89034N30642o44576
$$ 13243296 12908420 13170116 12997151 12972325 13252609 12687305 12536084 13525118 14055760 13411184
4834A3411184m17403L46639O18797L95166M18249N51053K24044p33926m14392
$$ 13411184 12993781 13340420 13959217 14354383 14772632 15323685 15547729 14813803 14399411
4825A4399411M76396L95885O52266k22392Q41851M93562J52708J5303j03890K21699
$$ 14399411 14875807 15271692 15923958 15701566 16543417 17036979 17189687 17204990 17101100 17322799
4815A7322799M31070J167238O60904N22347R66329J154519j92681J130867J543020
$$ 17322799 17753869 18921107 19582011 20104358 21070687 22225206 22032525 23163392 24706412
4806B4706412J577985J214908J523362J713550J994935M15253K3705K58334j094061
$$ 24706412 26284397 27499305 29022667 30736217 32731152 33146405 33170110 33428444 32334383
4797C2334383j448779j656545j260107j075808j055414j601345o62314j795416
$$ 32334383 30885604 29229059 27968952 26893144 25837730 24236385 23574071 21778655
4789B1778655o18689J2105q07860l15543p966o78412j194637k03957m26420K00272
$$ 21778655 21159966 21172071 20364211 20048668 20040702 19362290 18167653 17963696 17537276 17737548
4779A7737548K82708l08304P09218J66377o20039M42162k64359k12096J95577
$$ 17737548 18020256 17711952 18421170 18587547 17967508 18409670 18145311 17933215 18128792
4770A8128792k64798O96389L14248M78715o0893J045560P36629L76250O99145
$$ 18128792 17863994 18560383 18874631 19353346 19292453 20338013 21074642 21450892 22150037
4761B2150037Q29722Q83845J203993J335222K490041J711877J401671J968785
$$ 22150037 22979759 23863604 25067597 26402819 28892860 30604737 32006408 33975193
4753C3975193K685198K186400J876293K022208K151220J171198n42984j483359
$$ 33975193 36660391 38846791 40723084 42745292 44896512 46067710 45524726 44041367
4745D4041367j649046j648051k448401k294985k750736k340751j780756k483780
$$ 44041367 42392321 40744270 38295869 36000884 33250148 30909397 29128641 26644861
4737B6644861j775554j665834p84552r43273r86487o22900r58892l05122j116800
$$ 26644861 24869307 23203473 22418921 21475648 20489161 19866261 18907369 18602247 17485447
4728A7485447j027680l73200l72266m26852n93453k75336L66770n94246k87811
$$ 17485447 16457767 16084567 15712301 15285449 14691996 14416660 14783430 14189184 13901373
4719A3901373l95701J1808K5011l93015L2453k31248l54809M31702r14765K48480
$$ 13901373 13505672 13517480 13542491 13149476 13181929 12950681 12595872 13027574 12112809 12361289
4709A2361289k94395J64697J47199k05466j063474J33573N73515k49343J01992
$$ 12361289 12066894 12231591 12378790 12173324 11109850 11243423 11816938 11567595 11669587
4700A1669587m78023N07892Q3645r5801P22139J74662M34820j01497j42632O49628
$$ 11669587 11191564 11699456 11783101 11687300 12409439 12584101 13018921 12917424 12774792 13424420
4690A3424420N13945r9012J30755k45139o37318K0683J83112n83490L15854O32598
$$ 13424420 13938365 13839353 13970108 13724969 13087651 13108334 13291446 12707956 13023810 13656408
4680A3656408L67529M11942K58629j38375k615K95034R08562R48693J02659j88220
$$ 13656408 14023937 14435879 14694508 14556133 14553518 14848552 15757114 16705807 16808466 16620246
4670A6620246J232236P01515M32754Q61464j23309J069077O93590J096621K046983
$$ 16620246 17852482 18553997 18986751 19848215 19724906 20793983 21487573 22584194 24631177
4661B4631177J601594J833320K533825K224584K803220K717685K897062K847245
$$ 24631177 26232771 28066091 30599916 32824500 35627720 38345405 41242467 44089712
4653D4089712J548161J081666j10228j509243j334725k559254k372345k938368
$$ 44089712 45637873 46719539 46609311 45100068 43765343 41206089 38833744 35895376
4645C5895376k660493j868375k061262k756438q89773m89165k306549j246622
$$ 35895376 33234883 31366508 29305246 26548808 25659035 25169870 22863321 21616699
4637B1616699r9235j442467j354255k38165o88386k98996k63842k53590j075146
$$ 21616699 21517464 20074997 18720742 18482577 17794191 17495195 17231353 16977763 15902617
4628A5902617q0428M02111l59352J40032K34656p25444N10334n86384o71815L27626
$$ 15902617 15822189 16224300 15864948 16004980 16239636 15514192 16024526 15438142 14766327 15093953
4618A5093953r46968J197488L94061P22224P03177J01511l65350P49929O23293
$$ 15093953 14146985 15344473 15738534 16460758 17163935 17265446 16900096 17650025 18273318
4609A8273318R8414J709653J384191N35662J165532J982049J798896J931107J52449
$$ 18273318 18371732 20081385 21465576 22001238 23166770 25148819 26947715 28878822 29031271
4600B9031271l94044L13535n57369j309713j700006j710455j865102j336134j241650
$$ 29031271 28637227 28950762 28393393 27083680 25383674 23673219 21808117 20471983 19230333
4591A9230333k407862j129627n00564n53101k55091j487372l82522L11396n17949
$$ 19230333 16822471 15692844 15192280 14639179 14384088 12896716 12514194 12825590 12307641
4582A2307641m27510j58864m99806k42354J76414r67591p26769L6259o71009M81401
$$ 12307641 11880131 11721267 11221461 10979107 11155521 10187930 9461161 9497420 8826411 9307812
4572I307812l49861m76131l53838L79148J18852O427P6523j157839L33484K16246
$$ 9307812 8957951 8481820 8127982 8507130 8625982 8632409 8708932 7551093 7884577 8100823
4562H100823N16275m54128n44925N9512M8849K30175K56053o1664m68377l58788
$$ 8100823 8617098 8162970 7618045 7677557 7726406 7956581 8212634 8150970 7682593 7323805
4552G323805L01101j79941j63045l04666K48653j60719k8442J550880n57845j174497
$$ 7323805 7624906 7444965 7281920 6977254 7225907 7065188 7036746 8587626 8029781 6855284
4542F855284K29943R41602N15656o04330l26079P5481M2966j8421K09051L66375
$$ 6855284 7085227 8026829 8542485 7938155 7612076 7687557 7730523 7712102 7921153 8287528
4532H287528k2985j83928r403k76908j14895j428889O05339l09859k95234N72233
$$ 8287528 8264543 8080615 8071212 7794304 7679409 6250520 6855859 6546000 6250766 6822999
4522F822999p45063N9027O91341R60605o45809l60145m75723L52887Q05235l50035
$$ 6822999 6077936 6136963 6828304 7788909 7143100 6782955 6307232 6660119 7465354 7115319
4512G115319l07011n6930k86502L68400p8463K48846r5019J53206J14585M91031
$$ 7115319 6808308 6751378 6464876 6833276 6754813 7003659 6908640 7061846 7176431 7667462
4502G667462m12776Q394Q51403p20626J06045j12231j56981K62096J015249M59706
$$ 7667462 7254686 7263080 8114483 7393857 7499902 7387671 7230690 7492786 8508035 8967741
4492H967741n3569j7621J35784P99542l79743o14955N32420k83218L83990K31292
$$ 8967741 8914172 8896551 9032335 9831877 9452134 8837179 9369599 9086381 9470371 9701663
4482I701663P1066J152449l8764l71440K65765K67527O39654K15205N66777q96
$$ 9701663 9772729 10925178 10886414 10514974 10780739 11048266 11687920 11903125 12469902 12469006
4472A2469006N40476O58703L06035k0740L17453J015469R50881J002876R69033
$$ 12469006 13009482 13668185 13974220 13953480 14270933 15286402 16237283 17240159 18209192
4463A8209192Q71280Q17450J915304K018823K899830L275786K800098K968248
$$ 18209192 19080472 19897922 21813226 23832049 26731879 30007665 32807763 35776011
4455C5776011L430732K514324K331695Q94033j193106k728375l691273l801899
$$ 35776011 39206743 41721067 44052762 44946795 43753689 41025314 37334041 33532142
4447C3532142l303131k727250k794248k568486j732848j245487q35258p90134
$$ 33532142 30229011 27501761 24707513 22139027 20406179 19160692 18325434 17535300
4439A7535300p25700j530367j050345k45883j109212O93193l80769n18612P3731
$$ 17535300 16809600 15279233 14228888 13983005 12873793 13566986 13186217 12667605 12741336
4430A2741336o34682j085808p6576N47561k8623o26508q67361K27482K94401j5188
$$ 12741336 12106654 11020846 10944270 11491831 11463208 10836700 9969339 10196821 10491222 10476034
4420A0476034o66285k32848K0669M4337j04770n3458L87410k16168M31410l3428
$$ 10476034 9809749 9576901 9597570 9641907 9537137 9483679 9871089 9654921 10086331 10052903
4410A0052903M78369L84463k10867q05780L9109J09571m19847O54398O65738M50017
$$ 10052903 10531272 10915735 10704868 9899088 9938197 10047768 9627921 10282319 10948057 11398074
4400A1398074M27991J81220O39425J097455K8170M29596P98884J081392P46626
$$ 11398074 11826065 12007285 12646710 13744165 13772335 14201931 15000815 16082207 16828833
4391A6828833P48824J932895J694893J719711L097527K599702L636423K221764
$$ 16828833 17577657 19510552 21205445 22925156 26022683 28622385 32258808 34480572
4383C4480572J865481N27960j34736j895407k320348k463363l402033k627180
$$ 34480572 36346053 36874013 36739277 34843870 32523522 30060159 26658126 24030946
4375B4030946k093288k702970r88348r66407j442138j444366o02232n88368l18643
$$ 24030946 21937658 19234688 18246340 17279933 15837795 14393429 13791197 13202829 12884186
4366A2884186r80783q53062l8726n99016k40455n67424k40067J99597N63048q14364
$$ 12884186 11903403 11050341 11011615 10412599 10172144 9604720 9364653 9564250 10127298 9312934
4356I312934K40683N99973K46101q06376J57804l13871j06537k4926j60855N9933
$$ 9312934 9553617 10153590 10399691 9593315 9751119 9437248 9330711 9305785 9144930 9204863
4346I204863k55092K1861M36629L37044K01451m79446M65143N42272J128154L78812
$$ 9204863 8949771 8971632 9408261 9745305 9946756 9467310 9932453 10474725 11602879 11981691
4336A1981691j77668N09133R62035N83726r0192J432179J285298L56611m50983
$$ 11981691 11804023 12313156 13275191 13858917 13768725 15200904 16486202 16842813 16391830
4327A6391830k095967j029488p58360j312976m75595r87497r1044p83373k80048
$$ 16391830 14295863 13266375 12508015 11195039 10719444 9731947 9640903 8857530 8577482
4318H577482j83577M55922j09461k57065P93861j95641m15854M16998m44089Q3933
$$ 8577482 8393905 8849827 8740366 8483301 9277162 9081521 8665667 9082665 8638576 8722509
4308H722509l35587p26030O74512n25634O10561j91617N52706l72501m35481m98598
$$ 8722509 8386922 7660892 8335404 7809770 8420331 8228714 8781420 8408919 7973438 7474840
4298G474840o35206L11176K88530q76606K25894j046143j44584j6572O08362K15816
$$ 7474840 6839634 7150810 7439340 6562734 6788628 5742485 5597901 5581329 6189691 6405507
4288F405507m29880M62644m47540L37101j27829M07648N58095J14573q67146m43365
$$ 6405507 5975627 6438271 5990731 6327832 6200003 6607651 7165746 7280319 6413173 5969808
4278E969808n1349J71478J28260L16437L31624J74933J48350l69214R6016M51802
$$ 5969808 5918459 6089937 6218197 6534634 6866258 7041191 7189541 6820327 6916343 7368145
4268G368145M06060O17843J63353k14162K03148J8204P42591K19473L43944K56646
$$ 7368145 7774205 8392048 8555401 8341239 8544387 8562591 9305182 9524655 9868599 10125245
4258A0125245p88599o71539J19831N9420j40744p3055l87625J0837p57361j54375
$$ 10125245 9336646 8665107 8784938 8844358 8703614 8630559 8242934 8253771 7496410 7342035
4248G342035N358N72788k64722k79166l25344L43058o39693K15610M72814R33912
$$ 7342035 7347393 7920181 7655459 7376293 7050949 7394007 6754314 6969924 7442738 8376650
4238H376650l72121l95804N87438k75159j003202l19014r9902O07623N7939J98461
$$ 8376650 8004529 7608725 8196163 7921004 6917802 6598788 6498886 7106509 7164448 7362909
4228G362909k47463k32599J13428m78889M3916J227875O11812k06186j327783
$$ 7362909 7115446 6882847 6996275 6517386 6561302 7789177 8400989 8194803 6867020
4219F867020m49669L54405M90221K23100n93597R7856L79998J6189l59985L6511
$$ 6867020 6417351 6771756 7261977 7485077 6891480 6989336 7369334 7385523 7025538 7062049
4209G062049L75158J78333n6698p6492J54687L06853j7672j81005O11588N06500
$$ 7062049 7437207 7615540 7558842 7482350 7637037 7943890 7926218 7745213 8356801 8863301
4199H863301j25766J49682n54341P59918j343701N2611K17828M94867O51359k71272
$$ 8863301 8737535 8887217 8332876 9092794 7749093 7801704 8019532 8514399 9165758 8894486
4189H894486k86155L2941K10208r6574K03699l05954J55462j9702K6610M40896
$$ 8894486 8608331 8641272 8851480 8754906 8958605 8652651 8808113 8788411 8815021 9255917
4179I255917j87849M04908L83392L30918J42185J61266j84539L76053k41950K51779
$$ 9255917 9068068 9472976 9856368 10187286 10329471 10490737 10306198 10682251 10440301 10692080
4169A0692080P89509K76953r1321j96633k83810J88298N80026N33805J263284
$$ 10692080 11481589 11758542 11667221 11470588 11186778 11375076 11955102 12488907 13752191
4160A3752191O38369q5895r8842J81257n17697l5967Q39978Q7176k37708R53568
$$ 13752191 14390560 14304665 14205823 14387080 13869383 13833416 14673394 14760570 14522862 15476430
4150A5476430Q40859o63573m16352K68358k4163O35010O50461M32118P15958r27480
$$ 15476430 16317289 15653716 15237364 15505722 15481559 16116569 16767030 17199148 17915106 16987626
4140A6987626O31751P73198J52199L16007K19681P31097J37188Q4618K79897Q07620
$$ 16987626 17619377 18392575 18544774 18860781 19080462 19811559 19948747 20033365 20313262 21120882
4130B1120882N31785o05145J43897Q54099P70358J159853l95160P04991K23107
$$ 21120882 21652667 21047522 21191419 22045518 22815876 23975729 23580569 24285560 24508667
4121B4508667J122576Q41738O63568J250162j80231O69697R00757N8128K45897
$$ 24508667 25631243 26472981 27136549 28386711 28206480 28876177 29776934 29835062 30080959
4112C0080959J610874R22324K1643Q68778J546466J186154Q02365J131482J113416
$$ 30080959 31691833 32614157 32635800 33504578 35051044 36237198 37039563 38171045 39284461
4103C9284461J282570J299393J487269K178611J124786Q87941J672934K800041
$$ 39284461 40567031 41866424 43353693 45532304 46657090 47545031 49217965 52018006
4095E2018006J740428J137442K502474K690754J914579K041940K300733L500167
$$ 52018006 53758434 54895876 57398350 60089104 62003683 64045623 66346356 69846523
4087F9846523K175337K232179K942586K298470L361376L640255L611370L301549
$$ 69846523 72021860 74254039 77196625 79495095 82856471 86496726 90108096 93409645
4079I3409645K692362L661373L745007L820771L796309L319634L593428L217679
$$ 93409645 96102007 99763380 103508387 107329158 111125467 114445101 118038529 121256208
4071A21256208M073940M023060M282124M713145N168694M535037N349569N886118
$$ 121256208 125330148 129353208 133635332 138348477 143517171 148052208 153401777 159287895
4063A59287895P364178P778180Q903493J0273862J2878870J5981288J9100103
$$ 159287895 166652073 174430253 183333746 193607608 206486478 222467766 241567869
4056B41567869K2978661K7694767K7795186K3443785J1545935n273584k1739931
$$ 241567869 264546530 292241297 320036483 343480268 355026203 349752619 328012688
4049C28012688l0640137l0483803k8506242k1728793j7569451j4067355j2944173
$$ 328012688 297372551 266888748 238382506 216653713 199084262 185016907 172072734
4042A72072734r885236q554448p604437o922071o016363n429426n120497m555611
$$ 172072734 162187498 153633050 146028613 139106542 133090179 127660753 122540256 117984645
4034A17984645m245191m185648l990394l287260k897651l292285l025753k695393
$$ 117984645 113739454 109553806 105563412 102276152 99378501 96086216 93060463 90365070
4026I0365070l521451k760922k279798k070765j379093k692941j261991o37615
$$ 90365070 86843619 84082697 81802899 79732134 78353041 75660100 74398109 73760494
4018G3760494j912105j608394n00207m65416j769137k60750m70194j05502M71992
$$ 73760494 71848389 70239995 69739788 69274372 67505235 67244485 66774291 66668789 67140781
4009F7140781p59070m02001R62925N82757n08467m72214J132866J444527P71407
$$ 67140781 66381711 65979710 66942635 67525392 67016925 66544711 67677577 69122104 69893511
4000F9893511J74383J685332J329326J019655N50385J514791K106966K704931
$$ 69893511 70067894 71753226 73082552 74102207 74652592 76167383 78274349 80979280
3992H0979280K095416J972044K036007J503153J627555K033470K698228K630910
$$ 80979280 83074696 85046740 87082747 88585900 90213455 92246925 94945153 97576063
3984I7576063K673606K840911K478368J886359K057617L453700L424344L247082
$$ 97576063 100249669 103090580 105568948 107455307 109512924 112966624 116390968 119638050
3976A19638050K236998K991397K001630J998421K211826K023226K777491K364864
$$ 119638050 121875048 124866445 126868075 128866496 131078322 133101548 135879039 138243903
3968A38243903J967564L122300L161246L379161K838603J740073J806126K928849
$$ 138243903 140211467 143333767 146495013 149874174 152712777 154452850 156258976 159187825
3960A59187825L263108L637222N140064N130663N992529P665600Q777424J1530930
$$ 159187825 162450933 166088155 171228219 176358882 182351411 190017011 198794435 210325365
3952B10325365J6913964K1208357K5625184K7528470K5609905J4891470j449389
$$ 210325365 227239329 248447686 274072870 301601340 327211245 342102715 340653326
3945C40653326j8389894l0380988l4299020l0762101k5828681k0060685j5720685
$$ 340653326 322263432 291882444 257583424 226821323 200992642 180931957 165211272
3938A65211272j2852033j1483464r638182p903214o783878o161603n219664n044188
$$ 165211272 152359239 140875775 131237593 123334379 116550501 110388898 105169234 100125046
3930A00125046m936371m154055m635294l638973l475436l607299k594732k647899
$$ 100125046 95188675 91034620 86399326 82760353 79284917 75677618 73082886 70434987
3922G0434987k927665k945776j462978k429458j730175j433320k127901r51245
$$ 70434987 67507322 64561546 63098568 60669110 58938935 57505615 55377714 54426469
3914E4426469o30841M9323K80544j011412k10323r84155m47933l06072q97265
$$ 54426469 53795628 53844951 54125495 53114083 52903760 51919605 51471672 51165600 50268335
3905E0268335p10548j033568k004453j284767p34158j143357j493792j653748
$$ 50268335 49557787 48524219 46519766 45234999 44500841 43357484 41863692 40209944
3897D0209944j211175q70660r17668L46303j297765j907682j97906o63242q00604
$$ 40209944 38998769 38128109 37210441 37556744 36258979 34351297 34153391 33490149 32689545
3888C2689545o19186j84021k6301p47072m69009p62520J39420J4126m3568L82365
$$ 32689545 32070359 31886338 31860037 31112965 30643956 29881436 30020856 30034982 29991414 30373779
3878C0373779p85767j6307R0394M73703r67191m57318m37722J32367m4622M59057
$$ 30373779 29588012 29571705 29662099 30135802 29168611 28711293 28273571 28405938 28361316 28820373
3868B8820373J406490J43081k41909m21759k96890n2385K26189J288303M02996
$$ 28820373 30226863 30369944 30128035 29706276 29409386 29357001 29583190 30871493 31274489
3859C1274489K43525K60438M48655l04025Q08306J111365J026886R84809P28734
$$ 31274489 31518014 31778452 32227107 31923082 32731388 33842753 34869639 35854448 36583182
3850C6583182O10026R51602J462926J250072J435619J407830R80633J254405J535533
$$ 36583182 37193208 38144810 39607736 40857808 42293427 43701257 44681890 45936295 47471828
3841D7471828O61918Q06744J091954J421626J025090J879013J340172J102262
$$ 47471828 48133746 48940490 50032444 51454070 52479160 54358173 55698345 56800607
3833E6800607L32747O33247N36630N31100N71516K08918K21884l54595k20354
$$ 56800607 57133354 57766601 58303231 58834331 59405847 59614765 59836649 59482054 59261700
3824E9261700Q2015j82110r94421m37037o48090m73361q55488J71829j011964
$$ 59261700 59343715 59161605 58167184 57730147 57082057 56608696 55753208 55925037 54913073
3815E4913073j193935l0990K97490l83515l03212j444610j115355j34300K58462
$$ 54913073 53719138 53688148 53985638 53602123 53298911 51854301 50738946 50604646 50863108
3806E0863108p90719J004812M74048K02410m70444M8445J639169J451317J969073
$$ 50863108 50072389 51077201 51551249 51753659 51283215 51331660 52970829 54422146 56391219
3797E6391219J471755K211829J257437J917403K313599J679040J647929K145207
$$ 56391219 57862974 60074803 61332240 63249643 65563242 67242282 68890211 71035418
3789G1035418K737478K057532K035192K344651K385882J850521K171284K559881
$$ 71035418 73772896 75830428 77865620 80210271 82596153 84446674 86617958 89177839
3781H9177839K387698Q98892J200534J326758K27249N60476j5159K7361j065276
$$ 89177839 91565537 92464429 93664963 94991721 95218970 95779446 95764287 95791648 94726372
3772I4726372q12189l61746j223666j123733p93576j887521j377567j860414k106578
$$ 94726372 93914183 93552437 92328771 91205038 90411462 88523941 87146374 85285960 83179382
3763H3179382k141533j575122k763392k440173j873517k671440k881273j919315
$$ 83179382 81037849 79462727 76699335 74259162 72385645 69714205 66832932 64913617
3755F4913617k124649k117271j819703j475729j470691k424471j175142q93187
$$ 64913617 62788968 60671697 58851994 57376265 55905574 53481103 52305961 51412774
3747E1412774o33921q46888j284349m73137Q41874q12548j35300K01298j78005
$$ 51412774 50778853 49931965 48647616 48174479 49016353 48203805 48068505 48269803 48091798
3738D8091798r14261Q1600M16169L7141P94197K57001O15720R61571O79975K05357
$$ 48091798 47177537 47259137 47675306 47712447 48506644 48763645 49379365 50340936 51020911 51226268
3728E1226268J468377M08799P22735J581418J520439R00568J890129J327922J021948
$$ 51226268 52694645 53103444 53826179 55407597 56928036 57828604 59718733 61046655 62068603
3719F2068603J312976J059884J500433J312183Q02622J601773J738862J789329
$$ 62068603 63381579 64441463 65941896 67254079 68056701 69658474 71397336 73186665
3711G3186665J262644J949283K053055J980692K051193J937323J802076K722064
$$ 73186665 74449309 76398592 78451647 80432339 82483532 84420855 86222931 88944995
3703H8944995K044670L151785K988052K794058J751950L315524L223067K691794
$$ 88944995 90989665 94141450 97129502 99923560 101675510 104991034 108214101 110905895
3695A10905895K993662K138834K410165K532240L079466J550277J701322K191487
$$ 110905895 113899557 116038391 118448556 120980796 124060262 125610539 127311861 129503348
3687A29503348K045336K060420K543599J907488K243157K231251J455483J094693
$$ 129503348 131548684 133609104 136152703 138060191 140303348 142534599 143990082 145084775
3679A45084775Q17203Q67193Q26926R34513Q21184J085840P58562Q08168J875531
$$ 145084775 145901978 146769171 147596097 148530610 149351794 150437634 151196196 152004364 153879895
3670A53879895J361288J123917Q39690K091576J610897K205212K035216J536431
$$ 153879895 155241183 156365100 157204790 159296366 160907263 163112475 165147691 166684122
3662A66684122K036528K336397K578901K889312K176925K085277K330997L290222
$$ 166684122 168720650 171057047 173635948 176525260 178702185 180787462 183118459 186408681
3654A86408681L464914M172177K910497K842992L243478L124025K711273J725651
$$ 186408681 189873595 194045772 196956269 199799261 203042739 206166764 208878037 210603688
3646B10603688K844524L005581J667743K055200K521192K222890K401202J965235
$$ 210603688 213448212 216453793 218121536 220176736 222697928 224920818 227322020 229287255
3638B29287255J125787R07543M49505P23543Q26851k94743L2420J0507p01807
$$ 229287255 230413042 231320585 231770090 232493633 233320484 233025741 233058161 233068668 232366861
3629B32366861o94486q15506j719283j369825j391151j687590j258630k101229
$$ 232366861 231672375 230856869 229137586 227767761 226376610 224689020 223430390 221329161
3621B21329161j679454k482054l204137k682249k820722l944685l536644k630692
$$ 221329161 219649707 217167653 213963516 211281267 208460545 204515860 200979216 198348524
3613A98348524l333415k934912k719516l018602k911200r96056j273885j360790
$$ 198348524 195015109 192080197 189360681 186342079 183430879 182434823 181160938 179800148
3605A79800148j277656j665533p15654J90372m26921J036399P42746J97176J234773
$$ 179800148 178522492 176856959 176141305 176331677 175904756 176941155 177683901 177881077 179115850
3596A79115850M64276J699007J834539J527600J460443L026571J819266L306915
$$ 179115850 179580126 181279133 183113672 184641272 186101715 189128286 190947552 194254467
3588A94254467L164954K902727L790327L350680L408610J955522K765942L449830
$$ 194254467 197419421 200322148 204112475 207463155 210871765 212827287 215593229 219043059
3580B19043059K156967P43816K295462K051817K234254K007498K046496K360471
$$ 219043059 221200026 221943842 224239304 226291121 228525375 230532873 232579369 234939840
3572B34939840K151427L294199K261154K333739K983169K181307J761604K237361
$$ 234939840 237091267 240385466 242646620 244980359 247963528 250144835 251906439 254143800
3564B54143800J868931K401734K612905L204009L625070J772791L961986N261116
$$ 254143800 256012731 258414465 261027370 264231379 267856449 269629240 273591226 278852342
3556B78852342M892049O167283O451818N990760O775289O709238O930427P839882
$$ 278852342 283744391 289911674 296363492 302354252 309129541 315838779 322769206 330609088
3548C30609088O636209N277843M586214M078371K080431O72703q91813j779406
$$ 330609088 337245297 342523140 347109354 351187725 353268156 353940859 353049046 351269640
3540C51269640k792532l408932m642705m847566n656259o028626m540637o794675
$$ 351269640 348477108 345068176 340425471 335577905 329921646 323893020 319352383 312557708
3532C12557708q373363r110324r987923j1067613j1645280j3265389j2420906
$$ 312557708 304184345 295074021 285086098 274018485 262373205 249107816 236686910
3525B36686910j3008698j2957804j2660850j2862251j1514833j0476800q613651
$$ 236686910 223678212 210720408 198059558 185197307 173682474 163205674 154592023
3518A54592023p439582p398039p276618n107022n403822n071545m206953m954478
$$ 154592023 147152441 139754402 132477784 127370762 121966940 116895395 112688442 107733964
3510A07733964l455501l928905k655488k992032k152187k691073k909034j155014
$$ 107733964 104278463 100349558 97694070 94702038 92549851 89858778 86949744 85794730
3502H5794730j455410k311662j179679j260413k286449j548264j604859k144065
$$ 85794730 84339320 82027658 80847979 79587566 77301117 75752853 74147994 72003929
3494G2003929j652196j074998j887534k260099j886577j045030j218164j307142
$$ 72003929 70351733 69276735 67389201 65129102 63242525 62197495 60979331 59672189
3486E9672189j835744j465508j839806j813104j191730j297649j924501p32031
$$ 59672189 57836445 56370937 54531131 52718027 51526297 50228648 48304147 47572116
3478D7572116j549069j212816k029718j082457r82797j894226n95504j737507
$$ 47572116 46023047 44810231 42780513 41698056 40715259 38821033 38225529 36488022
3470C6488022n24847n78960j094337j262294l67564n69580j434888j166546n00169
$$ 36488022 35963175 35384215 34289878 33027584 32660020 32090440 30655552 29489006 28988837
3461B8988837j26003m84315m47353o46734j238641j2813R2023n98056j556911
$$ 28988837 28862834 28378519 27931166 27284432 26045791 26032978 26125001 25526945 23970034
3452B3970034j85863L94176r33089k35813p68161o50908K61527q0762m25938n43156
$$ 23970034 23784171 24178347 23245258 23009445 22241284 21590376 21851903 21771141 21345203 20802047
3442B0802047m16560k20268q52901J7281n34568q4708K47944k80223m9958n78301
$$ 20802047 20385487 20165219 19312318 19329599 18795031 18710323 18958267 18678044 18628086 18049785
3432A8049785p73822K3814m59245K00525q362K4267p26120q65246M90205M8511
$$ 18049785 17275963 17299777 16840532 17041057 17032695 17056962 16330842 15465596 15955801 16004312
3422A6004312L51455l96542j61869j46412r89298o74904P54980J35921q42557
$$ 16004312 16355767 15959225 15797356 15650944 14661646 13986742 14741722 14877643 14035086
3413A4035086m5011O2226o14122j06502L60797N76939m45974o45566K5549K1672
$$ 14035086 13990075 14052301 13438179 13331677 13692474 14269413 13823439 13177873 13203422 13225094
3403A3225094o60367m25062K68609m46018N48548j96790j127189P00655j486208
$$ 13225094 12564727 12139665 12408274 11962256 12510804 12314014 11186825 11887480 10401272
3394A0401272k59026R03727k74540J60275P2484M28246r17678m90622Q64019J01388
$$ 10401272 10142246 11045973 10771433 10931708 11004192 11432438 10514760 10024138 10888157 10989545
3384A0989545l39992k95304l32191p9481p98036O02787n60234n4825J041085n72397
$$ 10989545 10649553 10354249 10022058 9942577 9144541 9747328 9187094 9132269 10173354 9600957
3374I600957l38042J079357J86776j047162j94723L32389j05280k43529m69431
$$ 9600957 9262915 10342272 10529048 9481886 9287163 9619552 9514272 9270743 8801312
3365H801312l36406m82312O49265m91317L8116J96063K23670N74667n72283k39288
$$ 8801312 8464906 7982594 8631859 8140542 8178658 8374721 8598391 9173058 8600775 8361487
3355H361487k45728L71283K62519j29813M1052m62809j42965m13504M71810K88100
$$ 8361487 8115759 8487042 8749561 8619748 8660800 8197991 8055026 7641522 8113332 8401432
3345H401432j096956M75720m1249N5399N08268k08114l4626n31905J49952k09317
$$ 8401432 7304476 7780196 7738947 7794346 8302614 8094500 8059874 7527969 7677921 7468604
3335G468604O51958p03420l97797N86928m94471K54499P5375M0550n59506J19800
$$ 7468604 8120562 7417142 7019345 7606273 7111802 7366301 7441676 7482226 6922720 7042520
3325G042520R7673k53015L08657K21821m08566q0292q38660L53953J94517o05942
$$ 7042520 7140193 6887178 7195835 7417656 7009090 6928798 6090138 6444091 6638608 6032666
3315F032666m29253J29697M98555O1343O9564m45131P4529L77673r2211j33089
$$ 6032666 5603413 5733110 6231665 6293008 6362572 5917441 5991970 6369643 6277432 6144343
3305F144343j93723L15156m21899j007K74117O3017R70374L6852p97342N73457
$$ 6144343 5950620 6265776 5843877 5842870 6116987 6180004 7150378 7187230 6389888 6963345
3295F963345L5430J03446Q36824o40570k31021K02600k29728M73358q46274J32771
$$ 6963345 6998775 7102221 7939045 7298475 7067454 7270054 7040326 7513684 6667410 6800181
3285F800181k95967l94845J22039L21029J29280K05586M36134p4308q2822r7770
$$ 6800181 6504214 6109369 6231408 6552437 6681717 6887303 7323437 7249129 7166307 7068537
3275G068537L40145o58291N60537l01299J1025J073336l50389p98898J189571
$$ 7068537 7408682 6750391 7310928 7009629 7020654 8093990 7743601 6944703 8134274
3266H134274j08195q5107N01912K34633L94741n13487Q06708l13715N75429k81971
$$ 8134274 8026079 7940972 8442884 8677517 9072258 8558771 9365479 9051764 9627193 9345222
3256I345222N42371q2076n22604o7577M3903k37040l09306Q04556M06848j030474
$$ 9345222 9887593 9805517 9282913 9215336 9259239 9022199 8712893 9517449 9924297 8893823
3246H893823J20284o5187N40573M16675k29081o19369n78450M2382r47618J820
$$ 8893823 9014107 8948920 9489493 9906168 9677087 9057718 8479268 8521650 7574032 7575852
3236G575852p55780K10251j69004L31817N23362k50116M59414N30974J02720O54005
$$ 7575852 6820072 7030323 6861319 7193136 7716498 7466382 7925796 8456770 8559490 9213495
3226I213495J53703j08387m88459r63924o86777l60669m75412n34454N3700l01555
$$ 9213495 9367198 9258811 8770352 7806428 7119651 6758982 6283570 5749116 5802816 5501261
3216E501261J43272L31808o38480k57000p27164N34928l48339m79644P38317M14184
$$ 5501261 5644533 5976341 5337861 5080861 4353697 4888625 4540286 4060642 4798959 5213143
3206E213143l8854J90236J35959o72381R9173J61228l04315M81700L9848k18564
$$ 5213143 5174289 5364525 5500484 4828103 4927276 5088504 4784189 5265889 5305737 5087173
3196E087173N44915K7003J6993J99515m83236r84321p03433K84132N52801o76191
$$ 5087173 5632088 5659091 5676084 5875599 5392363 4408042 3704609 3988741 4541542 3865351
3186C865351j95736j47509l17242K8635J67522o02425n404K49083n99515J360043
$$ 3865351 3669615 3522106 3204864 3233499 3401021 2798596 2793192 3042275 2442760 3802803
3176C802803Q01416p57828q90195q11296j54791M16159Q31337k30888o49690Q07243
$$ 3802803 4604219 3846391 2956196 2144900 1990109 2406268 3237605 3006717 2357027 3164270
3166C164270r7025k60562k38003K03771J6893r3787o94161P82351n27470K44903
$$ 3164270 3067245 2806683 2568680 2772451 2789344 2695557 2001396 2783747 2256277 2501180
3156B501180j42846j60275M01716O9148k72501k757j12970m79722J229960k76634
$$ 2501180 2358334 2198059 2599775 2668923 2396422 2393665 2280695 1800973 3030933 2754299
3146B754299k44336K90822J53172q71427q07684M04785N66761O08161K59354r27756
$$ 2754299 2509963 2800785 2953957 2082530 1274846 1679631 2246392 2854553 3113907 2186151
3136B186151K68363M00174J12020K58133r88476N57894n09573p07415K90117j3888
$$ 2186151 2454514 2854688 2966708 3224841 2236365 2794259 2284686 1577271 1867388 1853500
3126A853500L98043m27957q12227J70169M80781q939J16345K16156j82388j22732
$$ 1853500 2251543 1823586 1011359 1181528 1662309 1653370 1769715 1985871 1803483 1680751
3116A680751J115858r74279K13135J86374K74252j90311o78725K777Q75147l55897
$$ 1680751 2796609 1822330 2035465 2221839 2496091 2305780 1627055 1629832 2504979 2149082
3106B149082L6559j15494j88938M37485k69371P9408o56860k60566K20137K90733
$$ 2149082 2185641 2070147 1881209 2318694 2049323 2128731 1471871 1211305 1431442 1722175
3096A722175L01814K32634N18795q09334o95950M09989l63324l24624R63086L06195
$$ 1722175 2023989 2256623 2775418 1966084 1270134 1680123 1316799 992175 1955261 2261456
3086B261456n76593p59540J46728L93794j50732j57054L5936J59832J00035l37352
$$ 2261456 1684863 925323 1072051 1465845 1315113 1158059 1193995 1353827 1453862 1116510
3076A116510m35572K16231N4252K01763J98752Q0496L76097k35267M14609n9559
$$ 1116510 680938 897169 951421 1153184 1351936 1432432 1808529 1573262 1987871 1928312
3066A928312K62930m12370L41929n7974j98235O0695r0428q8140r31092P77968
$$ 1928312 2191242 1778872 2120801 2062827 1864592 1925287 1834859 1746719 815627 1593595
3056A593595p6421L9087M31936l21231N70105J72148j85443k80770J6712l3296
$$ 1593595 1517174 1556261 1988197 1666966 2237071 2409219 2223776 1943006 1959718 1926422
3046A926422j332832J7998M92399O79654L74329m82152p17893L14969k50720j03766
$$ 1926422 593590 611588 1103987 1783641 2157970 1675818 957925 1272894 1022174 918408
3036I18408k53982p2791L50075M07101n70729j80473j72378Q73687k37703p5696
$$ 918408 664426 591635 941710 1348811 778082 597609 425231 1298918 1061215 985519
3026I85519K31732O7230J20851j69526O61247j35697p69617L15813O36221o90909
$$ 985519 1217251 1284481 1405332 1235806 1897053 1761356 991739 1307552 1943773 1252864
3016A252864P09353k62366q14391j1518j99219P57547n91507M24481P15632k29887
$$ 1252864 1962217 1699851 885460 873942 674723 1432270 840763 1265244 1980876 1750989
3006A750989n95948m79940k28497K43711P25915k88503k72294l01591P0083K58085
$$ 1750989 1155041 675101 446604 690315 1416230 1127727 855433 553842 623925 882010
2996H82010P33089j194266J045781O46930p00134l3186M16012J30232k68354o92088
$$ 882010 1615099 420833 1466614 2113544 1413410 1380224 1796236 1926468 1658114 966026
2986I66026R2309J33107j88228J79193M46762N83918n05215n57619j93553R8477
$$ 966026 1058335 1191442 1003214 1182407 1629169 2213087 1707872 1150253 956700 1055177
2976A055177J1550l65346L23682L06791L13989N0653m04242k79753m51734M89202
$$ 1055177 1066727 701381 1025063 1331854 1645843 1696496 1292254 1012501 560767 1049969
2966A049969K39874L80159m68044j65961l39799J232332l19523N5122n95167M28223
$$ 1049969 1289843 1670002 1201958 1035997 696198 1928530 1609007 1664129 1068962 1497185
2956A497185k46960L9441Q73875p08460L4377O1097p11652m70996N73773P29806
$$ 1497185 1250225 1289666 2163541 1455081 1489458 1550555 838903 367907 941680 1671486
2946A671486j036109l61544R07102N57037L44506p42413M87709N03114l13619
$$ 1671486 635377 273833 1180935 1737972 2082478 1340065 1827774 2330888 2017269
2937B017269o49066O90079l6586j086436o4629r6354o40258J017474m02965Q0580
$$ 2017269 1368203 2058282 2021696 935260 870631 774277 134019 1151493 748528 829108
2927H29108m21472J57883J2751J02716k2509m74869K89495Q44677l13611J41424
$$ 829108 407636 565519 578270 680986 658477 183608 473103 1317780 1004169 1145593
2917A145593n07357m6476k39767p2979M89013L75876p0000J20168P0744q8976
$$ 1145593 638236 591760 351993 279014 768027 1143903 1073903 1194071 1264815 1175839
2907A175839N94286l04110L40596o65194l95348j61933J81177n2819k9921K54514
$$ 1175839 1770125 1466015 1806611 1141417 746069 584136 765313 712494 682573 937087
2897I37087J279534m76705j96294n06057l73658n597M12665k83697K09177l71918
$$ 937087 2216621 1739916 1543622 1037565 663907 658310 1070975 787278 996455 624537
2887F24537k55973J69355J13293k65634l2985o95245K64148J055122p93042M53048
$$ 624537 368564 537919 651212 385578 352593 -342652 -78504 976618 183576 636624
2877F36624M14191J67039j66123k91912m38687R60802M52628o28885l60880m93452
$$ 636624 1050815 1217854 1051731 759819 321132 1281934 1734562 1105677 744797 251345
2867B51345K97531M24030j56714j17769p64638O08129l96904L25889J35481N11199
$$ 251345 548876 972906 816192 698423 -66215 541914 145010 470899 606380 1117579
2857A117579r681m58295k12557M7773J048396n75715k01206N38931K25061l04048
$$ 1117579 1107898 649603 437046 484819 1533215 957500 756294 1295225 1520286 1216238
2847A216238r1885p7342K75101K15334r00125L5620L1742o19510L16525K75596
$$ 1216238 1124353 1047011 1322112 1537446 637321 672941 704683 85173 401698 677294
2837F77294k63754L49889q09598k27465P5152N77228n4974l28362M48011L0611
$$ 677294 413540 763429 -46169 -273634 -198482 378746 323772 -4590 443421 474032
2827D74032j85252L04330n51743m25351M83521P63895p26792n62459J110488p88518
$$ 474032 288780 593110 41367 -383984 99537 863432 136640 -425819 684669 -103849
2817a03849Q0788L37894l92902j97090J41223K8968P67419N10077q99275l15951
$$ -103849 -23061 314833 -78069 -275159 -133936 -104968 662451 1172528 273253 -42698
2807d2698L36394R227n00543k52903k6896k41085N07857J10931N3243O36538k12454
$$ -42698 293696 302923 -197620 -450523 -477419 -718504 -210647 -99716 -46473 590065 377611
2796C77611J97815r3108k21929O65430l72996K61137K3150n01613k37804J34997
$$ 377611 575426 482318 260389 925819 552823 813960 837110 335497 97693 232690
2786B32690J838N28517j83553J013904K52197j132449l57853k32083j12106M97427
$$ 232690 234528 763045 579492 1593396 1845593 713144 355291 123208 11102 508529
2776E08529N4475p4108R5205J63350m69840k05601L30056l36592l10596m9159
$$ 508529 563004 488896 584101 747451 277611 72010 402066 65474 -245122 -294281
2766b94281K15174N18169J23209K15578r11308L35106m35671q21799L50470L69536
$$ -294281 -79107 439062 562271 777849 -133459 201647 -234024 -1055823 -705353 -335817
2756c35817j46896K58025J93751m02564j59174J91824N90608l1685m44218N430
$$ -335817 -482713 -224688 -30937 -433501 -592675 -400851 189757 158072 -286146 -280716
2746b80716k02979l66028M22947N4715k40952r1639m61073M257R50555K69389
$$ -280716 -483695 -849723 -426776 -372061 -613013 -704652 -1165725 -1161468 -210913 58476
2736E8476o4483M55170J70157l43371L57676j54583l96632l0492j82406K55855
$$ 58476 -6007 449163 619320 275949 633625 479042 82410 51918 -130488 125367
2726A25367n48189m99814L13099P93984K80185q56716n8623M47002J202195p42157
$$ 125367 -422822 -922636 -609537 184447 464632 -392084 -450707 -3705 1198490 456333
2716D56333m12858l99961P46196K21089p8516J81180k88515L9279K3617r38922
$$ 456333 43475 -356486 389710 610799 532283 713463 424948 464227 487844 -451078
2706d51078K03084L4592j51545K35498J096793k72962k32503N0992o21472M51168
$$ -451078 -247994 -213402 -364947 -129449 967344 694382 461879 512871 -108601 342567
2696C42567k56417J29216L60064o06308j212882j79171K39226m9638P55649M86645
$$ 342567 86150 215366 575430 -30878 -1243760 -1422931 -1183705 -1233343 -477694 8951
2686H951P5713l86959m37975K38889J089771l70018L49131n24934o88683J25777
$$ 8951 84664 -302295 -740270 -501381 588390 218372 567503 42569 -646114 -520337
2676e20337q44965J33406R51774J22590K43328K28232j10158l0561o16009k07497
$$ -520337 -1365302 -1231896 -280122 -157532 85796 314028 203870 173309 -442700 -650197
2666f50197k02384L057P97097k59305K46590k91116k46269O68538j6411r2896
$$ -650197 -852581 -849524 -52427 -311732 -65142 -356258 -602527 66011 49600 -43296
2656d3296J35884O63205n58337l41627m10935M27618j88940J24506j66857l81214
$$ -43296 92588 755793 197456 -144171 -555106 -127488 -316428 -191922 -358779 -739993
2646g39993M62339j86055j74705O95178j16391J39347l95332P3499J67266L28223
$$ -739993 -277654 -463709 -638414 56764 -59627 79720 -315612 -242113 -74847 253376
2636B53376m72853Q60769j66224l31677J5005J99904j9052n16254l83106J7414
$$ 253376 -219477 641292 475068 143391 158396 358300 339248 -177006 -560112 -542698
2626e42698L56208L94773J25357p48159r5494Q9205l89482M37699Q52094m1425
$$ -542698 -186490 208283 333640 -414519 -510013 -420808 -810290 -372591 479503 438078
2616D38078j199226M68215n80449J08406L58258k43520J197822k8626r49233L19730
$$ 438078 -761148 -292933 -873382 -764976 -406718 -650238 547584 518958 -430275 -110545
2606a10545L57580o82890P62720j30680J76711n99117K91496o8520o87553l58150
$$ -110545 247035 -435855 326865 196185 372896 -226221 65275 -3245 -690798 -1048948
2596a048948J90812J044547m58319j27602K27074k19768j49946o92553R4161N53240
$$ -1048948 -858136 186411 -271908 -399510 -172436 -392204 -542150 -1234703 -1140542 -587302
2586e87302O63978k77029m3636P15166r8535o61078l26627K32934j19951K15937
$$ -587302 76676 -200353 -243989 471177 372642 -288436 -615063 -382129 -502080 -286143
2576b86143M64247q2891j03026K25133P7688N96556k19535n23689l92259K55074
$$ -286143 178104 95213 -7813 217320 295008 891564 672029 148340 -243919 11155
2566A1155j98555l03785Q06944k62629o02405O74551j13709n42621o3738m20150
$$ 11155 -187400 -491185 315759 53130 -549275 125276 11567 -531054 -594792 -1014942
2556a014942M70971k9054M26798j26914j48873M05979K44363p02988r40443N36517
$$ -1014942 -543971 -573025 -146227 -273141 -422014 -16035 228328 -474660 -1415103 -878586
2546h78586P26311P7884q481Q4328R654l75188O56877m5753k29538k49439L45407
$$ -878586 -152275 -74391 -82872 1456 11110 -364078 292799 247046 17508 -231931 113476
2535A13476m01334q8376K97403k039L17199J40731l71873M07211j79800J96159
$$ 113476 -287858 -376234 -78831 -80870 236329 377060 5187 412398 232598 428757
2525D28757q60381j83664J129229l71784l47828K22671l12828m7328m25203k23346
$$ 428757 -431624 -615288 513941 142157 -205671 17000 -295828 -343156 -768359 -991705
2515i91705L01085L32707K26918j37772L02636l5508K89203R2353M48310o13269
$$ -991705 -690620 -357913 -130995 -268767 33869 -1639 287564 379917 828227 214958
2505B14958j08204k28448P62952J27965l46453q45555j4364O40649L0166R0655
$$ 214958 106754 -121694 641258 769223 422770 -422785 -437149 203500 233666 324321
2495C24321j34522j68198K87030L27455l32236l23612l04448j80405J21554P01982
$$ 324321 189799 21601 308631 636086 303850 -19762 -324210 -504615 -383061 318921
2485C18921J79324l8729k01585l75737m14912m26679Q35874J70135J6235O8751
$$ 318921 498245 459516 257931 -117806 -532718 -959397 -123523 46612 62847 131598
2475A31598J58031o99318K88011Q1912l39834J15999K19469O35059l19075r82360
$$ 131598 289629 -409689 -121678 -39766 -379600 -263601 -44132 590927 271852 -710508
2465g10508j79964J27657k14158L01213L92526P83509k52264q81707K71672p3460
$$ -710508 -890472 -762815 -976973 -675760 -283234 500275 248011 -633696 -362024 -435484
2455d35484M09248L98939k76134P11364M26993r18276n29479J5024L8820K64110
$$ -435484 -26236 372703 96569 807933 1234926 316650 -212829 -197805 -158985 105125
2445A05125K29051J75649n61941k95042l16079K9861j69042J55534N14635j63740
$$ 105125 334176 509825 -52116 -347158 -663237 -633376 -802418 -646884 -132249 -295989
2435b95989m07185K74859k3169m35836l30995j42410Q56806P44733k33397l06637
$$ -295989 -703174 -428315 -451484 -887320 -1218315 -1360725 -503919 240814 7417 -299220
2425b99220m45278k94054L39188N15123J17684K11230k57892R77914J64014l21182
$$ -299220 -744498 -1038552 -699364 -184241 -66557 144673 -113219 864695 1028709 707527
2415G07527p0914o56982n11229K49063k54730l88840N16011K33814J97349o54632
$$ 707527 636613 -20369 -531598 -282535 -537265 -926105 -410094 -176280 21069 -633563
2405f33563M23983O19469N928l30118r18973l89806P66661P23416R4943k83337
$$ -633563 -209580 409889 415817 85699 -833274 -1223080 -456419 266997 361940 78603
2395G8603j35918m46068O14035K78363p3089N82960L10696m61043m14323l21540
$$ 78603 -57315 -503383 110652 389015 315926 898886 1209582 748539 334216 12676
2385A2676O351K07778k9260K80208o04112M65511k34523p21550N44470J311928
$$ 12676 19027 226805 197545 477753 -126359 339152 104629 -616921 -72451 1239477
2375A239477L12124k58314q0547K96207J13619n96820M13064p0024j7035N1785
$$ 1239477 1551601 1293287 1212740 1508947 1622566 1025746 1438810 1368786 1351751 1403536
2365A403536N4732n53132M4418N31820o59747q34505k40647K71860J009931j39161
$$ 1403536 1458268 905136 949554 1481374 821627 -12878 -253525 18335 1028266 889105
2355H89105o76766k31382K13170K66026J65534J36933n10624m94549O75080O60285
$$ 889105 212339 -19043 194127 460153 625687 762620 251996 -242553 432527 1092812
2345A092812P6165m40304n19420M69891m880k91524K19491M67283m6633o77766
$$ 1092812 1168977 728673 209253 679144 674264 382740 602231 1069514 1022881 345115
2335C45115N2775r7508j6959P05288j44762L16424O3049l25794k00430o12738
$$ 345115 397890 300382 283423 988711 843949 1160373 1223422 897628 697198 84460
2325H4460m02720N17833O37462k70701J67047q3480l01874j42192L31019P37223
$$ 84460 -318260 199573 837035 566334 733381 649901 348027 205835 536854 1274077
2315A274077n70325o12206J70785K69071m005j85027m09310k75774j162O01661
$$ 1274077 703752 91546 262331 531402 527397 342370 -66940 -342714 -343876 257785
2305B57785K33553l75280n10980J60764M74212M72221o85474l13448L48414O49936
$$ 257785 491338 116058 -394922 -234158 240054 712275 26801 -286647 61767 711703
2295G11703J08053L25856L5866N10967K4633o07223l56017j24955M3427K99617
$$ 711703 819756 1145612 1181478 1692445 1717078 1109855 753838 628883 672310 971927
2285I71927o40799N78100J108168n38136o59195j81736n1413M34258k90206l62703
$$ 971927 331128 909228 2017396 1479260 820065 638329 586916 1021174 730968 368265
2275C68265O56238N9352l71899K15525N71945o70323J091183l47924M03774K52829
$$ 368265 1024503 1083855 711956 927481 1499426 829103 1920286 1572362 1976136 2228965
2265B228965l01859n95129J76062l18187l33972L01883k44311J93403K84370m70931
$$ 2228965 1927106 1331977 1508039 1189852 855880 1157763 913452 1106855 1391225 920294
2255I20294N77911K64787o17228N9992J90711m99036J22691k71413K1191N33279
$$ 920294 1498205 1762992 1145764 1205756 1396467 897431 1020122 748709 769900 1303179
2245A303179l84116K8070j23819k16149K11287R5502m06827M20656J69570k33822
$$ 1303179 919063 947133 823314 607165 818452 913954 507127 927783 1097353 863531
2235H63531J98045k98772M47935K64528q2288Q50215K7642l19110J01907k28139
$$ 863531 1061576 762804 1210739 1475267 1392979 2243194 2270836 1951726 2053633 1825494
2225A825494L93037N86512p73916J74494K81060Q99840j94865J81066l58347o6116
$$ 1825494 2218531 2805043 2031127 2205621 2486681 3386521 3191656 3372722 3014375 2948259
2215B948259J04864l18685M63773O17812m40012k18038m06382L86277J25818N0830
$$ 2948259 3053123 2734438 3198211 3816023 3376011 3157973 2751591 3137868 3263686 3314516
2205C314516N55722P9955k63049j12535n139M87983L95454J60394j23084j93523
$$ 3314516 3870238 3950193 3687144 3574609 3569470 4057453 4452907 4613301 4490217 4296694
2195D296694K87937N08883L26846l05722L70625l43502R52622n24154q8325K07150
$$ 4296694 4584631 5093514 5420360 5114638 5485263 5141761 6094383 5570229 5481904 5689054
2185E689054J310480l31322j053676k36523k61557J363513j20018K15320N78578
$$ 5689054 6999534 6668212 5614536 5378013 5116456 6479969 6359951 6575271 7153849
2176G153849J54818r6158Q56255k43132n9055k87654j19054O21812O46226l3047
$$ 7153849 7308667 7212509 8068764 7825632 7766577 7478923 7359869 7981681 8627907 8594860
2166H594860J69091P55672J142553K12347K62485N39129j09119R4187k03445O05704
$$ 8594860 8763951 9519623 10662176 10874523 11137008 11676137 11567018 11661205 11457760 12063464
2156A2063464K92093L60430k90121p927L46628O52234K4677O46139Q52274N03938
$$ 12063464 12355557 12715987 12425866 12417939 12764567 13416801 13441478 14087617 14939891 15443829
2146A5443829M60288J295812o5285O61982N96049P04120O60881J220503J575693
$$ 15443829 15904117 17199929 17134644 17796626 18392675 19096795 19757676 20978179 22553872
2137B2553872J13646J077783J423684R53884M99562O07831J265183N95559J261093
$$ 22553872 22667518 23745301 25168985 26122869 26622431 27230262 28495445 29091004 30352097
2128C0352097J635668J292325P19226J776575L124882K817138L267561L492170
$$ 30352097 31987765 33280090 33999316 35775891 38900773 41717911 44985472 48477642
2120D8477642L139907K747233L445224K292624L017521M115625N814583P642709
$$ 48477642 51617549 54364782 57810006 60102630 63120151 67235776 73050359 80693068
2112H0693068R480393J3567846J8060719K2823020L2076603M1881226M6508227
$$ 80693068 90173461 103741307 121802026 144625046 176701649 218582875 265091102
2105B65091102M5433783K6739685j0804960m2486150n2272475m6210011l5419373
$$ 265091102 310524885 337264570 326459610 283973460 231700985 185490974 150071601
2098A50071601k4936558j7925530j4001739j0336595q678162o208288m320526
$$ 150071601 125135043 107209513 93207774 82871179 74193017 67984729 63664203
2091F3664203l387328k810367l021086m451917m226986l580960l358035k361296
$$ 63664203 60276875 57466508 54445422 49993505 45766519 42185559 38827524 36466228
2083C6466228k095144k428293k147620j659621j491930j827782j340431q34329
$$ 36466228 34371084 31942791 29795171 28135550 26643620 24815838 23475407 22641078
2075B2641078p63702l23378j134036j722182n91061k58920j075820k76428j350025
$$ 22641078 21877376 21553998 20419962 18697780 18106719 17847799 16771979 16495551 15145526
2066A5145526p8235N22831j170987o95353M6832j000029l58969r6347r211r45452
$$ 15145526 15067291 15590122 14419135 13723782 13770614 12770585 12411616 12315269 12306058 11360606
2056A1360606p19155K893L84924j55871l27874n09461p20976j270986K21163K5170
$$ 11360606 10641451 10644344 11029268 10873397 10545523 10036062 9315086 8044100 8265263 8290433
2046H290433L023j4726m78266O374r7564k46952N02241m71496n76479N88779m50771
$$ 8290433 8293456 8278730 7800464 7806838 7709274 7462322 7964563 7493067 6916588 7505367 7054596
2035G054596p69906m01280o47732O3879L45992m01531m73861l86871k13189Q85027
$$ 7054596 6284690 5883410 5235678 5299557 5645549 5244018 4770157 4383286 4170097 5055124
2025E055124R4664n85305L2523L5798O82160L1847o19495m43069J64597J44393
$$ 5055124 5149788 4564483 4597006 4632804 5314964 5346811 4727316 4284247 4448844 4593237
2015D593237k36190r18239j36725J34484n90819r2421k11664L13827N1171j62307
$$ 4593237 4357047 3438808 3302083 3436567 2845748 2753327 2541663 2855490 2906661 2744354
2005B744354J23971n12178K06265M8288m49477J23309M86054n08668J51092J63107
$$ 2744354 2868325 2356147 2562412 2610700 2161223 2284532 2770586 2261918 2413010 2576117
1995B576117J93278p7577k6236J99960o66029p76998N47706P14213L65399j83412
$$ 2576117 2769395 2691818 2665582 2865542 2199513 1422515 1970221 2684434 3049833 2866421
1985B866421o28291k24204K59179m23409K90251L82057l4206l93601K44625n23992
$$ 2866421 2238130 2013926 2273105 1849696 2139947 2522004 2487798 2094197 2338822 1814830
1975A814830N4250L46677J5839N55232j298108J08823O37424m69150J270775n70280
$$ 1814830 1869080 2215757 2231596 2786828 1488720 1597543 2234967 1765817 3036592 2466312
1965B466312j95782J86854K7895k66822k41781m41166j15251j14378L92360k40406
$$ 2466312 2270530 2457384 2485279 2218457 1976676 1535510 1420259 1305881 1698241 1457835
1955A457835o88533P61132L15184o55428p612O23208o80557k28446P24292k97357
$$ 1457835 769302 1530434 1845618 1190190 1182578 1805786 1125229 896783 1621075 1323718
1945A323718k96934O9274K66537L32020r81220q98009J41553R26114K98533o5229
$$ 1323718 1026784 1096058 1362595 1694615 713395 -184614 -43061 883053 1181586 1116357
1935A116357n6606k28169m86628J24153K37377K64361j67919Q2385k73432J28772
$$ 1116357 1059751 831582 344954 469107 706484 970845 802926 885311 611879 740651
1925G40651M13402K45170m86464k38979K74959R7159o88159L76768J82943k42313
$$ 740651 1154053 1399223 912759 673780 948739 1045898 357739 734507 917450 675137
1915F75137L16949k05323n42247K07341M04531j60183L9930K66648o1972k97706
$$ 675137 992086 786763 244516 451857 856388 696205 736135 1002783 940811 643105
1905F43105j37996k490R16927q52879o98393Q98153L59458L62510j24980o04809
$$ 643105 505109 502619 1419546 566667 -131726 766427 1125885 1488395 1363415 758606
1895G58606L2901M0034n15010J49991m46809M86880J8760P12043l81288m24947
$$ 758606 791507 831541 316531 466522 19713 506593 525353 1237396 856108 431161
1885D31161j60761l98494N39930n1098k93866L40356N7717k40820m24626k8630
$$ 431161 270400 -128094 411836 360738 66872 407228 464945 224125 -200501 -229131
1875b29131P42566J51114M87656o2072p73789l06212N28208k88751N06166n9875
$$ -229131 513435 664549 1152205 1090133 316344 10132 538340 249589 755755 695880
1865F95880P9645m13633O37480P90828j93362n39711k54577J41738j87662L58880
$$ 695880 775525 361892 999372 1790200 1596838 1057127 802550 944288 756626 1115506
1855A115506J78110r5156o35215k51764O66816k75907l17140K87258Q8794l04818
$$ 1115506 1293616 1198460 563245 311481 978297 702390 385250 672508 761302 456484
1845D56484p75420k51585N87435O14015k09757L41995M31158J16537q0861R7415
$$ 456484 -318936 -570521 16914 630929 421172 763167 1194325 1310862 1230001 1327416
1835A327416L22770Q634J55206O4636k65299q457p37962m46835l4417J17032O5593
$$ 1327416 1650186 1658820 1814026 1878662 1613363 1604906 866944 420109 385692 502724 568317
1824E68317m68058k79133k43107L58837J99328K00811O02218l22307L33289j26726
$$ 568317 100259 -178874 -421981 -63144 136184 336995 939213 616906 950195 823469
1814H23469l10389m36036P50708k49483L608p33015o45160J017327N53157m44331
$$ 823469 513080 77044 827752 578269 581877 -151138 -796298 221029 774186 329855
1804C29855m04270j46537J96259N08252M20519J38931j422353J03677J99352J64498
$$ 329855 -74415 -220952 -24693 483559 904078 1043009 -379344 -275667 -76315 88183
1794H8183k28401m30408l976q7317O01646L03886j50242P05286o94127K64302
$$ 88183 -140218 -570626 -574602 -661919 -60273 243613 93371 798657 104530 368832
1784C68832q33654K40188j44033M33706L49588m83066M0280n81389K95275k45531
$$ 368832 -464822 -224634 -368667 65039 414627 -68439 -28159 -609548 -314273 -559804
1774e59804M39754J00543q7931n25582M56169N39320K37527q9724L8796l56377
$$ -559804 -120050 -19507 -107438 -633020 -176851 362469 599996 510272 549068 192691
1764A92691l09523P87344Q6792m50637n82858M85461l74627j98848N08948K58491
$$ 192691 -116832 670512 757304 306667 -276191 209270 -165357 -364205 144743 403234
1754D03234l87976o64487p0627O35136j66327K12032k03310m15205L21242m77779
$$ 403234 15258 -649229 -719856 -84720 -251047 -39015 -242325 -657530 -336288 -814067
1744h14067m86221Q60451j36946K8749K63919r6748P33847q97756l58096n0609
$$ -814067 -1300288 -439837 -576783 -548034 -284115 -380863 352984 -544772 -902868 -953477
1734i53477O32634L04118K15707L20030j01019l31795j8562j52296L29743K99158
$$ -953477 -320843 -16725 198982 519012 417993 86198 67636 -84660 245083 544241
1724E44241j3616j228858j47868M72963J54842j01728j69521q1847M63599L36054
$$ 544241 530625 -698233 -846101 -373138 -218296 -320024 -489545 -571392 -107793 228261
1714B28261K55830K4876J0238j39163j53918L69206o58306O76521K29802m42797
$$ 228261 484091 508967 519205 380042 226124 595330 -62976 613545 843347 400550
1704D00550k34031P0977j10958K97619O36669j32618l06669q30403o10501N08549
$$ 400550 166519 237496 126538 424157 1060826 928208 621539 -208864 -819365 -310816
1694c10816k9988N34673K32060m71509k48128J37792l91951J36516O87505K977
$$ -310816 -340804 193869 425929 -45580 -293708 -155916 -547867 -411351 276154 279131
1684B79131l01184L29983l98602P92332m12642l90634l78964r4371L80126M53843
$$ 279131 -22053 307930 -90672 701660 289018 -101616 -480580 -574951 -194825 259018
1674B59018P77016k02527N5971K03083K20797j060130m21848R56436j85326L13358
$$ 259018 1036034 833507 889478 1092561 1313358 253228 -168620 787816 602490 915848
1664I15848L95172l88102j3315o66566l95377L7674l66272L55599P52204j37164
$$ 915848 1311020 922918 909603 243037 -152340 -114666 -480938 -125339 626865 489701
1654D89701l15666n52709p9282N40909J87504k75125k85235J09369M5716k23193
$$ 489701 174035 -378674 -457956 82953 270457 -4668 -289903 -180534 -134818 -358011
1644c58011N3853M70892q486l2509N92114r15899J08751m75658M67983J83691
$$ -358011 -304158 166734 158248 125739 717853 -198046 -89295 -564953 -96970 86721
1634H6721J2792r39713K03904J118759P9646j1098p17365J55413o09341l839k06154
$$ 86721 99513 -840200 -636296 482463 562109 551011 -166354 -10941 -620282 -624121 -830275
1623h30275N36930J51229J05752K61115n99259r44037j06554R92221j6978O2992
$$ -830275 -293345 -142116 -36364 224751 -374508 -1318545 -1425099 -432878 -449856 -386864
1613c86864k61444O51549o8772Q2422o20125n56955J26434M494O24301L43211
$$ -386864 -648308 3241 -65531 16891 -603234 -1160189 -1033755 -1029261 -404960 -61749
1603f1749R6157p10300k80179O98981j67473P9225k29085j59692K91341o5730
$$ -61749 34408 -675892 -956071 -257090 -424563 -345338 -574423 -734115 -442774 -508504
1593e08504l44251Q42916J51165q3550n18477j25924Q9209J62149K62245j88463
$$ -508504 -852755 -9839 141326 57776 -460701 -586625 -497416 -335267 -73022 -261485
1583b61485M2634r9540J75657K03281l43654K86064l3923k06466r0037n75712
$$ -261485 -218851 -318391 -142734 60547 -283107 2957 -30966 -237432 -327469 -903181
1573i03181l41565R31846O60983l9567l4526p34950J93590Q5395K40112l13633
$$ -903181 -1244746 -312900 348083 308516 273990 -460960 -267370 -181975 58137 -255496
1563b55496M40897l80518r25646l24242L06161P54176L25050k93998L09816n48720
$$ -255496 185401 -195117 -1120763 -1445005 -1138844 -384668 -59618 -353616 -43800 -592520
1553e92520o88691Q12876P6746L46601J5984n41975o15869K69928R55510j79291
$$ -592520 -1281211 -468335 -391589 -44988 -29004 -570979 -1186848 -916920 38590 -140701
1543a40701m81360j72575n12695j60164O73699L96583M15190n27388L49187l8567
$$ -140701 -622061 -794636 -1307331 -1467495 -793796 -397213 17977 -509411 -160224 -198791
1533a98791M47312M87890q7760l31726l0680q22254O08698k7132J53734q5990
$$ -198791 248521 736411 648651 316925 286245 -536009 72689 45557 199291 113301
1523A13301q88169L30993O11818p02959k2651j38230J89046J03912K99115L37114
$$ 113301 -774868 -443875 167943 -535016 -557667 -695897 -506851 -402939 -103824 233290
1513B33290k12233n87167j2442O94454N1966o61669r6026j6314R3978m56693J10635
$$ 233290 21057 -566110 -578552 115902 167868 -493801 -589827 -606141 -512163 -968856 -858221
1502h58221O03308k58480K39024l69631m15323Q7415J76695P00481M30636n14079
$$ -858221 -254913 -513393 -274369 -644000 -1059323 -971908 -795213 -94732 335904 -178175
1492a78175k15801M37812O90633n68478l71431K3376L22552l05139k97933m94731
$$ -178175 -393976 43836 734469 165991 -205440 -182064 140488 -164651 -462584 -957315
1482i57315n6814J212016L59245n40478K424n79726N25801P48807r54800m14769
$$ -957315 -1014129 197887 557132 16654 19078 -560648 -34847 713960 -240840 -655609
1472f55609P78418o69211k27687M56956L02729r28368p8152L79523M04458n12812
$$ -655609 122809 -546402 -774089 -317133 -14404 -942772 -1020924 -641401 -236943 -749755
1462g49755l35536L97844J06778l35984P9417J91072L76971k7533M62336K85730
$$ -749755 -1085291 -687447 -580669 -916653 -837236 -646164 -269193 -296726 165610 451340
1452D51340l62291O39293o0927o21655j77121n92653R4647M43032r7792l44562
$$ 451340 89049 728342 667415 45760 -131361 -724014 -629367 -186335 -284127 -628689
1442f28689L25122L73998k05302J86532m21721K99428K65443n59358L73471O29120
$$ -628689 -303567 70431 -134871 51661 -370060 -70632 194811 -364547 8924 638044
1432F38044k68238m89969K99682M57024n86302m36513M1115j99988Q0525K0571
$$ 638044 369806 -120163 179519 636543 50241 -386272 -345157 -545145 -464620 -444049
1422d44049O05019m52019K70759J98010J3823o25074l3060O8338m7135L86220
$$ -444049 160970 -291049 -20290 177720 191543 -433531 -466591 -398253 -445388 -59168
1412e9168L97639q05780K48484j67838J79313J143659j315962p9187L96998j53116
$$ -59168 338471 -467309 -218825 -386663 -207350 936309 -379653 -458840 -61842 -214958
1402b14958r8246l60552K87899n201o8329J58901k91864O34053j69403J7290n11419
$$ -214958 -313204 -673756 -385857 -391058 -459387 -300486 -592350 41703 -127700 -110410 -621829
1391f21829L36125q4103k14307O67678J03303k28281L14417p4915j45430j95162
$$ -621829 -285704 -369807 -584114 83564 186867 -41414 273003 198088 52658 -142504
1381a42504J83365J6948l15824j7047m67689k39297M19376j06332P74500l24802
$$ -142504 40861 57809 -258015 -275062 -742751 -982048 -562672 -669004 105496 -219306
1371b19306J77898o35452k06035N78867m67404j503N22150L58289j50953n2607
$$ -219306 -41408 -676860 -882895 -304028 -771432 -772935 -250785 107504 -43449 -96056
1361i6056J51833n109Q3281M9883p90835j06868p2423J59973O91987o29862p49723
$$ -96056 55777 50668 133949 183832 -607003 -713871 -786294 -626321 65666 -564196 -1313919
1350a313919Q61200N70896K25751q3745l02979J45439p1767l05448j69822m76606
$$ -1313919 -452719 118177 343928 260183 -42796 102643 30876 -274572 -444394 -921000
1340i21000m813O00767O7197j24408L17986l91778L12354k51718L80800M27651
$$ -921000 -925813 -325046 -257849 -382257 -64271 -456049 -143695 -395413 -14613 413038
1330D13038r60296Q97822M35371l40094J93963L69368p41524J50741p77561p57430
$$ 413038 -547258 350564 785935 445841 639804 1009172 267648 418389 -359172 -1116602
1320a116602M14190P45873k26520l09001L32638l77476l32937R6179k30803L99255
$$ -1116602 -702412 43461 -183059 -492060 -159422 -536898 -869835 -773656 -1004459 -605204
1310f05204J52292M5597K18836K10934m35624n7731K51244k35883o3335K22328
$$ -605204 -452912 -407315 -188479 22455 -413169 -470900 -219656 -455539 -518874 -296546
1300b96546k55424J004146o65135R7294J54508J23722n03701o41143n0134J95980
$$ -296546 -551970 452176 -212959 -115665 38843 162565 -341136 -982279 -1032413 -836433
1290h36433N29653k75350J93145o06236J429921m24664J25588n02167K07972m77675
$$ -836433 -306780 -582130 -388985 -995221 434700 10036 135624 -366543 -158571 -636246
1280f36246N08150K24354j77942O45936l62150o15610P22801p85165n87296O22222
$$ -636246 -128096 96258 -81684 564252 202102 -413508 309293 -475872 -1063168 -440946
1270d40946N11361j54546K75968k15993j946K92962k75037q27369M61630Q27863
$$ -440946 70415 -84131 191837 -24156 -26102 266860 -8177 -835546 -373916 453947
1260D53947l19004k25925k5495k14558J75404O74946m22940O6680n00993j70569
$$ 453947 134943 -90982 -116477 -331035 -155631 519315 96375 163055 -337938 -508507
1250e08507M28851m03838O34405R7349m09019L7828R0564k94467r29479R89695
$$ -508507 -79656 -483494 150911 248260 -160759 -122931 -32367 -326834 -1256313 -266618
1240b66618K84227l9134L65533p8855k15190K58197K93409m3415J49460k65756
$$ -266618 17609 -21525 344008 265153 49963 308160 601569 558154 707614 441858
1230D41858j26772k73629K35838k92849o19112k92776N67176L00503L41077m71756
$$ 441858 315086 41457 277295 -15554 -634666 -927442 -360266 -59763 281314 -190442
1220a90442j65899P3935l76787N61031L03377L10139m01207N49077n75101p12705
$$ -190442 -356341 -282406 -659193 -98162 205215 515354 114147 663224 88123 -624582
1210f24582L56876m14928p65624L67850N44661Q62423q7920q4965l55481Q80M08637
$$ -624582 -267706 -682634 -1448258 -1080408 -535747 326676 238756 153791 -201690 -200810 207827
1199B07827n0064k16419L1604K82002r7881L5860n60247k28680Q23666m0135q20169
$$ 207827 157763 -58656 -27052 254950 157069 192929 -367318 -595998 227668 187533 -632636
1188f32636R5731O35901L1982L18562J3679m2407J32058k1672m65792n04843n19072
$$ -632636 -536905 98996 130978 449540 463219 420812 552870 531198 65406 -439437 -958509
1177i58509O11189k9086L94671k64662P13022k15725m36361N7252r9157j68795
$$ -958509 -347320 -376406 18265 -246397 466625 250900 -185461 -128209 -227366 -396161
1167c96161j27404K56744j11118P81690N5863r81283k11512N11454l26851n52120
$$ -396161 -523565 -266821 -377939 403751 459614 -521669 -733181 -221727 -548578 -1100698
1157a100698J88599K8005j62439J268866k0947L27855O0451p89107l9807q3490
$$ -1100698 -912099 -884094 -1046533 222333 201386 529241 589692 -199415 -239222 -322712
1147c22712K07273O27790k60891M8838l72759m77215m25720k02915J082539K37639
$$ -322712 -115439 512351 251460 300298 -72461 -549676 -975396 -1178311 -95772 141867
1137A41867p8564l73598k82984N67258K21698L20670j3764k32490o3708l48584
$$ 141867 63303 -310295 -593279 -26021 195677 516347 502583 270093 206385 -142199
1127a42199k24699J54003j50579m8545k68273N68146L21440j33978m73927m3120
$$ -142199 -366898 -212895 -363474 -412019 -680292 -112146 209294 75316 -398611 -441731
1117d41731L84387J29872L62855K98655l43489l24777p71304P47974P40091l63992
$$ -441731 -57344 72528 435383 734038 390549 65772 -705532 42442 782533 418541
1107D18541J51116o73552L94319J70434O60753m15894j133831L25890J09870N7816
$$ 418541 569657 -103895 290424 460858 1121611 705717 -428114 -102224 7646 65462
1097F5462n40816l68390K72854J037726k37360M70975m13072n49994l8292K52120
$$ 65462 -475354 -843744 -570890 466836 229476 700451 287379 -262615 -300907 -48787
1087d8787m73987O47639M1931m07921O89861n70599q38534N02849O77640k40573
$$ -48787 -522774 124865 166796 -241125 448736 -121863 -960397 -457548 220092 -20481
1077b0481P505l48070p7966L31904M07152k08743J98383J63480j175158J49200
$$ -20481 -12976 -361046 -439012 -107108 300044 91301 289684 453164 -721994 -572794
1067e72794J71124j9537M26130L98020j91995o7789K85723M6782j01623j07528
$$ -572794 -401670 -421207 4923 402943 210948 143159 428882 475664 374041 266513
1057B66513o33127Q5523M82960n45999K66932N06377K00983r34889J041204j41988
$$ 266513 -366614 -281091 201869 -344130 -77198 429179 630162 -304727 736477 594489
1047E94489l1561q75239K53781L6745m05824J63560O75573k70657r62575k42821
$$ 594489 562928 -312311 -58530 -21785 -427609 -264049 411524 140867 -821708 -1064529
1037a064529j17540Q1072K53875M49371Q7633l32876K80538K26984m52653O59757
$$ -1064529 -1182069 -1100997 -847122 -397751 -310118 -642994 -362456 -135472 -588125 71632
1027G1632n9612l94290J1488K06035O40226j18030R9483J01235q5862K47237l31435
$$ 71632 12020 -382270 -370782 -164747 475479 357449 456932 558167 472305 719542 388107
1016C88107l13078l5570J68340R8064m6920L1907L99027o1015R5187l14881l03628
$$ 388107 75029 39459 207799 305863 258943 290850 689877 628862 724049 409168 105540
1005A05540n99685o47588P11734K89288J49171r7373j30448K35702J29086J22198
$$ 105540 -494145 -1141733 -429999 -140711 8460 -88913 -219361 16341 145427 267625
995B67625j86212m45705j38456L0667Q13559n3319m76422K826p7673J86229q8332
$$ 267625 81413 -364292 -502748 -472081 341478 288159 -188263 -185437 -263110 -76881 -165213
984a65213j4175N57871J90483r31294k36822j75679l09271L66285O48448O9032
$$ -165213 -179388 378483 568966 -362328 -599150 -774829 -1084100 -717815 -69367 -335
974c35K96105o82570k41947O2722n8723R29910L00288n35061m07467K07045M20182
$$ -335 295770 -386800 -628747 -566025 -624748 305162 605450 70389 -337078 -130033 290149
963B90149k65606O15719j30198k41464n25475n50781O20512L37848l61040k97209
$$ 290149 24543 640262 510064 268600 -256875 -807656 -187144 150704 -210336 -507545
953e07545j06916J89235N7288p53495R08970J86914L87623M72361r17944p71632
$$ -507545 -614461 -425226 -367938 -1121433 -212463 -25549 362074 834435 -83509 -855141
943h55141O97692R4725m9373l14976M69423P62395q90259l29025M13113O05334
$$ -855141 -157449 -62724 -112097 -427073 42350 804745 -85514 -414539 -1426 603908
933F03908l67855J38197M53558o77392m06495r3198L99579j43577M67437J54700
$$ 603908 236053 374250 827808 150416 -256079 -349277 50302 -93275 374162 528862
923E28862m28390K67217K30676l60049o68179M03733n0414N49346M11935M8174
$$ 528862 100472 367689 598365 238316 -429863 -26130 -76544 472802 884737 932911
913I32911r85291n90923j73593K86097o83854Q4316P17486L32467M92415l6960
$$ 932911 -52380 -643303 -816896 -530799 -1214653 -1130337 -412851 -80384 412031 375071
903C75071l72895K40163m68804l49444K00161O33350K54895o66664L62664j81169
$$ 375071 2176 242339 -226465 -575909 -375748 257602 512497 -154167 208497 27328
893B7328j01002N81344p13565K39482o0049L17653j36836p88673K55182l00371
$$ 27328 -73674 507670 -205895 33587 -26462 291191 154355 -634318 -379136 -679507
883f79507K69361O25389j94631k59763K36432j64003J26041n05113O43201J54617
$$ -679507 -410146 215243 20612 -239151 -2719 -166722 -40681 -545794 97407 252024
873B52024l48444n60013P32573J14147m5251J52100M18024m33105n22198Q3380
$$ 252024 -96420 -656433 76140 190287 145036 297136 715160 282055 -240143 -156763
863a56763M037J22249M85159j8580j16820m52893o89995Q46938p44673N38916
$$ -156763 -152726 -30477 454682 436102 319282 -133611 -823606 23332 -721341 -182425
853a82425J05977l87077L06562L53294J01120j03819j08407j14099l44177k08616
$$ -182425 -76448 -463525 -156963 196331 297451 193632 85225 -28874 -373051 -581667
843e81667Q4576M10007j02913J90329K45626j49144j9232l35887M06681J24337
$$ -581667 -497091 -87084 -189997 332 245958 96814 77582 -258305 148376 272713
833B72713j10306O05872k20991j817177M82382N69658K93114K99469j77914J47993
$$ 272713 162407 768279 547288 -1269889 -787507 -217849 75265 374734 196820 344813
823C44813k31137R3710l17223r7433j44838R9296K43735M71556p7604n71126J21375
$$ 344813 113676 207386 -109837 -207270 -352108 -252812 -9077 462479 384875 -186251 -64876
812f4876J45179l41208j65911M93683K5017j18648j09405Q3863K23850M24736
$$ -64876 80303 -260905 -426816 66867 91884 -26764 -136169 -52306 171544 596280
802E96280p28788L99094n0514l8327J81217j85186J48971k69763J0607K76215
$$ 596280 -132508 266586 216072 177745 358962 173776 322747 52984 63591 339806
792C39806M0339j224737k98435J297361q65707R3999M97177O49082q86821j93255
$$ 339806 380145 -844592 -1143027 154334 -711373 -617374 -120197 528885 -357936 -551191
782e51191K87781j23921K14963o26937O00364k26381k9694o8443O64949J52331
$$ -551191 -263410 -387331 -172368 -799305 -198941 -425322 -455016 -523459 141490 293821
772B93821j92863j20028L56263j08687o1361O8333m90140k6141L49936j09371
$$ 293821 100958 -19070 337193 228506 167145 235478 -254662 -280803 69133 -40238
762d0238n63004n0846N44616L83944k50333L1985L08075L8360j25931n16857p2773
$$ -40238 -603242 -654088 -109472 274472 24139 56124 364199 402559 276628 -240229 -313002
751c13002P27277Q8568j98746o4380K88096n66926k94054K2493L17740L88645
$$ -313002 414275 502843 304097 239717 527813 -39113 -333167 -310674 7066 395711
741C95711p21079n9982L91754M68300k96645K84677p81801O91066l34562j39301
$$ 395711 -325368 -385350 6404 474704 178059 462736 -319065 372001 37439 -101862
731a01862P91186n92838j55851m24015N36380o1883O73836p75428l37507Q37939
$$ -101862 689324 96486 -59365 -483380 53000 -8883 664953 -110475 -447982 389957
721C89957o85523R4860K53284p8411L51836N6539j65272m92009J90304L54836
$$ 389957 -295566 -200706 52578 -25833 326003 382542 217270 -274739 -84435 270401
711B70401O53m50297m599K58179j0123M71139m82751R72182n30695n75964J52218
$$ 270401 271054 -179243 -183842 74337 64214 535353 52602 1024784 494089 -81875 70343
700G0343N42153k47765j838k08014J88442O9749K44607M7641J86375o93475l53668
$$ 70343 612496 364731 362893 154879 343321 413070 657677 705318 891693 198218 -155450
689a55450L00845K27890M25710p51893m82619L22591O7772N92104o71808j0776
$$ -155450 145395 373285 798995 47102 -435517 -112926 -45154 546950 -124858 -135634
679a35634P16379l50635l76071l95133J114541m1284k18925j88616O2390n36105
$$ -135634 580745 230110 -145961 -541094 573447 532163 313238 124622 187012 -349093
669c49093M67365j25819j28155M7772R80733K52299l69041n28357n3634j17645
$$ -349093 118272 -7547 -135702 -87930 892803 1145102 776061 247704 194070 76425
659G6425K96600K5332m16380l60173O33335P88019o66026k9540K74799p36284
$$ 76425 373025 398357 -18023 -378196 255139 1043158 377132 347592 622391 -113893
$$ [...]
##END NTUPLES=NMR SPECTRUM
##END=
