##TITLE=1H_CA-9031-1
 CDCl3
 24 sc, 
 5.07.2022
##JCAMPDX= 6.0         $$ Bruker NMR JCAMP-DX V2.0
##DATA TYPE= NMR SPECTRUM
##DATA CLASS= NTUPLES
##ORIGIN= UXNMR, Bruker Analytische Messtechnik GmbH
##OWNER= root
$$ XWIN-NMR		Version 3.5
$$ Tue Jul  5 15:34:43 2022 Russian Standard Time (UT+4h)  she@DPX200
##.OBSERVE FREQUENCY= 200.1313499994
##.OBSERVE NUCLEUS= ^1H
##.ACQUISITION MODE= SIMULTANEOUS
##.ACQUISITION SCHEME= undefined
##.AVERAGES= 16
##.DIGITISER RES= 18
##SPECTROMETER/DATA SYSTEM= spect
##.PULSE SEQUENCE= zg30
##.SOLVENT NAME= CDCl3
##.SHIFT REFERENCE= (INTERNAL, CDCl3, 0, 15.7348)
##AUDIT TRAIL= $$ (NUMBER, WHEN, WHO, WHERE, WHAT)
$$ ##TITLE= Audit trail, XWIN-NMR		Version 3.5
$$ ##JCAMPDX= 5.01
$$ ##ORIGIN= Bruker BioSpin GmbH
$$ ##OWNER= she
$$ F:/spectra/data/she/nmr/H-F/1/pdata/1/auditp.txt
$$ ##AUDIT TRAIL=  $$ (NUMBER, WHEN, WHO, WHERE, WHAT)
(   1,<2022-07-05 15:33:08.17 +0400>,<she>,<DPX200>,
      <created by zg, POWCHK disabled, PULCHK disabled
       configuration hash MD5:
       00 E9 B6 7A A2 85 ED C7 34 08 36 98 17 FE 4E 26
       data hash MD5: 16K
       74 42 77 78 F8 CE ED EF CA C5 E0 E0 B0 A8 07 B9>)
(   2,<2022-07-05 15:33:13.01 +0400>,<she>,<DPX200>,
      <Start of raw data processing
       efp BC_mod = 2 LB = 0.24 FT_mod = 6 PKNL = 1 PHC0 = -18072.72 PHC1 = 30.80069 SI = 16K 
       data hash MD5: 16K
       75 38 E4 E8 57 31 78 87 E0 41 5C 25 49 AD 94 A3>)
(   3,<2022-07-05 15:33:42.75 +0400>,<she>,<DPX200>,
      <pk PHC0 = 15.58046 PHC1 = -18.6 
       data hash MD5: 16K
       90 4E 34 BB 04 67 7B AB 69 A3 EA 0A AD 45 16 97>)
(   4,<2022-07-05 15:33:46.73 +0400>,<she>,<DPX200>,
      <abs ABSG = 5 
       data hash MD5: 16K
       3C 25 97 67 32 46 ED 36 8A 3E 99 DD 2A 3D 43 68>)
$$ ##END=
$$ 
$$ hash MD5
$$ 62 6A F7 68 8D 1A 44 27 4B 86 6C 69 9F FF 17 4A
##$RELAX= 
##$RELAX= 
##$RELAX= 
##$RELAX= 
##$RELAX= 
##$RELAX= 
$$ Bruker specific parameters
$$ --------------------------
##$DU= <F:/spectra>
##$EXPNO= 1
##$NAME= <H-F>
##$PROCNO= 1
##$TYPE= <nmr>
##$USER= <she>
##$AMP= (0..31)
100 100 100 100 100 100 100 100 100 100 100 100 100 100 100 100 100 100 
100 100 100 100 100 100 100 100 100 100 100 100 100 100 
##$AQSEQ= 0
##$AQ_mod= 1
##$AUNM= <au_zg>
##$AUTOPOS= <>
##$BF1= 200.13
##$BF2= 200.13
##$BF3= 200.13
##$BF4= 200.13
##$BF5= 200.13
##$BF6= 200.13
##$BF7= 200.13
##$BF8= 200.13
##$BYTORDA= 1
##$CFDGTYP= 0
##$CFRGTYP= 5
##$CHEMSTR= <none>
##$CNST= (0..31)
1 1 145 1 1 1 1 1 1 1 1 1 1 1 1 1 1 1 1 1 1 1 1 1 1 1 1 1 1 1 1 1 
##$CPDPRG= <>
##$CPDPRG1= <>
##$CPDPRG2= <>
##$CPDPRG3= <>
##$CPDPRG4= <mlev>
##$CPDPRG5= <mlev>
##$CPDPRG6= <mlev>
##$CPDPRG7= <mlev>
##$CPDPRG8= <mlev>
##$CPDPRGB= <>
##$CPDPRGT= <>
##$D= (0..31)
0 1.2 0 0 0 0 0 0 0 0.06 0 0.03 0 0 0 0 0.0002 0 0 0 0 0 0 0 0 0 0 0 0 
0 0 0 
##$DATE= 1657020787
##$DBL= (0..7)
120 120 120 120 120 120 120 120 
##$DBP= (0..7)
150 150 150 150 150 150 150 150 
##$DBP07= 0
##$DBPNAM0= <>
##$DBPNAM1= <>
##$DBPNAM2= <>
##$DBPNAM3= <>
##$DBPNAM4= <>
$$ [...]
##$SUBNAM2= <"">
##$SUBNAM3= <"">
##$SUBNAM4= <"">
##$SUBNAM5= <"">
##$SUBNAM6= <"">
##$SUBNAM7= <"">
##$SUBNAM8= <"">
##$SUBNAM9= <"">
##$SW= 18.0517283424941
##$SWIBOX= (0..15)
0 0 2 0 0 0 0 0 0 0 0 0 0 0 0 0 
##$SW_h= 3612.71676300578
##$TD= 16384
##$TD0= 1
##$TE= 0
##$TE2= 300
##$TE3= 300
##$TEG= 300
##$TL= (0..7)
0 120 120 120 120 120 120 120 
##$TP= (0..7)
150 150 150 150 150 150 150 150 
##$TP07= 0
##$TPNAME0= <>
##$TPNAME1= <>
##$TPNAME2= <>
##$TPNAME3= <>
##$TPNAME4= <>
##$TPNAME5= <>
##$TPNAME6= <>
##$TPNAME7= <>
##$TPOAL= (0..7)
0.5 0.5 0.5 0.5 0.5 0.5 0.5 0.5 
##$TPOFFS= (0..7)
0 0 0 0 0 0 0 0 
##$TUNHIN= 0
##$TUNHOUT= 0
##$TUNXOUT= 0
##$USERA1= <user>
##$USERA2= <user>
##$USERA3= <user>
##$USERA4= <user>
##$USERA5= <user>
##$V9= 5
##$VALIST= <valist>
##$VCLIST= <CCCCCCCCCCCCCCC>
##$VD= 0
##$VDLIST= <DDDDDDDDDDDDDDD>
##$VPLIST= <PPPPPPPPPPPPPPP>
##$VTLIST= <TTTTTTTTTTTTTTT>
##$WBST= 1024
##$WBSW= 4
##$XGAIN= (0..3)
0 0 0 0 
##$XL= 0
##$YL= 0
##$YMAX_a= 299441
##$YMIN_a= -310913
##$ZGOPTNS= <>
##$ZL1= 120
##$ZL2= 120
##$ZL3= 120
##$ZL4= 120
##$ABSF1= 15.73587
##$ABSF2= -2.315979
##$ABSG= 5
##$ABSL= 3
##$ALPHA= 0
##$AQORDER= 0
##$ASSFAC= 0
##$ASSFACI= 0
##$ASSFACX= 0
##$ASSWID= 0
##$AUNMP= <proc_1d>
##$AZFE= 0.1
##$AZFW= 0.1
##$BCFW= 0
##$BC_mod= 2
##$BYTORDP= 0
##$COROFFS= 0
##$CY= -3
##$DATMOD= 1
##$DC= 0
##$DFILT= <>
##$DTYPP= 0
##$F1P= 0
##$F2P= 0
##$FCOR= 1
##$FTSIZE= 16384
##$FT_mod= 6
##$GAMMA= 0
##$GB= 0
##$INTBC= 1
##$INTSCL= 0
##$ISEN= 128
##$LB= 0.24
##$LEV0= 0
##$LPBIN= 0
##$MAXI= 10000
##$MC2= 0
##$MEAN= 0
##$ME_mod= 0
##$MI= 1.114404
##$NCOEF= 0
##$NC_proc= -8
##$NLEV= 6
##$NOISF1= 3.799351
##$NOISF2= 2.8
##$NSP= 0
##$NTH_PI= 0
##$NZP= 0
##$OFFSET= 15.73477
##$PC= 1
##$PHC0= -18057.14
##$PHC1= 12.20069
##$PH_mod= 1
##$PKNL= yes
##$PPARMOD= 0
##$PSCAL= 0
##$PSIGN= 0
##$REVERSE= no
##$SF= 200.130007357788
##$SI= 16384
##$SIGF1= 3
##$SIGF2= 2
##$SINO= 5.538805
##$SIOLD= 16384
##$SREGLST= <1H.CDCl3>
##$SSB= 0
##$STSI= 16384
##$STSR= 0
##$SW_p= 3612.71676300578
##$SYMM= 0
##$S_DEV= 0
##$TDeff= 16384
##$TDoff= 0
##$TI= <>
##$TILT= no
##$TM1= 0
##$TM2= 0
##$TOPLEV= 0
##$USERP1= <user>
##$USERP2= <user>
##$USERP3= <user>
##$USERP4= <user>
##$USERP5= <user>
##$WDW= 1
##$XDIM= 16384
##$YMAX_p= 509582566
##$YMIN_p= -1248878
$$ End of Bruker specific parameters
$$ ---------------------------------
##NTUPLES= NMR SPECTRUM
##VAR_NAME=  FREQUENCY,     SPECTRUM/REAL,   SPECTRUM/IMAG
##SYMBOL=    X,             R,               I
##VAR_TYPE=  INDEPENDENT,   DEPENDENT,       DEPENDENT
##VAR_FORM=  AFFN,          ASDF,            ASDF
##VAR_DIM=   16384,         16384,           16384
##UNITS=     HZ,            ARBITRARY UNITS, ARBITRARY UNITS
##FACTOR=    0.220516191357247, 1,           1
##FIRST=     3148.99960008325, 0,            0
##LAST=      -463.717162922529, 0,           0
##MIN=       -463.717162922529, -1248878,    0
##MAX=       3148.99960008325, 509582566,    0
$$ Real data points
##PAGE= N=1
##DATA TABLE= (X++(R..R)), XYDATA
$$ [...]
6320B864992m61841k74679l21548L90991M35338n42162j07057J22982J31309k3715
$$ 2864992 2403151 2128472 1806924 2197915 2633253 2091091 1984034 2107016 2238325 2214610
6310B214610J24110K83514p1627k57555J94353K79872K17623j37005j27853j28381
$$ 2214610 2338720 2622234 2550607 2293052 2487405 2767277 2984900 2847895 2720042 2591661
6300B591661J11413j12907J33632j34803n020L09594l17714K80742J54414r293
$$ 2591661 2703074 2590167 2723799 2588996 2583976 2893570 2575856 2856598 3011012 3001719
6290C001719l45524J2679k85488o51337K92992J23098J33524M78294m49894k5866
$$ 3001719 2656195 2668874 2383386 1732049 2025041 2148139 2281663 2759957 2310063 2284197
6280B284197P45899o2352J79484N44471l79963N858n64756K39233K63664m272
$$ 2284197 3030096 2967744 3147228 3691699 3311736 3317594 2752838 2992071 3255735 3251463
6270C251463Q8216l5645n7889J18815j10301M34384N9618k73508r6196J76144
$$ 3251463 3339679 3304034 3246145 3364960 3254659 3689043 3748661 3475153 3378957 3555101
6260C555101k9863l83227J41699N76498j33571o47528K96623J48712l2373o0400
$$ 3555101 3525238 3142011 3283710 3860208 3726637 3079109 3375732 3524444 3492071 3431671
6250C431671k26880L96964J13004m82891L30597p9870o3553L7838j1725j51098
$$ 3431671 3204791 3601755 3714759 3231868 3562465 3482595 3419042 3456880 3445155 3294057
6240C294057R8902L4097O50406J5840l85308l8213L08790k5443R5750K57665O2991
$$ 3294057 3392959 3427056 4077462 4093302 3707994 3669781 3978571 3953128 4048878 4306543 4369534
6229D369534K1989O8436k43835k4686J461J59699O50975R6351k57070m09584R3742
$$ 4369534 4391523 4459959 4216124 4191438 4192899 4352598 5003573 5099924 4842854 4433270 4527012
6218D527012O0785K38835l37153Q3654L89973J59580K61793m24086J71301M16738
$$ 4527012 4587797 4826632 4489479 4573133 4963106 5122686 5384479 4960393 5131694 5548432
6208E548432L1998j98785M84710M159n27388K26569Q6042N84259M54122Q6127
$$ 5548432 5580430 5381645 5866355 5870514 5343126 5569695 5655737 6239996 6694118 6780245
6198F780245L0726M21548K43720m54017L97295K24218J06291J71009K56185P75239
$$ 6780245 6810971 7232519 7476239 7022222 7419517 7643735 7750026 7921035 8177220 8952459
6188H952459M56866K72871K36702O42414O66232O6479L35632L33843L01008L09097
$$ 8952459 9409325 9682196 9918898 10561312 11227544 11294023 11629655 11963498 12264506 12573603
6178A2573603j28159r0159N85899n5805k38423m88991k9113k10616p152j26381
$$ 12573603 12445444 12355285 12941184 12885379 12646956 12157965 12128852 11918236 11911084 11784703
6168A1784703R574m65095j72481j11327q7781k61786o44981M80323P864K11499
$$ 11784703 11794277 11329182 11156701 11045374 10957593 10695807 10050826 10531149 10539013 10750512
6158A0750512p04699L1124M6471k89050K50080J80755L08490J53333L96333o2442
$$ 10750512 10045813 10076937 10123408 9834358 10084438 10265193 10573683 10727016 11123349 11060907
6148A1060907L47382J53813J50421M52798N68338M86642l44950K30369m51782
$$ 11060907 11408289 11562102 11712523 12165321 12733659 13220301 12875351 13105720 12653938
6139A2653938N95972N31059j55978J79921n36896k74426o66355N4430J62887k09050
$$ 12653938 13249910 13780969 13624991 13804912 13268016 12993590 12327235 12381665 12544552 12335502
6129A2335502o01045j81735O8417p51255n64389n82806m68771p05476o29050J54816
$$ 12335502 11734457 11552722 11621139 10869884 10305495 9722689 9253918 8548442 7919392 8074208
6119H074208l77312l7903p1976R2663M35121k45195k99354o60549j88568n96595
$$ 8074208 7696896 7658993 7587017 7679680 8114801 7869606 7570252 6909703 6721135 6124540
6109F124540n04314N43831L74393m61528L70968L85988m37283o27533k03238J82742
$$ 6124540 5620226 6164057 6538450 6076922 6447890 6833878 6396595 5769062 5565824 5748566
6099E748566l3798N58912k44612l11386o10290j36265R34172j97978j11815K18269
$$ 5748566 5714768 6273680 6029068 5717682 5107392 4971127 5905299 5707321 5595506 5813775
6089E813775q7879l40851P5858l5276O42354n21371o9626J74002o49652j0768
$$ 5813775 5725896 5385045 5460903 5425627 6067981 5546610 5476984 5650986 5001334 4990566
6079D990566L1840J90586N74857k52140m49038k81161O17252L8370o68319J73145
$$ 4990566 5022406 5212992 5787849 5535709 5086671 4805510 5422762 5461132 4792813 4965958
6069D965958M54839l75305O4106K12588m9251j85223K25984M5131j72971M1070
$$ 4965958 5420797 5045492 5109598 5322186 5272935 5087712 5313696 5358827 5185856 5226926
6059E226926k14028L4088k4912Q5377N0337n52111M4633N39745J32751j0528m7185
$$ 5226926 5012898 5046986 5022074 5107451 5157788 4605677 4650310 5190055 5322806 5312278 5265093
6048E265093p2446n05909k55575O51803J96416j98846J4409l47320N5705n09284
$$ 5265093 5192647 4686738 4431163 5082966 5279382 5080536 5094945 4747625 4803330 4294046
6038D294046O47217M87559k48059j77668p371J41958N69043j15277j39447l52848
$$ 4294046 4941263 5428822 5180763 5003095 4995724 5137682 5706725 5591448 5452001 5099153
6028E099153l90969K60937M80477l01399j63454Q59j87418J4911m8957j61569
$$ 5099153 4708184 4969121 5449598 5148199 4984745 4985604 4798186 4813097 4764140 4602571
6018D602571O60564K19166J51261m59334J15283p1210M90849k60294k64741J86590
$$ 4602571 5263135 5482301 5633562 5174228 5289511 5218301 5709150 5448856 5184115 5370705
6008E370705j60670J11548J09556q7627j8406K99209j6002K74134M37099m65893
$$ 5370705 5210035 5321583 5431139 5343512 5325106 5624315 5608313 5882447 6319546 5853653
5998E853653k09204J25568n19423M34772J40651l23980l60397p0666K31136J04385
$$ 5853653 5644449 5770017 5250594 5685366 5826017 5502037 5141640 5070974 5302110 5406495
5988E406495J29839M75648k53424J49087K64491k33074j33269K17274n21002L64181
$$ 5406495 5536334 6011982 5758558 5907645 6172136 5939062 5805793 6023067 5502065 5866246
5978E866246J97638J2416R1069m09709r2330L49530N6203m18577m2926K43715
$$ 5866246 6063884 6076300 6167369 5757660 5665330 6014860 6071063 5652486 5609560 5853275
5968E853275K82023K41813j31054l61506J80345N09030j44770j7351m9974L76052
$$ 5853275 6135298 6377111 6246057 5884551 6064896 6573926 6429156 6411805 6361831 6737883
5958F737883J64051r3570j88381j17783Q4087j26899n48642M34716J38955L39895
$$ 6737883 6901934 6808364 6619983 6502200 6586287 6459388 5910746 6345462 6484417 6824312
5948F824312q4554k13207k61888N76540J03305j67675N08438m92753N7673k08968
$$ 6824312 6739758 6526551 6264663 6841203 6944508 6776833 7285271 6792518 6850191 6641223
5938F641223m17082j45079K70824Q08195j88106l15031O47218l08761r7046J22503
$$ 6641223 6224141 6079062 6349886 7158081 6969975 6654944 7302162 6993401 6896355 7018858
5928G018858k92968J97983q4478l09268M58216j07682j18996K66309L34944n29141
$$ 7018858 6725890 6923873 6839395 6530127 6988343 6880661 6761665 7027974 7362918 6833777
5918F833777l50286Q09607J17312m1839j60397j3235L63080p73894M7568j67053
$$ 6833777 6483491 7293098 7410410 7368571 7208174 7194939 7558019 6784125 6831693 6664640
5908F664640K17688K47245O7363M13885k18446k70632j95713K38912M56603K74143
$$ 6664640 6882328 7129573 7196936 7610821 7392375 7121743 6926030 7164942 7621545 7895688
5898G895688l92032j96711M54170J9773L5574K47152L16946k76376J531J24438
$$ 7895688 7503656 7306945 7761115 7780888 7816462 8063614 8380560 8104184 8105715 8230153
5888H230153j38300l12169K48154J89912k10796j28304J00473j07351j7263j54020
$$ 8230153 8091853 7779684 8027838 8217750 8006954 7878650 7979123 7871772 7854509 7700489
5878G700489K66999K11404k97247K80804L7951J05801L8794k64352J08680j41397
$$ 7700489 7967488 8178892 7881645 8162449 8200400 8306201 8344995 8080643 8189323 8047926
5868H047926Q567L11128K79009l63882j15451K68692k73235j98925J2483L55250
$$ 8047926 8056493 8367621 8646630 8282748 8167297 8435989 8162754 7963829 7976312 8331562
5858H331562j91805j13511O23944N91756p23916j61558M68019K96880m71280L4705
$$ 8331562 8139757 8026246 8650190 9241946 8518030 8356472 8824491 9121371 8650091 8684796
5848H684796M09081l35114K0169J92700j05136k84709k07362J78235M81701K56240
$$ 8684796 9093877 8758763 8778932 8971632 8866496 8581787 8374425 8552660 9034361 9290601
5838I290601p741j51869l87564l13742J30314L87509K70223n3468K78665k39783
$$ 9290601 9282860 9130991 8743427 8429685 8559999 8947508 9217731 9164263 9442928 9203145
5828I203145l43303K80717r2380M25056l12075k49221L84018J11087O1328K25699
$$ 9203145 8859842 9140559 9048179 9473235 9161160 8911939 9295957 9407044 9468372 9694071
5818I694071K99676k24013J071K82773m65906j27258j0131m9245K28437k4130
$$ 9694071 9993747 9769734 9770805 10053578 9587672 9460414 9450283 9401038 9629475 9605345
5808I605345K8249J23676m55117J27806K6869m30170M35171R19865L88254j97140
$$ 9605345 9633594 9757270 9302153 9429959 9456828 9026658 9461829 10381694 10769948 10572808
5798A0572808l50796o24399J94140J77507j676j38189P00478m00865m37230J8301
$$ 10572808 10222012 9597613 9791753 9969260 9967584 9829395 10529873 10129008 9691778 9710079
5788I710079K31733J49909o7318l9127k9626O35668M08710Q0971o33205q3587
$$ 9710079 9941812 10091721 10024403 9985276 9955650 10591318 11000028 11080999 10447794 10364207
5778A0364207k55323M54436k98488m69525L73603N35941n1103R8794k8984l37287
$$ 10364207 10108884 10563320 10264832 9795307 10168910 10704851 10653748 10752542 10723558 10386271
5768A0386271R7913L86917m6591j20714K28304j7311j93578o1500L88546K6023
$$ 10386271 10484184 10871101 10824510 10703796 10932100 10914789 10721211 10659711 11048257 11074280
5758A1074280R3439l86296j45489J20316P5569l16588k22650M37285L53847K41592
$$ 11074280 11167719 10781423 10635934 10756250 10831819 10515231 10292581 10729866 11083713 11325305
5748A1325305m21059P6190L69727L54562l33021j54812J01606P16988K78468o04552
$$ 11325305 10904246 10980436 11350163 11704725 11371704 11216892 11318498 12035486 12313954 11709402
5738A1709402K13347L35805l48479m02888M22220k29901K92844o6026o51467m9404
$$ 11709402 11922749 12258554 11910075 11507187 11929407 11699506 11992350 11926324 11274857 11225453
5728A1225453K74961p3173O69444L2169M08032R2401k40387J7729k4260m8796
$$ 11225453 11500414 11427241 12096685 12128854 12536886 12629287 12388900 12406629 12382369 12333573
5718A2333573K43079N5391m37660m36084j43922M83708L6271N08278M10606l60817
$$ 12333573 12576652 12632043 12194383 11758299 11614377 12098085 12134356 12642634 13053240 12692423
5708A2692423j7383K16070r6051K76470m75644k04136O39865J98610J2979K7444
$$ 12692423 12675040 12891110 12795059 13071529 12595885 12391749 13031614 13230224 13243203 13270647
5698A3270647l21807J86738K78932l55088k65272M42772K25274k15957J63042
$$ 13270647 12948840 13135578 13414510 13059422 12794150 13236922 13462196 13246239 13409281
5689A3409281l84503M4022O70727j70967l52428j15446J00952M78837N5044l45075
$$ 13409281 13024778 13068800 13739527 13568560 13216132 13100686 13201638 13680475 13735519 13390444
5679A3390444l09740n87088O55448K84328Q6397N57616l34327K76896K97004K89930
$$ 13390444 13080704 12493616 13149064 13433392 13519789 14077405 13743078 14019974 14316978 14606908
5669A4606908J12615k83955m25063m57459P7844k7614j67438L78646K64686N31431
$$ 14606908 14719523 14435568 14010505 13553046 13630890 13603276 13435838 13814484 14079170 14610601
5659A4610601M237l08905k04305N16523n24433k71193N28896K33754j04263J39226
$$ 14610601 14614838 14305933 14101628 14618151 14093718 13822525 14351421 14585175 14480912 14620138
5649A4620138K21373r5429K10000M43418k52119k77348M35520n22451K64095J57975
$$ 14620138 14841511 14746082 14956082 15399500 15147381 14870033 15305553 14783102 15047197 15205172
5639A5205172L9592P1682O38699p7481k81470n8031K27824l90164l95618m9031
$$ 15205172 15244764 15316446 15955145 15877664 15596194 15538163 15765987 15375823 14980205 14931174
5629A4931174P48932M79758q54986K39878L07841n6177L29350J72421k72409J60659
$$ 14931174 15680106 16159864 15304878 15544756 15852597 15796420 16125770 16298191 16025782 16186441
5619A6186441M1434O339J20403K88994l49748k63169L35829o7150j00992O99166
$$ 16186441 16227875 16234214 16354617 16643611 16293863 16030694 16366523 16299373 16198381 16897547
5609A6897547j34872k11839j82003L02401J45995q6998J4923l45167j87687K26135
$$ 16897547 16762675 16550836 16368833 16671234 16817229 16730231 16745154 16399987 16212300 16438435
5599A6438435M01954k311L27678n6452Q4282l93600K80332L53573k6149r1021
$$ 16438435 16840389 16838078 17165756 17109304 17193586 16799986 17080318 17433891 17407742 17316721
5589A7316721j5146J74125j22278N9422J04183k58716k57813l447K28293K69179
$$ 17316721 17301575 17475700 17353422 17412844 17517027 17258311 17000498 16997051 17225344 17494523
5579A7494523Q7001j61735r2001Q524J63070J7401j45156P2899N06793M81775
$$ 17494523 17581524 17419789 17327788 17336312 17499382 17516783 17371627 17444526 17951319 18433094
5569A8433094j31925k64836J53562Q60109l62739m2970J47658q82222l12321L35553
$$ 18433094 18301169 18036333 18189895 19050004 18687265 18644295 18791953 17909731 17597410 17932963
5559A7932963K19595k05474o5094L15331m531n4198P44066k5144J1923k15890
$$ 17932963 18152558 17947084 17881990 18197321 18192790 18138592 18882658 18857514 18869437 18653547
5549A8653547m77669M18102N40827j05071J35334q8594l1142j22730K34830o93601
$$ 18653547 18175878 18593980 19134807 19029736 19165070 19076476 19045334 18922604 19157434 18463833
5539A8463833J54602P66027O5502m05877l38451K33671L40571k90217Q17820L70981
$$ 18463833 18618435 19384462 19449964 19044087 18705636 18939307 19279878 18989661 19807481 20178462
5529B0178462j32579J90214r2978J34486l23179k10573K53424M1479k75287L51766
$$ 20178462 20045883 20236097 20143119 20277605 19954426 19743853 19997277 20038756 19763469 20115235
5519B0115235K81241J61473j77775j40551o5435K7076K60486J0329K6086L04543
$$ 20115235 20396476 20557949 20380174 20239623 20174188 20201264 20461750 20472079 20498165 20802708
5509B0802708k15875L06815m44461l92858N25932O6577J04094k73110L3513J43
$$ 20802708 20586833 20893648 20449187 20056329 20582261 20648838 20752932 20479822 20513335 20513478
5499B0513478J92061M85063l01287j73037o1488J052655p4468j26850J45355j81108
$$ 20513478 20705539 21190602 20889315 20716278 20654790 21707445 21632977 21506127 21651482 21470374
5489B1470374j33008M15218j38162L07293L7341J98911M25882k03236m50605k72265
$$ 21470374 21337366 21752584 21614422 21921715 21959056 22157967 22583849 22380613 21930008 21657743
5479B1657743O5919K27739k34164j56175o06079M46333N3876K09280j27168O0641
$$ 21657743 21723662 21951401 21717237 21561062 20954983 21401316 21455192 21664472 21537304 21597945
5469B1597945J5786m21009j1508K80855K86022k27899L43685L47478K79662r6391
$$ 21597945 21613731 21192722 21181214 21462069 21748091 21520192 21863877 22211355 22491017 22394626
5459B2394626o29251J33738M29388J52651J11770J87803k30130j21680J39985
$$ 22394626 21765375 21899113 22328501 22481152 22592922 22780725 22550595 22428915 22568900
5450B2568900Q924j54078l37758M75798r0570m2297n9454n39139m9230M20287
$$ 22568900 22577824 22423746 22085988 22561786 22471216 22428919 22369465 21830326 21781096 22201383
5440B2201383k52199N686l26708m18944K3751L09313j70935J14734J99051L90758
$$ 22201383 21949184 21954870 21628162 21209218 21232969 21542282 21371347 21486081 21685132 22075890
5430B2075890K99011l30587o91939j95735N26560l14851l2059L16186M48902L46762
$$ 22075890 22374901 22044314 21352375 21156640 21683200 21368349 21336290 21652476 22101378 22448140
5420B2448140o5105j61207L2056J54371q9231n30797n88467L82349J50886P0149
$$ 22448140 22383035 22221828 22253884 22408255 22319024 21788227 21199760 21582109 21732995 21803144
5410B1803144k83856j1679P5601j01937J09303N7900q7457q0391j67042K82108
$$ 21803144 21519288 21507609 21583210 21481273 21590576 21648476 21561019 21480628 21313586 21595694
5400B1595694R8506L05300p2968K54434o71069o8618J64281k35154J18825Q8325
$$ 21595694 21694200 21999500 21926532 22180966 21509897 21441279 21605560 21370406 21489231 21577556
5390B1577556R1113N93139j098284K31281P2923n18070L61421K01314k61328l3113
$$ 21577556 21668669 22261808 21163524 21394805 21467728 20949658 21311079 21512393 21251065 21217952
5380B1217952L3610K09587O29703J39024K5558m69589j7272m77454l01843J45017
$$ 21217952 21251562 21461149 22090852 22229876 22255434 21785845 21768573 21291119 20989276 21134293
5370B1134293j59121J49216J48454j7344M13931j94096r07107N68523R68741q5645
$$ 21134293 20975172 21124388 21272842 21255498 21669429 21475333 20568226 21136749 22105490 22019845
5360B2019845l7990J86348l86524j57569k6467k29762K3009r0913n19067M95484
$$ 22019845 21981855 22168203 21781679 21624110 21597643 21367881 21390890 21299977 20780910 21276394
5350B1276394K88390j92765k33872k34096J046404l42726j61778m3845j82173
$$ 21276394 21564784 21372019 21138147 20904051 21950455 21607729 21445951 21402106 21219933
5341B1219933j0359L02691J02447K784n01690k05761K79692N91939j30984k19349
$$ 21219933 21209574 21512265 21614712 21617496 21115806 20910045 21189737 21781676 21650692 21431343
5331B1431343l42153N8678J14736L61611m11699k53003L33523j45130k29019r46
$$ 21431343 21089190 21147868 21262604 21624215 21212516 20959513 21293036 21147906 20918887 20917941
5321B0917941q6219L59469N5678l73078L52576K38409O0117M31956k51368q7806
$$ 20917941 20831722 21191191 21246869 20873791 21226367 21464776 21524893 21956849 21705481 21617675
5311B1617675n82088k10239j17503k3361J52681m13765K21315k7596Q2217R6524
$$ 21617675 21035587 20825348 20707845 20684484 20837165 20423400 20644715 20617119 20699336 20795860
5301B0795860P9158L27034k03959l33369k98780m0852P51471L06281j26866l56593
$$ 20795860 20875018 21202052 20998093 20664724 20365944 20325092 21076563 21382844 21255978 20899385
5291B0899385n6798J14657K31673m2145r8143J40972L9294j61257m53462m43641
$$ 20899385 20842587 20957244 21188917 21146772 21048629 21189601 21228895 21067638 20614176 20170535
5281B0170535n44367L45551J2523J61384j26338k26140R5001J45761N62519K01885
$$ 20170535 19626168 19971719 19984242 20145626 20019288 19793148 19888149 20033910 20596429 20798314
5271B0798314n10240j79098L71461l41560k0893j70886j35519j07264K01434K36359
$$ 20798314 20288074 20108976 20480437 20138877 20117984 19947098 19811579 19704315 19905749 20142108
5261B0142108L35842J27441o43467k76644M13747J83179k05696k19086m61627
$$ 20142108 20477950 20605391 19961924 19685280 20099027 20282206 20076510 19857424 19395797
5252A9395797k3177o6648j96906J88906L10396j17458k57555O714j50562l82269
$$ 19395797 19372620 19305972 19109066 19297972 19608368 19490910 19233355 19240069 19089507 18707238
5242A8707238J90855K41827N93614k92770o33707K2738K47607N84049k21544l13866
$$ 18707238 18898093 19139920 19733534 19440764 18807057 18829795 19077402 19661451 19439907 19126041
5232A9126041k56132M77804O909j88444k60483m33626J45284q8631r3313R97802
$$ 19126041 18869909 19347713 19354622 19166178 18905695 18472069 18617353 18528722 18435409 19433211
5222A9433211o46508K16100n83940J88361R1367o05715J43214m19870m6189L38084
$$ 19433211 18786703 19002803 18418863 18607224 18698591 18092876 18236090 17816220 17770031 18108115
5212A8108115L39835j47058k94567K52319P34664o82480k09060j1656k44918k4741
$$ 18108115 18447950 18300892 18006325 18258644 18993308 18310828 18101768 18090112 17845194 17820453
5202A7820453j2964K83882k3927P8860M25620o19114l17306J29227K95247J7118
$$ 17820453 17807489 18091371 18067444 18146304 18571924 17952810 17635504 17764731 18059978 18077096
5192A8077096l35684k40691j11830J5490l18333L09372L193l3373r7204J91982
$$ 18077096 17741412 17500721 17388891 17404381 17086048 17395420 17398613 17365240 17268036 17460018
5182A7460018M2555k13756J96745o11885q3684L01125j40968J10224p5539m31052
$$ 17460018 17502573 17288817 17485562 16873677 16789993 17091118 16950150 17060374 16984835 16553783
5172A6553783M10422N23193m04632n42767k95928K44605q4372j82757L37744J79772
$$ 16553783 16964205 17487398 17082766 16539999 16244071 16488676 16404304 16221547 16559291 16739063
5162A6739063k5248j11819n9923n70739J8604M39599J35840n00813O6644L08863
$$ 16739063 16713815 16601996 16542073 15971334 15989938 16429537 16565377 16064564 16131208 16440071
5152A6440071K75686m68887J54277R6943o64393M57889K16035k55583L19630j50122
$$ 16440071 16715757 16246870 16401147 16498090 15833697 16291586 16507621 16252038 16571668 16421546
5142A6421546m77117M04990J38837n27241l63607K00883O4234j06026M39461m19284
$$ 16421546 15944429 16349419 16488256 15961015 15597408 15798291 15862525 15756499 16195960 15776676
5132A5776676q5646L31908o3934K33272m29359M19276j82847n18516j51517j57686
$$ 15776676 15691030 16022938 15959004 16192276 15762917 16182193 15999346 15480830 15329313 15171627
5122A5171627J11002N20711j82025m31715o2865o5397K60597J02636j69949p6265
$$ 15171627 15282629 15803340 15621315 15189600 15126735 15061338 15321935 15424571 15254622 15178357
5112A5178357k38808L57252K11746M7200K95611m3075k37264m05341m12346J51066
$$ 15178357 14939549 15296801 15508547 15555747 15851358 15808283 15571019 15165678 14753332 14904398
5102A4904398L39046J26592k63652j39171J54788j61434N23581J8771L724Q528
$$ 14904398 15243444 15370036 15106384 14967213 15122001 14960567 15484148 15502919 15506643 15515171
5092A5515171j39303k83099l52601M93856K53862k40031k51631K47156k80095
$$ 15515171 15375868 15092769 14740168 15234024 15487886 15247855 14996224 15243380 14963285
5083A4963285M08823p12792j63579m5726L94697L90606k07494L55555k12932J14887
$$ 14963285 15372108 14659316 14495737 14450011 14844708 15235314 15027820 15383375 15170443 15285330
5073A5285330j753J83037k31432q4225j39602J54022j95997L47428m24696J62830
$$ 15285330 15283577 15466614 15235182 15150957 15011355 15165377 14969380 15316808 14892112 15054942
5063A5054942j0309M95645K22338l25040J59367n10314m39213N97955n32j96076
$$ 15054942 15044633 15540278 15762616 15437576 15596943 15086629 14647416 15245371 15244839 15048763
5053A5048763K3270m55007L03768R26823l04938l18874L15966J16757n45018k09221
$$ 15048763 15072033 14617026 14920794 15847617 15542679 15223805 15539771 15656528 15111510 14902289
5043A4902289m1538M92345L85912N0503J45827j80004K80949P5378j97426k96960
$$ 14902289 14860751 15353096 15739008 15789511 15935338 15755334 16036283 16111661 15914235 15617275
5033A5617275K3081L46858j3251O4769K07228k39658K53218K08947J17418k69130
$$ 15617275 15640356 15987214 15973963 16038732 16245960 16006302 16259520 16468467 16585885 16316755
5023A6316755j90955K36692P05215l6716L06692O38070P2886J3179N5936o86280
$$ 16316755 16125800 16362492 17067707 17030991 17337683 17975753 18048639 18061818 18117754 17431474
5013A7431474N25361L31713J44824k42767P18569L93307p1943J30919J2726K19391
$$ 17431474 17956835 18288548 18433372 18190605 18909174 19302481 19230538 19361457 19374183 19593574
5003A9593574N4547J59605M34267j73732K43939P84478o4078M43611L49029P78037
$$ 19593574 19648121 19807726 20241993 20068261 20312200 21096678 21032600 21476211 21825240 22603277
4993B2603277j96736O3255O56517J441628M54151R76535P41766N49639J158817
$$ 22603277 22406541 22469796 23126313 24567941 25022092 25998627 26740393 27290032 28448849
4984B8448849J411627R22907J044013Q97393J224090J778045J812261J975448
$$ 28448849 29860476 30783383 31827396 32724789 33948879 35726924 37539185 39514633
4976C9514633J690206K468023K611088K080857K898918L022524K836537K252697
$$ 39514633 41204839 43672862 46283950 48364807 51263725 54286249 57122786 59375483
4968E9375483K304449J435870O48831n47955j303470j838045k349390k050128
$$ 59375483 61679932 63115802 63764633 63216678 61913208 60075163 57725773 55675645
4960E5675645k578780k678332k318795k350075k184909j872025j648871j358355
$$ 55675645 53096865 50418533 48099738 45749663 43564754 41692729 40043858 38685503
4952C8685503j883405j211298j451847p27371m96679o02584r72179p61780n32828
$$ 38685503 36802098 35590800 34138953 33411582 32914903 32312319 31340140 30578360 30045532
4943C0045532k20689k30052k87566j94886K66266l99136K44646O7507M75383k72291
$$ 30045532 29824843 29594791 29307225 29112339 29378605 28979469 29224115 29291622 29767005 29494714
4933B9494714L57396R14450M11397K67432N07788O24037J595139N81996P13991
$$ 29494714 29852110 30766560 31177957 31445389 31953177 32577214 34172353 34754349 35468340
4924C5468340J288572R37894J406491J033510J074683J245365J428713Q24454
$$ 35468340 36756912 37694806 39101297 40134807 41209490 42454855 43883568 44708022
4916D4708022Q43889P21548P19030J164982K47806L36875Q09742K49043J07756
$$ 44708022 45551911 46273459 46992489 48157471 48405277 48742152 49551894 49800937 49908693
4907D9908693L54111N69390Q75020O94545J279766J773297J859026J512200J246995
$$ 49908693 50262804 50832194 51707214 52401759 53681525 55454822 57313848 58826048 60073043
4898F0073043J075875J093169l15997p26213j336323k616463k367851k641537
$$ 60073043 61148918 62242087 61926090 61199877 59863554 57247091 54879240 52237703
4890E2237703k796363l264561l209159k416494j913468k320451j313002j745794
$$ 52237703 49441340 46176779 42967620 40551126 38637658 36317207 35004205 33258411
4882C3258411k046233j059000r45314j030632j92655r04459j300011q55645r58840
$$ 33258411 31212178 30153178 29207864 28177232 27984577 27080118 25780107 24924462 23965622
4873B3965622o38886J33855j168804k96229k57942j66718j68196m34147p44771
$$ 23965622 23326736 23460591 22291787 21995558 21737616 21570898 21402702 20968555 20223784
4864B0223784l37540m26023J95992m57426k09281K97543p46612j15868K22304
$$ 20223784 19886244 19460221 19656213 19198787 18989506 19287049 18540437 18424569 18646873
4855A8646873Q1431r3519J64251r87744r8643J12735R2752P31791o77303j34208
$$ 18646873 18728304 18634785 18799036 17811292 17712649 17825384 17918136 18649927 17972624 17838416
4845A7838416P3815M29722j38603M3359m34592N9373k9722q4052P21430J35000
$$ 17838416 17912231 18341953 18203350 18246709 17812117 17871490 17841768 17757716 18479146 18614146
4835A8614146M34274N041n062J61043L65128m82669K73742J93566J5525O74623
$$ 18614146 19048420 19053461 19048399 19209442 19574570 19091901 19365643 19559209 19574734 20249357
4825B0249357P50039l13142j06117L36683K27628J032528L49545K95444L79797
$$ 20249357 20999396 20686254 20580137 20916820 21144448 22176976 22526521 22821965 23201762
4816B3201762N54667K22589O03278L05254J292783J315926P84552O85635J286615
$$ 23201762 23756429 23979018 24582296 24887550 26180333 27496259 28280811 28966446 30253061
4807C0253061J658908Q39080J050014J077927O78178J718915J067868K95851N84122
$$ 30253061 31911969 32751049 33801063 34878990 35557168 37276083 38343951 38639802 39223924
4798C9223924j0465o88293o41535j077226r97951j251540r97338r50176j743293
$$ 39223924 39213459 38525166 37883631 36806405 35808454 34556914 33559576 32609400 30866107
4789C0866107l78518m99103l69391r48654q66512L980M07797m20018l69897L69289
$$ 30866107 30487589 29988486 29619095 28670441 27803929 27807909 28215706 27795688 27425791 27795080
4779B7795080m46727m31354M12500O84911R0138J53176M64076N53604N95952Q02513
$$ 27795080 27348353 26916999 27329499 28014410 28104548 28257724 28721800 29275404 29871356 30673869
4769C0673869P72480N78776J043525J017907J973960J024870J239069J283789
$$ 30673869 31446349 32025125 33068650 34086557 36060517 37085387 38324456 39608245
4761C9608245K217772J903564K126610K097578J880726K530454K420915J813867
$$ 39608245 41826017 43729581 45856191 47953769 49834495 52364949 54785864 56599731
4753E6599731J640634J950708J889513J749442R16095n24564p16140j349847k175527
$$ 56599731 58240365 60191073 62080586 63830028 64746123 64221559 63505419 62155572 59980045
4744E9980045k579673k517566k204181k322324k797912k004304j969469k471869
$$ 59980045 57400372 54882806 52678625 50356301 47558389 45554085 43584616 41112747
4736D1112747k023031j469620j316994j372491j369576j054286j156903J90191
$$ 41112747 39089716 37620096 36303102 34930611 33561035 32506749 31349846 31540037
4728C1540037p38267q29721o60623n814J86559j64072J71305k78475L69960o39192
$$ 31540037 30801770 29972049 29311426 29305612 29492171 29328099 29499404 29220929 29590889 28951697
4718B8951697O4098O62237l38498j27061l26073o69527k3409n97762o53620j086092
$$ 28951697 29015795 29678032 29339534 29212473 28886400 28216873 28193464 27595702 26942082 25855990
4708B5855990o14446l88712m98897p63716n52373r54228l18530m75007r7152o40867
$$ 25855990 25241544 24852832 24353935 23590219 23037846 22083618 21765088 21290081 21192929 20552062
4698B0552062Q2965J54219l16193l25408l24014K72609K41769j37387k13965J24449
$$ 20552062 20635027 20789246 20473053 20147645 19823631 20096240 20338009 20200622 19986657 20111106
4688B0111106J70300o11223j61535M24639M03608R9489J964M7630L90124P78375
$$ 20111106 20281406 19670183 19508648 19933287 20336895 20436384 20438348 20485978 20876102 21654477
4678B1654477L01809M82226K16490J150624J25119K93957P87815M90359Q57214
$$ 21654477 21956286 22438512 22655002 23805626 23930745 24224702 25012517 25502876 26360090
4669B6360090O56537J373643J120549Q23712J858664J337607J754191J423755
$$ 26360090 27016627 28390270 29510819 30334531 32193195 33530802 35284993 36708748
4661C6708748J626140K338820J651222K376682K579703K128907K037187J695345
$$ 36708748 38334888 40673708 42324930 44701612 47281315 49410222 51447409 53142754
4653E3142754J572960M74921N56315K63223j387358j707821j957732j650889k173712
$$ 53142754 54715714 55190635 55746950 56010173 54622815 52914994 50957262 49306373 47132661
4644D7132661k677703k210215k261906k091974j674670j663326j423941j201704
$$ 47132661 44454958 42244743 39982837 37890863 36216193 34552867 33128926 31927222
4636C1927222j403831j115276p66466j093882o20841n58616m59901o94519p74669
$$ 31927222 30523391 29408115 28641649 27547767 26926926 26368310 25908409 25213890 24439221
4627B4439221j60710m30778o2045m78005m54132m7861K24450K85065L26936j3257
$$ 24439221 24278511 23847733 23785688 23307683 22853551 22805690 23030140 23315205 23642141 23628884
4617B3628884K77140M41958m51115j40497O62630J185013M36338J011901P65699
$$ 23628884 23906024 24347982 23896867 23756370 24419000 25604013 26040351 27052252 27817951
4608B7817951O77457J345325J136498Q79824J353619J226298K38645L63031Q23414
$$ 27817951 28495408 29840733 30977231 31857055 33210674 34436972 34675617 35038648 35862062
4599C5862062k58738m64340j253459o85273r19062j266109j629967j455386p06513
$$ 35862062 35603324 35138984 33885525 33200252 32281190 31015081 29385114 27929728 27223215
4590B7223215j619324j142321j017367m40374m20101j202192o73745o19767n86558
$$ 27223215 25603891 24461570 23444203 23003829 22583728 21381536 20707791 20088024 19501466
4581A9501466m06738j2145k73884j01952n61929Q938p54896q81483n24483j21772
$$ 19501466 19094728 19082583 18808699 18706747 18144818 18153756 17398860 16517377 15992894 15871122
4571A5871122N61446j7797k37724P878j05683M5130K15271o83871K98711M11750
$$ 15871122 16432568 16414771 16177047 16184925 16079242 16124372 16339643 15655772 15954483 16366233
4561A6366233j66480k43061K34963R4649j59030M54738O91364N76774N4552J5130
$$ 16366233 16199753 15956692 16191655 16286304 16127274 16582012 17273376 17850150 17904702 17919832
4551A7919832O74596O22236N8732R30558P35819J030201Q54036N68896M09289
$$ 17919832 18594428 19216664 19275396 20205954 20941773 21971974 22826010 23394906 23804195
4542B3804195J512150J976522J281676R29725J613127J553547O10573N83393K54774
$$ 23804195 25316345 27292867 28574543 29504268 31117395 32670942 33281515 33864908 34119682
4533C4119682J16548q32418m53097j155490j363544j819068j260893j265579j078452
$$ 34119682 34236230 33403812 32950715 31795225 30431681 28612613 27351720 26086141 25007689
4524B5007689j133088p91303q67753j042101j138914Q5668k48833k28218m40085
$$ 25007689 23874601 23083298 22215545 21173444 20034530 20120198 19871365 19643147 19203062
4515A9203062L45575m25597q13252l06795K27079k83599j55253J26660L51313
$$ 19203062 19548637 19123040 18309788 18002993 18230072 17946473 17791220 17917880 18269193
4506A8269193N26117N96822k86990N15899M8112J51134M10655M42865O86340J52817
$$ 18269193 18795310 19392132 19105142 19621041 19669153 19820287 20230942 20673807 21360147 21512964
4496B1512964K55535P62864R40842P92778J134595J189998J088611J090081O70536
$$ 21512964 21768499 22531363 23472205 24264983 25399578 26589576 27678187 28768268 29438804
4487B9438804J453508J504812K02731N19428o6086l24983m54147r94379q65947
$$ 29438804 30892312 32397124 32599855 33119283 33053197 32728214 32274067 31279688 30413741
4478C0413741m64663j026898k57996o54005m94319l6400j19946k65654j7869J81838
$$ 30413741 29949078 28922180 28664184 28010179 27515860 27479460 27359514 27093860 27075991 27257829
4468B7257829J185633O83763N84103M76728J182474J554234J071662J503813J981081
$$ 27257829 28443462 29127225 29711328 30188056 31370530 32924764 33996426 35500239 37481320
4459C7481320J857027K319228K378848K184103K430291K137329R80729L33628
$$ 37481320 39338347 41657575 44036423 46220526 48650817 50788146 51768875 52102503
4451E2102503J6236q89959k372607k039381k607192k834611k256674k289081k623607
$$ 52102503 52118739 51228780 48856173 46816792 44209600 41374989 39118315 36829234 34205627
4442C4205627k012087k470962k261320q19516m23249j549349q44123p24372m71796
$$ 34205627 32193540 29722578 27461258 26641742 26218493 24669144 23825021 23100649 22628853
4433B2628853n97436r58409o76803j029993J8889l93969l66488l50897o43398
$$ 22628853 22031417 21073008 20396205 19366212 19385101 18991132 18624644 18273747 17630349
4424A7630349m1050J95173n72499m46661n8390k69927q8331J7998j38098j59837
$$ 17630349 17589299 17784472 17211973 16765312 16706922 16436995 16348664 16366662 16228564 16068727
4414A6068727N33284J78018J58943M3384L24863r5006j07504N13454k35495J36719
$$ 16068727 16602011 16780029 16938972 16982356 17307219 17212213 17104709 17618163 17382668 17519387
4404A7519387N54274M89878K87139M38511Q07831O88662L56449L23170J291949
$$ 17519387 18073661 18563539 18850678 19289189 20097020 20785682 21142131 21465301 22757250
4395B2757250O07250M65941J157990J385466J264382J203921K067868J725075
$$ 22757250 23364500 23830441 24988431 26373897 27638279 28842200 30910068 32635143
4387C2635143K107359K184025J828191K137939J270206N90831J52490o23088q13488
$$ 32635143 34742502 36926527 38754718 40892657 42162863 42753694 42906184 42283096 41469608
4378D1469608j454312k145716k214245k379783k005978j569496k060537j120200
$$ 41469608 40015296 37869580 35655335 33275552 31269574 29700078 27639541 26519341
4370B6519341r23323j270858j026996j408667n05260J18224q07360o60161m80648
$$ 26519341 25596018 24325160 23298164 21889497 21384237 21502461 20695101 20034940 19554292
4361A9554292k36129j3196P8635q63166r0981M4866k40347q8925m47040L43709
$$ 19554292 19318163 19304967 19383602 18520436 18429455 18474321 18233974 18145049 17698009 18041718
4351A8041718k30744k82042O2335j3267J34988M39977O32269M81207k7264L24516
$$ 18041718 17810974 17528932 17591267 17578000 17712988 18152965 18785234 19266441 19239177 19563693
4341A9563693l50666N4309K153O37702J186482o3271L56933j35861O15915L69723
$$ 19563693 19213027 19267336 19269489 19907191 21093673 21030402 21387335 21251474 21867389 22237112
4331B2237112K42334N93162P29658P02782J95991L77920K82739N08582N65006
$$ 22237112 22479446 23072608 23802266 24505048 24701039 25078959 25361698 25870280 26435286
4322B6435286J205668J622634J081102R92819J577096J780715J562276J954212
$$ 26435286 27640954 29263588 30344690 31337509 32914605 34695320 36257596 38211808
4314C8211808K423027L194632L278477L345601L803983N544939N439237M786211
$$ 38211808 40634835 43829467 47107944 50453545 54257528 59802467 65241704 70027915
4306G0027915N011987M184409J935240L46341k676628m399110n325154n273867
$$ 70027915 75039902 79224311 81159551 81505892 78829264 74430154 69105000 63831133
4298F3831133n462730n133967m997497l761762l089775l252486k473213k149882
$$ 63831133 58368403 53234436 48236939 44475177 41385402 38132916 35659703 33509821
4290C3509821j815818k169165j547619j676159j029954p54879o11133p21622m44042
$$ 33509821 31694003 29524838 27977219 26301060 25271106 24516227 23905094 23183472 22739430
4281B2739430j271112r88641j71056j63774l73661n90075j46205p52242n14261
$$ 22739430 21468318 20479677 20308621 20144847 19771186 19181111 19034906 18282664 17768403
4272A7768403n11384n5492j5690r71586m53471N6373m08842r6967K27891l27938
$$ 17768403 17257019 17201527 17185837 16214251 15760780 15817153 15408311 15311344 15539235 15211297
4262A5211297M3900J29893K43508J48360q72153n37030N6870J61267L54038r72679
$$ 15211297 15255197 15385090 15628598 15776958 14904805 14367775 14424645 14585912 14939950 13967271
4252A3967271l45064J79203j90830j67588N1407j89227N21255j76649K06220m0318
$$ 13967271 13622207 13801410 13610580 13442992 13494399 13305172 13826427 13649778 13855998 13815680
4242A3815680n13192o2363J32446N62695k72885l57897K30195n5957o22927j40608
$$ 13815680 13302488 13240125 13372571 13935266 13662381 13304484 13534679 13478722 12855795 12715187
4232A2715187k8051M80652P7889p6266l34529n01362q5848J18811o76593j31927
$$ 12715187 12687136 13167788 13245677 13169411 12834882 12333520 12247672 12366483 11689890 11557963
4222A1557963k748J6766J8195M55390J79415k20542k07725K13012o37530k35760
$$ 11557963 11555215 11571981 11590176 12045566 12224981 12004439 11796714 12009726 11372196 11136436
4212A1136436P51233L81280L60403q1817J51397M24728k94813l80798L67811N990
$$ 11136436 11887669 12268949 12629352 12547535 12698932 13123660 12828847 12448049 12815860 12821850
4202A2821850N6263N835J38789k28069p6371N04746J11480m25123M75564J21461
$$ 12821850 12878113 12883948 13022737 12794668 12718297 13223043 13334523 12909400 13384964 13506425
4192A3506425J45736K30767L78789m92181j26311L05430J73966L35254N53831
$$ 13506425 13652161 13882928 14261717 13769536 13643225 13948655 14122621 14457875 15011706
4183A5011706j72929k5273n8678n47315P93035k26148J60410P09950O01749J32368
$$ 15011706 14838777 14813504 14754826 14207511 15000546 14774398 14934808 15644758 16246507 16378875
4173A6378875M2440N17923l88097K55617K97455j92562m5134P87077P36866K12983
$$ 16378875 16421315 16939238 16551141 16806758 17104213 16911651 16866517 17653594 18390460 18603443
4163A8603443L32310O62261j46753J98089K29630J48263L10755J041877L80308
$$ 18603443 18935753 19598014 19451261 19649350 19878980 20027243 20337998 21379875 21760183
4154B1760183J15093K76855j87424q4214O59395N42692O19429K97922Q6121J88976
$$ 21760183 21875276 22152131 21964707 21880493 22539888 23082580 23702009 23999931 24086052 24275028
4144B4275028M21519M15352L98671P42360L58444M54437J35689K68184M84438
$$ 24275028 24696547 25111899 25510570 26252930 26611374 27065811 27201500 27469684 27954122
4135B7954122N14593K55106P39300M29234R02876P53021j30380N33786R19062
$$ 27954122 28468715 28723821 29463121 29892355 30795231 31548252 31417872 31951658 32870720
4126C2870720J065691P79033P7972J088993O25724O25473Q47110J101317J211585
$$ 32870720 33936411 34715444 34793416 35882409 36508133 37133606 37980716 39082033 40293618
4117D0293618O94046N32307J023765J735308J263734J068244J259760J724868
$$ 40293618 40987664 41519971 42543736 44279044 45542778 46611022 47870782 49595650
4109D9595650J632744O12385R42907J720944J569519J643234J934872J773725
$$ 49595650 51228394 51840779 52783686 54504630 56074149 57717383 59652255 61425980
4101F1425980J692497K221494K251842K279223J927197K399447K652794K697492
$$ 61425980 63118477 65339971 67591813 69871036 71798233 74197680 76850474 79547966
4093G9547966L023878K797966L407220L267550L202221L051625L777647L929702
$$ 79547966 82571844 85369810 88777030 92044580 95246801 98298426 102076073 106005775
4085A06005775L312108M038981L913601M115956M336846M644731N443894M444891
$$ 106005775 109317883 113356864 117270465 121386421 125723267 130367998 135811892 140256783
4077A40256783N081652N255362N184806N935215O329774O247285O295028O043816
$$ 140256783 145338435 150593797 155778603 161713818 168043592 174290877 180585905 186629721
4069A86629721O467209O750130P512537P675484Q631232Q374523R134005R294036
$$ 186629721 193096930 199847060 207359597 215035081 223666313 232040836 241174841 250468877
4061B50468877J0966977J2422962J3796570J5016029J6698388J8493715J8861987
$$ 250468877 261435854 273858816 287655386 302671415 319369803 337863518 356725505
4054C56725505J7793328J4742235J0667827L919834n202061j1743650j6704917
$$ 356725505 374518833 389261068 399928895 403848729 398646668 386903018 370198101
4047C70198101j9504029k0520893j9788788j7718846j6223594j5091308j2519066
$$ 370198101 350694072 330173179 310384391 292665545 276441951 261350643 248831577
4040B48831577j1619367j0217804q955668q119053o973076p545429o449784o100796
$$ 248831577 237212210 226994406 218038738 209919685 202946609 195401180 188951396 182850600
4032A82850600m846028m600588m560566m110876l527175l940547k560115k391052
$$ 182850600 178004572 173403984 168843418 164732542 161205367 157264820 154704705 152313653
4024A52313653k655843k461379j455528j435886j236943j030461j235397r1916
$$ 152313653 149657810 147196431 145740903 144305017 143068074 142037613 140802216 140710300
4016A40710300k14647m69302p6537J52578O47468Q0369P84765J131426J250202
$$ 140710300 140495653 140026351 139949814 140102392 140749860 140830229 141614994 142746420 143996622
4007A43996622J878327J847151J442803K179051J293842K173222K111087K451512
$$ 143996622 145874949 147722100 149164903 151343954 152637796 154811018 156922105 159373617
3999A59373617K354026K643756K656880K967227K560738K644102K902485K862999
$$ 159373617 161727643 164371399 167028279 169995506 172556244 175200346 178102831 180965830
3991A80965830L043747L047762K853161K692929K723064K761936K582971K914695
$$ 180965830 184009577 187057339 189910500 192603429 195326493 198088429 200671400 203586095
3983B03586095K787366K759904K089510K480822K325911K383534K612265K418396
$$ 203586095 206373461 209133365 211222875 213703697 216029608 218413142 221025407 223443803
3975B23443803J996019J954781K246401J779717K606385J677755K229348K358128
$$ 223443803 225439822 227394603 229641004 231420721 234027106 235704861 237934209 240292337
3967B40292337J656336J512063K486045K666729K471469L143514L957609L867701
$$ 240292337 241948673 243460736 245946781 248613510 251084979 254228493 258186102 262053803
3959B62053803L998948M326220N216749O693415Q027701R206404J1007400J3130904
$$ 262053803 266052751 270378971 275595720 282289135 290316836 299523240 310530640 323661544
3951C23661544J4557941J4831334J4286502J2038583Q121903L90116o956952j4024947
$$ 323661544 338219485 353050819 367337321 379375904 387497807 387887923 380930971 366906024
3943C66906024j9480248k2110045k2285461k1329266j9952360j7767093j5980393
$$ 366906024 347425776 325315731 303030270 281701004 261748644 243981551 228001158
3936B28001158j4414466j2584643j1433075j0566675r044095p889466p822824
$$ 228001158 213586692 201002049 189568974 179002299 169958204 162068738 154245914
3929A54245914o687977o749312o135472n509006n491857m918358m371792l798336
$$ 154245914 147557937 140808625 134673153 129164147 123672290 118753932 114382140 110583804
3921A10583804l813645l551409l239848k685343l277435k818542k235094k788057
$$ 110583804 106770159 103218750 99978902 97293559 94016124 91197582 88962488 86174431
3913H6174431j885614k166793j781962k132094k610449j474660j438077j473217
$$ 86174431 84288817 82122024 80340062 78207968 75597519 74122859 72684782 71211565
3905G1211565k043189j981831j292286j753166j457198j432165q06734p19570
$$ 71211565 69168376 67186545 65894259 64141093 62683895 61251730 60444996 59725426
3897E9725426j762591j228169r77100r60343l89959o36117j230835q66846l82615
$$ 59725426 57962835 56734666 55757566 54797223 54407264 53771147 52540312 51673466 51290851
3888E1290851j126109r22642j445n14484m20988l10102j25865n66848q12368k2823
$$ 51290851 50164742 49242100 49240655 48726171 48305183 47995081 47869216 47302368 46490000 46467177
3878D6467177K60372l49662k0682m56035k13716k5317M18726q0675n62835J53403
$$ 46467177 46727549 46377887 46357205 45901170 45687454 45662137 46080863 46000188 45437353 45590756
3868D5590756M09971M17217K52300m10610j49085O47928K03592O14363R11703
$$ 45590756 46000727 46417944 46670244 46259634 46110549 46758477 46962069 47576432 48488135
3859D8488135J73089n3647M73802J019959R64216Q18784J054509N47903R01534
$$ 48488135 48661224 48607577 49081379 50101338 51065554 51884338 52938847 53486750 54388284
3850E4388284J646361J042407J632630J662000J396846J633575J431176J104687
$$ 54388284 56034645 57077052 58709682 60371682 61768528 63402103 64833279 65937966
3842F5937966J250263J706212J785372J668392J538816J423689J283972J399669
$$ 65937966 67188229 68894441 70679813 72348205 73887021 75310710 76594682 77994351
3834G7994351J337241O94743R98476R18818Q58576Q49526L35354M74696N92580
$$ 77994351 79331592 80026335 81024811 81943629 82802205 83651731 83987085 84461781 85054361
3825H5054361L2226k3080K94398p57932l16456j70339r94364n76751N245j88132
$$ 85054361 85086587 85063507 85357905 84599973 84283517 84113178 83118814 82542063 82547308 82359176
3815H2359176q82809p48235k06615o61251k42606l38483r2546j62632j79618m59618
$$ 82359176 81476367 80728132 80521517 79860266 79617660 79279177 79186631 79023999 78844381 78384763
3805G8384763K2267L39460O64235J177865R27933Q97214R40264J429174J664370
$$ 78384763 78407030 78746490 79410725 80588590 81516523 82413737 83354001 84783175 86447545
3796H6447545K225299K272523K321898K878159K511716K737847K638643K625733
$$ 86447545 88672844 90945367 93267265 96145424 98657140 101394987 104033630 106659363
3788A06659363K021273K211644K411779K953664K776934K380864K115748J950169
$$ 106659363 108680636 110892280 113304059 116257723 119034657 121415521 123531269 125481438
3780A25481438K053687K117731J055658J143323O97150N67087L66003j57794p12835
$$ 125481438 127535125 129652856 130708514 131851837 132548987 133116074 133482077 133324283 132611448
3771A32611448j40876j265717r34992j068217j825748q58523j764784j383456
$$ 132611448 132470572 131204855 130269863 129201646 127375898 126517375 124752591 123369135
3763A23369135k545680k567211k307143k029195k674617k072344k757107k523290
$$ 123369135 120823455 118256244 115949101 113919906 111245289 109172945 106415838 103892548
3755A03892548l138125k424792j709452j998431j943926j827420j670009j553343
$$ 103892548 100754423 98329631 96620179 94621748 92677822 90850402 89180393 87627050
3747H7627050j319559p51364p82937r55166j029539m84502J72744m8340K7266
$$ 87627050 86307491 85556127 84773190 83818024 82788485 82303983 82476727 82428387 82455653
3738H2455653O39387N13572K41510P70189K98836K81018Q48817J053200J664061
$$ 82455653 83095040 83608612 83850122 84620311 84919147 85200165 86048982 87102182 88766243
3729H8766243J523470J489467J103201J703722J665923J931347J485571K015936
$$ 88766243 90289713 91779180 92882381 94586103 96252026 98183373 99668944 101684880
3721A01684880K249685J803941K705839K818312K166972K425187L155423L014287
$$ 101684880 103934565 105738506 108444345 111262657 113429629 115854816 119010239 122024526
3713A22024526J974378L306766L033330L006565K911914L378776L184831K969729
$$ 122024526 123998904 127305670 130339000 133345565 136257479 139636255 142821086 145790815
3705A45790815L347074L741063M296016L859487M492248L776774M055587M011339
$$ 145790815 149137889 152878952 157174968 161034455 165526703 169303477 173359064 177370403
3697A77370403L939102M354666M676869L301354L276893M112483L933938L293807
$$ 177370403 181309505 185664171 190341040 193642394 196919287 201031770 204965708 208259515
3689B08259515L703366M014533L715355L997180L306505L493208L882434K767464
$$ 208259515 211962881 215977414 219692769 223689949 226996454 230489662 234372096 237139560
3681B37139560L152002K981096L014922K844246L082623L090175L421365K818662
$$ 237139560 240291562 243272658 246287580 249131826 252214449 255304624 258725989 261544651
3673B61544651L457187L908605L746253M324930M594068M632329N605440N943104
$$ 261544651 265001838 268910443 272656696 276981626 281575694 286208023 291813463 297756567
3665B97756567N872013O237146O541817O687963P254004P954231P571815P742607
$$ 297756567 303628580 309865726 316407543 323095506 330349510 338303741 345875556 353618163
3657C53618163R031393R884430R719685R423211R943484R639579R748497R460939
$$ 353618163 362649556 372533986 382253671 391676882 401620366 411259945 421008442 430469381
3649D30469381R065492R026012Q903398Q343631P794225O240839N498050M930142
$$ 430469381 439534873 448560885 457464283 465807914 473602139 479842978 485341028 490271170
3641D90271170M783345L930578L025062K670964J260804R03467M27902j043297
$$ 490271170 495054515 498985093 502010155 504681119 505941923 506845390 507273292 506229995
3633E06229995j391732j713562l188276l681771n008110m982418n632934n811896
$$ 506229995 504838263 503124701 499936425 496254654 491246544 486264126 480631192 474819296
3625D74819296o053557o248154n930650o494534o395103o687835o331184n836398
$$ 474819296 468765739 462517585 456586935 450092401 443697298 437009463 430678279 424841881
3617D24841881o383810n775818n434576n119398m394745m945799m007459l378510
$$ 424841881 418458071 412682253 407247677 402128279 397733534 392787735 388780276 385401766
3609C85401766k953854l043590k448584j348044p74065r6894j09852N24514P49872
$$ 385401766 382447912 379404322 376955738 375607694 374833629 374736735 374626883 375151397 375901269
3600C75901269Q71216J658670J510381K112624K032910K314317L127322L431088
$$ 375901269 376772485 378431155 379941536 382054160 384087070 386401387 389528709 392959797
3592C92959797L224640L204219L876047L846088M652855M396423L572039L641069
$$ 392959797 396184437 399388656 403264703 407110791 411763646 416160069 419732108 423373177
3584D23373177M071060L637234L899399K856398K392543K195375K574187K477808
$$ 423373177 427444237 431081471 434980870 437837268 440229811 442425186 444999373 447477181
3576D47477181K297269J994915J253745J873609R35928Q99195J114276N52458
$$ 447477181 449774450 451769365 453023110 454896719 455832647 456731842 457846118 458398576
3568D58398576O92935M36525l37220L16788J24261o06582K44730j71441J31573
$$ 458398576 459091511 459528036 459190816 459507604 459631865 459025283 459270013 459098572 459230145
3559D59230145K84428J18695M64886J248687J381561J750560K032324L581562
$$ 459230145 459514573 459633268 460098154 461346841 462728402 464478962 466511286 470092848
3551D70092848L570885M161946N126756M708656M921985N271207M549899L737197
$$ 470092848 473663733 477825679 482952435 487661091 492583076 497854283 502404182 506141379
3543E06141379K847017N94170j117546j812028l284302m498068n563563o841130
$$ 506141379 508988396 509582566 508465020 506652992 503368690 498870622 493307059 486465929
3535D86465929p313901p415806p860410q527274q615186r562707r873328j1152436
$$ 486465929 479152028 471736222 463875812 455348538 446733352 437170645 427297317 416144881
3527D16144881j2604275j3927382j4106424j5255432j6338261j6278493j5597062
$$ 416144881 403540606 389613224 375506800 360251368 343913107 327634614 312037552
3520C12037552j4757465j4594224j3541084j2313080j1589530j0579535r795727
$$ 312037552 297280087 282685863 269144779 256831699 245242169 234662634 224866907
3513B24866907r264422q224904p976502p383209n837050n532003n724666n786927
$$ 224866907 215602485 207377581 199401079 192017870 186180820 180648817 174924151 169137224
3505A69137224m535539m673538m719344l871265l539060m076716l942098l875159
$$ 169137224 164601685 159928147 155208803 151337538 147798478 143721762 139779664 135904505
3497A35904505l303444l666509l344737l311034l590050l322924k920218k885131
$$ 135904505 132601061 128934552 125589815 122278781 118688731 115365807 112445589 109560458
3489A09560458l618216k673281k674070k290118k548723k188062k614996k454087
$$ 109560458 105942242 103268961 100594891 98304773 95756050 93567988 90952992 88498905
3481H8498905k731449k570417k138049k112109j940485k172225j929381j460254
$$ 88498905 85767456 83197039 81058990 78946881 77006396 74834171 72904790 71444536
3473G1444536j956735k374961k379353j145940j315467j366842j366053j077205
$$ 71444536 69487801 67112840 64733487 63587547 62272080 60905238 59539185 58461980
3465E8461980j795017j396560q00746j045518j478409r75059r08968j011544m10288
$$ 58461980 56666963 55270403 54469657 53424139 51945730 50970671 50061703 49050159 48639871
3456D8639871q16664q76268p68160n64715j020587j055979l29828o20822m26659
$$ 48639871 47823207 46946939 46178779 45614064 44593477 43537498 43207670 42586848 42160189
3447D2160189n34949j086111o09028K15926m84025j207740j66202l7397j55026
$$ 42160189 41625240 40539129 39930101 40146027 39662002 38454262 38288060 38250663 38095637
3438C8095637j57218o87830j132866k26323m98386j58650p85973m46405l84216
$$ 38095637 37938419 37250589 36117723 35891400 35393014 35234364 34448391 34001986 33617770
3429C3617770n83115n59057n92842n29655m61250q65126l51410r53603k10804
$$ 33617770 33034655 32475598 31882756 31353101 30891851 30026725 29675315 28721712 28510908
3420B8510908J98232o63620q03576p81556J23200l78435j087537M6770k01751
$$ 28510908 28709140 28045520 27241944 26460388 26583588 26205153 25117616 25164386 24962635
3411B4962635r65267K6155k53462n72798p44494j44149j2146k41846l41991k4735
$$ 24962635 23997368 24023523 23770061 23197263 22452769 22308620 22296474 22054628 21712637 21687902
3401B1687902J83179m88833k3588n64495n55710k84714q0577n57402k84889k47528
$$ 21687902 21871081 21382248 21358660 20794165 20238455 19953741 19873164 19315762 19030873 18783345
3391A8783345j30261l78731M45866J7180k61756m32852n45548l85403J30225L79943
$$ 18783345 18653084 18274353 18720219 18737399 18475643 18042791 17497243 17111840 17242065 17622008
3381A7622008k16291j40102n39994n70187K00247M109M1750n82826m13178M59425
$$ 17622008 17405717 17265615 16725621 16155434 16355681 16359790 16401540 15818714 15405536 15864961
3371A5864961l93898O2985O99034o56055m63169l47806K04424O38182m98864r9070
$$ 15864961 15471063 15534048 16233082 15577027 15113858 14766052 14970476 15608658 15109794 15010724
3361A5010724j68861j85574l86220J64471K63400l81612J79742O55616m85033
$$ 15010724 14841863 14656289 14270069 14434540 14697940 14316328 14496070 15151686 14666653
3352A4666653j18354k51484j91950k2960O5445j69900Q013m37606m93343k81273
$$ 14666653 14548299 14296815 14104865 14081905 14147350 13977450 13985463 13547857 13054514 12773241
3342A2773241M67055L93227k87350j20362m95081l50621P1757k18606L02019m1424
$$ 12773241 13240296 13633523 13346173 13225811 12730730 12380109 12451866 12233260 12535279 12493855
3332A2493855j6243L8590Q657n40725n7145q8512K94044m36275l15924J83154
$$ 12493855 12477612 12516202 12524859 11984134 11926989 11838477 12132521 11696246 11380322 11563476
3322A1563476k13602L09806k07484m81504q128k17526P8644R2482P3266j38324
$$ 11563476 11349874 11659680 11452196 10970692 10962564 10745038 10823682 10916164 10989430 10851106
3312A0851106j33307j01295K84640N3193n78825l12842n9244L83694j20251l25215
$$ 10851106 10717799 10616504 10901144 10954337 10375512 10062670 10003426 10387120 10266869 9941654
3302I941654q8637j18431L60920q0897J53396K26042J5353R1013o18103r5601
$$ 9941654 9853017 9734586 10095506 10014609 10168005 10394047 10409400 10500413 9882310 9786709
3292I786709J01857J81765L0354J06813O088J23638k67608l10072j49184J60714
$$ 9786709 9888566 10070331 10100685 10207498 10213586 10337224 10069616 9759544 9610360 9771074
3282I771074k14908L82346M31571k87646k64451k80086O62170O2060j22758J85710
$$ 9771074 9556166 9938512 10370083 10082437 9817986 9537900 10200070 10262130 10139372 10325082
3272A0325082l18745n68729K40417O05453j66547j77911j85189J5983P7927K41113
$$ 10325082 10006337 9437608 9678025 10283478 10116931 9939020 9753831 9769814 9847741 10088854
3262A0088854M37423L62088k24501P4127K10985L75226n1656P0094J30420m3109
$$ 10088854 10526277 10888365 10663864 10737991 10948976 11324202 11272546 11342640 11473060 11429951
3252A1429951k88249k34167L52688K67797m80625m16749R2342j07886K18931J35061
$$ 11429951 11141702 10907535 11260223 11528020 11047395 10630646 10722988 10615102 10834033 10969094
3242A0969094k65429l0014r1872k2985j09094K9254l23331l15974l19571o63035
$$ 10969094 10703665 10673651 10581779 10558794 10449700 10478954 10155623 9839649 9520078 8857043
3232H857043O95920Q2275j30435L00934n21082J10102K63102J75700j28621n7068
$$ 8857043 9552963 9635238 9504803 9805737 9284655 9394757 9657859 9833559 9704938 9647870
3222I647870J24684J00174m64488m9374k89836o2182p29438q37075p4698j51828
$$ 9647870 9772554 9872728 9408240 9358866 9069030 9006848 8277410 7440335 7365637 7213809
3212G213809j39362q0204L2639j90814m17229R8934l6951m55042N23873l01192
$$ 7213809 7074447 6994243 7026882 6836068 6418839 6517773 6480822 6025780 6549653 6248461
3202F248461N0095P68899j35087m25760N1620L50302p7338j35720p6527R9544
$$ 6248461 6298556 7067455 6932368 6506608 6558228 6908530 6831192 6695472 6618945 6718489
3192F718489m40729l49662K26761k68515K43747k83108j70563J6223o8366k91215
$$ 6718489 6277760 5928098 6154859 5886344 6130091 5846983 5676420 5692643 5624277 5333062
3182E333062J06906L04837j37893k10137m71121K38670q8700o06643O9548m29457
$$ 5333062 5439968 5744805 5606912 5396775 4925654 5164324 5075624 4468981 4538529 4109072
3172D109072j02243j7500L3088J02383O7148M41480R2063j08643L6729l8600k79873
$$ 4109072 4006829 3989329 4022417 4124800 4191948 4633428 4725491 4616848 4653577 4614977 4335104
3161D335104k31923M25750K63706m4953J8758m91590k95327m1878j35779K6082
$$ 4335104 4103181 4528931 4792637 4747684 4766442 4274852 3979525 3937647 3801868 3827950
3151C827950o4092L4301k70292L89502J32495p76007l92450M7560R37524N82976
$$ 3827950 3763858 3798159 3527867 3917369 4049864 3273857 2881407 2928967 3866491 4449467
3141D449467p44029k61840J0239j30848J21290j58754k90281K46105J11186L20152
$$ 4449467 3705438 3443598 3453837 3322989 3444279 3285525 2995244 3241349 3352535 3672687
3131C672687K38189k73238l79866n5500m03722L50475R8073m88891k42970j07813
$$ 3672687 3910876 3637638 3257772 3202272 2798550 3149025 3247098 2758207 2515237 2407424
3121B407424N1008P3110K89871L36240l23507o7334N87295k38729j34445K90800
$$ 2407424 2458432 2531542 2821413 3157653 2834146 2766812 3354107 3115378 2980933 3271733
3111C271733n53214j79949N66246K79719L53612j68032j33423l54616L64583J40379
$$ 3271733 2718519 2538570 3104816 3384535 3738147 3570115 3436692 3082076 3446659 3587038
3101C587038k80944n02016q3912R4890k36458k57249K60518L82074J07896K5021
$$ 3587038 3306094 2804078 2720166 2815056 2578598 2321349 2581867 2963941 3071837 3096858
3091C096858j33990j31129R61269r4811o06848J81710m95153n72919O38364k75236
$$ 3096858 2962868 2831739 3793008 3698197 3091349 3273059 2777906 2204987 2843351 2568115
3081B568115k11076j7050J24675J19354N37778k17765J43975k08392m51700K89316
$$ 2568115 2357039 2339989 2464664 2584018 3121796 2904031 3048006 2839614 2387914 2677230
3071B677230l10259J55416K17960l71858p0165k75724J63436K6894r2524l38589
$$ 2677230 2366971 2522387 2740347 2368489 2298324 2022600 2186036 2212930 2120406 1781817
3061A781817J83230N84276m54271k13802j88879Q06630K0900l4473m3640j21189
$$ 1781817 1965047 2549323 2095052 1881250 1692371 2499001 2519901 2485428 2441788 2320599
3051B320599j43830Q6947Q1461J53504n9590r1048n21309N48290k92753P6164
$$ 2320599 2176769 2263716 2345177 2498681 2439091 2348043 1826734 2375024 2082271 2158435
3041B158435M73155K46914m26119L0079j26323k89895l02523R1988K35575j89607
$$ 2158435 2631590 2878504 2452385 2482464 2356141 2066246 1763723 1855711 2091286 1901679
3031A901679l9857n1736p5121j94151L03699Q7751k80103M21450K8558k62706
$$ 1901679 1861822 1810086 1734965 1540814 1844513 1932264 1652161 2073611 2102169 1839463
3021A839463M56920J08658J53558l75293k43795K48949j02657j63752k64504K01240
$$ 1839463 2296383 2405041 2558599 2183306 1939511 2188460 2085803 1922051 1657547 1858787
3011A858787M15399k17369m4615M02994q5672l78759k73875j26824L89096Q6119
$$ 1858787 2274186 2056817 2012202 2415196 2329524 1950765 1676890 1550066 1939162 2025281
3001B025281j22979r0956M80850j50786p9037m55338k91767O97811O7557o5698
$$ 2025281 1902302 1811346 2292196 2141410 2062373 1607035 1315268 2013079 2080636 2014938
2991B014938J96942K87204p03414l62276K83789k24510K66531L75867n34907R6014
$$ 2014938 2211880 2499084 1795670 1433394 1717183 1492673 1759204 2135071 1600164 1696178
2981A696178m84953o18322N70844N21664n0546k04590N47475k00520j42755K81518
$$ 1696178 1211225 592903 1163747 1685411 1634865 1430275 1977750 1777230 1634475 1915993
2971A915993o7088j73154j51861o6071j52278j09142L09666K22606o40951k0388
$$ 1915993 1848905 1675751 1523890 1457819 1305541 1196399 1506065 1728671 1087720 1067332
2961A067332L82623k02801K28207K54098J52377k80038Q281J19348l04730j71947
$$ 1067332 1449955 1247154 1475361 1729459 1881836 1601798 1610079 1729427 1424697 1252750
2951A252750K71844r3040m5484l70046K02189M91731j63261l84511L41023k57554
$$ 1252750 1524594 1431554 1386070 1016024 1218213 1709944 1546683 1162172 1503195 1245641
2941A245641l07059J39695M36371M775Q5645K79515m30312r078J44699r6535J86514
$$ 1245641 938582 1078277 1514648 1519423 1605068 1884583 1454271 1445193 1589892 1493357 1679871
2930A679871J3094J8868m35144J42457L28994k54637L19702k43069k44643L47086
$$ 1679871 1692965 1711833 1276689 1419146 1748140 1493503 1813205 1570136 1325493 1672579
2920A672579l4283J6260J19960n9388N8133p9328k38153r5232l63141o16520O96898
$$ 1672579 1638296 1654556 1774516 1715128 1773261 1693933 1455780 1360548 997407 380887 1077785
2909A077785L64102L49167k63504l49593K99186L39010M23127l89362q63101l1503
$$ 1077785 1441887 1791054 1527550 1177957 1477143 1816153 2239280 1849918 986817 955314
2899I55314J70891J9110J11259K44391L43116k48937K998k59506k25464j21079
$$ 955314 1126205 1145315 1256574 1500965 1844081 1595144 1598142 1338636 1113172 992093
2889I92093K73902J27789m39731m72040O3476M16113j93162P96577M35506p15962
$$ 992093 1265995 1393784 954053 482013 545489 961602 768440 1565017 2000523 1284561
2879A284561m10749L5138P24330n93973K4299J28888j07779K73665m96748k03960
$$ 1284561 873812 908950 1633280 1039307 1063606 1192494 1084715 1358380 861632 657672
2869F57672J56267M01821k27219m1889j02112L72577j11352M7106k95401K28207
$$ 657672 813939 1215760 988541 946652 844540 1217117 1105765 1152871 857470 1085677
2859A085677J88334n48045P7601M86464K18591L9300n4896M4872O11675k75453
$$ 1085677 1274011 725966 803567 1290031 1508622 1547922 1493026 1537898 2149573 1874120
2849A874120n42358o07998l09778N10390M75842j19865L97274r4427l53598k14305
$$ 1874120 1331762 723764 413986 924376 1400218 1280353 1677627 1583200 1229602 1015297
2839A015297Q1175K02029o1235j54122R8636n3145o3678M21850k35041k35447
$$ 1015297 1096472 1298501 1237266 1083144 1181780 1128635 1064957 1486807 1251766 1016319
2829A016319J20710m81857J2714L13305L72084M25809o61648k44945j12607L34021
$$ 1016319 1137029 655172 667886 981191 1353275 1779084 1117436 872491 759884 1093905
2819A093905p5656L68334m7439n70089N22613K69848l67985J47349l82571N9496
$$ 1093905 1018249 1386583 1339144 769055 1291668 1561516 1193531 1340880 958309 1017805
2809A017805K270K41797K1206R448o8790m979l35504n25056L6790M726r8001N09857
$$ 1017805 1020075 1261872 1283078 1292526 1223736 1218757 883253 358197 394987 399713 301712 811569
2797H11569o4002j13356l61827N33435Q3391j31035L02817Q9976m46729o49246
$$ 811569 747567 634211 272384 805819 889210 758175 1060992 1150968 704239 54993
2787E4993j1951J07698P24042l20250N37256j18727r45394L44944P7604J2838
$$ 54993 43042 150740 874782 554532 1091788 973061 27667 372611 450215 463053
2777D63053J31349j85474K56614l17516j08947K25362P1661q3525m98807K57271
$$ 463053 594402 408928 665542 348026 239079 464441 536102 452577 -46230 211041
2767B11041P65472p6896m0965l84805J33261n21634n091M53090M09691j13017
$$ 211041 976513 899617 858652 473847 607108 85474 80383 533473 943164 830147
2757H30147J00381n4881K62026r68186m55247l31469P14915K05637L1049l3961
$$ 830147 930528 875647 1137673 169487 -285760 -617229 97686 303323 334372 300411
2747C00411N1835j60225k68332K38023l8100Q78878p35732P6958L41427k05257
$$ 300411 352246 192021 -76311 161712 123612 1002490 266758 343716 685143 479886
2737D79886J404j58204K84673L1819k67129J04423M26949R1538P3243j12124L1281
$$ 479886 481290 323086 607759 639578 372449 476872 903821 995359 1068602 956478 987759
2726I87759J1225K1615k31710k38042n26117P8395M17691l23453N61321P4169
$$ 987759 998984 1020599 788889 550847 24730 103125 520816 197363 758684 832853
2716H32853l55705l80643K89063K2570N81369r0450l47278k24820j53352K99016
$$ 832853 477148 96505 385568 408138 989507 899057 551779 326959 173607 472623
2706D72623j9625j758J01350l7931J43421j78595k16009L40016k81465Q9247M88872
$$ 472623 452998 451240 552590 514659 658080 479485 263476 603492 322027 411274 900146
2695I00146k52126P9225j14505L83297j08765J0978J38959n0196P0075o33519
$$ 900146 648020 727245 612740 996037 887272 898250 1037209 987013 1057088 423569
2685D23569q4766j32905M74901l86426l99570L78918M8060P30409j25825m0964
$$ 423569 338803 205898 680799 294373 -105197 273721 321781 1052190 926365 885401
2675H85401k37951o10558J57685k83358L99765J36422k12866l00881J45421N40660
$$ 885401 647450 36892 194577 -88781 310984 447406 234540 -66341 79080 619740
2665F19740q6506J86015K92327J01185n94757J10444J37699n07611J763K0802
$$ 619740 533234 719249 1011576 1112761 518004 628448 766147 258536 260299 281101
2655B81101J76616n8299l48125L60810J0683l78996m6155K72298J0200M5907J27303
$$ 281101 457717 399418 51293 412103 422786 43790 -2365 269933 280133 326040 453343
2644D53343L15415L30743J93252j41291j028355M5662L41215J75457L43855m50867
$$ 453343 768758 1099501 1292753 1151462 123107 168769 509984 685441 1029296 578429
2634E78429m18988p1425n7829L46590j34137k17361K92827J28378N80819l16937
$$ 578429 159441 88016 30187 376777 242640 25279 318106 446484 1027303 710366
2624G10366l05350j92899j02209K29339p4030j88991O65428R2681J5816p33631
$$ 710366 405016 212117 109908 339247 265217 76226 741654 834335 850151 116520
2614A16520j23529M98132j79921j80004J13362q6874j32438M11787o3048o4221
$$ 116520 -7009 491123 311202 131198 244560 157686 25248 437035 373987 309766
2604C09766k95834M45901L04718m70534k36697M60833M22998m38958j30887l67600
$$ 309766 13932 459833 764551 294017 57320 518153 941151 502193 371306 3706
2594C706m51788J16546J91350K20290K33201M04947j28408J78228l22681K88257
$$ 3706 -448082 -331536 -140186 80104 313305 718252 589844 768072 445391 733648
2584G33648p46154J61501Q5271N18501k96126J59142r1580j37841J85044l74258
$$ 733648 -12506 148995 234266 752767 456641 615783 524203 386362 571406 197148
2574A97148N11340n83810J64804J77784K19983L4085J99483n17184L06550j25564
$$ 197148 708488 124678 289482 467266 687249 721334 920817 403633 710183 584619
2564E84619j60911P6351j12049o1490K81400k5838o94133K01052J53810m19521
$$ 584619 423708 500059 388010 326520 607920 582082 -112051 89001 242811 -176710
2554a76710K34920j96470M24301n9197P0625M72988K18669l17205n51077N80185
$$ -176710 58210 -138260 286041 226844 297469 770457 989126 671921 120844 701029
2544G01029j06897o67010M70739k91992j57945O65370Q810L56098o55419r0975
$$ 701029 594132 -72878 397861 105869 -52076 613294 622104 978202 322783 231808
2534B31808j59940J21756L73879N427k07018J13136L85482k7656k18327o32442
$$ 231808 71868 193624 567503 572930 365912 479048 864530 836874 618547 -13895
2524a3895K75659M01034J3277J43868l01261K19524m37251j79069L05488k39057
$$ -13895 261764 662798 676075 819943 518682 738206 300955 121886 427374 188317
2514A88317J69523n3875M1978l52113j26897N97468k30012K77503J26798j65194
$$ 188317 357840 303965 345943 -6170 -133067 464401 234389 511892 638690 473496
2504D73496l16144l9608j08748J60123l06494L3347m6838k51627L98917L22423
$$ 473496 157352 117744 8996 169119 -137375 -104028 -150866 -402493 -3576 318847
2494C18847J38030o7448k70332p9933n0522K14764k28829N03511M27397m76675
$$ 318847 456877 389429 119097 39164 -11358 203406 -25423 478088 905485 428810
2484D28810J07108L30220k82710j39948l00929l81760P06066P2687o46879r1454
$$ 428810 535918 866138 583428 443480 142551 -239209 466857 539544 -107335 -198789
2474a98789L27954m93318K48383J27634m8838K04106J51443K90883L82563m84282
$$ -198789 129165 -364153 -115770 11864 -36974 167132 318575 609458 992021 507739
2464E07739L66064M8499K10176j81865j307108M56705L68260l75921K5881J37308
$$ 507739 873803 922302 1132478 950613 -356495 100210 468470 92549 118430 255738
2454B55738P4140k93801j43220J6028L67320N95837N0338m82990l54766L24060
$$ 255738 329878 36077 -107143 -91115 276205 872042 922380 439390 84624 408684
2444D08684J64638o04613n091M89235k63255P68q3836J60017j28740j11224L72506
$$ 408684 573322 -31291 -36382 452853 189598 190366 106530 266547 137807 26583 399089
2433C99089m11497j24484M94452J74572l338l62207m60938K12090J84960J27729
$$ 399089 -12408 -136892 357560 532132 528794 166587 -294351 -82261 102699 230428
2423B30428N50193J45693l52721K67145o19199l5578L08064M68028l20285l30554
$$ 230428 780621 926314 573593 840738 221539 185961 494025 962053 641768 311214
2413C11214k23994J26845N86260k45862l36006k71784L59315j0026k44657M53701
$$ 311214 87220 214065 800325 554463 218457 -53327 305988 295962 51305 505006
2403E05006L30619j1374k27467n02809J59980M89775M2935n18486l4418N41265
$$ 505006 835625 824251 596784 93975 253955 743730 786665 268179 233761 775026
2393G75026J3349m41609O0980M11464k08777K26385l3262l79601k2517Q81514
$$ 775026 788375 346766 407746 819210 610433 836818 803556 423955 401438 1282952
2383A282952m17752r1699k33145M1274O14284L2531J80723k10910N77465n44732
$$ 1282952 865200 773501 540356 581630 1195914 1228445 1409168 1198258 1775723 1230991
2373A230991K68115K76177j59612l1343J18521Q1368L03083o72287o1751k01711
$$ 1230991 1499106 1775283 1615671 1584328 1702849 1784217 2087300 1415013 1353262 1151551
2363A151551j33573k68787m0257k1352L96545M55164n80992r3670M14678K60991
$$ 1151551 1017978 749191 708934 687582 1084127 1539291 958299 864629 1279307 1540298
2353A540298k26141m78406O14J85940n07335j90172M50285K28436k3789l76362
$$ 1540298 1314157 835751 836365 1022305 514970 324798 775083 1003519 979730 603368
2343F03368k51469p649O98791L12772k21028j54487l70398J09904m30307J2957
$$ 603368 351899 344250 1043041 1355813 1134785 980298 609900 719804 289497 302454
2333C02454L2959K14137m5844R1063L2009o03384J7556R04015k78193j48637J4783
$$ 302454 335413 549550 503706 594769 626778 23394 40950 944965 666772 518135 532918
2322E32918o0867J05047K14236O3371k43616L70205K3965O259M9539K54407P4695
$$ 532918 472051 577098 791334 854705 611089 981294 1005259 1011518 1061057 1315464 1390159
2311A390159l51021k03482N1727L00202j49923l22665p2970L00992J85936j36972
$$ 1390159 1039138 835656 887383 1187585 1037662 714997 642027 943019 1128955 991983
2301I91983K3443l1891j99253R06075o3820j79705r5608P1093L80655o3055l57383
$$ 991983 1015426 983535 784282 1690357 1626537 1446832 1351224 1422317 1802972 1739917 1382534
2290A382534k01320l4107j32219J73561K24651R2263R1899k33325j84099K26321
$$ 1382534 1181214 1147107 1014888 1188449 1413100 1505363 1597262 1363937 1179838 1406159
2280A406159m203m7968J01311j66102J48458k45879m84124N25966k02753J49870
$$ 1406159 1401956 1353988 1455299 1289197 1437655 1191776 707652 1233618 1030865 1180735
2270A180735M46915N3024k16473J37599R7930l1084L25350L30522o49006n40314
$$ 1180735 1627650 1680674 1464201 1601800 1699730 1668646 1993996 2324518 1675512 1135198
2260A135198K85952L4158k60618j56581J78332M28440j68510L29816M2786m99893
$$ 1135198 1421150 1455308 1194690 1038109 1216441 1644881 1476371 1806187 1848973 1349080
2250A349080K11264Q0724k50631M97934l82778J37745K89384j1657J15831J37739
$$ 1349080 1560344 1641068 1390437 1888371 1505593 1643338 1932722 1921065 2036896 2174635
2240B174635K45575J12743l8012J06499N2936m03583L9740j1292l88449O40781
$$ 2174635 2420210 2532953 2494941 2601440 2654376 2250793 2290533 2279241 1890792 2531573
2230B531573J74062j26076k31217L80716Q4129j0213J59037j39068J13083L1314
$$ 2531573 2705635 2579559 2348342 2729058 2813187 2802974 2962011 2822943 2936026 2967340
2220B967340M8371q9173J90323l4978O3345m05126j11455O03312j37168Q753J19183
$$ 2967340 3015711 2926538 3116861 3081883 3145228 2740102 2628647 3231959 3094791 3103544 3222727
2209C222727Q2108N77183m18445o1886J21089R8713J39316K81570L15554q5721
$$ 3222727 3304835 3882018 3463573 3401687 3522776 3621489 3760805 4042375 4357929 4272208
2199D272208R0778O98334j15376K38998k24873K69057K5763l6239k23562M96590
$$ 4272208 4362986 5061320 4945944 5184942 4960069 5229126 5254889 5218650 4995088 5491678
2189E491678J17408j96123N54592L24729p9073J05573j38707K46534O80477J11741
$$ 5491678 5609086 5412963 5967555 6292284 6213211 6318784 6180077 6426611 7107088 7218829
2179G218829J7613O7795j93128l77790J78766N90913K11218J52576K35609M34507
$$ 7218829 7236442 7304237 7111109 6733319 6912085 7502998 7714216 7866792 8102401 8536908
2169H536908J92311L15132J37477L77463O88537n51081K61518J02491N62104P97300
$$ 8536908 8729219 9044351 9181828 9559291 10247828 9696747 9958265 10060756 10622860 11420160
2159A1420160L25722J6414N72882O07972O50553J28174J24201P95388M48789M75444
$$ 11420160 11745882 11762296 12335178 12943150 13593703 13721877 13846078 14641466 15090255 15565699
2149A5565699K90173N3569P09831M07143K49228J122348O28853N55655M52744
$$ 15565699 15855872 15909441 16619272 17026415 17275643 18397991 19026844 19582499 20035243
2140B0035243N69229J226323K31855M16433J061850R77842N18267J115526J414681
$$ 20035243 20604472 21830795 22062650 22479083 23540933 24518775 25037042 26152568 27567249
2131B7567249P59046J229503J442677K048027J865592J856205K113415K628918
$$ 27567249 28326295 29555798 30998475 33046502 34912094 36768299 38881714 41510632
2123D1510632K587199K307381L498905L461493L273163M057657M292361M538652
$$ 41510632 44097831 46405212 49904117 53365610 56638773 60696430 64988791 69527443
2115F9527443N255327N620927N568857P133680Q981878J1078804J3754217J6055505
$$ 69527443 74782770 80403697 85972554 93106234 102088112 113166916 126921133 142976638
2107A42976638J7806187J8718048J7944355J4053311P259285j465004j0223293
$$ 142976638 160782825 179500873 197445228 211498539 218757824 217292820 207069527
2100B07069527j6616395j8845903j9513139j7670774j5623800j2191406j1014085
$$ 207069527 190453132 171607229 152094090 134423316 118799516 106608110 95594025
2093I5594025q906984p748587o475517n590944m265655m001880m128661l471723
$$ 95594025 86687041 78938454 72462937 66871993 62606338 58604458 54475797 51004074
2085E1004074l780634l022981l415964k425664k548291k142056j296947j689238
$$ 51004074 47223440 44200459 40784495 38358831 35810540 33668484 32371537 30682299
2077C0682299j241570r98204k237851q99101q32670p36293r92520l10276j025170
$$ 30682299 29440729 28442525 26204674 25305573 24472903 23736610 22744090 22433814 21408644
2068B1408644q89537p73295j360998j74656j033203r54804l28093q06104m99229
$$ 21408644 20519107 19745812 18384814 18210158 17176955 16222151 15894058 15087954 14588725
2059A4588725n61188M4763n47855l68743l81744l08228q35146k04712N9095m65806
$$ 14588725 14027537 14072300 13524445 13155702 12773958 12465730 11630584 11425872 11484967 11019161
2049A1019161n20447o81964j06335K53629L01299k92140q09764l58684J53621
$$ 11019161 10498714 9816750 9710415 9964044 10265343 9973203 9163439 8804755 8958376
2040H958376l30204j09250l48474Q6656n15552N8507m22952m54356j68619j7631
$$ 8958376 8628172 8518922 8170448 8257104 7741552 7800059 7377107 6922751 6754132 6736501
2030F736501M2421J50960m42125l93373n70670K06151R5320j95193K36439k58448
$$ 6736501 6778922 6929882 6487757 6094384 5523714 5729865 5825185 5629992 5866431 5607983
2020E607983j34017l16243M8903q4776m7989j71749m46454m29600o80236K96566
$$ 5607983 5473966 5157723 5206626 5121850 5073861 4902112 4455658 4026058 3345822 3642388
2010C642388M75181J01968l83874j7432j87472j54280N37490n72815m59322J68382
$$ 3642388 4117569 4219537 3835663 3818231 3630759 3476479 4013969 3441154 2981832 3150214
2000C150214J61643j84336n2776J12824m023j03138l19425j8083K56956l33878
$$ 3150214 3311857 3127521 3074745 3187569 3183546 3080408 2760983 2742900 2999856 2665978
1990B665978J01757J12920J06981j44745k5636Q0252j54193j79867K25856R074
$$ 2665978 2767735 2880655 2987636 2842891 2817255 2897507 2743314 2563447 2789303 2798377
1980B798377k11091m99041J65086L88742k59877k38205n0541K2243n39299L3483
$$ 2798377 2587286 2088245 2253331 2642073 2382196 2143991 2093450 2115693 1576394 1609877
1970A609877J12705m073K3698K27067j68620J21143j01602j12492L51151o39553
$$ 1609877 1722582 1718509 1742207 1969274 1800654 1921797 1820195 1707703 2058854 1419301
1960A419301j30368P6847J81033L00053p0275J28603q4252o31254J61363K225
$$ 1419301 1288933 1365780 1546813 1846866 1776591 1905194 1820942 1189688 1351051 1353276
1950A353276O9964j40239J22856R3671k92757M667q8436k81113k056K13935J6450
$$ 1353276 1423240 1283001 1405857 1499528 1206771 1211438 1123002 841889 839833 1053768 1070218
1939A070218m29225k01809K85033L01095K81279N2469l26825l18169q5100L12703
$$ 1070218 640993 439184 724217 1025312 1306591 1359060 1032235 714066 628966 941669
1929I41669P6012k66893R374K85409K76057o35869K6609J37531M51648Q2459J77679
$$ 941669 1017681 750788 760162 1045571 1321628 685759 712368 849899 1301547 1384006 1561685
1918A561685R0458m99789m50320k37108K7479j89813K53073j73168n03011N42829
$$ 1561685 1652143 1152354 702034 464926 492405 302592 555665 382497 -120514 422315
1908D22315R4323J08403K75953k18072p3968K80789k39990J47282O23509j62389
$$ 422315 516638 625041 900994 682922 608954 889743 649753 797035 1420544 1258155
1898A258155l97507m87648K13810j37328j35604K28023K65025o51798J4184N84105
$$ 1258155 860648 373000 586810 449482 313878 541901 806926 155128 169312 753417
1888G53417P1321k36747l91933L78460J92802J22556P8738J18211m07586j39569
$$ 753417 824738 587991 196058 574518 767320 889876 968614 1086825 679239 539670
1878E39670j39906J79046J54360K08590m41837l0475K95047n44516k70608J45815
$$ 539670 399764 578810 733170 941760 499923 469448 764495 219979 -50629 95186
1868I5186L42358r8355N34971K79541l64576J20395n50335k80173K54297K15696
$$ 95186 437544 339189 874160 1153701 789125 909520 359185 79012 333309 549005
1858E49005P1183J1220L32390L9341O59065j85993r84741Q7474p3924L2333L38052
$$ 549005 620188 631408 963798 1003139 1662204 1476211 491470 578944 505020 537353 875405
1847H75405l012K50461j24471j846j8889K78772j56717J92321q1856J50148O04659
$$ 875405 872393 1122854 998383 996537 977648 1256420 1099703 1292024 1210168 1360316 1964975
1836A964975m93118J48959K4231j72241l8634J09111k1709l85209l09881n33445
$$ 1964975 1471857 1620816 1645047 1472806 1434172 1543283 1521574 1136365 826484 293039
1826B93039J00384L63210j02940n850j98343L72348Q7857k04283k86840l78912
$$ 293039 393423 756633 653693 647843 449500 821848 909705 705422 418582 39670
1816C9670j62648L69005N37931l80572o68003k29688N12375M89272M89179n12973
$$ 39670 -122978 246027 783958 403386 -264617 -494305 18070 507342 996521 483548
1806D83548k13236K69418J46590l17968r4344m4576O3766j93994l02760l949L40082
$$ 483548 270312 539730 686320 368352 274008 229432 293198 99204 -203556 -207505 132577
1795A32577j3441J94864m91641j31795L02646j40922J89522k54309j83166q4179
$$ 132577 119136 314000 -177641 -309436 -6790 -147712 41810 -212499 -395665 -479844
1785d79844J29737L49457L06713o01545O05890N40738k85740n39077j6854K19771
$$ -479844 -350107 -650 306063 -295482 310408 851146 565406 26329 9475 229246
1775B29246l19234j41125N92521L74424p3293j36732k53965K21267J75217q0972
$$ 229246 -89988 -231113 361408 735832 662539 525807 271842 493109 668326 587354
1765E87354j63101k1116K1401q3285M83236k55876k78612L1716l88181J95638
$$ 587354 424253 403137 424538 341253 824489 568613 290001 321717 -66464 129174
1755A29174J08926m03885O17183k13615m51795L10890l21673j10669M17298M8890
$$ 129174 238100 -165785 451398 237783 -214012 96878 -224795 -335464 81834 130724
1745A30724O37371j94910p33789o3451L32065M28854k69884k12436j41234J57900
$$ 130724 768095 573185 -160604 -224055 108010 536864 266980 54544 -86690 71210
1735G1210R6711k50825m0155r4818L41546L0355k90112K48522j77789J64522K01255
$$ 71210 167921 -82904 -123059 -217877 123669 154024 -136088 112434 -65355 99167 300422
1724C00422k07240J52855j62246L77346k76995k93919L52528K60192j70249j2846
$$ 300422 93182 246037 83791 461137 184142 -109777 242751 502943 332694 319848
1714C19848K43960J65664m8840n41745n66662k11500N30131O13607P5341k22932
$$ 319848 563808 729472 680632 138887 -427775 -639275 -109144 504463 579804 356872
1704C56872k87895j07596J76852l87621N45029j28997p2153J5259J3579o6883
$$ 356872 68977 -38619 138233 -249388 295641 166644 94491 109750 123329 56446
1694E6446j80367P2454L72737m32397K10526L63698k85859p9119o33476L78140
$$ 56446 -123921 -51467 321270 -111127 99399 463097 177238 98119 -535357 -157217
1684a57217N08541k03579K26027l58179m50572K32803K24854P7081j60585p4564
$$ -157217 351324 147745 373772 15593 -434979 -202176 22678 99759 -60826 -135390
1674a35390O1906j8804J30639p88412M16169L51501k35720N2524l29352K18465
$$ -135390 -73484 -92288 38351 -750061 -333892 17609 -218111 -165587 -494939 -276474
1664b76474O7809o07084L91516L11206K32479O10113m09017n68395L09568j83860
$$ -276474 -208665 -815749 -424233 -113027 119452 729565 320548 -247847 61721 -122139
1654a22139j27966k45025j2889L70329l37698K19473m83361P564M02148K78124
$$ -122139 -250105 -495130 -508019 -137690 -475388 -255915 -739276 -731712 -329564 -51440
1644e1440j72237k1812M70863k88088J31953K01979j50191R1884K70519j89521
$$ -51440 -223677 -245489 225374 -62714 69239 271218 121027 212911 483430 293909
1634B93909n37505j54178M6812L40509J4359L75052m42203k30281j12668o2372
$$ 293909 -243596 -397774 -350962 -10453 3906 378958 -63245 -293526 -406194 -468566
1624d68566j27408J46194J45422K00103l3236k4587o9455M14533j81023n32509
$$ -468566 -595974 -449780 -304358 -104255 -137491 -162078 -231533 183000 1977 -530532
1614e30532J81036J28689k31280j26112O75692L31100l75864K83142m26209J07456
$$ -530532 -349496 -220807 -452087 -578199 97493 428593 52729 335871 -90338 17118
1604A7118L5369o73410q7790M80252K05739J80651K71561R4785l13151n0975j71538
$$ 17118 52487 -620923 -708713 -228461 -22722 157929 429490 524275 211124 160149 -11389
1593a1389n05541K5014J95746L17568n79701L2493m95766Q60401R04543m19708
$$ -11389 -516930 -491916 -296170 21398 -558303 -525810 -1021576 -161175 743368 323660
1583C23660o40324j32072j80839J31417P46261j12257l24755J5910n6874p5955
$$ 323660 -316664 -448736 -629575 -498158 248103 135846 -188909 -172999 -229873 -305828
1573c05828Q5392M9313k29894M0030n51793K30445P39525K57939k30939l74556
$$ -305828 -220436 -171123 -401017 -360987 -912780 -682335 57190 315129 84190 -290366
1563b90366j20699M52844m17267J90870j60648K45878L54230j25566L54378l75176
$$ -290366 -411065 41779 -375488 -184618 -345266 -99388 254842 129276 483654 108478
1553A08478l85240K27992j23830n80040P47925q1727j09134J36256K08641m77336
$$ 108478 -276762 -48770 -172600 -752640 -4715 -86442 -195576 -59320 149321 -328015
1543c28015K53802j08339n40537M33317K39457j29698m10247k40552O93417K52333
$$ -328015 -74213 -182552 -723089 -289772 -50315 -180013 -590260 -830812 -137395 114938
1533A14938r3723J91904m48297j25788m38128M20030J76922j65074L28046q210
$$ 114938 21215 213119 -235178 -360966 -799094 -379064 -202142 -367216 -39170 -47380
1523d7380j05743L03743L3155l02175K07940k55814J00160j04381n2611k76471
$$ -47380 -153123 150620 183775 -118400 89540 -166274 -66114 -170495 -223106 -499577
1513d99577J90028O04068l41733j83015N6030j16675M3541k89272J24352K76655
$$ -499577 -309549 294519 -47214 -230229 -174199 -290874 -247333 -536605 -412253 -135598
1503a35598k39244j95651J7548L41679j76505J99526r5924Q841l56086m7300L95919
$$ -135598 -374842 -570493 -552945 -211266 -387771 -188245 -284169 -275328 -631414 -678714 -282795
1492b82795M70671r5353k50652j01386J55188L65835n90043N88510K92706r91701
$$ -282795 187876 92523 -158129 -259515 -104327 261508 -328535 259975 552681 -439020
1482d39020m13454R653J0236L09044R0127j72194K88006N13046p37287K58804
$$ -439020 -852474 -842821 -832585 -523541 -433414 -605608 -317602 195444 -541843 -283039
1472b83039k53952J68268J04562j22574o606J43287M41102j82640j57331P04576
$$ -283039 -536991 -368723 -264161 -386735 -393341 -250054 191048 8408 -148923 555653
1462E55653j62357m89844K02462l82771J02536K47764j22727R5792l86284o2772
$$ 555653 393296 -96548 105914 -276857 -174321 73443 -49284 46508 -339776 -402548
1452d02548P4902l5625J26300j91427M59478l11529L06823L69413j38013k3000
$$ -402548 -327646 -363271 -236971 -428398 31080 -280449 26374 395787 257774 234774
1442B34774k69701o17138J51348L02296j42161k42135M52749R4572O6879p6196
$$ 234774 -34927 -652065 -500717 -198421 -340582 -582717 -129968 -35396 31483 -44713
1432d4713M00795K37609k10352k56003k54101J85155N1566m2818L65052k29946
$$ -44713 356082 593691 383339 127336 -126765 58390 109956 67138 432190 202244
1422B02244m10372k66631M21926K35136n11895N08017l03491o90700r4533M19474
$$ 202244 -208128 -474759 -52833 182303 -329592 178425 -125066 -815766 -910299 -490825
1412d90825K28231O6747q2118j68593M66720k51383j92863K51687O04996j71983
$$ -490825 -262594 -195847 -277965 -446558 20162 -231221 -424084 -172397 432599 260616
1402B60616o66487Q2077M84408M72988p47747j41960K92911m45243o65012J72053
$$ 260616 -405871 -323794 160614 633602 -114145 -256105 36806 -408437 -1073449 -901396
1392i01396O0437L44789J68179R9103k89544j65853J61779k61806R24727J52466
$$ -901396 -840959 -496170 -327991 -228888 -518432 -684285 -522506 -784312 140415 292881
1382B92881l15530J65493k23857k92503q1199P3496J229m06584L65307J05018
$$ 292881 -22649 142844 -81013 -373516 -454715 -381219 -379990 -786574 -421267 -316249
1372c16249L81028J60558j58448k06360k14836K53955O8639J08289m41798O06631
$$ -316249 64779 225337 66889 -139471 -354307 -100352 -31713 76576 -365222 241409
1362B41409j06267n15409j41010k7799K7129J7250K26334K65494K08018j71350
$$ 241409 135142 -380267 -521277 -549076 -521947 -504697 -278363 -12869 195149 23799
1352B3799M5247M1725J11028o4863m70222J5736j32822M23729j32635l8338o5815
$$ 23799 69046 110771 221799 156936 -313286 -297550 -430372 -6643 -139278 -177616 -243431
1341b43431J02223o5829p5162l2857J28099P7379k09745j76152j24093N8815k55016
$$ -243431 -141208 -207037 -282199 -315056 -186957 -109578 -319323 -495475 -619568 -560753 -815769
1330h15769O63180j18852L53180J5602j08166j02849k27736J17524K64144p25902
$$ -815769 -152589 -271441 81739 97341 -10825 -113674 -341410 -223886 40258 -685644
1320f85644K70481K92771l26313K24042O53715J87753l23088o46830m95201k168
$$ -685644 -415163 -122392 -448705 -224663 429052 616805 293717 -353113 -848314 -850482
1310h50482M87400N28982j82853o5862k81566K38869o364m466k57897k45996L32800
$$ -850482 -363082 165900 -16953 -82815 -364381 -125512 -131876 -136342 -394239 -640235 -307435
1299c07435O10926o4340o66796k57744J69526J81817j56550p0073L26759N06460
$$ -307435 303491 239151 -427645 -685389 -515863 -334046 -490596 -560669 -233910 272550
1289B72550m81406k979j88121J18746K38405P300r2274k15475J06156l15313N26536
$$ 272550 -208856 -211835 -399956 -281210 -42805 -35505 -127779 -343254 -237098 -552411 -25875
1278b5875k32420K16251N42996p99795p8350L03237J96555L08003m12511K29630
$$ -25875 -258295 -42044 500952 -298843 -377193 -73956 122599 430602 18091 247721
1268B47721k04712m24462K76850L75423m70676M3094k2902N6683j29630o0131
$$ 247721 43009 -381453 -104603 270820 -199856 -156762 -179664 -122981 -252611 -312742
1258c12742K95671M66492k00067K45796l97108j80290K27336L73932l46714j01104
$$ -312742 -17071 449421 249354 495150 98042 -82248 145088 519020 172306 71202
1248G1202j7967m51979K63121N987j15685P3848Q1542j01848j8371o5176j70617
$$ 71202 53235 -398744 -135623 -129636 -245321 -171473 -89931 -191779 -210150 -275326 -445943
1237d45943m768L46707j23816N71341p0721l69827M22299j17140j78385L5930
$$ -445943 -450711 -104004 -227820 343521 272800 -97027 325272 208132 29747 65677
1227F5677n58199K07518J29694M6615J14925l1344l323P8563j13773m25029K71271
$$ 65677 -492522 -285004 -155310 -108695 6230 -25114 -28437 50126 -63647 -488676 -217405
1216b17405M23512j32840l24086l36412j86439J59600O47373m17813L16159L1748
$$ -217405 206107 73267 -250819 -587231 -773670 -614070 33303 -384510 -68351 -36603
1206c6603l08142o10916L40752M87506j50666L6973k9904l23477K17035K40168
$$ -36603 -344745 -955661 -614909 -127403 -278069 -241096 -271000 -594477 -377442 -137274
1196a37274P4254r8581K83671n28844k40649J53588k87469K82325L18219k33369
$$ -137274 -63020 -161601 122070 -406774 -647423 -493835 -781304 -498979 -180760 -414129
1186d14129K05567J18131k5383q1190K60135j66260k37937Q11559N67481J20689
$$ -414129 -208562 -90431 -115814 -197004 63131 -103129 -341066 470493 1037974 1158663
1176A158663l22208l28474n31764j00920O1022j51549r584k70806K19940m7447
$$ 1158663 836455 507981 -23783 -124703 -63681 -215230 -224814 -495620 -275680 -323127
1166c23127o89781J97304J57285K87264L08248k327j15558j90357R6746M01292
$$ -323127 -1012908 -815604 -658319 -371055 -62807 -65134 -180692 -371049 -274303 126989
1156A26989m55770k22954M48147J14356m3998j82748l53612j08895K75194K28108
$$ 126989 -328781 -551735 -103588 10768 -33230 -215978 -569590 -678485 -403291 -175183
1146a75183l58537j20384N78739N03290j89672n48086m70071K39311K05997L52934
$$ -175183 -533720 -654104 -75365 427925 238253 -309833 -779904 -540593 -334596 18338
1136A8338M7506l58081k01899M59107n90427N50844K47536j20432L8857p4806
$$ 18338 65844 -292237 -494136 -35029 -625456 -74612 172924 52492 91349 16543
1126A6543l59419p4228J23357K84777L3804k77268M24648l01351l27685R4043
$$ 16543 -342876 -417104 -293747 -8970 24834 -252434 172214 -129137 -456822 -362779
1116c62779L66083J96175o83341q6325l2235j52482K20730N78512r8831J61875
$$ -362779 3304 199479 -483862 -570187 -602422 -754904 -534174 44338 -54493 107382
1106A07382K29798k95325l90126R0000L82863m89029K10306J85988O5620l94261
$$ 107382 337180 41855 -348271 -258271 124592 -364437 -154131 31857 97477 -296784
1096b96784J55509K45082l23845J50921j15730p42310J97623M72211P8971p3595
$$ -296784 -141275 103807 -220038 -69117 -184847 -927157 -729534 -257323 -178352 -251947
1086b51947N7938K46936o3490l11448l1433K53845M81047M8117l55193k19811
$$ -251947 -194009 52927 -10563 -322011 -353444 -99599 381448 429565 74372 -145439
1076a45439m54958K06416K14386l96142N04671M95231k6447n72906M82400l1883
$$ -145439 -600397 -393981 -179595 -575737 -71066 424165 397718 -175188 307212 275329
1066B75329K5081j37866o26272j48570k35754q1759N69491j25017K07863K99269
$$ 275329 300410 162544 -463728 -612298 -848052 -929811 -360320 -485337 -277474 21795
1056B1795o57567K83191J18840J92773J70560J00283l66033M69312p2656m3982
$$ 21795 -635772 -352581 -233741 -40968 129592 229875 -136158 333154 260498 216516
1046B16516J28448l37814K14068l65324p9970Q6224k63406k456J98444K47874
$$ 216516 344964 7150 221218 -144106 -224076 -137852 -401258 -403714 -205270 42604
1036D2604k44867j35866P0121K79952K10438J4807k77358j36288R7109J58899
$$ 42604 -202263 -338129 -268008 11944 222382 237189 -40169 -176457 -79348 79551
1026G9551O4286l23696O03891K08045J399r97945p2452M19237L12527J05253k1355
$$ 79551 143837 -179859 424032 632077 633476 -364469 -436921 -17684 294843 400096 378741
1015C78741j62424m43201q6434j7807J96429L89259o0033p24606j56138J98391
$$ 378741 216317 -226884 -313318 -331125 -134696 254563 194530 -530076 -686214 -487823
1005d87823L46320L17982N03559k28187j72219l61518l69982K45965l6660K39104
$$ -487823 -141503 176479 680038 451851 279632 -81886 -451868 -205903 -242563 -3459
995c459M12753O7794K5139l18090j0061K92574K3724K06521K1792j83637R8690
$$ -3459 409294 477088 502227 184137 174076 466650 490374 696895 718687 535050 633740
984F33740k86086K10609O8535j74992k02191k12027k31216M4362m2104l79736
$$ 633740 347654 558263 626798 451806 249615 37588 -193628 -149266 -191370 -571106
974e71106K01264L70034m04524j30290K02575K40037j45693J21813R62058O3314
$$ -571106 -369842 192 -404332 -534622 -332047 -92010 -237703 -115890 846168 909482
964I09482k64094n0437o49560k14062O85713l72757l56334J66742j37396M53661
$$ 909482 645388 594951 -54609 -268671 417042 44285 -312049 -145307 -282703 170958
954A70958k08210l70763k03569J64017J67781j56329m2583L1693K70073J91041
$$ 170958 -37252 -408015 -611584 -447567 -279786 -436115 -478698 -447005 -176932 14109
944A4109M1903m30636K97656J05431o279l88706k402j27321M19289L42266M4040
$$ 14109 56012 -374624 -76968 28463 22184 -366522 -368924 -496245 -76956 265310 309350
933C09350q8114J26698k96869Q4184l80733j73899M20841K29101M0801k65983
$$ 309350 221236 347934 51065 135249 -245484 -419383 1458 230559 271360 5377
923E377k33138J14969J42769L28769q078R6330o35973l63837M03335K09823M06567
$$ 5377 -227761 -112792 29977 358746 350668 446998 -188975 -552812 -149477 60346 466913
912D66913k27824l60433n15107K27893j34775J59596k2406J25914j50429L77880
$$ 466913 239089 -121344 -636451 -408558 -543333 -383737 -406143 -280229 -430658 -52778
902e2778j73604J46029m1620Q3619M14435P4069l82654l26476K52910k91512J40305
$$ -52778 -226382 -80353 -121973 -38354 376081 450150 67496 -258980 -6070 -297582 -157277
891a57277R2325K6299J52167l54468j0595K60312L88777j20310k4018k46326k04966
$$ -157277 -64952 -38653 113514 -240954 -251549 8763 397540 277230 253212 6886 -198080
880a98080M86507K4863l6796q7789j94968J61569j5592m96754R8605r2213K9145
$$ -198080 288427 313290 276494 188705 -6263 155306 139714 -357040 -258435 -350648 -321503
869c21503J12915K27303j55511K21533L04187n35540k29618N4062L62003l89886
$$ -321503 -208588 18715 -136796 84737 388924 -146616 -376234 -322172 39831 -350055
859c50055l1987J18362J00428m9121k92364K74510M51404j47362J74014k46177
$$ -350055 -382042 -263680 -163252 -212373 -504737 -230227 221177 73815 247829 1652
849A652n48995L24271n8903M5631M37206n74641J10576L57365k09751N18023k28341
$$ 1652 -547343 -223072 -281975 -236344 200862 -373779 -263203 94162 -115589 402434 174093
838A74093J67379j31134l99009K11617J04885k27826K0501k75690j59377P84949
$$ 174093 341472 210338 -188671 22946 127831 -99995 -79494 -355184 -514561 270388
828B70388j87775n87267P581K64087r2899N4591M9047L46079k31652o2460J00255
$$ 270388 82613 -504654 -497073 -232986 -325885 -271294 -222247 123832 -107820 -170280 -70025
817g0025J43173l01703r6021O72467o54471K69356N58872J7022K71643o26839
$$ -70025 73148 -228555 -324576 347891 -306580 -37224 521648 538670 810313 183474
807A83474o04548K80497R3077j25177J10204M55305l34010l7853J11916k6400
$$ 183474 -421074 -140577 -47500 -172677 -62473 392832 58822 20969 132885 106485
797A06485j02071J20768r6024j43756l1780k8165L69384k54458K06273q399J65315
$$ 106485 4414 125182 29158 -114598 -146378 -174543 194841 -59617 146656 138257 303572
786C03572k20030j73934q7067k0271Q7014K69410M1476m51986J56563L87688k36311
$$ 303572 83542 -90392 -177459 -197730 -110716 158694 200170 -251816 -95253 292435 56124
$$ [...]
##END NTUPLES=NMR SPECTRUM
##END=
