##TITLE=1H_CA-9030-5
 CDCl3
 8 sc, 
 8.07.2022
##JCAMPDX= 6.0         $$ Bruker NMR JCAMP-DX V2.0
##DATA TYPE= NMR SPECTRUM
##DATA CLASS= NTUPLES
##ORIGIN= UXNMR, Bruker Analytische Messtechnik GmbH
##OWNER= root
$$ XWIN-NMR		Version 3.5
$$ Fri Jul  8 16:18:00 2022 Russian Standard Time (UT+4h)  she@DPX200
##.OBSERVE FREQUENCY= 200.1313499994
##.OBSERVE NUCLEUS= ^1H
##.ACQUISITION MODE= SIMULTANEOUS
##.ACQUISITION SCHEME= undefined
##.AVERAGES= 8
##.DIGITISER RES= 18
##SPECTROMETER/DATA SYSTEM= spect
##.PULSE SEQUENCE= zg30
##.SOLVENT NAME= CDCl3
##.SHIFT REFERENCE= (INTERNAL, CDCl3, 0, 15.7469)
##AUDIT TRAIL= $$ (NUMBER, WHEN, WHO, WHERE, WHAT)
$$ ##TITLE= Audit trail, XWIN-NMR		Version 3.5
$$ ##JCAMPDX= 5.01
$$ ##ORIGIN= Bruker BioSpin GmbH
$$ ##OWNER= she
$$ F:/spectra/data/she/nmr/H-F/1/pdata/1/auditp.txt
$$ ##AUDIT TRAIL=  $$ (NUMBER, WHEN, WHO, WHERE, WHAT)
(   1,<2022-07-08 16:16:49.85 +0400>,<she>,<DPX200>,
      <created by zg, POWCHK disabled, PULCHK disabled
       configuration hash MD5:
       00 E9 B6 7A A2 85 ED C7 34 08 36 98 17 FE 4E 26
       data hash MD5: 16K
       D9 F5 1D 51 88 1B 86 92 80 BF EE 55 F7 41 EF 2E>)
(   2,<2022-07-08 16:16:55.23 +0400>,<she>,<DPX200>,
      <Start of raw data processing
       efp BC_mod = 2 LB = 0.24 FT_mod = 6 PKNL = 1 PHC0 = -18061.08 PHC1 = 14.40068 SI = 16K 
       data hash MD5: 16K
       9D FC 72 D7 4A 1A 96 CD 1A BB F4 16 27 65 33 6D>)
(   3,<2022-07-08 16:17:19.51 +0400>,<she>,<DPX200>,
      <pk PHC0 = -0.7968258 PHC1 = -3.4 
       data hash MD5: 16K
       7A F3 D7 D4 88 60 DB BF 3E 35 41 55 17 26 77 AD>)
(   4,<2022-07-08 16:17:22.56 +0400>,<she>,<DPX200>,
      <abs ABSG = 5 
       data hash MD5: 16K
       BF 09 0C BF 31 18 42 F5 68 D8 22 00 4F 3E CE D7>)
$$ ##END=
$$ 
$$ hash MD5
$$ 47 F8 CC EA 39 54 50 02 D6 24 C9 C6 3D 2C F1 12
##$RELAX= 
##$RELAX= 
##$RELAX= 
##$RELAX= 
##$RELAX= 
##$RELAX= 
$$ Bruker specific parameters
$$ --------------------------
##$DU= <F:/spectra>
##$EXPNO= 1
##$NAME= <H-F>
##$PROCNO= 1
##$TYPE= <nmr>
##$USER= <she>
##$AMP= (0..31)
100 100 100 100 100 100 100 100 100 100 100 100 100 100 100 100 100 100 
100 100 100 100 100 100 100 100 100 100 100 100 100 100 
##$AQSEQ= 0
##$AQ_mod= 1
##$AUNM= <au_zg>
##$AUTOPOS= <>
##$BF1= 200.13
##$BF2= 200.13
##$BF3= 200.13
##$BF4= 200.13
##$BF5= 200.13
##$BF6= 200.13
##$BF7= 200.13
##$BF8= 200.13
##$BYTORDA= 1
##$CFDGTYP= 0
##$CFRGTYP= 5
##$CHEMSTR= <none>
##$CNST= (0..31)
1 1 145 1 1 1 1 1 1 1 1 1 1 1 1 1 1 1 1 1 1 1 1 1 1 1 1 1 1 1 1 1 
##$CPDPRG= <>
##$CPDPRG1= <>
##$CPDPRG2= <>
##$CPDPRG3= <>
##$CPDPRG4= <mlev>
##$CPDPRG5= <mlev>
##$CPDPRG6= <mlev>
##$CPDPRG7= <mlev>
##$CPDPRG8= <mlev>
##$CPDPRGB= <>
##$CPDPRGT= <>
##$D= (0..31)
0 1.2 0 0 0 0 0 0 0 0.06 0 0.03 0 0 0 0 0.0002 0 0 0 0 0 0 0 0 0 0 0 0 
0 0 0 
##$DATE= 1657282609
##$DBL= (0..7)
120 120 120 120 120 120 120 120 
##$DBP= (0..7)
150 150 150 150 150 150 150 150 
##$DBP07= 0
##$DBPNAM0= <>
##$DBPNAM1= <>
##$DBPNAM2= <>
##$DBPNAM3= <>
##$DBPNAM4= <>
$$ [...]
##$SUBNAM2= <"">
##$SUBNAM3= <"">
##$SUBNAM4= <"">
##$SUBNAM5= <"">
##$SUBNAM6= <"">
##$SUBNAM7= <"">
##$SUBNAM8= <"">
##$SUBNAM9= <"">
##$SW= 18.0517283424941
##$SWIBOX= (0..15)
0 0 2 0 0 0 0 0 0 0 0 0 0 0 0 0 
##$SW_h= 3612.71676300578
##$TD= 16384
##$TD0= 1
##$TE= 0
##$TE2= 300
##$TE3= 300
##$TEG= 300
##$TL= (0..7)
0 120 120 120 120 120 120 120 
##$TP= (0..7)
150 150 150 150 150 150 150 150 
##$TP07= 0
##$TPNAME0= <>
##$TPNAME1= <>
##$TPNAME2= <>
##$TPNAME3= <>
##$TPNAME4= <>
##$TPNAME5= <>
##$TPNAME6= <>
##$TPNAME7= <>
##$TPOAL= (0..7)
0.5 0.5 0.5 0.5 0.5 0.5 0.5 0.5 
##$TPOFFS= (0..7)
0 0 0 0 0 0 0 0 
##$TUNHIN= 0
##$TUNHOUT= 0
##$TUNXOUT= 0
##$USERA1= <user>
##$USERA2= <user>
##$USERA3= <user>
##$USERA4= <user>
##$USERA5= <user>
##$V9= 5
##$VALIST= <valist>
##$VCLIST= <CCCCCCCCCCCCCCC>
##$VD= 0
##$VDLIST= <DDDDDDDDDDDDDDD>
##$VPLIST= <PPPPPPPPPPPPPPP>
##$VTLIST= <TTTTTTTTTTTTTTT>
##$WBST= 1024
##$WBSW= 4
##$XGAIN= (0..3)
0 0 0 0 
##$XL= 0
##$YL= 0
##$YMAX_a= 253919
##$YMIN_a= -420260
##$ZGOPTNS= <>
##$ZL1= 120
##$ZL2= 120
##$ZL3= 120
##$ZL4= 120
##$ABSF1= 15.76672
##$ABSF2= -2.28513
##$ABSG= 5
##$ABSL= 3
##$ALPHA= 0
##$AQORDER= 0
##$ASSFAC= 0
##$ASSFACI= 0
##$ASSFACX= 0
##$ASSWID= 0
##$AUNMP= <proc_1d>
##$AZFE= 0.1
##$AZFW= 0.1
##$BCFW= 0
##$BC_mod= 2
##$BYTORDP= 0
##$COROFFS= 0
##$CY= -3
##$DATMOD= 1
##$DC= 0
##$DFILT= <>
##$DTYPP= 0
##$F1P= 0
##$F2P= 0
##$FCOR= 1
##$FTSIZE= 16384
##$FT_mod= 6
##$GAMMA= 0
##$GB= 0
##$INTBC= 1
##$INTSCL= 0
##$ISEN= 128
##$LB= 0.24
##$LEV0= 0
##$LPBIN= 0
##$MAXI= 10000
##$MC2= 0
##$MEAN= 0
##$ME_mod= 0
##$MI= 1.114404
##$NCOEF= 0
##$NC_proc= -7
##$NLEV= 6
##$NOISF1= 3.799351
##$NOISF2= 2.8
##$NSP= 0
##$NTH_PI= 0
##$NZP= 0
##$OFFSET= 15.74689
##$PC= 1
##$PHC0= -18061.88
##$PHC1= 11.00068
##$PH_mod= 1
##$PKNL= yes
##$PPARMOD= 0
##$PSCAL= 0
##$PSIGN= 0
##$REVERSE= no
##$SF= 200.130004932677
##$SI= 16384
##$SIGF1= 3
##$SIGF2= 2
##$SINO= 5.538805
##$SIOLD= 16384
##$SREGLST= <1H.CDCl3>
##$SSB= 0
##$STSI= 16384
##$STSR= 0
##$SW_p= 3612.71676300578
##$SYMM= 0
##$S_DEV= 0
##$TDeff= 16384
##$TDoff= 0
##$TI= <>
##$TILT= no
##$TM1= 0
##$TM2= 0
##$TOPLEV= 0
##$USERP1= <user>
##$USERP2= <user>
##$USERP3= <user>
##$USERP4= <user>
##$USERP5= <user>
##$WDW= 1
##$XDIM= 16384
##$YMAX_p= 404973445
##$YMIN_p= -2147712
$$ End of Bruker specific parameters
$$ ---------------------------------
##NTUPLES= NMR SPECTRUM
##VAR_NAME=  FREQUENCY,     SPECTRUM/REAL,   SPECTRUM/IMAG
##SYMBOL=    X,             R,               I
##VAR_TYPE=  INDEPENDENT,   DEPENDENT,       DEPENDENT
##VAR_FORM=  AFFN,          ASDF,            ASDF
##VAR_DIM=   16384,         16384,           16384
##UNITS=     HZ,            ARBITRARY UNITS, ARBITRARY UNITS
##FACTOR=    0.220516191357247, 1,           1
##FIRST=     3151.42518699401, 0,            0
##LAST=      -461.291576011771, 0,           0
##MIN=       -461.291576011771, -2147712,    0
##MAX=       3151.42518699401, 404973445,    0
$$ Real data points
##PAGE= N=1
##DATA TABLE= (X++(R..R)), XYDATA
$$ [...]
6950C303876o3086J1130O2547J78794k83562K1484K16836L06459o61981k7366
6940C065131O10062K39396m84157K19556P6966r5025k43401j45423L91370j07784
6930C526691m9590r5815k600N7282R8571j86587J69851l9208r9807N52794m43442
6919C488140n3837J92134K79528m07639n1472L92193k54223J12951j36L25914
6909D023553m38476j36348M76838R6609j26615j16079N03508j74890l76475M01162
6899D132787R2649k01099L58J71777o6108k39667N42389K29135k53860J16976
6889D525337P2313j08625j12318K76605j00216j22445l691N5585R0716j83463
6879D389798L2547K05272j67169J65096N0760J48822J27314j36047L59403o1413
$$ y = [3303876, 3240790, 3251920, 3314467, 3493261, 3209699, 3231183, 3448019, 3754478, 3092497, 3065131, 3675193, 3914589, 3430432, 3649988, 3726954, 3631929, 3388528, 3243105, 3634475, 3526691, 3477101, 3381286, 3378686, 3435968, 3534539, 3347952, 3517803, 3478595, 3378788, 3931582, 3488140, 3434303, 3626437, 3905965, 3498326, 3446854, 3839047, 3584824, 3697775, 3697639, 4023553, 3585077, 3448729, 3925567, 4022176, 3895561, 3779482, 4282990, 4108100, 3731625, 4132787, 4225436, 4024337, 4024695, 4196472, 4130364, 3890697, 4433086, 4662221, 4408361, 4525337, 4597650, 4489025, 4376707, 4653312, 4553096, 4430651, 4426960, 4482545, 4573261, 4389798, 4422345, 4627617, 4460448, 4625544, 4676304, 4825126, 4952440, 4816393, 5175796, 5114383]
6869E114383r2258l0397P8521O2674j63885K50123j20736j82320J74432J32151
6859E222688L1045k01227L18359L83894k20801n5522J12905o169j64565L16463
6849E737070m8498k98582M66572j34312q9557K76582j01748p3666L89135Q655
6839F131651J35484q1195J65892N4936J84464J57184O47350n26880k53411N60413
6829G175888j92109R2534O1512K00346J87044j356K63336L00885P74J25449L33128
6818H547431k33942J83088M33112l61690J23952J79037j5846J75174L96930K35626
6808I662872K0103M09674L71010N2661K74839L61401N25993j25645J63907J77663
6798A1894478N57993J05346K37557L05190J59973N46949N02071L49091Q17334
$$ y = [5114383, 5022125, 4991728, 5070249, 5132923, 4969038, 5219161, 5098425, 4916105, 5090537, 5222688, 5253733, 5052506, 5370865, 5754759, 5533958, 5478436, 5591341, 5585172, 5420607, 5737070, 5688572, 5389990, 5856562, 5722250, 5632693, 5909275, 5807527, 5733861, 6122996, 6131651, 6267135, 6185940, 6351832, 6406768, 6591232, 6748416, 7395766, 6868886, 6615475, 7175888, 6983779, 7076313, 7137825, 7338171, 7525215, 7523859, 7787195, 8088080, 8088854, 8214303, 8547431, 8313489, 8496577, 8929689, 8567999, 8691951, 8870988, 8855142, 9030316, 9427246, 9662872, 9682975, 10092649, 10463659, 10516320, 10791159, 11152560, 11678553, 11552908, 11716815, 11894478, 12452471, 12557817, 12795374, 13100564, 13260537, 13807486, 14309557, 14658648, 15475982]
6789A5475982M25795M04464M36947M06229J83094Q93841P97537K45083L38598
6780A9607570R37450R48411J88191P08126J422134M86521Q67869J474353J537811
6771B8178436J173399R13815J807978J858881J657436K363863K853166K533453
6763D3340427L068782L741381M162839M624702N212948N411580N866532N615969
6755H1045160N700175N477580M244160K436986Q61357k80909k477217m028160
6747I2979132n249524n879991p006064o514157o270189n736722n116856n054334
6739D6151295m207610l836704l477446k774651k590794k109157j840661j345482
6731B3968790j004967j677882j601381r10712l31885o36107j008648j171227l70651
$$ y = [15475982, 15901777, 16306241, 16743188, 17149417, 17332511, 18226352, 19023889, 19268972, 19607570, 20545020, 21493431, 21681622, 22389748, 23811882, 24298403, 25166272, 26640625, 28178436, 29351835, 30265650, 32073628, 33932509, 35589945, 37953808, 40806974, 43340427, 46409209, 50150590, 54313429, 58938131, 64151079, 69562659, 75429191, 81045160, 86745335, 92222915, 96467075, 98904061, 99765418, 99484509, 97007292, 92979132, 87729608, 81849617, 74843553, 68329396, 62059207, 56322485, 51205629, 46151295, 41943685, 38106981, 34629535, 31854884, 29264090, 27154933, 25314272, 23968790, 22963823, 21285941, 19684560, 18773848, 18441963, 17805856, 16797208, 15625981, 15255330]
6722A5255330n97051j324011l04874m2754p88917j19717o78749k51093l97485
6713A0750679p5474m63251m92706j98533j96254j74107r8876m41624K39399K1445
6703H870698k33415k82572Q2291j14964k62746k53789n79088L02320n92354n42795
6693F393586N67181R2518l99385l97542O14066k92624l3151J03812n9988k41623
6683F346850q3196M5858m17788j69666n5574K71695P4930J08536j21082K91299
6673F291862p43620l8060K63895l98361j4813j60942P0171J60824J0958l76366
6663E065548O06888j59819n10094K21199k2595J5653n4104k09894k4678J47966
6653E076070r6453J04929R1754L51590J57220o13701k0591J0663r5691j93836
$$ y = [15255330, 14658279, 13334268, 13029394, 12986640, 12197723, 12078006, 11399257, 11148164, 10750679, 10675205, 10211954, 9719248, 9520715, 9324461, 9150354, 9051478, 8609854, 8849253, 8870698, 8637283, 8354711, 8437002, 8322038, 8059292, 7805503, 7226415, 7528735, 6936381, 6393586, 6960767, 7053285, 6653900, 6256358, 6870424, 6577800, 6544649, 6648461, 6588473, 6346850, 6263654, 6309512, 5891724, 5722058, 5666484, 5938179, 6013109, 6121645, 6000563, 6291862, 5548242, 5510182, 5774077, 5375716, 5360903, 5199961, 5270132, 5430956, 5441914, 5065548, 5672436, 5512617, 5002523, 5223722, 5201127, 5216780, 5162676, 4952782, 4928104, 5076070, 4979617, 5084546, 5176300, 5527890, 5685110, 5071409, 5050818, 5061481, 4965790, 4771954]
6643D771954j1692N3131J66961l67854K74929J61308m21546L0111J90866k45260
6633D602908j7824K12327l02785J99405L84529j9327k16567J59928L05178l92157
6623D915615n97811K82770K73887J37986l98668j1111p3416P2508N1763M5264
6613D698787k31962r610l108j26369l33030L17604p5195K10586M8162Q4372n7104
6602D523133N08823L7454l34527M2930K64387n48149q7715K7281J62255l65343
6592D230529j2343K69779o9244j12220O8292L61535l18486j38110M34976P2101
6582D786809k63893J04040L59188l3655l34120J28879j0680r509L1170j69653
6572D588576K27951k73521k66444J63365K75494Q6596o61320N21972K82729j43869
$$ y = [4771954, 4760262, 4813393, 4980354, 4612500, 4887429, 5048737, 4627191, 4657302, 4848168, 4602908, 4585084, 4797411, 4494626, 4694031, 5078560, 5059233, 4842666, 5002594, 5307772, 4915615, 4317804, 4600574, 4874461, 5012447, 4613779, 4602668, 4529252, 4601760, 4653523, 4698787, 4466825, 4457215, 4454107, 4327738, 3994708, 4312312, 4237117, 4447703, 4495865, 4580237, 4523133, 5031956, 5069410, 4734883, 4777813, 5042200, 4494051, 4406336, 4433617, 4595872, 4230529, 4218186, 4487965, 4418721, 4306501, 4374793, 4736328, 4417842, 4279732, 4714708, 4786809, 4522916, 4626956, 4986144, 4952489, 4618369, 4747248, 4736568, 4727059, 4758229, 4588576, 4816527, 4543006, 4276562, 4439927, 4715421, 4802017, 4140697, 4662669, 4945398, 4801529]
6562D801529k9324J0189j69056j96338L24182n9480j2255K57168j94176m1523
6552D690916k04009L29974K57617m64101O9925K67563O2523p8441k01143P2882
6542D803706M0406J80266K35680Q9806q7063J55722m6397R1572J79897k31640
6532E411955m2394q824j80790m0596K33922j33727l03120J92678K8294m72194
6522D685204J28138N41119j52690l47369L4632L67424l08132K8975M12853J26109
6512E516263j90894J91630L10827J09561n9515K12391n18343k60204O5705j7076
6502E360345n53024J42607N33691J10830j03810k1392P7013K86137J58017k18960
6492E771454j98670j63912j01033k07490k74515j19930J64577K21992q5744P79518
$$ y = [4801529, 4772205, 4782394, 4613338, 4417000, 4741182, 4681702, 4669447, 4926615, 4732439, 4690916, 4486907, 4816881, 5074498, 4610397, 4680322, 4947885, 5010408, 4931967, 4730824, 4803706, 4844112, 5024378, 5260058, 5349864, 5262801, 5418523, 5372126, 5463698, 5643595, 5411955, 5369561, 5360737, 5179947, 5139351, 5373273, 5239546, 4936426, 5129104, 5157398, 4685204, 4813342, 5354461, 5201771, 4854402, 4889034, 5256458, 4948326, 4977301, 5390154, 5516263, 5325369, 5516999, 5827826, 5937387, 5877872, 6090263, 5571920, 5311716, 5377421, 5360345, 4807321, 4949928, 5483619, 5594449, 5490639, 5469247, 5546260, 5832397, 5990414, 5771454, 5572784, 5408872, 5307839, 5100349, 4825834, 4705904, 4870481, 5092473, 5006729, 5786247]
6482E786247j60933J41386M73649k29706k20331N2929J05285k993n3125l72341
6472E520067k96738K46486o350K60940m40268j02428j10603R8346j87618r7651
6462D884183K95841K16338P3892j21485J31761K39375P429J0849l5455l56215
6452E346513J26013O4993l4602l13600J15316P0040n5849j8142J51306M08382
6442E860370l80424o59547M72396J05582n40902k31612P35792m99315J95107M11652
6432E469099m0026j07270J88566N314R3703n3289R1403l16565j36642l37642L89968
6421E246619j38167k31997L46804L89224l41669k19580L87673p3411j33477J66116
6411E398135K41039J43177k89805j15238J03499Q4402m12374K31013P1102l05126
$$ y = [5786247, 5625314, 5766700, 6240349, 6010643, 5790312, 5843241, 5948526, 5945533, 5892408, 5520067, 5223329, 5469815, 5463465, 5724405, 5284137, 5181709, 5071106, 5169452, 4981834, 4884183, 5180024, 5396362, 5470254, 5348769, 5480530, 5719905, 5727334, 5738183, 5702728, 5346513, 5472526, 5537519, 5502917, 5189317, 5304633, 5374673, 5318824, 5300682, 5451988, 5860370, 5479946, 4820399, 5292795, 5398377, 4857475, 4625863, 5361655, 4862340, 5057447, 5469099, 5429073, 5321803, 5510369, 5515683, 5609386, 5556097, 5647500, 5330935, 5194293, 4856651, 5246619, 5108452, 4876455, 5223259, 5612483, 5270814, 5051234, 5438907, 5365496, 5232019, 5398135, 5639174, 5782351, 5492546, 5377308, 5480807, 5565209, 5152835, 5383848, 5454950, 5149824]
6401E149824m4788K99941P1804j12612j36709M67364J14577l39773J63232J6067
6391E648927k21852j90056K65923O8987j20411R5871j93434J13179k58287O48454
6381E857301Q1211q60797L13568J3734m0411l64538P18806k92970L4073J77390
6371E637367Q3118J84768q3449K3023R1883k00366j79469k712j90268j90476j9799
6360E153620K71061J20878L95531k47851P2170M09837M704O6690Q3533q5791m15578
6349E828804j18404m8779J5858J75326k47623K70258j27092J79630L35769l54093
6339E909654M72407J03294k82130l55939J04787k7457l35739K91635p2573k5943
6329E781996O3530J32250q1285l34191R38261j18671k05939m43578o6135J98165
$$ y = [5149824, 5105036, 5404977, 5476781, 5364169, 5227460, 5694824, 5809401, 5469628, 5632860, 5648927, 5427075, 5237019, 5502942, 5571929, 5451518, 5547389, 5353955, 5467134, 5208847, 5857301, 5938512, 5077715, 5391283, 5405017, 5364606, 5000068, 5718874, 5425904, 5459977, 5637367, 5720485, 5905253, 5821804, 5844827, 5936710, 5736344, 5556875, 5554163, 5363895, 5173419, 5153620, 5424681, 5545559, 5941090, 5693239, 5765409, 6175246, 6179950, 6246640, 6330173, 6244382, 5828804, 5710400, 5661621, 5677479, 5852805, 5605182, 5875440, 5748348, 5927978, 6263747, 5909654, 6382061, 6485355, 6203225, 5847286, 5952073, 5924616, 5588877, 5880512, 5807939, 5781996, 5845526, 5977776, 5896491, 5562300, 6500561, 6381890, 6175951, 5732373, 5666238, 5864403]
6319E864403K2655N0685R1888q9643j06352J54002Q013m25366P46350n527k69891
6308F041217L0519j10194O4494j94260j44440L1226J37211K33224k71369M7013
6298E864641K69062n3869Q8816L07337K23937m38343M9690m3551l6104j45294
6288F086322n65304K27704J21053P9959K12016l38877M14660K01341m3954l23967
6278F070953Q1930O86488m4845p29400l0055M00885m38054R4680K20323r2820
6268F220085L36170J58990k85017M1030l8495K07424k07015l23576K50476j74172
6258F185900J84997l36168J23648j16279K50577K61048l05909R3055N3048K12774
6248F606691l24913K33234L28595o87871k11515M87168m291k86482j03119J3022
$$ y = [5864403, 5887058, 5937743, 6029631, 5939988, 5833636, 5987638, 5995651, 5570285, 6316635, 6311108, 6041217, 6071736, 5961542, 6026036, 5831776, 5687336, 5718562, 5855773, 6088997, 5817628, 5864641, 6133703, 6079834, 6168650, 6475987, 6699924, 6261581, 6311271, 6267720, 6231616, 6086322, 5521018, 5748722, 5869775, 5949734, 6161750, 5822873, 6237533, 6438874, 6394920, 6070953, 6152883, 6839371, 6794526, 6065126, 6035071, 6435956, 5997902, 6092582, 6312905, 6220085, 6556255, 6715245, 6430228, 6471258, 6432763, 6640187, 6433172, 6109596, 6360072, 6185900, 6370897, 6034729, 6158377, 6042098, 6292675, 6553723, 6247814, 6340869, 6393917, 6606691, 6281778, 6515012, 6843607, 6155736, 5944221, 6431389, 6427098, 6140616, 6037497, 6050519]
6238F050519j68157J43373J33195M49253R430j85826K52007k26177o0631M62070
6228F859056N8088k27449o52024O21398J19504l65406j10466J10329J73545j49783
6218F436792j31927K33544K23747j75871J57561R3651l94738o4102O70386o02913
6208F446130o6622J70154K43302m59446l1804j19201M83728K28063n5850m19154
6198F419300K18572Q1144K6888p6139J48333n4083K47705R4338K81592m13557
6188F974093j41797k1309K73425l5298j63545J79605l12145K94631R8032L86261
6178G531953k12341R063l70001q8100J17468N4697k9541M21284k67007P8286K342
6167G248103K26925N88209Q8526M74768K26308L66747M6745M97707L59155K25709
$$ y = [6050519, 5882362, 6025735, 6158930, 6608183, 6617613, 6431787, 6683794, 6457617, 6396986, 6859056, 6917144, 6689695, 6037671, 6659069, 6778573, 6413167, 6302701, 6413030, 6586575, 6436792, 6304865, 6538409, 6762156, 6586285, 6743846, 6837497, 6442759, 6378657, 7049043, 6446130, 6379508, 6549662, 6792964, 6333518, 6301714, 6182513, 6666241, 6894304, 6838454, 6419300, 6637872, 6719016, 6745904, 6669765, 6818098, 6764015, 7011720, 7106058, 7387650, 6974093, 6832296, 6810987, 7084412, 7049114, 6885569, 7065174, 6753029, 7047660, 7145692, 7531953, 7319612, 7328675, 6958674, 6870574, 6988042, 7042739, 7013198, 7434482, 7167475, 7245761, 7248103, 7475028, 8063237, 8151763, 8626531, 8852839, 9219586, 9266331, 9764038, 10123193, 10348902]
6157A0348902P79157k5741n27156m98960o51737m04629o44171Q4960l34235l90558
6147G735832m31766k43688M67372l87683J12242l11562N2848J52680m41036M3805
6137F749044M5019J84462l28114j70207O14928m98649K82455k7001J15685k98925
6127F668697K9566K45281j50487q8113l9577k19985l54547j01418O69041k37655
6117F420803k3605O6388N38950J26838n22213K61282k1036k51619j39437N9918
6107F516269j2505j64586n9828L2608K32326k11503j73107L46503J68994j29920
6097F545251k51126J24098k68405O4169N84363l15557j39333K31212J9287K02271
6087F796230n07882L55336J22428L0959n27192J88738J96434r5270k10498k0065
$$ y = [10348902, 11128059, 11102318, 10575162, 10076202, 9424465, 9019836, 8375665, 8460625, 8126390, 7735832, 7304066, 7060378, 7527750, 7140067, 7252309, 6940747, 6993595, 7146275, 6705239, 6749044, 6794063, 6978525, 6650411, 6480204, 7095132, 6596483, 6878938, 6851937, 6967622, 6668697, 6698263, 6943544, 6793057, 6704944, 6665367, 6445382, 6090835, 5989417, 6658458, 6420803, 6397198, 6463586, 7002536, 7129374, 6607161, 6868443, 6847407, 6595788, 6456351, 6516269, 6503764, 6339178, 6279350, 6311958, 6544284, 6332781, 6159674, 6506177, 6675171, 6545251, 6294125, 6418223, 6149818, 6213987, 6798350, 6482793, 6343460, 6574672, 6593959, 6796230, 6288348, 6643684, 6766112, 6797071, 6269879, 6458617, 6655051, 6559781, 6349283, 6329218]
6077F329218O9948j85019J75578K22843k17439O2380K74546K2553O4918k32832
6067F586694j40982L26929l11949j65254L08132r6891j49918Q9671r7667p4405
6057F274360L93074J9729Q8184q116R5388q1593J44184k85032k8678r8732k28522
6046F284246J48742k52242j54665O6477L89294k28581Q2282O55886J82834m07170
6036F767103R4212Q2569l10938j48392k102k30435k16116K57815L12710J33408
6026F739834m96730J10850J93024L29173o9219K34481K61922n54806n03427J44913
6016F390015M17477j45239R3374q2381j73076R6868j09322L15977l923k16379
6006F583391j81077K01842k27797n8241L72098n1904m43270N67761K7895q3844
$$ y = [6329218, 6399166, 6214147, 6389725, 6612568, 6395129, 6457509, 6732055, 6754608, 6819526, 6586694, 6445712, 6772641, 6460692, 6295438, 6603570, 6506679, 6356761, 6446432, 6348765, 6274360, 6667434, 6687163, 6775347, 6767231, 6862619, 6781026, 6925210, 6640178, 6611500, 6512768, 6284246, 6432988, 6180746, 6026081, 6092558, 6481852, 6253271, 6335553, 6991439, 7174273, 6767103, 6861315, 6943884, 6632946, 6484554, 6482452, 6252017, 6035901, 6293716, 6606426, 6739834, 6243104, 6353954, 6546978, 6876151, 6806932, 7041413, 7303335, 6748529, 6245102, 6390015, 6807492, 6662253, 6755627, 6673246, 6500170, 6597038, 6487716, 6803693, 6799770, 6583391, 6402314, 6604156, 6376359, 6318118, 6690216, 6638312, 6195042, 6762803, 6790698, 6706854]
5996F706854j42492M0323K61098J30979l9526J6795k11136k52695j39701K69305
5986F639804j54276P1879J36660J54159J75536n1699K83122l39541O9695o5647
5976F919692o8386J52015R50J8901Q4562j4080j77516j76477M40659l63126O36272
5965G453466K37984j1076l77554r2351j31794Q07142k19417o1161j85118k59005
5955G161116j49923J71995j5689M7948M46242j01711K14268J23634p449L21530
5945H211961j1204n8490j93779P8443L19874j95184m68887o3199J08713M67655
5935H195903P8376j11122J91781K35326M52698o5785j90547O2981P55976j42564
5925I463023o30885L56701R3016R7496k09374J55367N19219K40632M73124J08171
$$ y = [6706854, 6564362, 6604685, 6865783, 6996762, 6957236, 6974031, 6762895, 6510200, 6370499, 6639804, 6485528, 6557407, 6694067, 6848226, 7023762, 6972063, 7255185, 6915644, 6985339, 6919692, 6851306, 7003321, 7004271, 7023172, 7107734, 7093654, 6916138, 6739661, 7180320, 6817194, 7453466, 7691450, 7680374, 7302820, 7210469, 7078675, 7885817, 7666400, 7605239, 7420121, 7161116, 7011193, 7183188, 7167499, 7215447, 7661689, 7559978, 7774246, 7897880, 7890431, 8211961, 8200757, 8142267, 7948488, 8026931, 8346805, 8151621, 7682734, 7619535, 7728248, 8195903, 8274279, 8163157, 8354938, 8590264, 9042962, 8977177, 8786630, 8849611, 9605587, 9463023, 8832138, 9188839, 9281855, 9379351, 9169977, 9325344, 9844563, 10085195, 10558319, 10666490]
5915A0666490J07766J02245N0247J55056l17254J89655M25837Q629l89131L8417
5905A1037957M69557Q0842P94711l28092J2833M96664J64906O6573M9429J06132
5895A2951512R1299q8264K69176J72037j10558M918K37388K98510K3965J62801
5885A4012784K21731P2620o9187m0260L91265k50439p3223J29859O4420j83114
5875A4276456K92764L34616L36409k63068N68295O11480P6293q1443O59900J43626
5865A6955328k95387j37920N28300M79154O62363J55109M69780K86376M2136O06788
5855A9752027J276628J041619J264863J330318J062374J134352J341835J491010
5847B9695026J156113J62556o34091k60810m1986m74638l67117K392K46449R5645
$$ y = [10666490, 10774256, 10876501, 10926748, 11081804, 10764550, 10954205, 11380042, 11388671, 10999540, 11037957, 11507514, 11588356, 12383067, 12054975, 12067808, 12564472, 12729378, 12795951, 12845380, 12951512, 13042811, 12954547, 13223723, 13395760, 13285202, 13290120, 13527508, 13826018, 13849983, 14012784, 14234515, 14307135, 14237948, 14197688, 14588953, 14338514, 14265291, 14395150, 14459570, 14276456, 14569220, 14903836, 15240245, 14977177, 15545472, 16156952, 16233245, 16151802, 16811702, 16955328, 16659941, 16522021, 17050321, 17529475, 18191838, 18346947, 18816727, 19103103, 19145239, 19752027, 21028655, 22070274, 23335137, 24665455, 25727829, 26862181, 28204016, 29695026, 30851139, 31013695, 30379604, 30118794, 30076808, 29602170, 29235053, 29237445, 29483894, 29579539]
5837B9579539K04802R01369P58482J215040J392937J504988J088749J520938J587692
5828C9754536J027417K69132m06386k18022r91056j458789p98662j404214j503988
5819C4269968j373123j050699j091521o47117l58930o3686Q4205Q51325L69688
5810C0990110L32969q4633Q91973L57142p2932n46022r67681j755717j981588
5801B7163621k065621k212810j688446j115269j280480j113035q56577o55026
5793A6176357n69956r13963k21016n51495p87081m20822j5707m56716m18771J28127
5783A1948957n7695k21261l26427l42866K78184n71612k72367R5740m74360k76034
5773I780259Q8706K03518j62256K06288K94493j12724l19838l26713O3715K28819
$$ y = [29579539, 29784341, 30685710, 31444192, 32659232, 34052169, 35557157, 36645906, 38166844, 39754536, 40781953, 41051085, 40644699, 40426677, 39435621, 37976832, 37178170, 35773956, 34269968, 32896845, 31846146, 30754625, 30107508, 29748578, 29684892, 29769097, 30620422, 30990110, 31323079, 31238446, 32130419, 32487561, 32414629, 31868607, 30900926, 29145209, 27163621, 25098000, 22885190, 21196744, 20081475, 18800995, 17687960, 16831383, 16176357, 15606401, 14692438, 14471422, 13919927, 13132846, 12712024, 12696317, 12239601, 11820830, 11948957, 11891262, 11670001, 11343574, 11000708, 11278892, 10707280, 10434913, 10530653, 10056293, 9780259, 9868965, 10072483, 9910227, 10116515, 10411008, 10298284, 9978446, 9651733, 9715448, 9944267]
5763I944267j12946m44194l14802k8214j76523M03644l2268K5922L04459R3101
5753I662446P621m19205K15146N34459j98379m12298j70774N01830k35673k73684
5743I211489j6119R2616M36372n28799K4980L60102l1101j64860N5198L20368
5733I760246K21917K10084j09910k42600M8692J50182J67624j57491k59277K37591
5723A0027058q8634j5034j79966K99904K30543m15704M86139N9580j29030K18214
5713A0493070J96813k60250J71335J17092j94459J47791J72428R7831j46036k7537
5703A0768078K56188O9169p1207l4793J01902K73092J70294J17202q7740K24714
5693A1786899O56065j42647N3084L09721J81388l3981j58399m4805K46748L77162
$$ y = [9944267, 9831321, 9387127, 9072325, 9044111, 8867588, 9271232, 9238964, 9264886, 9569345, 9662446, 9670067, 9250862, 9466008, 10000467, 9802088, 9389790, 9219016, 9720846, 9485173, 9211489, 9195370, 9287986, 9724358, 9195559, 9220539, 9580641, 9549540, 9384680, 9439878, 9760246, 9982163, 10192247, 10082337, 9839737, 9888429, 10038611, 10206235, 10048744, 9789467, 10027058, 9938424, 9923390, 9743424, 10043328, 10273871, 9858167, 10344306, 10403886, 10274856, 10493070, 10689883, 10429633, 10600968, 10718060, 10523601, 10671392, 10843820, 10941651, 10795615, 10768078, 11024266, 11093435, 11022228, 10987435, 11089337, 11362429, 11532723, 11649925, 11562185, 11786899, 12442964, 12300317, 12353401, 12663122, 12844510, 12810529, 12652130, 12607325, 12854073, 13231235]
5683A3231235m8258K32329K20633J24440N78659K76649l4831K34793N10649O05775
5673A5932073M32906L2027M30605M41968L25379O06392J254400P03417J96363
5664B0355530P38825Q12805j68650J73477M85904o6628l2854K68708L19775M08390
5654B3295282j16806P54888L46586J78572Q02868R35742M28096K22695N11597
5645B7359520N46422M80055K20000j10852J71612k51154k0296m2091k94356q9125
5635B7969735m37707k83983n5765L97760r9343N161M10357K35077N05271M44160
5625B9090723L87488L55655j95547J89343j88425l97817m35649J81767j71778
5616B8815760m21051N27669O85946J83804P54860M46826J356599J034338J431402
$$ y = [13231235, 13182977, 13415306, 13635939, 13760379, 14339038, 14615687, 14580856, 14815649, 15326298, 15932073, 16364979, 16397006, 16827611, 17269579, 17594958, 18201350, 19455750, 20159167, 20355530, 21094355, 21907160, 21738510, 21911987, 22397891, 22331263, 22298409, 22567117, 22886892, 23295282, 23178476, 23933364, 24279950, 24458522, 25261390, 26197132, 26625228, 26847923, 27359520, 27905942, 28385997, 28605997, 28495145, 28666757, 28415603, 28395307, 28353216, 28058860, 27969735, 27532028, 27248045, 27192280, 27590040, 27490697, 27495858, 27906215, 28141292, 28646563, 29090723, 29478211, 29833866, 29638319, 29827662, 29639237, 29241420, 28805771, 28987538, 28815760, 28394709, 28922378, 29608324, 29792128, 30546988, 30993814, 32350413, 33384751, 34816153]
5607C4816153J280459J226487J231754R42004N83673n57026m73750l57830m28273
5598C8263651p93272m77268r4084m32905M2634N3047O93699J142771L87307P65016
5588C9550596J269237J009498J019540Q42060R44860L88499j38373k77789j015772
5579D3592356j475252j867665r09282j459201j681909j226838k75984q85855q20231
5570C2990139J85270J15602k09857j6393J5562L43160j8910K22673k94675p52989
5560C2579582n37506q23921j051525j715721j236071j008755q50300o09382p87109
5551B3959292k38549o16610o33355p5237m88647k53242j26708k39547k6510k18
5541B1260669K153J27852K34841j62945q7123K05159L13760L73687k68004K65958
$$ y = [34816153, 36096612, 37323099, 38554853, 39496857, 40080530, 39523504, 39049754, 38691924, 38263651, 37470379, 36993111, 36899027, 36466122, 36508756, 36561803, 37255502, 38398273, 38785580, 39550596, 40819833, 41829331, 42848871, 43690931, 44635791, 45024290, 44885917, 44608128, 43592356, 42117104, 40249439, 39340157, 37880956, 36199047, 34972209, 34696225, 33810370, 32990139, 33175409, 33291011, 33081154, 33064761, 33080323, 33423483, 33404573, 33627246, 33332571, 32579582, 32042076, 31218155, 30166630, 28450909, 27214838, 26206083, 25355783, 24746401, 23959292, 23720743, 23104133, 22470778, 22395541, 21906894, 21653652, 21526944, 21287397, 21260887, 21260669, 21262822, 21390674, 21625515, 21462570, 21375447, 21580606, 21894366, 22268053, 22000049, 22266007]
5531B2266007J14120J10538j74773l0318J71454J1864k96598K31353K3484p113
5521B2420018j24912o2647m3734k55793K53441J20585j26125L46309J47673N99497
5511B3274312J22868J6661J42789O28296k9447P884L18987k49266K07857K83771
5501B4724712m60783j03700M8728j00400K62935K0894j974K48239Q10348K676
5491B5451675K85958K55513O10051M85309P1005M24242M84881q147J75356L01783
5481B8537626J58295M01471P99069M73546L04381N07458P96183R32143L55632
5472C3265804O44695J014228N29973M93158J009272J063152Q16291P95679N29216
5463D0161468Q56171O99157N34990Q45246M87683O52367M04311P86622J26949
$$ y = [22266007, 22380127, 22490665, 22315892, 22285574, 22457028, 22468892, 22172294, 22403647, 22427131, 22420018, 22295106, 22232459, 22188725, 21932932, 22186373, 22306958, 22180833, 22527142, 22674815, 23274312, 23397180, 23413841, 23556630, 24184926, 24155479, 24163363, 24482350, 24233084, 24440941, 24724712, 24263929, 24160229, 24208957, 24108557, 24371492, 24392386, 24390412, 24638651, 25448999, 25451675, 25737633, 25993146, 26603197, 27088506, 27159511, 27583753, 28068634, 28060487, 28235843, 28537626, 28695921, 29097392, 29896461, 30370007, 30674388, 31181846, 31978029, 32910172, 33265804, 33910499, 34924727, 35454700, 35947858, 36957130, 38020282, 38836573, 39632252, 40161468, 41017639, 41716796, 42251786, 43097032, 43584715, 44237082, 44641393, 45428015, 45554964]
5454D5554964M34195J197763P74086L88936L1918P77477O21453J256106R81290
5445E2018188P31183J228217J223247J724757K049786J195521J937521K216783
5437F4325203K046293J716684J665443J289663Q25823P93805O6589J6422o55q02450
5427G1942820p82644o47184k95669o49541k95545j18190k63578O4390L10441P94079
5417G0059379N52914N01752J099120N86370P64538P96087J332940J004146K95064
5408G6992310M35153L95185K40168K88130O19321J46216M55035P29515Q39074
5399H1140107R83001O42058J866067J521495J789374J485862J616822J796801
5391I2841587J540151J724219J300108Q28381L44316M81429K29363M0068k40187
$$ y = [45554964, 45989159, 47186922, 47961008, 48349944, 48381862, 49159339, 49780792, 51036898, 52018188, 52749371, 53977588, 55200835, 56925592, 58975378, 60170899, 62108420, 64325203, 66371496, 68088180, 69753623, 71043286, 71869109, 72662914, 72729503, 72745925, 72745270, 71942820, 71160176, 70512992, 70217323, 69567782, 69272237, 69154047, 68890469, 68954859, 69265300, 70059379, 70612293, 71114045, 72213165, 72799535, 73564073, 74360160, 75693100, 76697246, 76992310, 77427463, 77822648, 78062816, 78350946, 78970267, 79116483, 79571518, 80301033, 81140107, 82123108, 82765166, 84631233, 86152728, 87942102, 89427964, 91044786, 92841587, 94381738, 96105957, 97406065, 98234446, 98578762, 99060191, 99289554, 99329622, 99089435]
5382I9089435o13M625M03963J12049J051150J045865J529934J384686K390072
5373A07011166K453996L186067L356246L502667L381573K586241L450767J941996
5365A30870719Q04433L4157q17363k265028k993116l383550m189903l918932l638650
5356A10502767l393232k681757k423896j608575j440315j199373m75718j2752
5348I7267149L61081k64611N5313o9498j233627r39302j881849k712582l243091
5339H7338983l289271l938140m331623l581486m311554l134847l288566l434310
5331E8029186l295119k296837k431252k172095j945737j960401j509126j033194
5323D1385425j870882j018777j122585n51850r45355j247853r31483m09614m54060
$$ y = [99089435, 99088822, 99093447, 99497410, 99609459, 100660609, 101706474, 103236408, 104621094, 107011166, 109465162, 112651229, 116007475, 119510142, 122891715, 125477956, 128928723, 130870719, 131675152, 131709309, 130891946, 128626918, 125633802, 122250252, 118060349, 114141417, 110502767, 107109535, 104427778, 102003882, 100395307, 98954992, 97755619, 97279901, 97267149, 97628230, 97363619, 97418932, 97349434, 96115807, 95176505, 93294656, 90582074, 87338983, 84049712, 80111572, 75779949, 72198463, 67886909, 64752062, 61463496, 58029186, 54734067, 52437230, 50005978, 47833883, 45888146, 43927745, 42418619, 41385425, 39514543, 38495766, 37373181, 36821331, 35875976, 34628123, 33696640, 33287026, 32832966]
5314C2832966j162188p45076k52445p10205k68898m20524m70117m18360n5689
5305B8329464j52957m92045k03751j98227j54460p86167j66659M4290m36541k08771
5295B5574176k71208l31416n76873j64867l33884m49469R5520k80002L015l30326
5285B2934666O5484j26043K16598O8412k75700L6093j56270l04296L21079k11145
5275B2568878J75158j02509J89530m4495K62743l4379J38768K45601J5607K45100
5265B3660002K21710j4669L91292j50086M88801Q5989j44143O40774Q18098O30724
5255B6628492N21098M3282L05270N47883M56371O77648N15715k17803P4757M54012
5245C0006725K25216N36420L34614M81663J99428J59164P53006P36640K61038
$$ y = [32832966, 31670778, 30925702, 30673257, 29963052, 29694154, 29273630, 28803513, 28385153, 28329464, 28176507, 27684462, 27480711, 27282484, 27128024, 26341857, 26175198, 26219488, 25782947, 25574176, 25302968, 24971552, 24394679, 24229812, 23895928, 23446459, 23541979, 23261977, 23264992, 22934666, 23000150, 22874107, 23090705, 23159117, 22883417, 22919510, 22763240, 22458944, 22780023, 22568878, 22744036, 22641527, 22831057, 22786562, 23049305, 23014926, 23153694, 23399295, 23414902, 23660002, 23881712, 23867043, 24258335, 24108249, 24597050, 24683039, 24538896, 25179670, 25997768, 26628492, 27149590, 27192872, 27498142, 28046025, 28502396, 29180044, 29695759, 29477956, 29552713, 30006725, 30231941, 30768361, 31102975, 31584638, 31784066, 31943230, 32696236, 33432876, 33693914]
5236C3693914L82522L66060o060N63449O50780M57594L01116M67661R47582R03929
5226C8728547J084153R00041O75610R70011J076303R19898N63528J198673P42005
5217D6858769Q82778Q43331J335686J596003J714794J446511J156575J651751
5209E7486198K669591K011306K085183J923504K661258K953747K731918L427928
5201G7950633L153646L404858L665863L483194K222054K388161K016138Q64393
5193I9148940j4416n49366k77018m20604j257086n35640j24556Q5714P33976J154802
5183I7944746J385369K188042K396582K939524K471809L125482K990350K404674
5175A17846578J674586O30481k48096j228673k343420l035993l783963m121252
$$ y = [33693914, 34076436, 34442496, 34436436, 34999885, 35650665, 36108259, 36409375, 36877036, 37824618, 38728547, 39812700, 40712741, 41388351, 42358362, 43434665, 44354563, 44918091, 46116764, 46858769, 47741547, 48584878, 49920564, 51516567, 53231361, 54677872, 55834447, 57486198, 60155789, 62167095, 64252278, 66175782, 68837040, 71790787, 74522705, 77950633, 81104279, 84509137, 88175000, 91658194, 93880248, 96268409, 98284547, 99148940, 99134524, 98585158, 98308140, 97887536, 96630450, 96094810, 95970254, 96055968, 96789944, 97944746, 99330115, 101518157, 103914739, 106854263, 109326072, 112451554, 115441904, 117846578, 119521164, 120151645, 119903549, 118674876, 116331456, 113295463, 109511500, 105390248]
5167A05390248m463247l440559l832137k948075k464285k393592j617899j841927
5159H2388527j071001j041807j026077k84684r26335q27190p40250o34259j367754
5150G4469170j412292j293011j547004j953151k462983k512193k440789k451171
5142E8396576j271600j791589j986103j861029k146956j852424k352476k523350
5134D2611049j715418j714162j940745j332415j175564j606385j071653q88769
5126C1165938j373224p66853j068934l53513p96972o31717q25032m26036o65176
5117B4258481o67972m77651p69213m98588o46058l74754m12576m87178l95779
5108A9528712k42144k39660j84131n94563o23003k69600k75118l13414l15249
$$ y = [105390248, 100927001, 97486442, 93654305, 90706230, 88241945, 85848353, 84230454, 82388527, 81317526, 80275719, 79249642, 78964958, 78038623, 77211433, 76471183, 75836924, 74469170, 73056878, 71763867, 70216863, 68263712, 65800729, 63288536, 60847747, 58396576, 57124976, 55333387, 53347284, 51486255, 49339299, 47486875, 45134399, 42611049, 40895631, 39181469, 37240724, 35908309, 34732745, 33126360, 32054707, 31165938, 29792714, 29025861, 27956927, 27603414, 26806442, 26174725, 25349693, 24923657, 24258481, 23590509, 23112858, 22343645, 21845057, 21198999, 20824245, 20411669, 19924491, 19528712, 19286568, 19046908, 18862777, 18268214, 17645211, 17375611, 17100493, 16787079, 16471830]
5099A6471830p11097l34292J38431o55991n64352l36479m22896J49793j29933
5090A3605014n66632k12604K55375M6076m24643l46167j94449L56944q06855n32412
5080A1179647j25162m7924l83319l94320M21877l89003m87128Q8144k97750n78562
5070H986500M67829N5433o06916j48009j91495L9980k42199k5455J30594k11933
5060H254329m51211j47882J99544n84308K11729j13247m03956K6339L8693K03846
5050G233876q5045N0689k88422k01361j8581Q6655m18333K7528N8962k16614j80949
5039F048405N8791j38836k45858Q3975k3889K09281o558l90789p3356k23393j43431
5028E154342J24008K86617k78609j53348M13844M5386m1096j00987M4722k13967
$$ y = [16471830, 15760733, 15426441, 15564872, 14908881, 14344529, 14008050, 13585154, 13734947, 13605014, 13038382, 12825778, 13081153, 13127229, 12702586, 12356419, 12161970, 12518914, 11712059, 11179647, 11054485, 11006561, 10623242, 10228922, 10650799, 10261796, 9774668, 9862812, 9565062, 8986500, 9454329, 9509762, 8902846, 8754837, 8563342, 8603322, 8361123, 8335668, 8466262, 8254329, 7803118, 7655236, 7854780, 7270472, 7482201, 7368954, 6964998, 6991337, 7030030, 7233876, 7148831, 7199520, 6911098, 6709737, 6691156, 6777811, 6359478, 6387006, 6445968, 6229354, 6048405, 6107196, 5968360, 5722502, 5806477, 5782588, 5991869, 5985311, 5594522, 5521166, 5297773, 5154342, 5278350, 5564967, 5286358, 5133010, 5546854, 5592240, 5551144, 5450157, 5494879, 5280912]
5018E280912r0188p03586j09161M04183n71256K11775J28690k45541J74551N90216
5008E070595m92369j33957P3725k64874j8598k38126j76979M28254j87547J14963
4998D175087n242L3966m4494O97809j44957k97501l43784o5428j98290l17709
4988C489457J06475L16680l50196O0938M44083j91498Q6308P6415J71443k38535
4978C971570k22035l68299L28633k16695q039k7670l25075k9690M48679p2219
4968C479160j4077j44498K28429n56916m8015L97439k1713j04637j21914k13447
4958B879811K48257K29922k27489l53370L31869n18324O123j255j95024J34679
4948B535199k5284L32042K15770P8463J2588j49672m2105j58504J46696K84846
$$ y = [5280912, 5190724, 4487138, 4377977, 4782160, 4210904, 4422679, 4551369, 4305828, 4480379, 5070595, 4578226, 4444269, 4517994, 4253120, 4234522, 3996396, 3819417, 4247671, 4060124, 4175087, 4169845, 4203811, 4159317, 4857126, 4712169, 4414668, 4070884, 4005456, 3807166, 3489457, 3595932, 3912612, 3562416, 3623354, 4067437, 3875939, 3962247, 4038662, 4210105, 3971570, 3749535, 3381236, 3709869, 3493174, 3485135, 3457465, 3132390, 3102700, 3551379, 3479160, 3465083, 3320585, 3549014, 2992098, 2944083, 3341522, 3319809, 3215172, 3093258, 2879811, 3128068, 3357990, 3130501, 2777131, 3109000, 2590676, 2596799, 2595544, 2400520, 2535199, 2509915, 2841957, 3057727, 3136190, 3148778, 2999106, 2957001, 2798497, 2945193, 3230039]
4938C230039o4115l50842l76367N3948M3200K04827j33663k98290N22308k15484
4928B615561l47683J03789L71938j06493k2904k17318K70919K14318j66856k94970
4918B420301k02413m54266L59485K55306K2841k63616M8764J26207k02916O509
4908B116202R0411P387j23615q5705K19665k26876J69079N34405k48895j60892
4898B291166k39630O6166j64232J71246k34819O8822J87816J0448L2161J05397
4888B294541m09895L09622J35169j03741K30117j79623n1715Q4297l3195l52173
4878A923404Q4638K96742n8268R4203l80657J97798r4671J3554o7943M11966K8271
4867B449037j79252O7659J38092l86136J07517j61885k188L6704K1719Q4728l13720
$$ y = [3230039, 3165924, 2815082, 2438715, 2492663, 2535863, 2740690, 2607027, 2308737, 2831045, 2615561, 2267878, 2371667, 2743605, 2637112, 2614208, 2396890, 2667809, 2882127, 2715271, 2420301, 2217888, 1763622, 2123107, 2378413, 2401254, 2137638, 2186402, 2312609, 2109693, 2116202, 2206613, 2214000, 2090385, 2004680, 2224345, 1997469, 2166548, 2700953, 2452058, 2291166, 2051536, 2117702, 1953470, 2124716, 1889897, 1958719, 2146535, 2156983, 2189144, 2294541, 1884646, 2194268, 2329437, 2225696, 2455813, 2276190, 2224475, 2308772, 2275577, 1923404, 2008042, 2304784, 2246516, 2340719, 1960062, 2157860, 2063189, 2076743, 2008800, 2420766, 2449037, 2269785, 2337444, 2475536, 2089400, 2196917, 2035032, 2032844, 2069548, 2091267, 2175995, 1862275]
4856A862275J22298J60604K34257J63838l57344j3855k76288M45247k62256p5476
4846B003300j49271L12822J43075l25491J32712L48341j23137k45622J03310k83017
4836A917022j24264L58709L5244m82437L14807j13750J28589K28096l19953j40646
4826A801417K00185j14890k05759k24847j04924L28180P42821m98316J64334o1313
4816B026888j88728l306L0871k23768K2652q6506n37522M30670K86358R1063J43392
4805A992064n0602R3595j60692J51163L4447o24217k57974J71265m33181J48847
4795A064715N58923K42219p9182l26446R8064J65909p4178o2384L57260l86997
4785A557903l90147N89889l0925j68210J3515J19571R5650r6782J72820j15987
$$ y = [1862275, 1984573, 2145177, 2379434, 2543272, 2185928, 2172073, 1895785, 2341032, 2078776, 2003300, 1854029, 2166851, 2309926, 1984435, 2117147, 2465488, 2342351, 2096729, 2200039, 1917022, 1792758, 2151467, 2186711, 1704274, 2019081, 1905331, 2033920, 2262016, 1942063, 1801417, 2001602, 1886712, 1680953, 1456106, 1351182, 1679362, 2422183, 1923867, 2088201, 2026888, 1838160, 1834854, 1865725, 1641957, 1664609, 1578103, 1040581, 1471251, 1757609, 1848672, 1992064, 1941462, 2035057, 1874365, 2025528, 2059975, 1435758, 1177784, 1349049, 915868, 1064715, 1623638, 1865857, 1786675, 1460229, 1558293, 1724202, 1650024, 1587640, 1944900, 1557903, 1167756, 1757645, 1726720, 1558510, 1572025, 1691596, 1787246, 1690464, 1863284, 1747297]
4775A747297k36423j4639Q2557J00530k29946J05720K14827r8942l92111J96601
4765A475471K57519J57861p5827m4085l27695l0860L05187o7933j93017k73707
4755A182914K36542R9142o7120K75872j80815K7976l1667J59916K96262L6584
4745B035606j9292m59110k03710N9435L23378j5676m08229J76063O1561j91538
4735A358488K9726j75977M93798J55240j65964m97397J08496N05484k11357r4983
4725A505554N1387j69407J10593N3981J85572k49024L19816J52498k9666M6458
4715A977762k43957J7856n9387k53763P376J43202k02837L14855N0548j7213M04849
4704B139291r7759N7372J83666l37396k56872J58365j17545l26297K423J58517
$$ y = [1747297, 1510874, 1496235, 1578792, 1679322, 1449376, 1555096, 1769923, 1670981, 1278870, 1475471, 1732990, 1890851, 1815024, 1770939, 1443244, 1412384, 1717571, 1649638, 1456621, 1182914, 1419456, 1518598, 1451478, 1727350, 1546535, 1574511, 1542844, 1702760, 1999022, 2035606, 2016314, 1557204, 1353494, 1412929, 1736307, 1720631, 1312402, 1488465, 1550026, 1358488, 1388214, 1212237, 1706035, 1861275, 1695311, 1197914, 1306410, 1811894, 1600537, 1505554, 1556941, 1387534, 1498127, 1552108, 1737680, 1488656, 1808472, 1960970, 1931304, 1977762, 1733805, 1751661, 1692274, 1438511, 1445887, 1589089, 1386252, 1701107, 1751655, 1734442, 2139291, 2041532, 2098904, 2282570, 1945174, 1688302, 1846667, 1729122, 1402825, 1405248, 1563765]
4694A563765K18327j18840N6445Q3243o1249j96570L44753J50402r5127L1486
4684A976635J5657j06614k14634N9334M58251M6234m14628M09022p0860k87218
4674A871179K80308N5569p8374j99023j03432L34650j65788m58640L46080L68251
4664B250780k65483K15914M52324k95615k34106J79712L3260k92602k02734O69622
4654B511072l07033n63884M19333N66074k30766j54687L05200j22860j15136k30826
4644B076487K73303l2248l81099L41030K80479m35962J04447M6156k830j98124
4634B071639J06190m896n410L4146K82355k15495n4839J69177K02315k6207j4092
4623B544883k0455J72404K20901k95446J41240j58847k42883P3087k14703m7225
$$ y = [1563765, 1782092, 1663252, 1719697, 1802940, 1741691, 1545121, 1889874, 2040276, 1945149, 1976635, 1992292, 1885678, 1671044, 1730378, 2188629, 2234863, 1820235, 2229257, 2158397, 1871179, 2151487, 2207056, 2128682, 1929659, 1826227, 2160877, 1995089, 1536449, 1882529, 2250780, 1985297, 2201211, 2653535, 2357920, 2123814, 2303526, 2336786, 2044184, 1841450, 2511072, 2204039, 1640155, 2059488, 2625562, 2394796, 2240109, 2545309, 2422449, 2307313, 2076487, 2349790, 2317542, 1936443, 2277473, 2557952, 2121990, 2226437, 2272593, 2269763, 2071639, 2177829, 2172933, 2167523, 2201669, 2484024, 2268529, 2213690, 2382867, 2585182, 2558975, 2544883, 2524428, 2696832, 2917733, 2622287, 2763527, 2604680, 2361797, 2434884, 2220181, 2172956]
4613B172956k18291L57411j32539k29463M6569M91224K86796m75662j618J92929
4603B490312N62714j02268k45609J2458j22510k65364M38302n22858k74685N17264
4593B487756K0418j81614k22504N74547O7618l0114M1177m8653k8896l41429J23594
4582B461900k43890J18694k00323K37863L2565k6741R0454L25775K70694k72759
4572B794232J26143J78586M8237l01571k05302O48384j64614k65446k22756J13204
4562B749097j69820K57041L90735K21868m47845J21739K08753m25306J26106J00676
4552C133044J47933J1051M136l9226j13291N197J34130J15765p995J89032j26954
4541C452822j44361K7119Q2842L39751k77952K82263j28026j1049O14947J55946
$$ y = [2172956, 1954665, 2312076, 2179537, 1950074, 1996643, 2487867, 2774663, 2299001, 2297383, 2490312, 3053026, 2950758, 2705149, 2717607, 2595097, 2329733, 2768035, 2245177, 1970492, 2487756, 2508174, 2326560, 2104056, 2678603, 2746221, 2716107, 2757284, 2708631, 2679735, 2338306, 2461900, 2218010, 2336704, 2136381, 2374244, 2406809, 2380068, 2470522, 2796297, 3066991, 2794232, 2920375, 3098961, 3147198, 2845627, 2640325, 3288709, 3124095, 2858649, 2635893, 2749097, 2579277, 2836318, 3227053, 3448921, 3001076, 3122815, 3331568, 2906262, 3032368, 3133044, 3280977, 3292028, 3296164, 3256938, 3143647, 3148844, 3282974, 3398739, 3390744, 3579776, 3452822, 3308461, 3335580, 3418422, 3758173, 3480221, 3762484, 3634458, 3623409, 4238356, 4394302]
4531D394302j81842R3787J64759J9789r6877L89846M774l35002K73175K73231
4521D999942R6825k18083K20243j89910K62414N8691q4299O84579K3942m0433
4511E813911K12299L88104M53359j53165j10012M34698M41471r8768L21128O31567
4501H334592R6328R31962M74070k15049R34822P10908R64110R2461m354L02535
4491A2622385m5066j81782k78447k6329m99716J45624l11735l28779K48447J57739
4481A1502341l17689j96327K29226L30740k24383P65934M37671L98578J00940
4472A3027031P86536R05078M57626O50105R56854M79650P40312M54339L80469
4463A8838000r1703N6510o56019o69092n81250r68837k05019n29372r70758r19587
$$ y = [4394302, 4212460, 4306247, 4471006, 4490795, 4393918, 4783764, 4788538, 4453536, 4726711, 4999942, 5096767, 4878684, 5098927, 4909017, 5171431, 5230122, 5145823, 5830402, 5854344, 5813911, 6026210, 6414314, 6867673, 6714508, 6604496, 7039194, 7480665, 7381897, 7703025, 8334592, 8430920, 9362882, 9836952, 9621903, 10556725, 11267633, 12231743, 12324204, 12319850, 12622385, 12577319, 12395537, 12117090, 12090761, 11591045, 11736669, 11424934, 11096155, 11344602, 11502341, 11184652, 10988325, 11217551, 11548291, 11323908, 12089842, 12527513, 12926091, 13027031, 13813567, 14718645, 15176271, 15826376, 16783230, 17262880, 18003192, 18457531, 18838000, 18746297, 18802807, 18146788, 17477696, 16896446, 15927609, 15722590, 15193218, 14222460, 13302873]
4453A3302873k30386k42141n23207m75223k09999q495k76621K62693L21633j98194
4443A1722933J68487K82329K91204K27845N70565J19233l36713L24571N37394
4434A3907848k83980N8955J21080m72101o25775j50641n20248o40427k08436l52846
4424A0833429p64213n82471M16018J05838o26898J5783K32794K04971J937j28886
4414I708302k85390m77841j62571m57863o82049k16460M73809k61959k78024J38216
4404G498170j38699l60931m9914j81756M36137L77013j11236K17161m2960l30621
4394G312364R4958J47367K14443j83499l51601p2441p555L05559J824k99146m26674
4383F735599K26543K12911J949k68876j816L16768L99745j34868M43984p8426
$$ y = [13302873, 13072487, 12830346, 12307139, 11831916, 11621917, 11613422, 11336801, 11599494, 11921127, 11722933, 11891420, 12173749, 12464953, 12692798, 13263363, 13382596, 13045883, 13370454, 13907848, 13623868, 13682823, 13803903, 13331802, 12706027, 12555386, 12035138, 11394711, 11186275, 10833429, 10069216, 9486745, 9902763, 10008601, 9381703, 9397486, 9630280, 9835251, 9837188, 9708302, 9422912, 8945071, 8782500, 8324637, 7642588, 7426128, 7899937, 7637978, 7359954, 7498170, 7359471, 6998540, 6948626, 6766870, 7203007, 7580020, 7468784, 7685945, 7642985, 7312364, 7407322, 7554689, 7769132, 7585633, 7234032, 7161591, 7154036, 7459595, 7461419, 7162273, 6735599, 6962142, 7175053, 7177002, 6908126, 6906310, 7223078, 7622823, 7487955, 7931939, 7853513]
4373G853513L57685Q5463j55757k66948K78872J97090l21816M9247N06578K26825
4363H810752Q0091j35526L15279N7836L46326N1912K3056K81735K55622K84252
4353A0371335k71390O36833K71196J7830K67720J42898Q8881r1262K56277J30609
4343A1820927K0481L76521N53470K20601K52804N72347O26696K22480M99902L65703
4333A5531932O89038L34233L73157K99005k42987J051825L7594M69312O36954
4324A9180063K20670M6006J29149R43450M97494N69328R5017P13712R18637j27575
4314B3185951M15170L44886K77238O41333J02420Q1634M72629R44843j08247L06578
4304B6664435O67098N07879Q09344N65711N09732J129962N12656O34940L82442
$$ y = [7853513, 8211198, 8296661, 8140904, 7873956, 8152828, 8349918, 8028102, 8077349, 8583927, 8810752, 8890843, 8755317, 9070596, 9128432, 9474758, 9526670, 9549726, 9831461, 10087083, 10371335, 10099945, 10736778, 11007974, 11025804, 11293524, 11436422, 11525303, 11434041, 11690318, 11820927, 11841408, 12217929, 12771399, 12992000, 13244804, 13817151, 14443847, 14666327, 15166229, 15531932, 16220970, 16555203, 16928360, 17227365, 16984378, 18036203, 18073797, 18543109, 19180063, 19400733, 19446739, 19575888, 20519338, 21016832, 21586160, 21681177, 22394889, 23313526, 23185951, 23601121, 23946007, 24223245, 24864578, 24966998, 25048632, 25521261, 26466104, 26357857, 26664435, 27331533, 27839412, 28648756, 29214467, 29724199, 30854161, 31366817, 32001757, 32384199]
4295C2384199J208011M11460L84377N19454k07549J27798p40877K11014j1940
4286C4285947o32058l00791K70912m85230l83342L9575j63828k97912O58117Q150
4276C2999540L16188l8332O76334P14960J54059R28168J109881P49126N28854
4267C8138778P92184J048681L49133O70097j30363R7396q94466p12255r63385
4258C8395800j286400j109235j247735j124094o94594j084172q46665q44400p56161
4249B9402344l50143p70735n56440j56533j56876m996j65151n09685j52571M71782
4239B7050996n3598N9953k56574P1621J70342m94909N39158Q2773n9397K13356
4229B7323721L86606O52147L19775J27873j4825N2338j50819L09297J3227l01274
$$ y = [32384199, 33592210, 34003670, 34388047, 34907501, 34699952, 34827750, 34086873, 34297887, 34285947, 33653889, 33353098, 33624010, 33138780, 32755438, 32795013, 32631185, 32333273, 32991390, 32999540, 33315728, 33277396, 33953730, 34668690, 34822749, 35750917, 36860798, 37609924, 38138778, 38930962, 39979643, 40328776, 40998873, 40868510, 40965906, 40071440, 39359185, 38395800, 37109400, 36000165, 34752430, 33628336, 32933742, 31849570, 31002905, 30158505, 29402344, 29052201, 28281466, 27725026, 27568493, 27411617, 27406621, 27241470, 26731785, 26579214, 27050996, 26997398, 27057351, 26800777, 26872398, 27042740, 26547831, 27086989, 27169762, 27110365, 27323721, 27710327, 28362474, 28682249, 28810122, 28795297, 28847635, 28696816, 29006113, 29019340, 28718066]
4219B8718066K49845J35325J29379M21286O77K95144K86621M13792L90398L31861
4209C1372394K26926M90627K64145K51960L54847M68221N21315O84601M11144
4200C5046180O41929N56628P68623J006506N38146J274637M88797M29757Q48101
4191D1599304N44867O10259P51172M86717J417971J122488R33046R15802J876303
4182E0257929Q88414K044111J082679J805851J838749J067296J877856J571832
4174F2434717J592659K265920J713121K137210J920836K627873K488846K512576
4166G9693758K238492L294695L702249L333417L781471M043968M360058M792035
4158A09240143N297746O683586O621600P215110Q316106R017827J0060653J0986547
$$ y = [28718066, 28967911, 29103236, 29232615, 29653901, 29654578, 29949722, 30236343, 30650135, 31040533, 31372394, 31599320, 32089947, 32354092, 32606052, 32960899, 33429120, 33950435, 34635036, 35046180, 35688109, 36244737, 37013360, 38019866, 38558012, 39832649, 40321446, 40751203, 41599304, 42144171, 42754430, 43505602, 43992319, 45410290, 46532778, 47465824, 48381626, 50257929, 51146343, 53190454, 54273133, 56078984, 57917733, 58985029, 60862885, 62434717, 64027376, 66293296, 68006417, 70143627, 72064463, 74692336, 77181182, 79693758, 81932250, 85226945, 88929194, 92262611, 96044082, 100088050, 104448108, 109240143, 114537889, 121221475, 127843075, 135058185, 143374291, 152392118, 162452771, 173439318]
4150A73439318J2655375J4258734J6357018J8586657K1545247K4241935K5635652
4143C06719936K7988556K6466628K2388930J5812822N596573n899153j7193873
4136C81880419k5609385k9812427l1025031k9595558k5720579k1643024j8032951
4129B00441464j5016536j2505045r931980p939746o964578m984379m381515l533724
4121A35183961k115044r93663l68275O88006J758989L391132M031740N341788
4113A46918634P691481R755993J1367344J3314193J3231337J0051896L377509
4106B15708387o026042j4906925j9470033k0007798j7272755j3595867j0048048
4099A14380919q317242o573090n253946m147498m098474l011330k579660k215161
$$ y = [173439318, 186094693, 200353427, 216710445, 235297102, 256842349, 281084284, 306719936, 334708492, 361175120, 383564050, 399376872, 404973445, 399074292, 381880419, 356271034, 326458607, 295433576, 265838018, 240117439, 218474415, 200441464, 185424928, 172919883, 162987903, 155048157, 148083579, 143099200, 138717685, 135183961, 133068917, 132075254, 131706979, 132394985, 134153974, 137545106, 141576846, 146918634, 154610115, 164366108, 175733452, 189047645, 202278982, 212330878, 215708387, 209682345, 194775420, 175305387, 155297589, 138024834, 124428967, 114380919, 106063677, 99490587, 94236641, 90089143, 85990669, 82979339, 80399679, 78184518]
4091G8184518k652321k357110j676626j378449q84599o52294n19445r44793j28847
4082F6990034J66895m26131j24244k80533j23446j55721M02070J123991J008286
4073F8581201J918821J926009K874327L433861M006608N157653M655257L733898
4065I6287635J822158j123693m843134p222972p732044o449685n146578m391177
4057F1200510l175290k621980k389945j517542j571274j247426j361088j065190
4049D6250775p63857n23345r78725o25879m66909j34490p8337L2940m04925J32034
4039D2439282k32584N4881P0255j79049N55100o5914K77993K99713M67336L70623
4029D4057636K276l00451k78246J59225l75856o73594K80833l76924K73731k58158
$$ y = [78184518, 75532197, 73175087, 71498461, 70120012, 69235413, 68583119, 68063674, 67118881, 66990034, 67156929, 66730798, 66606554, 66326021, 66202575, 66046854, 66448924, 67572915, 68581201, 70500022, 72426031, 75300358, 78734219, 82740827, 87898480, 92553737, 96287635, 98109793, 96986100, 92142966, 84919994, 77187950, 70738265, 65591687, 61200510, 58025220, 55403240, 53013295, 51495753, 49924479, 48677053, 47315965, 46250775, 45486918, 44963573, 43984848, 43358969, 42892060, 42757570, 42679233, 42712173, 42307248, 42439282, 42206698, 42261579, 42331834, 42152785, 42707885, 42641971, 42919964, 43219677, 43687013, 44057636, 44059912, 43759461, 43481215, 43640440, 43264584, 42590990, 42871823, 42494899, 42768630, 42510472]
4019D2510472N03626J11722L07974N99560M61623L2918N82716O48805O29929j37524
4009D6251821L03062M00766l62671l01044p60195j231408j173513o83946o32399
4000D1810473m83808l96695n86669l45017k43964L42098Q96983j3019J049089
3991D2029471Q70091P45453J092583J953644J370517J180896J464225J037650
3983E1744530M57812O04389J066373J457065J682567K384478K465049K610511
3975F4472774K244470J434708J101801k7952p3521o06663j012907j025703j029206
3966F5477801j466688j914509k155791j992863k298681k763989k376124j493059
3958D9016097j749953j308338j456358l79039l15593q45480n22732L81497l23760
$$ y = [42510472, 43014098, 43125820, 43433794, 44033354, 44494977, 44527895, 45110611, 45759416, 46389345, 46251821, 46554883, 46955649, 46592978, 46291934, 45531739, 44300331, 43126818, 42442872, 41810473, 41326665, 40929970, 40343301, 39998284, 39754320, 40096418, 40993401, 40980382, 42029471, 42899562, 43645015, 44737598, 46691242, 48061759, 49242655, 50706880, 51744530, 52202342, 52806731, 53873104, 55330169, 57012736, 59397214, 61862263, 64472774, 66717244, 68151952, 69253753, 69225801, 69152280, 68545617, 67532710, 66507007, 65477801, 64011113, 62096604, 59940813, 57947950, 55649269, 52885280, 50509156, 49016097, 47266144, 45957806, 44501448, 44122409, 43806816, 42961336, 42438604, 42820101, 42496341]
3949D2496341o2278M08561K69413n1428M08624k23635J85717M90871N24250L18389
3939D4764825M07651R10251P00377O91464J16286Q45038P11588R2398L29209O36986
3929E0206073k0321P37011J323024R62991Q30981J602353J196034J457548J496674
3920E9792368K426012K085905J810877K010338K063644O91456N18175m4607n12562
3911G0841606j547169j964829j850762k126373k274374j255427j024834k334928
3903E6462910j129826r30100j580504j823221j767958j675793j643900k008289
3895D3903319j888733j575333j370380j635137j257313j476661j245892j290078
3887C2163792o20648j245152r75450o60541j122619p41076l56370j032519l52050
$$ y = [42496341, 42434063, 42842624, 43112037, 43060609, 43469233, 43245598, 43431315, 43922186, 44446436, 44764825, 45172476, 46082727, 46783104, 47474568, 47590854, 48435892, 49147480, 49239878, 49569087, 50206073, 50185752, 50922763, 52245787, 53208778, 54039759, 55642112, 56838146, 58295694, 59792368, 62218380, 64304285, 66115162, 68125500, 70189144, 70880600, 71398775, 71354168, 70841606, 69294437, 67329608, 65478846, 63352473, 61078099, 59822672, 58797838, 56462910, 55333084, 54402984, 52822480, 50999259, 49231301, 47555508, 45911608, 43903319, 42014586, 40439253, 39068873, 37433736, 36176423, 34699762, 33453870, 32163792, 31543144, 30297992, 29322542, 28662001, 27539382, 26798306, 26441936, 25409417, 25057367]
3878B5057367l91972n06451m56727k87438n93876l39297Q8714p27261l26296l30600
3868B1186163l84490j68111n26832m13805l13408M0492j67848m78746j31164n25684
3858A8116567j60513k48752q7902p9249K53033n8418r2533K95149J3199J63574
3848A8114155J71461k1064K59594j21051j23713l4674K24704j70705n31737l40951
3838A7426019j36045J10665r9456k18217L681j57857J29870N0854K28005l8993
3828A7298526J42365O48240K93510L90149N32407M14806P00329N43403O43049
3819B1606784J70208J029097N35960N93605N05845K12901J317262N17585N83291
3810B7072538O45368O59233J101660M87524Q81731J84052P17413L10908l79875
$$ y = [25057367, 24665395, 24158944, 23702217, 23414779, 22820903, 22481606, 22570320, 21843059, 21516763, 21186163, 20801673, 20633562, 20106730, 19692925, 19379517, 19420009, 19252161, 18773415, 18642251, 18116567, 17956054, 17707302, 17619400, 17540151, 17793184, 17734766, 17642233, 17937382, 17950581, 18114155, 18285616, 18264552, 18524146, 18403095, 18279382, 18244708, 18469412, 18298707, 17766970, 17426019, 17289974, 17400639, 17301183, 17082966, 17086647, 16928790, 17058660, 17109514, 17337519, 17298526, 17440891, 18089131, 18382641, 18772790, 19305197, 19720003, 20420332, 20963735, 21606784, 21776992, 22806089, 23342049, 23935654, 24441499, 24654400, 25971662, 26489247, 27072538, 27717906, 28377139, 29478799, 29966323, 30848054, 31032106, 31749519, 32060427, 31680552]
3801C1680552k70008r48467j069550j494781j304071j380764j804291j497019
3793B1911601j393304r91660o69874j598025r31579o42067m84120o09477k86870
3784A4304625r6988m43340K13895l18399r7788o31318p5921k41156q93575o90406
3774A1029629k06248l97445o59233m10179K24056l31799o20965K19927Q9382k04294
3764H732831q0866N6118k67108m2097k09953j97440R0807K48555m05609j76615
3754G748623j67859L3304l81698j60889L60347l4729k57515K92256l64499L540
3744G070881J60260r626p36167j48655J68165n18469j49801j82557L27130O2261
3734F043422n27490K91975j8267N9545l32772j10998J79184l97057L6030j17535
$$ y = [31680552, 31410544, 30462077, 29392527, 27897746, 26593675, 25212911, 23408620, 21911601, 20518297, 19526637, 18856763, 17258738, 16327159, 15685092, 15200972, 14591495, 14304625, 14207637, 13764297, 13978192, 13659793, 13562005, 12930687, 12854766, 12613610, 11720035, 11029629, 10823381, 10425936, 9766703, 9356524, 9580580, 9248781, 8627816, 8847743, 8937125, 8732831, 8651965, 8708083, 8440975, 8398878, 8188925, 7991485, 8082292, 8330847, 7925238, 7748623, 7580764, 7614068, 7232370, 7071481, 7431828, 7397099, 7139584, 7431840, 7067341, 7070881, 7231141, 7221515, 6485348, 6336693, 6504858, 5986389, 5836588, 5654031, 5981161, 6043422, 5515932, 5807907, 5789640, 5849185, 5516413, 5405415, 5584599, 5187542, 5223572, 5106037]
3724E106037K56592j63787o98380K07011O35459o8853m83171n7749j80258k64312
3714D288589P1987j71387k46796Q7096j28164k03233k95411N98922J85787k8373
3704D159017k2964L58009J20316k52867k06019O9011l27396j43799m1393K53456
3694C965371j98517j02555K642L6123J77403L13160J7655K42561N1351k58430
3684D246764K04386O6791l2059l49617J9281J69671k07653j12843l42405J63400
3674C825716m8922j76769K390j43906l715k75254J9707k40622j27788j6094p8189
3663B736554J7380P4128k36448j54274J61864L21409o8022M3776j91090j69839
3653B535438J29047p4783k76146R2798L1202J15102n45376M44738K6845K32161
$$ y = [5106037, 5362629, 5198842, 4500462, 4707473, 5342932, 5274079, 4790908, 4733159, 4552901, 4288589, 4360576, 4189189, 3942393, 4029489, 3901325, 3698092, 3402681, 4001603, 4187390, 4159017, 4136053, 4494062, 4614378, 4361511, 4155492, 4224503, 3897107, 3753308, 3711915, 3965371, 3766854, 3664299, 3666941, 3703064, 3880467, 4193627, 4211282, 4453843, 4505194, 4246764, 4451150, 4517941, 4485882, 4136265, 4155546, 4325217, 4117564, 4004721, 3662316, 3825716, 3776794, 3600025, 3602415, 3458509, 3454794, 3179540, 3199247, 2958625, 2830837, 2814743, 2736554, 2753934, 2828062, 2591614, 2437340, 2599204, 2920613, 2852591, 2896367, 2705277, 2535438, 2664485, 2589702, 2313556, 2406354, 2437556, 2552658, 2007282, 2452020, 2478865, 2711026]
3643B711026r5350j25156j10137j68273J33051o055k47296j68249l48321J20925
3633A696165j24747P66550K26043m44114J13789L01488m5062l48354K29462J72051
3623B543271m36059J48954n1374m49174P5115M3L85397l12748L6091J3987K09124
3612B162627k14529m21082O55195l20030O0374J59431J49517N2396l40426M14897
3602B358370q9256l15618m35964L2214J14614l16929P9607J91212K43265j96648
3592A664867Q5901J73946n06292J71777P60582l90012J17966j32995N9367q3985
3582A921122n7769r267k38707q5206o7866J97649m85560M11093P3695j89741K39721
3571A709164j80391M83172J96443o18904l6459J17410J84466k2605o04805J1459
$$ y = [2711026, 2615676, 2490520, 2380383, 2212110, 2345161, 2339106, 2091810, 1923561, 1575240, 1696165, 1571418, 2337968, 2564011, 2119897, 2233686, 2535174, 2490112, 2141758, 2371220, 2543271, 2107212, 2256166, 2204792, 1755618, 1830733, 1830776, 2216173, 1903425, 1939516, 1953503, 2162627, 1948098, 1527016, 2182211, 1862181, 1922555, 2081986, 2231503, 2283899, 1943473, 2358370, 2269114, 1953496, 1517532, 1549746, 1664360, 1347431, 1427038, 1618250, 1861515, 1664867, 1750768, 1924714, 1418422, 1590199, 2350781, 1960769, 2078735, 1945740, 2005107, 1921122, 1863353, 1854086, 1615379, 1530173, 1462307, 1659956, 1174396, 1585489, 1659184, 1469443, 1709164, 1528773, 2011945, 2208388, 1589484, 1553025, 1670435, 1854901, 1832296, 1227491, 1238950]
3561A238950J42567K0767k2386K82385J77537J25349L51577n62200K78478J27491
3551B160515K60889m00928j53222L72344l45810j88669J79240j6139l87249K23209
3541A704180k9705j30683L75386q4495l6928J71045j16334j04296j65574L64601
3531A947197K44702l21755j28422p2916M57738O9838j03819m4377J83935j39521
3521B092600K05001m41561M5426N41917k05890l20009K87367j85155L09212J14899
3511B443807j67887m181J91163j0592k89808m7043J02675J2786q2765k77811K60242
3500B130586m40923J44116k6608o8452j62385R3129M47437o81976K68405L11925
3490B015254j04691J3850N6644K43367l03085K67146k81948l97589L17510k81508
$$ y = [1238950, 1381517, 1402284, 1379898, 1662283, 1839820, 1965169, 2316746, 1754546, 2033024, 2160515, 2421404, 2020476, 1867254, 2239598, 1893788, 1705119, 1884359, 1868220, 1480971, 1704180, 1674475, 1543792, 1919178, 1834683, 1797755, 1968800, 1852466, 1748170, 1582596, 1947197, 2191899, 1870144, 1741722, 1668806, 2126544, 2196382, 2092563, 2048186, 2232121, 2092600, 2297601, 1856040, 1901466, 2443383, 2237493, 1917484, 2204851, 2019696, 2328908, 2443807, 2275920, 2271739, 2462902, 2452310, 2162502, 2115459, 2218134, 2230920, 2148155, 1870344, 2130586, 1689663, 1833779, 1807171, 1738719, 1576334, 1669463, 2116900, 1434924, 1703329, 2015254, 1910563, 1924413, 1981057, 2224424, 1921339, 2188485, 1906537, 1508948, 1826458, 1544950]
3480A544950L0991j17120q4730N72919k50221j18908J46136k78842k26542J95764
3470A414397K80679m80475Q2271j00653J25587O883m7392p8836J11508p0384R0657
3459A334242n35911K93600j61061L5387o5180L3525O7821n8540K09085P5992j4245
3448A214715J40646n6603l65077p0874L16186j01591o2474n5098o6900j50562
3438G42368p1666J8054O24499j08864l91003L11175m1241L99853k77205l38377
3428H67593J85331K27972j34687j1271j25943l29851J27015J7309O8313L00571
3418A192352R7702m61443R6093J93022L5901l22147K00989p6500K34088K64514
3408A454571m09555j46189O2341k68064k62599N3999L51120L17619r4034k14612
$$ y = [1544950, 1575941, 1458821, 1374091, 1947010, 1696789, 1577881, 1724017, 1445175, 1218633, 1414397, 1695076, 1214601, 1296872, 1196219, 1321806, 1328689, 1281297, 1202461, 1313969, 1243585, 1334242, 798331, 1091931, 930870, 966257, 901077, 934602, 1002423, 943883, 1152968, 1228960, 1214715, 1355361, 1298758, 933681, 862807, 1178993, 1077402, 1014928, 959830, 892930, 742368, 670702, 688756, 1313255, 1204391, 813388, 1124563, 1083322, 1483175, 1205970, 867593, 1052924, 1280896, 1146209, 1134938, 1008995, 679144, 806159, 823468, 891781, 1192352, 1290054, 828611, 924704, 1117726, 1153627, 831480, 1032469, 955969, 1190057, 1454571, 1045016, 898827, 961168, 693104, 430505, 484504, 835624, 1153243, 1059209, 844597]
3398H44597J04267M94303k03916l3799l6697N7457j43367j58973J65917l7772
3388A052017j95521M587k80878J78855L88034N3985r737L8871K95518R9147k33336
3377A391542K28606o5180j72016j70430J16270n39316J84162K79059k39867r4266
3367I18564K3470K58071l52044J3514K45258q9555k4186O9281O3377N7392j79888
3356A003254L10930R9932M9518j59905J39172M51455K27054m85317m35987J45343
3346A345449L6066J1360K46487n9927r2669R8042K76989q3718m90785M08436N36000
3335B231730k34933m04792L62979Q0956n79869j14062M93853j49108J8956K3444
3325A729154J70235k86880M27118L72834M22644n94254k11302O15362j07793k69838
$$ y = [844597, 948864, 1443167, 1239251, 1205452, 1168755, 1226212, 1082845, 923872, 1089789, 1052017, 856496, 861083, 580205, 759060, 1147094, 1201079, 1191342, 1230213, 1525731, 1624878, 1391542, 1620148, 1554968, 1382952, 1212522, 1328792, 789476, 973638, 1252697, 1012830, 918564, 942034, 1200105, 848061, 861575, 1106833, 1017278, 993092, 1062373, 1125750, 1183142, 1003254, 1314184, 1414116, 1463634, 1303729, 1442901, 1894356, 2121410, 1636093, 1200106, 1345449, 1381515, 1392875, 1639362, 1579435, 1486766, 1584808, 1861797, 1778079, 1287294, 1695730, 2231730, 1996797, 1592005, 1954984, 2035940, 1456071, 1342009, 1835862, 1686754, 1705710, 1729154, 1899389, 1612509, 2039627, 2412461, 2835105, 2240851, 2029549, 2644911, 2537118, 2267280]
3315B267280j98493k0307l6824o6527o2198K98377K3390J42444L96184K8597Q1357
3304B853280J39574J19632L59381l65661l3398P84038J74942n38440K02763j77440
3294C518671J20214J2221M8361L8145N03707L28005K14253j18824J95387N21154
3284E381294M61261L59428L93561P19560R97555P15452L62617J122533J246477
3275A1759738R53542k3615p38453r24153j481823j392161Q0232n44125p63914
3266F925268K83900M99757l09732l24141K44564K87744m17844n1262L93595M53090
3256G984939K77340L16704L29470O92462J094607Q04659P14989Q94174J413823
3247A4523167J215043k28089m34419q56941j462176q99456l44996o3452Q366L60064
$$ y = [2267280, 2068787, 2048480, 2011656, 1945129, 1882931, 2181308, 2204698, 2347142, 2743326, 2771923, 2853280, 2992854, 3112486, 3471867, 3106206, 3072808, 3856846, 4031788, 3493348, 3696111, 3518671, 3638885, 3651106, 3699467, 3737612, 4241319, 4569324, 4783577, 4664753, 4860140, 5381294, 5842555, 6201983, 6595544, 7315104, 8312659, 9028111, 9390728, 10513261, 11759738, 12713280, 12689665, 11951212, 11027059, 9545236, 8153075, 8233307, 7689182, 6925268, 7209168, 7708925, 7399193, 7075052, 7319616, 7607360, 7189516, 7138254, 7531849, 7984939, 8262279, 8578983, 8908453, 9600915, 10695522, 11500181, 12215170, 13109344, 14523167, 15738210, 15510121, 15075702, 14218761, 12756585, 11857129, 11512133, 11448681, 11457047, 11817111]
3237A1817111j05753K77362O6213k23479o56089r04271o46646q29442p21631k89005
3227G784370k42305l01577k27974k85029j18246k48016l26715n09425l199l75198
3217E146686j13515k89847m26444J80972k94209j35452n7746L9761J51068k40689
3207C960585l46876l51698L37635J07299n48264j83352N14914L46497l89043K62743
3197C710440L46518l73205p4625l72992P3198L96331j49315m1810J02578K19484
3187C836602K1638M37708j36865J65313N70566j69369n10556j15742k22639l98928
3177C477728k49497j8542K14710l14168j83235m31218L58211J89374j20078k5786
3167B897499J2492k34034J29079N19928m61925K92331N73700l07196J3581J61608
$$ y = [11817111, 11711358, 11988720, 12054933, 11831454, 11175365, 10271094, 9624448, 8795006, 8073375, 7784370, 7542065, 7240488, 7012514, 6727485, 6609239, 6361223, 6034508, 5525083, 5521884, 5146686, 5033171, 4743324, 4316880, 4497852, 4203643, 4068191, 4010445, 4050206, 4201274, 3960585, 3613709, 3262011, 3599646, 3706945, 3158681, 2975329, 3490243, 3836740, 3447697, 3710440, 4056958, 3683753, 3609128, 3236136, 3309334, 3705665, 3556350, 3514540, 3617118, 3836602, 3858240, 4295948, 4159083, 4324396, 4894962, 4725593, 4215037, 4099295, 3876656, 3477728, 3228231, 3209689, 3424399, 3110231, 2926996, 2495778, 2853989, 3043363, 2923285, 2897499, 2909991, 2675957, 2805036, 3324964, 2863039, 3155370, 3729070, 3421874, 3435455, 3597063]
3157C597063Q4852N30997k46687K89241N27739K57767k07019J82349j94198m20774
3147D401330m20629n43526l45557j35103l65943n2021l07512M66487n14354l17775
3137A865397Q3566K31213J02628k63172j44615K33590M7275r2182l92158K07347
3127A878889K90533r6863l84753L67513Q62015k30837J77956r8517L30138j98596
3117B897478m34572k43532m22212j21045J82887k98697l22201O6047k86437j22877
3107H94839N98283o3194j24483J70691J2794q9452m86244J09802J63609p25529
3097D61116M14860N1267j82591j44651P35202k89152n15000L11752K55313n0375
3087A047741o06651K65352L13864l07208J67991m66469J66986J0271J96737J67796
$$ y = [3597063, 3681915, 4212912, 3966225, 4255466, 4783205, 5040972, 4833953, 5016302, 4822104, 4401330, 3980701, 3437175, 3091618, 2956515, 2590572, 2538551, 2231039, 2697526, 2183172, 1865397, 1948963, 2180176, 2282804, 2019632, 1875017, 2108607, 2155882, 2063700, 1671542, 1878889, 2169422, 2072559, 1687806, 2055319, 2917334, 2686497, 2864453, 2765936, 3096074, 2897478, 2462906, 2219374, 1797162, 1676117, 1859004, 1560307, 1238106, 1304153, 1017716, 894839, 1493122, 1429928, 1305445, 1476136, 1488930, 1399478, 913234, 1023036, 1186645, 461116, 875976, 927243, 744652, 600001, 1335203, 1046051, 531051, 842803, 1098116, 1047741, 441090, 706442, 1020306, 713098, 881089, 414620, 581606, 591877, 788614, 956410]
3077I56410l23476J66159j62429k23302J24799J21385M26405o41174k12980J85526
3067D17323M57684K42476n09326K66664J33637m6117p06589K69235K69799p67995
3057B6791J06344o6835M12131J95628j35151N7395j0795o9781j09263L3728o9821
3046C70371j99948J00125k05423K69484k9261l36833J43703o549K77840J57809
3036E41318m1423j9245N1650l35649r677J07993K9828j87274l8032p49707l5554
3025f85772P40106J82109k24453J37623J74956n4785k38437K79446J49350l9641
3015D20502j60675j49719L8538j3181N8882l15575l29143M8970L91882K34394
3005B24875o31328J63576M78667k56287M2293J42319j41834k02426K70051l9382
$$ y = [956410, 632934, 799093, 636664, 413362, 538161, 659546, 1085951, 444777, 231797, 417323, 875007, 1117483, 608157, 874821, 1008458, 962341, 255752, 524987, 794786, 26791, 133135, 66300, 478431, 674059, 538908, 596303, 585508, 515727, 406464, 440192, 370371, 170423, 270548, 65125, 334609, 305348, -31485, 112218, 105669, 383509, 541318, 499895, 480650, 532300, 196651, 186974, 294967, 324795, 137521, 99489, -650218, -685772, 54334, 236443, 11990, 149613, 324569, 269784, 31347, 310793, 460143, 420502, 259827, 110108, 148646, 135465, 194347, -121228, -450371, -401401, -9519, 224875, -406453, -242877, 235790, -20497, 21796, 164115, 22281, -180145, 89906, 50524]
2995E0524k0292L20375l08673j89521K80563J77030n0651k56521j65259k56338
2985d18763J34508J9724l5410N06464l66564L00210K85644K60887m96073j07461
2975H3166R1229p6928M6854m43547n05N6338j62378K92226K11418k0998o0627
2964A6248L61424K43788j45088p7515M39621k65149l81359q5702J96103r2536
2954B09835j7567J22348k63609M8259m17318K34867J84037l7584N0532P9030j99279
2943f449L19480n868k2166R5359J00722k49351J82316k7180l1399j7118j79587
2932A58759J04716P8094J60038r8275l76421K78656Q8704o4424J56649J64412
2922F50908O5383J02013M1557j39906n9424L789K2085M2400M1844m27138k05709
$$ y = [50524, 30232, 350607, 41934, -147587, 132976, 310006, 259355, 2834, -162425, -418763, -284255, -264531, -299941, 206523, -160041, 140169, 425813, 686700, 190627, 83166, 174395, 97467, 144321, -299226, -299731, -243393, -405771, -113545, 97873, 76875, 16248, 377672, 621460, 476372, 398857, 838478, 573329, 191970, 106268, 302371, 209835, 192268, 314616, 51007, 99266, -318052, -83185, 100852, 63268, 113800, 192830, -6449, 313031, 307163, 284997, 380356, 481078, 231727, 414043, 386863, 355464, 338346, 158759, 263475, 341569, 501607, 403332, 26911, 305567, 394271, 329847, 486496, 650908, 716291, 818304, 859861, 719955, 660531, 664320, 686405, 728805, 770649, 343511, 137802]
2911A37802j51324K74167M75036m2123j11093M62875J15249l87379K13351R4938
2901A081499l39406M0145J31697l14012K0542M0862j5840r3206j20792P35081
2891A166570K37549l21263j39782k15830J63101O0399j25919l639q7548k8435
2881G05203O9933j66902L01977J11837n21397L80897N73992k33871l67815j71212
2871F82642K8125J27078j03387J32256l0163j79277j08812j85115K42322K32297
2861H37966L3945m7220L64256l26838k14217J56451j46793j09414k45953J23636
2851D25819K84038k950L27418r8716n01731O5193P33328m38243p45219L70965
2841D19902L87606m49855o49800M74437J60243m84150L12124O45906o05289k50610
$$ y = [137802, -13522, 260645, 735681, 693558, 582465, 1045340, 1160589, 773210, 986561, 1081499, 742093, 782238, 913935, 599923, 620465, 661327, 645487, 552281, 431489, 1166570, 1404119, 1082856, 943074, 727244, 890345, 950744, 824825, 821186, 733638, 705203, 775136, 608234, 910211, 1022048, 500651, 881548, 1455540, 1221669, 853854, 682642, 710767, 837845, 734458, 866714, 836551, 657274, 548462, 363347, 605669, 837966, 871911, 824691, 1188947, 862109, 647892, 804343, 657550, 548136, 302183, 425819, 709857, 706907, 1034325, 935609, 433878, 499071, 1232399, 794156, 48937, 419902, 807508, 357653, -292147, 182290, 342533, -141617, 170507, 816413, 211124, -39486]
2831c9486j10502O46465n04432P9554M81921J87073n21402j68272M29999k26009
2821B54909k20478J97147J66982l49082k78943J70477j61080j84970j19140K29044
2811b95134M25589q068J89515Q3633k29482j42233J83741Q6158k59450K04219
2801B38488R0651k74679k33664J2526K96067r5109J60572J6397J68397m57867
2791g8221N5847l8305Q7520J54846J74884N8598J22465j48680k74497l48499N44210
2780C10168j38210k40313j23652N83239j97227k51574O1391K79053j11988J10798
2770B81685l96887j5995K51331K47375m41585j51500M58301M99520K55121o99003
2760B88363J73440J24661m8769k58230k66134p0931L56186l75437J10438K62776
$$ y = [-39486, -149988, 496477, -7955, 71599, 553520, 740593, 219191, 50919, 480918, 254909, 34431, 231578, 398560, 49478, -229465, -58988, -220068, -405038, -524178, -295134, 130455, 122387, 311902, 395535, 166053, 23820, 207561, 293719, 34269, 238488, 329139, 54460, -179204, -166678, 129389, 34280, 194852, 211249, 379646, -78221, -22374, -60679, 26841, 181687, 356571, 415169, 537634, 388954, 114457, -234042, 310168, 171958, -68355, -192007, 391232, 194005, -57569, 3822, 282875, 170887, 281685, -115202, -131197, 120134, 367509, -74076, -225576, 232725, 732245, 987366, 288363, 461803, 586464, 537695, 279465, 13331, -57600, 298586, -76851, 33587, 296363]
2750B96363N05401l18028J03818M27641K13447j97613m94902J29858l0240J03900
2740G39645L24402m03144K74493m43252n4595J6417j51683M47432l18838k25474
2730B05403j9373K97975j43717k37742j15011J41165K99266j62702j73265K94534
2720C86533n2637J00464l56892o2080M24730k92071P1221O8958J02817j10401
2710B80642p2071l97733L9061K92453Q656k5775k95192k47207J61316p237J10936
2699a52151j07961L45644j84619k43830r7887N46880J3231k50317J83026K97487
2689C49503n69804P7567K31285n7198p33190K13014M87728j95164j31223J91564
2679a35918Q7286K7154p4588N28108k99189j63336k43723K76502M8447m77766
$$ y = [296363, 801764, 483736, 587554, 1015195, 1228642, 1031029, 536127, 665985, 635745, 739645, 1064047, 660903, 935396, 492144, 437549, 453966, 302283, 749715, 430877, 205403, 186030, 484005, 340288, 102546, -12465, 128700, 427966, 265264, 91999, 386533, 333896, 434360, 77468, 15388, 440118, 148047, 219268, 288226, 391043, 280642, 208571, -189162, -150101, 142352, 151008, 125233, -169959, -417166, -255850, -263087, -152151, -260112, 85532, -99087, -342917, -440804, 106076, 119307, -131010, 52016, 349503, -220301, -142734, 88551, 31353, -701837, -488823, -1095, -196259, -327482, -135918, -48632, -21478, -96066, 432042, 132853, -30483, -274206, 2296, 50743, -427023]
2669d27023k37574k52317L10279K67887K61264o6133q8923k93040K98085K29256
2659A761j00860l27429M98433k63814q1496k71098M39940r5674j06602l19735
2649f26574J72179j24619l828l0545M38974r8810j23123K07407J87623k00225
2639b01541L71132M13953J3765n19573n42655N31654k7483o74551r3242M94381
2629b34160m97942m89016P24666O37357l89988o4681L94486M37844m52407L32426
2619C98585N0898l07053k55003k8429M23727p96004M3637K62566m36083j18188
2609g61347L79665L2151M8597j16917L90565k1588j10927j16154M71348n00185
2599c04792L3047p8510j50189K14325L386j03478J53801K02206J61619j55834
$$ y = [-427023, -664597, -916914, -606635, -338748, -77484, -143617, -232540, -525580, -227495, 1761, -99099, -426528, 71905, -191909, -273405, -544503, -104563, -200237, -306839, -626574, -454395, -579014, -582842, -613387, -174413, -273223, -396346, -188939, -1316, -201541, 169591, 583544, 597309, 77736, -464919, 66735, 39252, -635299, -728541, -234160, -732102, -1221118, -496452, 140905, -249083, -313764, 80722, 518566, 66159, 398585, 449483, 142430, -112573, -141002, 282725, -513279, -469642, -207076, -643159, -761347, -381682, -349531, -300934, -417851, -27286, -48874, -159801, -275955, 195393, -304792, -271745, -350255, -500444, -286119, -282733, -386211, -232410, -30204, 131415, -24419]
2589b4419J5604K25279l43179j91324K30925K9653l27739l55226K92914q7968
2579e35480J9023R0630L02885j14869j08245L26906j76519N63460k24693l18363
2569a75265J67199P0020l02457N54288k95638m19528N9257M28189j09732m65006
2559d88673p4695J34406Q2591j57454J61402M69487k60384j27758K0949K72133
2549C2004l33193J68547J87692p4089j11578J75932k07484j80240R2944j82629
2539d32094P4193L97047K0810j76255J09871K13784M7469o9477l35766j2813m9153
2528b12384Q207m69238L77394Q6740J37271l90326j36261L87379M28718l68287
2518a50787p6898L83037r4090l55508K29296k32626r2168L29306J88807k08329
$$ y = [-24419, -8815, 216464, -126715, -318039, -87114, -57461, -385200, -740426, -447512, -535480, -516457, -425827, -122942, -237811, -346056, -19150, -195669, 367791, 143098, -175265, -8066, 61954, -240503, 313785, 18147, -401381, -342124, 86065, -23667, -488673, -563368, -428962, -346371, -503825, -342423, 127064, -133320, -261078, -240129, 32004, -301189, -132642, 55050, -19039, -130617, 45315, -162169, -342409, -249465, -432094, -357901, 39146, 59956, -116299, -6428, 207356, 254825, 185348, -150418, -163231, -212384, -204177, -673415, -296021, -209281, -72010, -462336, -598597, -211218, 217500, -150787, -227685, 155352, 61262, -294246, -64950, -297576, -389744, -60438, 128369, -79960]
2508g9960j91340L64920l1467k73254J54545n92967Q1936O75018k55558J30753
2498a7374j00401m0213M78006J61009n76527N5799J87072j32109l64068m82712
2488h31518j52325Q30650r5170R2667L1774q4931r0636M17852K32801l80242l71905
2477d00983N35770j76280k78933M5446J41258j261O1157m75320K09695N60803
2467B21352k17378k77877J4965r4161K26108M8622j49816k38769p668L11198K55218
2456I1794k15106k80047L53399K07636J2024j78798K63527M3684n45279J78435
2446f8731q395j68227n889k14949j13184K87999M43178j30989J09519p9540k27509
2435a76717L88473q493k68671J39367J57391l82939j66778N51228l18781j24189
$$ y = [-79960, -271300, 93620, 62153, -211101, -56556, -649523, -567587, 107431, -148127, -17374, -117775, -157988, 320018, 481027, -95500, -39701, 147371, 15262, -348806, -831518, -983843, -153193, -248363, -155696, -123922, -208853, -299489, 118363, 351164, -29078, -400983, 134787, -41493, -320426, -274980, -133722, -134983, -73826, -549146, -339451, 221352, 3974, -273903, -258938, -353099, -126991, -78369, -228185, -466954, -474622, -163424, 91794, -123312, -403359, -49960, 157676, 169700, -9098, 254429, 298113, -247166, -68731, -77126, -245353, -251242, -466191, -579375, -291376, 151802, 20813, 130332, 50792, -176717, 211756, 203263, -65408, 73959, 231350, -151589, -318367, 232861, -85920, -210109]
2425b10109n676J18387M29323k85255n7422K93568j52425k50140J5100J49712
2415D5063j70219l925q8576j68911O06403R5327m55657K84876J09201l70931J40692
2404B3343L43256l01111k07663Q2048q0038J78094o40288K53386K27967J37716
2394A6710k6561M64609k40638o163L20977j50015K3225l16706M419k69983l82449
2383e62575J74792J53470K8240j78446J54963J22251R7623K17158K84698O2692
2373E54866l13118J75064K69503l47096j99345K91923l5309o0512m25478K49811
2363A60309k79961J96425r719J27381J86871k0457l3975l34621J43949J33545
2353B69747j43287J61035k27122K39066J86673j34564K46275j51293l05928p9601
$$ y = [-210109, -215785, -97398, 331925, 46670, -10752, 282816, 130391, -119749, -104649, 45063, -125156, -129081, -217657, -386568, 219835, 315162, -140495, 144381, 253582, -117349, 23343, 366599, 65488, -142175, -60127, -140165, 37929, -602359, -348973, -121006, 16710, -9851, 454758, 214120, 207957, 528934, 378919, 402144, 85438, 89857, -180126, -562575, -387783, -234313, -206073, -384519, -229556, -107305, -9682, 207476, 492174, 554866, 241748, 416812, 686315, 339219, 139874, 431797, 396488, 335976, -89502, 160309, -119652, 76773, 67054, 194435, 381306, 360849, 326874, -7747, 136202, 269747, 126460, 287495, 60373, 299439, 486112, 351548, 597823, 446530, 140602, 61001]
2343F1001O1961M7790j73514k3943j42804J46977P2589l0342M33752q0871k7394
2332C45202O3665j39172j37609R5222K3755j39544K1683n4141k65337L31746L560
2321A49030l80595L81111J14360o4234k84144J17706k48007K67732J87830q2096
2311A58693M34386l0826k6832j58717m81698J09380r6269J47385l31288J05844
2301a69942P7533m11460L07835L41401J73014m7744J15574K97369m61624j89213
2291C2743p0142N4316k46334j59766n8053k4739j38626K39129P39567J07548n9948
2280D15695K27240P7859m10595J05059l9772j29806k27550j89750J62414p2633
2270h1839r000Q4736K44204m25233J9700N56633p7482j03918J68520K14941n61924
$$ y = [61001, 122962, 170752, -2762, -26705, -169509, -22532, 50057, 19715, 453467, 372596, 345202, 408867, 269695, 132086, 227308, 251063, 111519, 133202, 79061, -186276, 145470, 149030, -231565, 149546, 263906, 199672, -84472, 33234, -214773, 52959, 240789, 158693, 593079, 562253, 535421, 376704, -104994, 4386, -91883, 55502, -275786, -169942, -92409, -503869, -196034, 145367, 318381, 270637, 386211, 683580, 221956, 32743, -37399, 16917, -229417, -389183, -447236, -471975, -610601, -371472, 368095, 475643, 415695, 642935, 720794, 310199, 415258, 375486, 245680, 18130, -171620, -9206, -81839, -90839, -6103, 238101, -187132, -167432, 389201, 311719, 207801, 376321, 591262, 29338]
2259B9338q4622J14176L0411p7071J89441N07382p2927n15579O6031L11157n8444
2248D39293j64218L02079j05126k62169l18919L26601L6875k91658L03665J11828
2238C78251m98103L47530J30835m8430k3011J45171K86900j02234n75436L20195
2228C61668J99313k99633k47649K41848l35353J73920K53027k45449L48854O868
2218D57414K69237j77561k95122J07691q8933J50765l23367K27288Q8686k8079
2208C88019J22962K50323L72553k93444j23647N4292l7122N8535Q9903j83239
2198F99135j78749j58015n4120k75342K81360K88292L98860l83213Q6696N09701
2188A214605l70932k11936K95758Q7709M2251j82832j39147N3997J51010l5464
$$ y = [29338, -55284, 58892, 89303, 12232, 201673, 709055, 636128, 120549, 186580, 497737, 439293, 275075, 577154, 472028, 209859, -109060, 217541, 254416, -37242, 266423, 378251, -119852, 227678, 358513, 310083, 287072, 432243, 719143, 616909, 41473, 361668, 560981, 261348, 13699, 255547, -79806, 94114, 347141, 101692, 450546, 457414, 726651, 549090, 253968, 361659, 272726, 423491, 100124, 327412, 416098, 388019, 510981, 761304, 1133857, 840413, 716766, 771058, 733936, 792471, 882374, 699135, 520386, 362371, 308251, 32909, 314269, 602561, 1001421, 618208, 704904, 1214605, 843673, 631737, 927495, 1015204, 1057455, 874623, 735476, 789473, 940483, 905019]
2178I05019p5756J63721r3641M69124j94438j98735r2035j10650k44880J17973
2168F45702J53132l5215J45750M23096k12375K59388J92936K06006l96199J13992
2158A496213P2783J49911l7583l96476L4803k98250L96039j4306n5094M74018
2148A822058K32079m5002K56651k66437N4835K0033P7223j40488M82509j80861
2138B312600J86735J66543m8241J92754k304K08361L76780k10481M93302J12163
2128C788212N5555Q8547R0444n9689L88686k13840L9330N33083j51615M62425
2118E021138J95968o2254O96276K30528K49729O57673N4901N97819N78454L01786
2108H522018P40606O65824L20671K25585O19779N67537J509825J126789J217696
$$ y = [905019, 829263, 992984, 899343, 1368467, 1174029, 975294, 883259, 772609, 527729, 645702, 798834, 763619, 909369, 1332465, 1120090, 1379478, 1572414, 1778420, 1382221, 1496213, 1568996, 1718907, 1681324, 1284848, 1319651, 1021401, 1417440, 1403134, 1348040, 1822058, 2054137, 2009135, 2265786, 1999349, 2054184, 2074217, 2151440, 2010952, 2493461, 2312600, 2499335, 2665878, 2617637, 2810391, 2808087, 3016448, 3393228, 3182747, 3676049, 3788212, 3843767, 3932314, 4022758, 3963069, 4351755, 4137915, 4177245, 4710328, 4558713, 5021138, 5217106, 5154852, 5851128, 6081656, 6331385, 6989058, 7043959, 7641778, 8220232, 8522018, 9262624, 9928448, 10249119, 10474704, 11094483, 11662020, 13171845, 14298634, 15516330]
2099A5516330K324897K706397L568127M609583N735352P068166Q262794P692575
2091E7484221L655872j886028q460457j1879974r831550o641177l800647k531898
2083A6108362k537767j656260j196560o22517q05261o66557l55411q33177m94581
2074F940271q39396p17103n59093l14362o1230j83835l04519m53177j03998R2636
2064C496194o92445k9758j19294k80298j6474p0270J8434m53413j46132M688j09460
2053A601772k98027K86477K34209n31983J72663m2064k9531J27335P7169r7948
2043A500072j28729j94102j87151j47034K80503j49800q4113m27583N25917J14380
2033A102360l25551P423j71706Q1117l7524O0228J51718j97219O7321M36042k91582
$$ y = [15516330, 17841227, 20547624, 24115751, 28725334, 34460686, 41528852, 49791646, 57484221, 61140093, 59254065, 50793608, 38913634, 29082084, 22440907, 18640260, 16108362, 13570595, 11914335, 10717775, 10095258, 9289997, 8623440, 8268029, 7434852, 6940271, 6100875, 5383772, 4824679, 4510317, 4449087, 4265252, 3960733, 3507556, 3403558, 3496194, 2803749, 2773991, 2654697, 2374399, 2357925, 2287655, 2306089, 1852676, 1706544, 1711232, 1601772, 1303745, 1590222, 1824431, 1292448, 1465111, 1423047, 1393516, 1520851, 1598020, 1500072, 1371343, 1177241, 990090, 843056, 1123559, 973759, 889646, 462063, 987980, 1102360, 776809, 784232, 612526, 693643, 656119, 716347, 868065, 670846, 738167, 1174209, 882627]
2022H82627l80639N32298j37209m64571o8516j71128J19495j29493O1483M58642
2012G02989l82078q7039L08595J87903j60303k35179M53339J84587q5784m11414
2002D75616n4923q6505n9952L79839o63637n0240N2892K28761r0388j46516k1195
1991c6248N34802k00181J886J06175J9751p9241j9587j77532J00995R6836r5985
1980B51671l00970M934P4022N3542J13683L3500j29452J23067J09426j15826m3378
1969A74219k506L0221l38598J79211J8960K75363j08351J81774N2395N6126j54340
1958C64474p6805j82301k00477o6960J31534l88664N47921j04726n5503N0166
1948A8659J54438J68164r499L9611j25323k33346k26550J09595O1857k53272K70418
$$ y = [882627, 501988, 1034286, 897077, 432506, 363990, 192862, 312357, 182864, 244347, 702989, 320911, 233872, 542467, 730370, 570067, 334888, 788227, 972814, 887030, 475616, 420693, 334188, 274236, 654075, -9562, -59802, -6910, 221851, 131463, -15053, -36248, 498554, 298373, 300259, 406434, 426185, 346944, 327357, 149825, 250820, 347656, 251671, -49299, -44365, 29657, 83199, 196882, 230382, 100930, 223997, 333423, 217597, 174219, 171713, 201934, -136664, 42547, 61507, 336870, 228519, 410293, 462688, 518814, 364474, 287669, 105368, -95109, -162069, -30535, -419199, 128722, 23996, -31507, 18659, 173097, 341261, 331762, 371373, 246050, 12704, -213846, -104251, -42394, -295666, -25248]
1937b5248n0575K26899O7258l80000K64258M29164j84285l7602n907j74721J57771
1926B87012l23171j35520L79046O301m3156j2752k69733L8105L35111L4005j77773
1915A17475m5224k8988j49262K66420j568n8060j14184J5577k21523l9528l3333
1904b92198J67779J33683m33030Q8250M94100k54839J8369L33313Q9919m04152
1894e8806K52796j4172k01912k18704R5K24933k51960j87865L45713j2853j93925
1883c16660N05362R1590l14992J47979K35757q7548l33779O7058J70602k83231
1873a17862k39028K43907K16583m01199L4991K15410K87159r34n65660L15421
1863a1212J50574k24020J87109m27972K45352L21431k85367q5539J19583j45620
$$ y = [-25248, -75823, 151076, 218334, -161666, 102592, 531756, 347471, 309869, 303962, 129241, 287012, -36159, -171679, 207367, 213668, 170512, 157760, -111973, -73868, 261243, 295248, 117475, 72251, 43263, -105999, 160421, 158853, 100793, -13391, 2186, -219337, -258865, -292198, -124419, 9264, -423766, -335516, 158584, -96255, -77886, 255427, 345346, -58806, 193990, 179818, -22094, -240798, -240703, -15770, -267730, -455595, -109882, -122735, -316660, 188702, 280292, -34700, 113279, 349036, 261488, -72291, -5233, 165369, -117862, -356890, -112983, 103600, -297599, -262608, -47198, 239961, 239027, -326633, -11212, 139362, -84658, 102451, -325521, -80169, 241262, -44105, -129644, -10061, -155681]
1853a55681K32137n801j58166J70690j47106k10229P68235k89966j6269J15223
1843C03067j21729J24671k61263P6074j13833m21162J63933l1779j87636o4392
1833e34049N38778k7128J32161k96496J10064K28971L5817k8158K82928l43552
1823I9336K74061k15378n09983M01671n6255j41661L78867J657r7590J44647J50143
1812D29515m19817j7772o2037N8993m07355k79976M49680j71916J29408L15948
1802B4671M45114k96915k19746J91557j71911k01568K12287k01318L0870k31597
1792d18556L11980L24486l42016p6687l06920J31960L46986l3157O7428J2444
1782A7948J1778m11925L26430K18046l6685l10152m88L50598n24857j86947K70196
$$ y = [-155681, 76456, 70655, -87511, 83179, -63927, -274156, 494079, 204113, 187844, 303067, 181338, 306009, 44746, 120820, 6987, -414175, -250242, -282021, -469657, -534049, 4729, -22399, 109762, -186734, -76670, 152301, 188118, 159960, 442888, 99336, 373397, 158019, -351964, 49707, -6548, -148209, 230658, 232315, 134725, 279372, 429515, 9698, -8074, -70111, -11118, -418473, -698449, -248769, -420685, -291277, 24671, 469785, 172870, -46876, 144681, -27230, -228798, -16511, -217829, -186959, -418556, -106576, 217910, -124106, -200793, -507713, -375753, -28767, -61924, 5504, 17948, 29726, -382199, -55769, 162277, 125592, -184560, -185048, 165550, -359307, -546254, -276058]
1771b76058M42916k57564l5087K47938M6960k88114J04705l44265N06937q7174
1761F1194k41454k6828n6588P8465K80663J91711k86813J35190l89503j27235
1751c81198J68706l13123J93434j71775k05387O22020K1177J65508o0014O09542
1741F48890l45085q441k58896J55076k87384m7768k31120R3131k04425J69960
1731c16062l33126M41100M26124N2183k42954n2980J96451k77681l78357K2476
1721d62826J5450J68248J7294P6950K12854j48925p13J44009k06775j4759M6334
1710a52859j1193L4188Q4537J24992k6070j80101K86932K97418n12423Q99J1037
1699d2643J63327k91875m65558L1709N01413k51740j57089L05699L20743J90623
$$ y = [-276058, 166858, -90706, -125793, 122145, 169105, -119009, -14304, -358569, 148368, 61194, -180260, -207088, -263676, -185211, 95452, 287163, 350, 135540, -253963, -381198, -212492, -525615, -332181, -503956, -709343, -87323, -66146, 99362, 39348, 648890, 303805, 295364, 36468, 191544, -95840, -143608, -374728, -281597, -486022, -316062, -649188, -208088, 218036, 270219, 27265, -25715, 170736, -106945, -485302, -462826, -447376, -279128, -261834, -184884, 27970, -120955, -121668, 22341, -184434, -199193, -152859, -164052, -129864, -45327, 79665, 53595, -126506, 160426, 457844, -54579, -53680, -42643, 120684, -171191, -636749, -605040, -103627, -355367, -512456, -206757, 113986, 304609]
1689C04609m2824j16684r4344j70699l628K5559m81441K42869K93927k57676P5721
1678b24611m7797K84784J21952r7674k1003N48406k82239r9469k26488l54937
1668c99076l15493K82572n5649Q8355P7944K8255j24063K42147K20304K4918L05255
1657C75469m9493j48551J93186l34382M5640j27279j54037k7603O8101j79733
1647c38682p4268M81759j67108m26626J40104M52452k77244m9826K81596j74740
1637a52583L61283j49332j82795K16925l30647j55152K25250J39162j35095J32379
1627c0605j67297q4407O94571n5385m57399O3768j39762j89060L8859N7584K1387
1616b47746J39542Q9380m41283K6373P28975j94075r1298p7490O6174k59717j76060
$$ y = [304609, 261785, 145101, 50757, -119942, -123570, -98011, -579452, -336583, -42656, -300332, -224611, -272408, 12376, 134328, 36654, 15651, 564057, 281818, 182349, -44139, -399076, -714569, -431997, -487646, -399291, -321347, -293092, -417155, -175008, 45296, 70214, 375469, 325976, 177425, 370611, 36229, 81869, -45410, -199447, -227050, -158949, -338682, -412950, 68809, -98299, -524925, -384821, 67631, -209613, -259439, 22157, -152583, 208700, 59368, -123427, 93498, -237149, -392301, -167051, -27889, -162984, -30605, -197902, -282309, 412262, 356877, -100522, -36754, -176516, -365576, -326717, -269133, -247746, -108204, -18824, -460107, -433734, 295241, 101166, 9868, -67622, -1448, -261165, -437225]
1605d37225Q877M67895j91771l47598O69056J67775J28664m093l65124J5528k37528
1594a25544O5898j63686k31089Q0611L07373J21293l61742j35425O6527L85678
1584I894m14050r0191M54476k38275k50646J90728K1920k62097K75827K40944
1574f1470P2802n48137j64257N98067p9025l52396K37690K08617j18490O0153
1564a46446j48588J24597j02102l4562O214m3843M3632K22685o9028q1049j59354
1553c87844m7822P9189q6927L8847K74583j47709q5878j86528L80660O5391r7277
1542b01315J47911J43913j82219o15899P10161j9691j75425m03071m1582K33389
1532d03828J68129k70238r8529K11212J50758l02281o7220K82035M70928p0840
$$ y = [-437225, -428348, 39547, -152224, -499822, 169234, 337009, 465673, 461580, 96456, 111984, -125544, -59646, -223332, -454421, -373810, -66437, 54856, -306886, -442311, -375784, 9894, -404156, -494347, -39871, -278146, -528792, -338064, -316144, -578241, -302414, -61470, 11332, -536805, -701062, -102995, -182020, -534416, -296726, -88109, -206599, -146446, -295034, -170437, -272539, -307101, -300887, -344730, -301098, -78413, -147441, -228490, -387844, -435666, -356477, -443404, -404557, -129974, -277683, -363561, -550089, -169429, -104038, -201315, -53404, 90509, -91710, -707609, 2552, -17139, -192564, -595635, -637217, -403828, -235699, -505937, -604466, -393254, -242496, -544777, -611997, -329962, 140966, 70126]
1522G0126k48728J37568m3641k18157K94580l36219k24871M39458J46599l86437
1512c69722n732j91202J34152L83828N9665M16684k87563l25729N94991r5576
1502C13796n84565Q5035K38270k89721j92229p8618J60062j8868J55845M03017
1492A92024k19290l4435L13755K1188k82712J89365l82361J88714j86466l3421
1482b33639Q9818j51767J69936L78915o6630j38704k40315R9198L614K03448k31065
1471a17191K60053O8514P7368O899l80384K91617k07498k28445K10465k5190M6418
1460B626J49260j57956J47046L2693K35212L5582k05252j28199j69474j09451
1450a67913m5253J59357j92764K10464Q5114M3771M51376j18543j02617o2873
$$ y = [70126, -178602, -41034, -84675, -302832, -8252, -344471, -569342, -129884, 16715, -369722, -375454, -566656, -432504, -48676, 10989, 427673, 140110, -185619, 409372, 313796, -270769, -185734, 52536, -237185, -429414, -508032, -347970, -366838, -210993, 192024, -27266, -61701, 252054, 273242, -9470, 179895, -202466, -13752, -200218, -233639, -143821, -295588, -125652, 253263, 186633, 47929, -192386, -93188, -89574, 113874, -117191, 142862, 211376, 288744, 295643, -84741, 206876, -622, -229067, -18602, -43792, 2626, 151886, -6070, 140976, 173669, 408881, 444463, 239211, 111012, -58462, -167913, -213166, -53809, -246573, -36109, 49005, 92776, 544152, 425609, 322992, 260119]
1440B60119M6998j48179l51052J53535L8228q2901k05945K31107L55342L9402
1430C36654K7625L04239M1578j84858l30781K36268l74547k12771K17325j73590
1420a12858m4305m10445M16762P6062L03583n4345o540J74348m7978l46208N26649
1409D74725j94532k82707J76255m39128k43136M96275N69799k88589j74546k28208
1399a33792K39227L33278m37261J168J17071N1210k60272k6912P5839j79144K2132
1388a97456m3453N32005J9486j77187k88908N85198j34435l13876K51046l1708
1378B00712n71958K7761N07226j83942j24691j76874L35387k4101K0622K75369
1368B85511K7229l95771L38996l5651j86487J19504j85119J76937k92751l95137
$$ y = [260119, 307117, 158938, -192114, -38579, -351, -83252, -289197, -58090, 297252, 336654, 364279, 668518, 710096, 525238, 194457, 430725, 56178, -156593, 60732, -112858, -157163, -567608, -150846, -74784, 228799, 174454, 167914, 342262, 294284, -51924, 474725, 280193, -2514, 173741, -265387, -508523, -12248, 557551, 268962, 94416, -133792, 105435, 438713, 1452, 2620, 119691, 170901, -89371, -116283, -40444, -219588, -197456, -240909, 291096, 310582, 133395, -155513, 429685, 295250, -18626, 232420, 200712, -371246, -343485, 163741, -20201, -144892, -321766, 13621, -10480, 10142, 285511, 312740, -83031, 255965, 220314, 33827, 153331, -31788, 145149, -147602, -542739]
1358e42739J53294J76862k56636M01997J96469k3818R3499l15652M1042O6949
1348h733j98450j857L13223L073j47534j58668L02122M03538K0978m02477K78866
1337D04081m05326n713k43864J1281k2159k76433L83149L70962m22176L87255
1327A81057M98347n02222k37568R2764K38581l31245r2123K13276K7008l03245
1317b15370m7630M44033k87342J22272r7892J89531J29776m48221M1888l89658
1307e58613M96204l23515M25854k50323J26734P457k01107K73080K72341k92049
1297b3937J02053K36332j93656k16450K74737k05054L11221R5888l68340N4231
1287F7025J01906l05120N9787n1606M11317j6358m50853j01335o7699J89062L58205
$$ y = [-542739, -389445, -212583, -469219, -67222, 129247, 105429, 198928, -116724, -75682, -8733, -207183, -209040, 104183, 107256, -40278, -198946, 103176, 506714, 527692, 125215, 404081, -1245, -6958, -250822, -239541, -261700, -538133, -154984, 215978, -206198, 181057, 679404, 177182, -60386, 32378, 270959, -60286, -152409, 60867, 87875, -215370, -263000, 181033, -106309, 15963, -81929, 107602, 237378, -210843, -168955, -558613, -62409, -385924, 39930, -210393, -83659, -76202, -277309, -4229, 268112, -23937, 78116, 314448, 120792, -95658, 179079, -25975, 285246, 381134, 12794, 67025, 168931, -136189, -76402, -128008, 283309, 266951, -183902, -285237, -352936, -163874, 194331]
1276A94331J3226l75399M14952j63326l46709J80582J03520n4795l42808J29546
1266b46880L53294m3716L3859o8503k60702J12459M81895o11406J59261J81186
1256I0747k31975J8272k18977M53141j06198n8662O20074m22303j68064m1282
1246f5227M93895n68960k52115J07502N3524r2839J06214K56106k09125J28976
1236d2049O84221m25032n4051p3068j91562j90777n1904J83245k51536J63337
1226b49176j899J45743r5207p0555K66135j16754K21197L63022m38137m8637j10239
$$ y = [194331, 207557, -167842, 247110, 83784, -262925, -82343, 21177, -33618, -376426, -246880, 106414, 62698, 96557, 28054, -232648, -120189, 361706, -249700, -90439, 90747, -141228, -122956, -341933, 111208, 5010, -53652, 566422, 144119, -23945, -65227, 428668, -140292, -392407, -284905, -231381, -324220, -218006, 38100, -171025, -42049, 642172, 217140, 163089, 90021, -101541, -292318, -344222, -160977, -412513, -249176, -251075, -105332, -200539, -271094, -4959, -121713, 99484, 462506, 24369, -24268, -134507]
$$ [...]
##END NTUPLES=NMR SPECTRUM
##END=
