##TITLE=1H_CA-9030-4
 CDCl3
 8 sc, 
 8.07.2022
##JCAMPDX= 6.0         $$ Bruker NMR JCAMP-DX V2.0
##DATA TYPE= NMR SPECTRUM
##DATA CLASS= NTUPLES
##ORIGIN= UXNMR, Bruker Analytische Messtechnik GmbH
##OWNER= root
$$ XWIN-NMR		Version 3.5
$$ Fri Jul  8 13:56:29 2022 Russian Standard Time (UT+4h)  she@DPX200
##.OBSERVE FREQUENCY= 200.1313499994
##.OBSERVE NUCLEUS= ^1H
##.ACQUISITION MODE= SIMULTANEOUS
##.ACQUISITION SCHEME= undefined
##.AVERAGES= 8
##.DIGITISER RES= 18
##SPECTROMETER/DATA SYSTEM= spect
##.PULSE SEQUENCE= zg30
##.SOLVENT NAME= CDCl3
##.SHIFT REFERENCE= (INTERNAL, CDCl3, 0, 15.7667)
##AUDIT TRAIL= $$ (NUMBER, WHEN, WHO, WHERE, WHAT)
$$ ##TITLE= Audit trail, XWIN-NMR		Version 3.5
$$ ##JCAMPDX= 5.01
$$ ##ORIGIN= Bruker BioSpin GmbH
$$ ##OWNER= she
$$ F:/spectra/data/she/nmr/H-F/1/pdata/1/auditp.txt
$$ ##AUDIT TRAIL=  $$ (NUMBER, WHEN, WHO, WHERE, WHAT)
(   1,<2022-07-08 13:55:11.59 +0400>,<she>,<DPX200>,
      <created by zg, POWCHK disabled, PULCHK disabled
       configuration hash MD5:
       00 E9 B6 7A A2 85 ED C7 34 08 36 98 17 FE 4E 26
       data hash MD5: 16K
       04 C2 0C D2 CF A0 39 4D 00 55 0F A0 C8 86 72 CD>)
(   2,<2022-07-08 13:55:14.37 +0400>,<she>,<DPX200>,
      <Start of raw data processing
       efp BC_mod = 2 LB = 0.24 FT_mod = 6 PKNL = 1 PHC0 = -18056.88 PHC1 = 7.800677 SI = 16K 
       data hash MD5: 16K
       C9 9A C5 4A 7D 97 C4 0B F9 C0 AC 22 0C C5 C6 5A>)
(   3,<2022-07-08 13:55:35.15 +0400>,<she>,<DPX200>,
      <pk PHC0 = -2.985696 PHC1 = 4 
       data hash MD5: 16K
       D9 42 1D DA 2B 80 6C 6D D7 29 51 5B 8A F1 B9 C7>)
(   4,<2022-07-08 13:55:38.45 +0400>,<she>,<DPX200>,
      <abs ABSG = 5 
       data hash MD5: 16K
       77 0C EF DD 18 86 08 3F 3C 7C 73 60 C9 90 8C 6E>)
$$ ##END=
$$ 
$$ hash MD5
$$ 32 AA CC 3E 7C 76 58 03 D4 C1 6F 79 7C 6E 6A 4D
##$RELAX= 
##$RELAX= 
##$RELAX= 
##$RELAX= 
##$RELAX= 
##$RELAX= 
$$ Bruker specific parameters
$$ --------------------------
##$DU= <F:/spectra>
##$EXPNO= 1
##$NAME= <H-F>
##$PROCNO= 1
##$TYPE= <nmr>
##$USER= <she>
##$AMP= (0..31)
100 100 100 100 100 100 100 100 100 100 100 100 100 100 100 100 100 100 
100 100 100 100 100 100 100 100 100 100 100 100 100 100 
##$AQSEQ= 0
##$AQ_mod= 1
##$AUNM= <au_zg>
##$AUTOPOS= <>
##$BF1= 200.13
##$BF2= 200.13
##$BF3= 200.13
##$BF4= 200.13
##$BF5= 200.13
##$BF6= 200.13
##$BF7= 200.13
##$BF8= 200.13
##$BYTORDA= 1
##$CFDGTYP= 0
##$CFRGTYP= 5
##$CHEMSTR= <none>
##$CNST= (0..31)
1 1 145 1 1 1 1 1 1 1 1 1 1 1 1 1 1 1 1 1 1 1 1 1 1 1 1 1 1 1 1 1 
##$CPDPRG= <>
##$CPDPRG1= <>
##$CPDPRG2= <>
##$CPDPRG3= <>
##$CPDPRG4= <mlev>
##$CPDPRG5= <mlev>
##$CPDPRG6= <mlev>
##$CPDPRG7= <mlev>
##$CPDPRG8= <mlev>
##$CPDPRGB= <>
##$CPDPRGT= <>
##$D= (0..31)
0 1.2 0 0 0 0 0 0 0 0.06 0 0.03 0 0 0 0 0.0002 0 0 0 0 0 0 0 0 0 0 0 0 
0 0 0 
##$DATE= 1657274111
##$DBL= (0..7)
120 120 120 120 120 120 120 120 
##$DBP= (0..7)
150 150 150 150 150 150 150 150 
##$DBP07= 0
##$DBPNAM0= <>
##$DBPNAM1= <>
##$DBPNAM2= <>
##$DBPNAM3= <>
##$DBPNAM4= <>
$$ [...]
##$SUBNAM2= <"">
##$SUBNAM3= <"">
##$SUBNAM4= <"">
##$SUBNAM5= <"">
##$SUBNAM6= <"">
##$SUBNAM7= <"">
##$SUBNAM8= <"">
##$SUBNAM9= <"">
##$SW= 18.0517283424941
##$SWIBOX= (0..15)
0 0 2 0 0 0 0 0 0 0 0 0 0 0 0 0 
##$SW_h= 3612.71676300578
##$TD= 16384
##$TD0= 1
##$TE= 0
##$TE2= 300
##$TE3= 300
##$TEG= 300
##$TL= (0..7)
0 120 120 120 120 120 120 120 
##$TP= (0..7)
150 150 150 150 150 150 150 150 
##$TP07= 0
##$TPNAME0= <>
##$TPNAME1= <>
##$TPNAME2= <>
##$TPNAME3= <>
##$TPNAME4= <>
##$TPNAME5= <>
##$TPNAME6= <>
##$TPNAME7= <>
##$TPOAL= (0..7)
0.5 0.5 0.5 0.5 0.5 0.5 0.5 0.5 
##$TPOFFS= (0..7)
0 0 0 0 0 0 0 0 
##$TUNHIN= 0
##$TUNHOUT= 0
##$TUNXOUT= 0
##$USERA1= <user>
##$USERA2= <user>
##$USERA3= <user>
##$USERA4= <user>
##$USERA5= <user>
##$V9= 5
##$VALIST= <valist>
##$VCLIST= <CCCCCCCCCCCCCCC>
##$VD= 0
##$VDLIST= <DDDDDDDDDDDDDDD>
##$VPLIST= <PPPPPPPPPPPPPPP>
##$VTLIST= <TTTTTTTTTTTTTTT>
##$WBST= 1024
##$WBSW= 4
##$XGAIN= (0..3)
0 0 0 0 
##$XL= 0
##$YL= 0
##$YMAX_a= 453022
##$YMIN_a= -853809
##$ZGOPTNS= <>
##$ZL1= 120
##$ZL2= 120
##$ZL3= 120
##$ZL4= 120
##$ABSF1= 15.79868
##$ABSF2= -2.253171
##$ABSG= 5
##$ABSL= 3
##$ALPHA= 0
##$AQORDER= 0
##$ASSFAC= 0
##$ASSFACI= 0
##$ASSFACX= 0
##$ASSWID= 0
##$AUNMP= <proc_1d>
##$AZFE= 0.1
##$AZFW= 0.1
##$BCFW= 0
##$BC_mod= 2
##$BYTORDP= 0
##$COROFFS= 0
##$CY= -3
##$DATMOD= 1
##$DC= 0
##$DFILT= <>
##$DTYPP= 0
##$F1P= 0
##$F2P= 0
##$FCOR= 1
##$FTSIZE= 16384
##$FT_mod= 6
##$GAMMA= 0
##$GB= 0
##$INTBC= 1
##$INTSCL= 0
##$ISEN= 128
##$LB= 0.24
##$LEV0= 0
##$LPBIN= 0
##$MAXI= 10000
##$MC2= 0
##$MEAN= 0
##$ME_mod= 0
##$MI= 1.114404
##$NCOEF= 0
##$NC_proc= -5
##$NLEV= 6
##$NOISF1= 3.799351
##$NOISF2= 2.8
##$NSP= 0
##$NTH_PI= 0
##$NZP= 0
##$OFFSET= 15.76672
##$PC= 1
##$PHC0= -18059.87
##$PHC1= 11.80068
##$PH_mod= 1
##$PKNL= yes
##$PPARMOD= 0
##$PSCAL= 0
##$PSIGN= 0
##$REVERSE= no
##$SF= 200.130000964072
##$SI= 16384
##$SIGF1= 3
##$SIGF2= 2
##$SINO= 5.538805
##$SIOLD= 16384
##$SREGLST= <1H.CDCl3>
##$SSB= 0
##$STSI= 16384
##$STSR= 0
##$SW_p= 3612.71676300578
##$SYMM= 0
##$S_DEV= 0
##$TDeff= 16384
##$TDoff= 0
##$TI= <>
##$TILT= no
##$TM1= 0
##$TM2= 0
##$TOPLEV= 0
##$USERP1= <user>
##$USERP2= <user>
##$USERP3= <user>
##$USERP4= <user>
##$USERP5= <user>
##$WDW= 1
##$XDIM= 16384
##$YMAX_p= 335285781
##$YMIN_p= -119900
$$ End of Bruker specific parameters
$$ ---------------------------------
##NTUPLES= NMR SPECTRUM
##VAR_NAME=  FREQUENCY,     SPECTRUM/REAL,   SPECTRUM/IMAG
##SYMBOL=    X,             R,               I
##VAR_TYPE=  INDEPENDENT,   DEPENDENT,       DEPENDENT
##VAR_FORM=  AFFN,          ASDF,            ASDF
##VAR_DIM=   16384,         16384,           16384
##UNITS=     HZ,            ARBITRARY UNITS, ARBITRARY UNITS
##FACTOR=    0.220516191357247, 1,           1
##FIRST=     3155.39365239965, 0,            0
##LAST=      -457.323110606125, 0,           0
##MIN=       -457.323110606125, -119900,     0
##MAX=       3155.39365239965, 335285781,    0
$$ Real data points
##PAGE= N=1
##DATA TABLE= (X++(R..R)), XYDATA
$$ [...]
9258 3472213 3506088 3552022 3583722 3647763 3722405 3829514 3905085 3996185 4124128 4228020 4355409
9247 4355409 4580408 4755674 4952053 5191133 5462111 5708060 5958016 6212852 6488077 6791686
9237 6791686 7048239 7248612 7395771 7515165 7630513 7697469 7716082 7780754 7804083 7787957
9227 7787957 7774047 7736609 7676173 7572303 7513564 7499662 7447099 7414586 7410696 7458621 7535459
9216 7535459 7590213 7601154 7569514 7455604 7371123 7215235 7047212 6974033 6927765 6929688 6918871
9205 6918871 6938708 6991533 7056221 7081757 7212352 7291763 7405533 7581858 7756398 7944308
9195 7944308 8071133 8118060 8038868 7939671 7713585 7556224 7358087 7208085 7145962 7127422
9185 7127422 7207675 7317904 7364378 7374941 7444838 7556119 7699607 7863381 8125902 8468701
9175 8468701 8773746 8987608 9062194 8940942 8668588 8297748 7943184 7549170 7198110 6902516
9165 6902516 6714015 6560237 6435449 6376850 6325629 6222856 6192368 6145571 6176174 6143842 6110549
9154 6110549 6112892 6183293 6134729 6061952 6032729 5938071 5761232 5622045 5468832 5354021 5273348
9143 5273348 5214250 5167600 5091047 5086082 5054840 5066889 5016920 4981360 4943173 4926889 4936002 4971112
9131 4971112 4987260 4969209 4972057 4936504 4826341 4735331 4665122 4538765 4427769 4351619 4270105
9120 4270105 4175146 4105743 4078053 4073815 4038483 3975696 3932898 3889206 3846598 3821126 3778387 3788950
9108 3788950 3823236 3810619 3876466 3870358 3850871 3774266 3767492 3752568 3668392 3604735 3589591 3559367
9096 3559367 3559701 3539540 3510628 3493259 3534731 3541468 3512969 3534110 3522496 3515179 3530963 3538613
9084 3538613 3560410 3621945 3652535 3685012 3712783 3711517 3728486 3734291 3765723 3762583 3792064 3832684
9072 3832684 3894429 3916578 3922598 3992797 3985965 4041526 4060374 4078955 4117100 4183094 4232822 4271812
9060 4271812 4337119 4318320 4371713 4466369 4551982 4608486 4655900 4712813 4794351 4863821 4917363
9049 4917363 4953755 5027609 5137045 5230362 5313788 5415264 5509369 5623887 5686511 5719883 5840286
9038 5840286 5987873 6069192 6133387 6216816 6312667 6448182 6573451 6698559 6844202 7012439
9028 7012439 7177522 7332431 7490110 7656963 7876933 8087400 8284500 8514292 8711967 8903065
9018 8903065 9150540 9384756 9591115 9856804 10140944 10379367 10674003 10971689 11315112 11685379
9008 11685379 12078026 12430638 12852988 13273870 13677788 14099278 14486318 14939614 15409423
8999 15409423 15935180 16539390 17194077 17975787 18896777 19942411 21226174 22671826 24236892
8990 24236892 25727180 27011733 27957603 28664489 29249235 29632748 29942218 30347261 30923636
8981 30923636 31817020 33047015 34622345 36531091 38933391 41920591 45771887 50435537
8973 50435537 55254856 59310262 61963636 63177900 63584006 63165820 61514069 59089949
8965 59089949 56707946 54929664 53757109 52956777 52328088 51804022 51540784 51547374 51882391
8956 51882391 52371312 53353778 55321109 58370611 62499910 67160372 71242480 73809331
8948 73809331 74406474 73810990 72483688 70143445 67520536 65368142 63973879 63373178 63307318
8939 63307318 63247795 63202595 63284354 63518483 64145157 65511268 67977310 71202855 74293904
8930 74293904 75970657 75866507 74380374 71919919 68764193 64543830 59857373 55914811
8922 55914811 53230592 51649723 50671941 50130304 49827552 49729809 49848811 50261130 50914102
8913 50914102 51861672 53514549 56132912 59182915 61576705 62328177 61071312 58279912
8905 58279912 54489455 50165490 45061009 39687633 35116554 31594164 28911238 26895979
8897 26895979 25343587 24127041 23210384 22425923 21729642 21009402 20237424 19424203 18591209
8888 18591209 17815205 17042728 16244653 15595875 15038323 14546860 14081914 13624787 13232039
8879 13232039 12832503 12460846 12185304 11916355 11623427 11305742 11001686 10725296 10462465
8870 10462465 10202582 9995296 9810816 9633742 9440555 9246893 9109511 9056015 8977320 8872238
8860 8872238 8802024 8653580 8595267 8509763 8373858 8209685 8079452 7907895 7706640 7547868
8850 7547868 7353225 7174879 7079977 6987177 6883497 6778158 6686199 6629095 6543870 6438630
8840 6438630 6361198 6298874 6200171 6128941 6101302 6116040 6083881 5967389 5970272 5906665 5897916 5801485
8828 5801485 5745226 5645354 5551945 5480791 5421162 5377100 5352525 5320430 5324659 5312352 5249946 5225867
8816 5225867 5229607 5243699 5235192 5283530 5299110 5260304 5322242 5324189 5253607 5227654 5179783 5102880
8804 5102880 5058901 4998586 4988030 5002833 4973332 4924674 4919237 4911546 4900504 4900084 4951137 4982321
8792 4982321 5030125 5089978 5132491 5111123 5105664 5141377 5253434 5320162 5398477 5520059 5683861
8781 5683861 5775746 5883534 5983135 6059239 6130792 6207166 6305615 6373394 6462124 6584315 6668638
8770 6668638 6768460 6903587 7030322 7215865 7346456 7466900 7627515 7757242 7843013 7979882
8760 7979882 8037243 8185337 8355845 8521202 8666548 8875527 9032110 9207398 9373762 9550807
8750 9550807 9763271 10049287 10287396 10564848 10866468 11117151 11288489 11444379 11606489 11846115
8740 11846115 11992891 12225664 12523605 12863636 13164882 13481793 13727466 13995023 14236195
8731 14236195 14546207 14861090 15342329 15870078 16517083 17217051 18064681 18955162 20029261
8722 20029261 21061991 22191621 23324000 24718726 26267421 28117269 30172239 32580619
8714 32580619 35141183 38109690 41655030 46022859 51170388 57306439 64248826 72805346
8706 72805346 83618176 98743113 119824058 145034911 171896761 197162471 207510399
8699 207510399 199018085 176037118 142926279 112798304 88902875 71627749 59644162
8692 59644162 51330348 45079728 40201256 36120116 32718742 29846601 27616895 25750146
8684 25750146 24234443 22908826 21826956 20868184 20041729 19261967 18549630 17806036 17153376
8675 17153376 16551526 15961886 15409236 14869419 14377165 13878590 13362991 12848955 12366200
8666 12366200 11862757 11319526 10862034 10439867 10056484 9711800 9481429 9246111 9005180
8657 9005180 8718364 8496238 8312775 8173143 8073400 7976285 7890197 7801102 7735323 7594779
8647 7594779 7474724 7333292 7240483 7066666 6918519 6783184 6672729 6607616 6556092 6510258
8637 6510258 6455580 6455344 6471019 6592234 6713857 6788808 6895267 6871414 6837291 6709104 6578323
8626 6578323 6457799 6323221 6151847 6021769 5946814 5834721 5696730 5613766 5508504 5515767
8616 5515767 5534280 5542498 5533513 5500177 5420067 5464049 5378272 5335797 5351680 5366127 5367500 5359781
8604 5359781 5429170 5461186 5532198 5544264 5536646 5559387 5598086 5602295 5605700 5644576 5632030 5596874
8592 5596874 5543397 5649150 5670200 5737168 5790674 5868866 5969558 6095552 6177765 6311880 6464835
8581 6464835 6537750 6566552 6628993 6699294 6837626 6918192 7038082 7183408 7466544 7658218
8571 7658218 7799430 8035905 8236025 8420221 8625478 8818705 8919162 8996136 9068580 9255607
8561 9255607 9399486 9596489 9719612 9820755 9876108 9961358 10072475 10107468 10229046 10378305
8551 10378305 10506803 10659511 10845486 11018555 11245398 11460453 11711271 12001807 12271107
8542 12271107 12504792 12756614 13086082 13437018 13827180 14223414 14660030 15189912 15755840
8533 15755840 16356983 16967099 17545184 18109415 18714098 19249141 19701145 20102393 20545676
8524 20545676 21033780 21570360 22190852 22887996 23688745 24677087 25802626 26975668 27817094
8515 27817094 28323392 28399871 28205004 27957930 27404057 26847007 26359339 26103450 26125064 26261964
8505 26261964 26447512 26681466 26924960 27220155 27577375 28056697 28612129 29388763 30415769
8496 30415769 31541510 32711923 33865163 34955739 36129832 37402422 38758704 40127499
8488 40127499 41735318 43748904 46225921 49159605 52784205 57257740 62800461 68896548
8480 68896548 74445588 78350417 80070905 79910788 78821431 77098921 73815088 69386295
8472 69386295 64964353 61340992 58690408 56508815 54443756 52413078 50573516 49003301
8464 49003301 47544208 46076622 44808693 44000737 43743090 43882660 44266330 44805286 45373276
8455 45373276 46171671 47223864 48633793 50325450 52312748 54910818 57919894 61242383
8447 61242383 64753129 68773927 73783387 79849192 86011032 91388170 95521929 98560997
8439 98560997 100507865 101111504 99162843 94450451 88348864 82285556 76618622 70638724
8431 70638724 64440688 58956612 54434741 50789678 47851538 45202844 42847728 40904755
8423 40904755 39375805 38071077 36977104 36072670 35333502 34759923 34320588 34052118 34008282
8414 34008282 34283298 34868156 35639524 36358021 36880126 37224119 37557932 38191591 39044852
8405 39044852 40173986 41839630 44250192 46982759 49136090 49794208 48921630 46868548
8397 46868548 44205124 41258579 37727530 33481233 29554517 26515941 24343709 22711738
8389 22711738 21484721 20467958 19708705 19046788 18430946 17714113 16919485 16172626 15423967
8380 15423967 14724200 13960101 13251748 12599133 11991363 11537912 11057997 10590292 10174806
8371 10174806 9802772 9372584 8988113 8676399 8339290 8023631 7775065 7565851 7336877
8362 7336877 7100845 6907440 6719150 6512742 6342136 6170977 6026000 5890171 5790618 5688290
8352 5688290 5577241 5480546 5353670 5257957 5150269 5049062 4922485 4730082 4632569 4539348
8342 4539348 4428655 4328869 4250190 4138055 4132093 4007499 3920652 3823348 3674885 3563205 3468487
8331 3468487 3431117 3392298 3319048 3283465 3219404 3142511 3080767 3068646 3033368 2978114 2966933
8320 2966933 2929626 2866995 2833052 2797254 2730119 2708281 2699948 2640745 2618270 2591277 2504305 2455089
8308 2455089 2437379 2436262 2391089 2379452 2355856 2292951 2278621 2290126 2306967 2301205 2255107 2193393
8296 2193393 2137904 2137888 2101099 2054993 2073896 2026445 2019872 2011717 1922426 1921442 1893271 1868180 1862976
8283 1862976 1858694 1861236 1831752 1802383 1747765 1735837 1782029 1789157 1762818 1744614 1741968 1745734
8271 1745734 1748974 1724688 1734097 1702332 1700385 1671819 1653892 1664669 1739465 1777243 1841252 1839978
8259 1839978 1801685 1798289 1792061 1791007 1734283 1676116 1637344 1608523 1555585 1542233 1477260 1457559
8247 1457559 1417005 1467719 1487354 1434279 1402313 1416284 1418277 1421631 1439090 1412192 1365394 1321950
8235 1321950 1364665 1391372 1377716 1425795 1497610 1542185 1534713 1530048 1587835 1723253 1832882
8224 1832882 1987273 2127664 2281209 2317260 2235954 2024292 1807799 1678095 1571936 1439026
8214 1439026 1340812 1269825 1205505 1145258 1078411 1033862 1009981 998618 973296 972342 966949 932407
8202 932407 916666 880263 907964 875828 846353 783226 840402 796325 730045 502237 583210
8191 583210 958217 907198 893870 829683 874782 876805 880572 782803 811402 807391 789413 778630
8179 778630 753344 742537 739773 703896 712321 704791 682167 677525 709339 712435 620837 588288 606381
8166 606381 664261 617795 563838 570116 586998 575400 567239 565450 574017 545712 581687 613096
8154 613096 597562 598898 599445 570672 533297 529738 560549 606825 601806 597780 627866 627680 590520
8141 590520 609703 605025 611084 617805 646328 653794 600057 608254 627924 582140 615264 590128 596479
8128 596479 605392 534108 549572 568968 602076 624493 611946 604586 588349 634952 679035 693693
8116 693693 670636 653490 681932 716067 742919 732121 756490 756879 742877 769440 716398 702587
8104 702587 708557 656435 701919 700169 698723 673575 681766 664068 662115 647525 675146 703077 668930
8091 668930 643237 660988 716217 699000 655383 667305 711169 649947 638523 687172 691640 674613
8079 674613 688906 729453 766930 783716 855726 910987 938743 1000762 996330 977781 990051 958354
8067 958354 974110 950842 931113 910902 854153 819285 811914 843920 795552 803842 845920 862664
8055 862664 852805 821711 801607 827090 833192 811622 774852 754827 735384 725849 725863 712290 718378
8042 718378 715229 704228 751317 700682 618606 629369 646865 639857 671381 668154 652017 627550
8030 627550 618683 624885 624296 605917 554750 541009 565453 580349 562929 555865 534037 507622 514318
8017 514318 491156 482446 547022 591967 532116 516492 508849 474569 462847 463709 454651 437411 440228
8004 440228 383594 324041 324456 321512 282342 291838 256534 258475 292918 293161 272321 268086 250048
7991 250048 246589 231100 218425 192542 245667 228125 231501 189332 162483 168982 183864 161578
7979 161578 125012 182120 193469 193268 183657 149344 167273 193620 177907 193006 207107 188078
7967 188078 157439 193350 139290 151222 151795 135673 164909 151233 121236 129899 150106 175461
7955 175461 166553 198963 170494 129487 141489 152637 154237 137726 134982 143274 103736 129767
7943 129767 128882 104221 134279 147020 133539 184375 204224 141235 112530 67957 77026 83554
7931 83554 127804 106069 82194 34840 50732 72030 69627 57355 84878 138260 133902 160169
7919 160169 159984 133383 130947 96500 50769 113275 132787 83504 83269 95892 83542 48862 93501
7906 93501 128479 130136 83022 114729 60729 62947 112557 114848 120525 119898 140261 164821 121129
7893 121129 106736 164404 132509 217059 253804 255159 252446 262798 244301 218822 207783 168752
7881 168752 153608 167883 120384 128658 140128 125210 137782 174462 145778 183051 141312 155898
7869 155898 161175 159835 170758 167415 146994 95507 86781 112168 148555 126695 150399 124928
7857 124928 133912 114450 86279 84180 93786 80723 103864 82803 73881 138494 128380 130596 131711
7844 131711 70018 67576 81915 109183 137189 140670 100654 44609 80036 88316 73562 93353
7832 93353 105317 84232 109290 107951 88529 119481 152666 107652 81557 107593 89101 105634
7820 105634 123201 152036 146664 151218 157052 156202 127096 221207 215909 104697 53349 -3840 23774
7807 23774 46414 46427 41107 52796 114918 67494 35902 31502 54154 33216 47549 104009 73707
7794 73707 60817 69911 40886 55847 96072 78265 61548 62876 59098 75172 96984 102511 107698
7781 107698 123563 67183 55914 101938 107905 76223 82311 91075 129422 123526 72104 81732 100676
7768 100676 106510 85303 63189 47237 94233 72498 18966 34476 69809 68356 71761 46977
7756 46977 82446 27410 38152 55668 73559 45408 13672 37151 80574 49329 67042 87211
7744 87211 39146 73985 75840 68328 72985 83240 100879 96033 80368 57701 90619 94511 75549
7731 75549 42611 68831 32850 18131 4442 -3841 71294 54594 33950 58545 85023 68754
7719 68754 26530 11685 16103 26951 31697 50863 73626 73240 89163 115734 138364 148763 155279
7706 155279 113090 75456 83641 115774 87491 112978 108587 90969 103017 138876 128831 133250
7694 133250 162352 145597 103891 75244 90951 101867 95401 79588 89201 88408 54156 63725 50175
7681 50175 79246 66654 115335 58607 4093 4617 7819 16506 38736 49128 43025 46932 76738
7668 76738 101158 75812 61476 73929 89848 92036 56093 20725 34725 90958 123265 44306
7656 44306 63635 55528 53898 79105 83815 120541 120325 101608 73976 86907 56963 14522 20083
7643 20083 25956 14699 43462 74912 38689 60571 -4840 19914 56486 80982 30982 -22196
7631 -22196 6912 49616 34655 32254 38712 30062 9903 24499 12315 5190 -2666 34439 20559
7618 20559 -24719 -5383 6509 74356 49586 54303 -2672 15735 43327 41800 59430 37591
7606 37591 64486 55264 45548 71529 117393 77014 39288 110573 116323 64005 66801 67280 45589
7593 45589 30154 28283 25002 -19744 -15009 36166 56760 38666 47406 47754 45117 31435 38121
7580 38121 36982 28399 30350 37961 53033 33074 77304 100234 62756 76583 64479 58756 57811
7567 57811 51288 96117 122859 80696 49701 16342 45712 103879 95840 67762 76840 112608
7555 112608 102471 71785 102812 75882 84437 117033 69077 82645 126944 119399 82292 80605
7543 80605 69952 89700 63240 62184 74426 68730 125369 115364 100753 97386 134756 125586 98918
7530 98918 82544 79590 117608 136557 158638 101435 82957 110291 124233 108637 131835 132270
7518 132270 112946 79020 72259 88979 91066 110034 133147 138040 158799 140046 68863 62505
7506 62505 78438 86366 93673 121497 147853 150999 138152 93269 119854 155557 178129 182524 162104
7493 162104 157347 139263 123502 146801 159279 165547 168442 131991 153950 139834 105110 149653
7481 149653 196777 178055 176266 148760 148597 178497 212431 244382 207710 202792 208866 194302 195785
7468 195785 241879 265586 248295 312269 318194 310227 336843 322214 329280 373700 391983 424740
7456 424740 439850 409149 410447 417018 415866 384788 410096 378913 425518 414374 424243 444245
7444 444245 415131 388801 358534 360967 355651 368863 336137 320514 332591 324857 280174 319977
7432 319977 352437 351043 332226 357539 374160 395121 356393 374686 376256 379166 419521 443074
7420 443074 453511 489284 481031 449620 425752 394756 384776 396062 400532 415944 424137 420138 390528
7407 390528 381162 436678 458857 427470 442855 497066 476457 509547 571180 619418 670673 669304
7395 669304 642662 629242 605044 614829 570350 542232 447310 452280 406938 326713 310712 279972
7383 279972 300642 298906 318388 339698 318196 251957 222902 217701 207835 204881 170065 165038 202519
7370 202519 254111 246859 270045 282972 286431 250958 187943 210207 233662 220854 185562 185532 204537
7357 204537 199570 159408 142441 182549 192658 163573 157202 167598 191843 146511 152662 228159
7345 228159 255274 241456 221458 218327 170588 192927 223810 196959 204178 185381 218180 256794
7333 256794 249568 221912 227288 235973 253103 283336 242856 213718 221574 198866 146461 178073
7321 178073 147221 174988 194171 186370 196190 159571 158814 175157 158284 179975 169357 142610
7309 142610 202045 215050 218035 199346 179820 174478 195322 176236 203711 160342 163739 222018
7297 222018 269959 269239 214971 207042 243252 224133 230992 247797 249272 253208 254543 282020 254963
7284 254963 233700 235864 233894 236911 242616 275797 331975 287388 226084 211877 235648 265726
7272 265726 225992 234556 249236 257194 285335 254529 253822 291045 289156 308009 286971 304866 351601
7259 351601 373717 368711 340395 340314 361951 337199 340959 333712 275509 284864 232630 279900 244934
7246 244934 215842 292684 341513 330007 284621 250013 253043 278957 253449 277679 318195 294793
7234 294793 284741 323872 348108 378777 369520 318797 322162 317536 286472 297275 306233 330022
7222 330022 337785 316238 315632 340522 388151 407921 395207 389933 351417 370347 307477 317339 403758
7209 403758 400412 399079 371846 337388 336371 389501 408072 414933 395429 410828 461993 472638
7197 472638 489345 474767 447526 440196 429508 458387 471141 482283 494309 520745 511867 506673
7185 506673 465243 420074 418738 496517 477930 509987 550780 524908 505971 480365 484003 511588
7173 511588 559968 568188 576451 642306 612089 648244 638837 643273 639375 610880 607650 587306 630221
7160 630221 648788 673675 675567 690379 672819 670981 672018 713071 718823 749302 749358 759484 803251
7147 803251 802295 823804 854857 838631 858594 924357 901439 871629 866207 892878 915431 939045
7135 939045 956693 925696 1000395 1018932 1019439 1006658 1076218 1087296 1099867 1141203 1122430 1123295
7123 1123295 1119728 1133970 1196105 1187671 1205993 1200557 1150257 1139488 1160755 1182207 1154451 1230416
7111 1230416 1215775 1229316 1270188 1371317 1372302 1387196 1458224 1479473 1490075 1457256 1523166 1532010
7099 1532010 1580135 1604945 1610166 1666322 1685323 1722293 1762130 1801252 1879059 1938840 1975751 1983908
7087 1983908 2061617 2144594 2181660 2228037 2280875 2361839 2486684 2534456 2587385 2636962 2784009
7076 2784009 2878820 2978062 3082049 3183433 3284099 3371680 3486723 3583931 3638710 3736291 3892166
7065 3892166 3959104 4069431 4189663 4374280 4486182 4613688 4736809 4854000 5033249 5190224
7055 5190224 5384579 5501705 5675512 5844634 6073304 6266596 6432186 6677839 6915153 7117962
7045 7117962 7311103 7543997 7783616 8022044 8255090 8522041 8766012 9079289 9382237 9705413
7035 9705413 10065391 10478498 10886763 11357206 11787981 12313241 13009062 13796398 14693535 15750202
7025 15750202 17024671 18613416 20585374 22917058 25436723 27825845 29771460 30963360
7017 30963360 31351630 31115394 30336678 29388467 28436147 27738301 27532333 27969985 28969300
7008 28969300 30498000 32578346 35208975 38556311 42763312 48041028 54834281 63306626
7000 63306626 73341280 83887910 93206325 99312140 101226876 99288205 94531261 87399594
6992 87399594 78287993 68003130 57249555 47588518 39882190 34024103 29587057 26253749
6984 26253749 23562732 21352103 19480304 17905333 16533080 15365204 14347569 13422159
6976 13422159 12607654 11967773 11398925 10882745 10410487 10002015 9616326 9194426 8798631
6967 8798631 8415266 8091281 7714967 7390874 7011205 6639996 6307277 5978388 5684857 5478489
6957 5478489 5234526 5053103 4869487 4683356 4566971 4406001 4264090 4111878 4025517 3952416
6947 3952416 3898761 3800121 3701728 3608282 3526603 3417120 3369439 3298278 3166485 3091497 2960123
6936 2960123 2866497 2785737 2619982 2580706 2489261 2433882 2328633 2245697 2235466 2175388 2126834
6925 2126834 2093388 2071204 2054471 2071180 2045635 1994732 1925750 1906980 1871355 1857751 1873670
6914 1873670 1803597 1753766 1759757 1788779 1718489 1672483 1624147 1582652 1604887 1569206 1539223 1509960
6902 1509960 1524216 1527192 1489985 1473117 1433949 1437627 1389525 1376537 1399528 1336045 1306888 1305658
6890 1305658 1275412 1224020 1218985 1246637 1290984 1278163 1280901 1319914 1302821 1293105 1343970 1343606
6878 1343606 1372076 1410503 1405988 1423900 1443307 1491314 1551988 1618301 1704810 1771679 1868649 2060556
6866 2060556 2283734 2599737 2891266 3125365 3193007 3007253 2798824 2683354 2409224 2019445
6856 2019445 1708491 1534812 1425395 1335334 1267599 1198999 1160283 1094769 1064871 1063514 1059296
6845 1059296 1048554 1052273 1036651 1088079 1073194 1045580 1080907 1060764 1076840 1048360 1001676 997848
6833 997848 990819 912369 909162 904469 854432 855113 881235 839100 794606 812731 839829 833766 787454
6820 787454 768453 798214 793126 778889 833661 803870 767514 763219 743513 715865 740204 707228
6808 707228 683795 679099 686512 683885 677945 696385 728378 676711 671528 640954 637316 649849 678562
6795 678562 636978 583493 587060 621817 661607 654585 626505 643072 665347 665814 676776 630380
6783 630380 645328 633478 607869 645806 598049 615077 613161 627284 574785 601373 597433 580188
6771 580188 572292 562445 583013 590878 576042 576262 578829 569026 537524 537027 514524 524465 563761 581558
6757 581558 567048 527004 544290 539920 584498 573963 524404 510684 519711 499828 589460 571642
6745 571642 552230 557025 580503 603631 616354 629657 632218 607725 590821 580054 627676 572515
6733 572515 546973 519572 536971 514345 509952 485714 515378 529510 511713 452619 472972 530948
6721 530948 519822 486881 517838 463493 460456 464783 485352 476620 507943 504232 518592 515013 505879
6708 505879 534685 503187 499245 484233 537060 525702 528560 560202 568702 544373 525500 519368
6696 519368 529492 514982 517148 521380 577671 549737 525650 552072 560679 495559 502912 517453
6684 517453 521464 506342 503284 544794 540645 519831 540155 552416 534728 483580 456902 496832
6672 496832 471545 502036 550375 501994 516191 536354 552588 576153 600952 567851 561750 577913
6660 577913 628038 674359 614445 522104 611474 613176 638978 668195 680093 665968 698603 701994
6648 701994 662132 688540 671469 685219 684501 700210 702246 751944 781524 798770 777972 772496
6636 772496 845639 850266 823441 850702 841665 855350 866069 836498 837979 793624 811233 807812
6624 807812 842285 870004 858408 838278 828752 869043 870915 932899 936059 917131 896732 890074
6612 890074 942815 895867 895920 912350 877362 877444 942787 988980 1010678 1008054 1004452 1017045 1075291
6599 1075291 1142122 1197239 1230173 1219691 1256633 1300666 1305621 1300329 1314045 1265396 1235814 1224499
6587 1224499 1245722 1226101 1184194 1157623 1156536 1143289 1147170 1147901 1158490 1161679 1246415 1214878
6575 1214878 1181268 1246647 1293107 1307314 1361745 1424472 1464860 1556866 1633633 1672739 1702037
6564 1702037 1759236 1813005 1851255 1830005 1833620 1805748 1796368 1764109 1774824 1818591 1875469 1904365
6552 1904365 1891416 1879928 1944162 1990452 2042006 2044632 2122964 2215447 2315554 2456479 2613563
6541 2613563 2822963 3035374 3315773 3658948 4019297 4207189 4279953 4312898 4263401 4153335
6531 4153335 4023842 3808772 3600119 3391030 3285270 3188015 3175506 3222467 3212880 3242179 3360619
6520 3360619 3417795 3528135 3655676 3864156 4102976 4348922 4673277 5049368 5527131 6174112
6510 6174112 6934215 7745314 8397886 8723063 8745466 8495311 8150214 7725749 7132951 6399965
6500 6399965 5793661 5332424 4986208 4794771 4600635 4531494 4498957 4507028 4586441 4656345 4789185
6489 4789185 4977728 5172442 5455319 5867914 6315725 6844453 7551877 8490099 9594371
6480 9594371 10525394 11128324 11227977 10876525 10396880 9827064 9039807 8001505 7015043 6204097
6470 6204097 5632853 5244525 4992230 4769345 4672620 4562305 4511626 4509513 4588535 4659394 4791083
6459 4791083 4978300 5235348 5550479 5887000 6333605 6973684 7691603 8388845 8920738 9104174
6449 9104174 8906463 8436312 7997547 7407021 6625603 5802419 5087279 4572677 4183884 3909740
6439 3909740 3764688 3585542 3407131 3302609 3226681 3222810 3169252 3169855 3251612 3338226 3373014
6428 3373014 3403810 3576226 3817724 4081259 4370558 4568963 4659217 4671559 4519461 4358794
6418 4358794 4094301 3792971 3466794 3163570 2926693 2748879 2628612 2522421 2390614 2353805
6408 2353805 2285761 2218071 2219653 2193359 2232280 2255515 2353104 2409140 2474121 2571219 2746890
6397 2746890 2980601 3176509 3297698 3361141 3324571 3220001 3114226 2915463 2665032 2446375
6387 2446375 2244552 2063374 1885159 1754034 1718044 1627130 1568783 1528490 1454309 1458241 1462707
6376 1462707 1476162 1414444 1394203 1387187 1355059 1342237 1319070 1341185 1335694 1324366 1349151 1325136
6364 1325136 1283655 1237787 1235963 1227543 1166778 1160177 1177695 1195215 1175288 1142861 1149752 1160931
6352 1160931 1159786 1165697 1134104 1115226 1095508 1107307 1128733 1164921 1165707 1160436 1086703 1059942
6340 1059942 1089083 1121551 1170004 1152700 1137340 1144828 1120820 1143408 1156486 1078304 1083633 1124375
6328 1124375 1094631 1128981 1149975 1149491 1172137 1174981 1174806 1172837 1179778 1219035 1222822 1211138 1235612
6315 1235612 1269057 1267910 1271394 1318441 1284232 1297113 1327307 1349873 1369702 1353894 1353229 1304574
6303 1304574 1311035 1323638 1337361 1343645 1355865 1362229 1352151 1369351 1392584 1443130 1495148 1500406
6291 1500406 1560976 1580287 1619740 1700729 1721756 1672255 1618305 1591123 1562106 1551385 1480379
6280 1480379 1452205 1485130 1462768 1456881 1473285 1500289 1514584 1504072 1498122 1533945 1568753 1609546
6268 1609546 1627963 1641685 1641818 1594810 1601084 1620091 1684886 1706563 1684020 1598975 1620186 1643149
6256 1643149 1589258 1604381 1601491 1599210 1638200 1652615 1664999 1685714 1708765 1727846 1802946 1829670
6244 1829670 1878009 1928524 1894720 1966918 1987692 2043786 2084338 2045563 2059017 2087249 2078420 2005025
6232 2005025 1946015 1922389 1898420 1893810 1903985 1877170 1848880 1860792 1893607 1847468 1852374 1877259
6220 1877259 1877752 1918722 1987933 1968181 1991606 2020394 2050714 2093032 2099088 2075772 2100208 2144962
6208 2144962 2156814 2191696 2259293 2258364 2229791 2244706 2258621 2313149 2399663 2432574 2449343 2495204
6196 2495204 2521097 2596533 2641928 2704444 2792040 2862639 2944748 2996977 3026211 3063709 3144087
6185 3144087 3176599 3232030 3234574 3307366 3381044 3460062 3502980 3531790 3654717 3743431 3836548
6174 3836548 3939800 4017347 4144676 4230366 4351635 4425165 4512488 4614389 4715888 4841659
6164 4841659 5000519 5159063 5311771 5426144 5562252 5695773 5808755 5935571 6017526 6116524
6154 6116524 6182274 6229224 6335610 6459272 6464734 6500638 6597238 6727279 6883077 6967272 7048530
6143 7048530 7176515 7267944 7416690 7562550 7713959 7868196 8059545 8226899 8475500 8689556
6133 8689556 8900393 9112250 9436273 9759526 10150977 10561052 11016789 11442392 11967389 12570398
6123 12570398 13301534 14059976 14951103 15928589 17063798 18374149 19965791 21735587 23836106
6114 23836106 26415379 29608123 33528791 38362852 44522296 53186644 62913726 72462174
6106 72462174 78638428 78614931 74976530 70250192 66482676 64056048 57252015 46042289
6098 46042289 36870656 30471085 25934741 22608990 20252695 18327162 16758393 15381597
6090 15381597 14275233 13272098 12569694 11911073 11394234 10914020 10549702 10234360 9934043
6081 9934043 9621114 9255017 8962260 8690490 8409045 8151038 7805215 7511525 7260610 7007762
6071 7007762 6709749 6468074 6262138 6093179 5928456 5712899 5569828 5404409 5308326 5216843
6061 5216843 5067635 5011162 4929287 4894529 4830830 4742215 4719774 4732125 4722135 4647099 4557029
6050 4557029 4522689 4438672 4420118 4410559 4351204 4241648 4145072 4205683 4195518 4168503 4092865
6039 4092865 4063344 4035290 4002779 3985049 3952003 3946681 3935897 3897335 3874050 3936146 3897175 3880877
6027 3880877 3856980 3803794 3833295 3858881 3910908 3975169 3987711 4018769 4040545 4084883 4167356
6016 4167356 4202808 4223504 4234761 4279747 4240798 4216173 4171497 4147031 4105280 4107896 4165420 4143227
6004 4143227 4177710 4180622 4248681 4350386 4416939 4448427 4503109 4608693 4636402 4625589 4589574
5993 4589574 4573602 4520354 4498591 4450597 4369233 4347008 4326321 4311806 4301437 4248732 4212568
5982 4212568 4205183 4186673 4167153 4154937 4165946 4151501 4176914 4286755 4334456 4355516 4436764
5971 4436764 4484069 4534222 4575708 4590769 4664067 4693018 4712721 4666021 4697307 4739316 4788203
5960 4788203 4759731 4757141 4775753 4816645 4862733 4942726 4960308 5043874 5075501 5119992 5140539 5195796
5948 5195796 5287336 5275640 5318655 5406116 5496131 5596068 5654728 5703042 5839020 5872547 5978519
5937 5978519 6090362 6209342 6290049 6366163 6442700 6505772 6635173 6774668 6925807 7013435
5927 7013435 7113402 7249030 7353432 7455847 7529371 7603584 7687954 7741699 7833049 7913728 7990945
5916 7990945 8083980 8270548 8475179 8652431 8814870 8954370 9134145 9269789 9444481 9572039
5906 9572039 9743667 9915641 10103149 10330880 10539971 10767054 10990376 11252584 11497207 11778930
5896 11778930 12061182 12345073 12650327 12986468 13331284 13685561 14035752 14472842 15000445
5887 15000445 15528793 16142888 16887483 17733283 18751856 20015905 21492735 23047215 24526261
5878 24526261 25700072 26451074 26761914 26809286 26711304 26504766 26068788 25515585 25164113 25116042
5868 25116042 25419973 25969538 26776717 27754506 28929407 30271165 31767239 33254534 34573741
5859 34573741 35721455 36680059 37430546 37842364 37835417 37668314 37548697 37482594 37359716 37206632
5849 37206632 36982718 36737739 36429342 36029682 35395263 34619524 33883039 33343901 32957703
5840 32957703 32871804 33160942 33883877 34942171 36032690 36771756 36987671 36683277 36105949
5831 36105949 35361997 34481993 33415674 32137645 30985418 30230113 29812916 29697224 29944429
5822 29944429 30374176 31013011 32024671 33401812 35125797 37113499 38937878 40107390
5814 40107390 40661513 40621078 40441450 40357736 39886065 39205793 38975031 39345126 40268809 41716058
5804 41716058 43530447 45807900 48584005 51766708 55225682 58651653 61660501 64003851
5796 64003851 65658751 66687396 67228946 67401476 67360589 67232404 67205723 67511108 68364284
5787 68364284 69990919 72490897 75797242 79551149 83333450 86921585 90366268 93778350
5779 93778350 96740168 98276480 98536799 98187601 97588901 96601375 94762084 91900494 88173147
5770 88173147 84060126 80087753 76620127 73779744 71229857 69082754 67603535 66907333
5762 66907333 66956615 67688089 69017238 70936967 73282665 75566637 77155048 77703633 77076122
5753 77076122 75392058 72772340 69340334 65070404 60133390 54844922 49743496 45079267
5745 45079267 41005890 37587234 34710693 32293649 30274484 28529643 27010505 25676494
5737 25676494 24550700 23557130 22671922 21780474 21116264 20539743 19937374 19348965 18853457
5728 18853457 18481945 18076650 17652909 17286583 16899646 16549325 16241924 15939417 15618819
5719 15618819 15331523 15080833 14834424 14611478 14397405 14226855 13988414 13809713 13601295
5710 13601295 13473496 13332155 13144739 12962272 12869565 12774899 12621683 12515229 12471172 12361311
5700 12361311 12263621 12185272 12094569 11996534 11978024 11910533 11802867 11749413 11724918 11627304 11527420
5689 11527420 11498683 11466395 11491936 11493420 11466558 11488544 11465574 11483693 11509354 11505464 11537307 11571312
5677 11571312 11554382 11519067 11502574 11493534 11470556 11448247 11457506 11432720 11394595 11416191 11345117 11260706
5665 11260706 11226914 11285295 11297164 11312943 11291316 11309753 11410250 11422082 11434485 11490591 11544124
5654 11544124 11608607 11623935 11676263 11705785 11692598 11723632 11796649 11832784 11896279 11926903 11958039
5643 11958039 12019174 12125652 12170221 12165460 12236980 12296078 12382307 12486241 12601462 12681313 12790229
5632 12790229 12889715 13005815 13131954 13262710 13323659 13429575 13518148 13609427 13760833 13850138
5622 13850138 13920894 14022491 14195033 14341492 14479116 14613459 14775472 14999141 15226634 15446659
5612 15446659 15665510 15886996 16104669 16366536 16605576 16874215 17115920 17343191 17598485
5603 17598485 17845266 18043537 18285075 18484416 18695625 18977337 19254461 19552239 19867012
5594 19867012 20195362 20520314 20958520 21384488 21813080 22276594 22806827 23379388 23987763
5585 23987763 24616833 25286150 26082182 26955060 27897834 28882298 29993107 31133438 32415662
5576 32415662 33894800 35500758 37293050 39301159 41719160 44506438 47664398 51319543
5568 51319543 55451807 60023818 64755596 69110434 72691201 75098693 76375136 76704062
5560 76704062 76315138 75479068 74137412 72336561 70394785 68760269 67700895 67372796 67750138
5551 67750138 68836805 70666570 72998345 75769275 78832990 81993361 85177863 88334374
5543 88334374 91159573 93058558 93619319 92744635 90637110 87721891 84285612 80477965
5535 80477965 76418282 72261925 68434180 65209467 62733539 60938719 59796921 59211609
5527 59211609 59225059 59637298 60393927 61285168 62041431 62466892 62241588 61272357 59620838
5518 59620838 57414141 54905279 52045726 48856535 45638291 42578515 39854903 37612469
5510 37612469 35759937 34326227 33185654 32326627 31699428 31263686 31010301 30971213 31195638
5501 31195638 31648046 32400206 33386493 34562384 35895499 37052223 37774081 37968501 37696698
5492 37696698 37169392 36545123 35763005 34776509 33607993 32575042 31959564 31669220 31694288
5483 31694288 31951895 32291324 32798669 33465943 34103686 34844882 35566713 36337582 37294998
5474 37294998 38212370 38761796 38856748 38621074 38137134 37466880 36608535 35455262 34021500
5465 34021500 32476032 31062254 29750563 28546851 27563991 26774766 26233915 25900289 25792671
5456 25792671 26084645 26595411 27301063 28039821 28512436 28608377 28317643 27753775 27086797 26268752
5446 26268752 25304397 24180888 22973933 21863723 20890310 19960084 19107890 18348403 17710249
5437 17710249 17065054 16370084 15702869 15132388 14612543 14221240 13873406 13579629 13365236
5428 13365236 13172912 13002222 12900183 12864569 12837685 12842406 12951072 13061746 13195472 13308932
5418 13308932 13394788 13603286 13813039 13987591 14049239 13988886 13844311 13665574 13389393 13083002
5408 13083002 12787199 12473588 12159105 11867478 11621056 11473406 11417487 11304091 11290754 11306385
5398 11306385 11376669 11394724 11473667 11592035 11639694 11707705 11730786 11821486 11874466 11989263 12047118
5387 12047118 12130177 12173348 12134404 12073887 11903736 11680384 11426414 11136763 10804895 10478551
5377 10478551 10247180 9966831 9802198 9698019 9615026 9579624 9583038 9640580 9704348 9861832
5367 9861832 10015153 10209771 10406650 10579427 10717293 10814157 10909312 10885170 10706514 10501034
5357 10501034 10266287 10003862 9619565 9265017 8995910 8737479 8548833 8450048 8363026 8306344
5347 8306344 8309118 8320300 8335816 8348994 8353686 8356408 8322612 8292763 8285315 8243267 8207292 8187361
5335 8187361 8204995 8222083 8246344 8253319 8281900 8243572 8146096 8090532 8034828 7927435 7847957
5324 7847957 7815918 7826959 7826191 7861706 7875383 7921106 8016963 8021465 7980508 7916409 7782167 7669984
5312 7669984 7565878 7437658 7271163 7127962 6978609 6840381 6670169 6608158 6576989 6571268
5302 6571268 6619029 6615542 6650176 6703371 6704529 6720730 6757576 6792628 6804763 6796309 6822217 6745940
5290 6745940 6669865 6587806 6504460 6418059 6341692 6204942 6002679 5838203 5667040 5540540
5280 5540540 5414480 5280467 5134011 5005239 4910018 4896608 4892421 4811860 4741629 4708986 4758085
5269 4758085 4785851 4743345 4733347 4691606 4691131 4643867 4532041 4491287 4433007 4375416 4334974 4279386
5257 4279386 4253675 4193213 4136889 4141591 4138539 4098615 4079790 4137777 4125147 4119572 4110854 4128856
5245 4128856 4172093 4212348 4233872 4221066 4178001 4116570 4116846 4139031 4105794 4092388 4084296 3988698
5233 3988698 3940466 3907957 3906927 3925407 3882210 3835587 3809361 3790512 3769857 3786506 3780315 3793689
5221 3793689 3766055 3768896 3741505 3717782 3717019 3727105 3668015 3633755 3663947 3657371 3557715 3512857
5209 3512857 3466936 3474683 3482456 3439305 3421474 3347366 3299299 3282380 3281477 3294655 3291453 3273920
5197 3273920 3297700 3280216 3258987 3274987 3298309 3302733 3316326 3323924 3263727 3245772 3280385 3318669
5185 3318669 3334381 3288587 3283235 3271785 3227392 3263693 3275226 3273453 3246385 3232813 3247694 3247560
5173 3247560 3237927 3253782 3263170 3301926 3318226 3306542 3257917 3295302 3305014 3314867 3351693 3378481
5161 3378481 3381447 3369678 3389329 3406038 3439200 3463638 3461179 3465153 3501725 3529074 3589947 3578996
5149 3578996 3665685 3684971 3718864 3817355 3918268 3967512 4072111 4231276 4342078 4448260
5139 4448260 4624306 4733275 4799493 4819896 4846829 4835641 4773807 4643686 4563583 4488773 4401133
5128 4401133 4308922 4275755 4264106 4223330 4231244 4266041 4274679 4322020 4423436 4497198 4650391
5117 4650391 4815896 4990972 5225804 5515422 5928951 6415380 6965507 7631059 8392497 9294406
5107 9294406 10231465 10868559 10944810 10621524 10187924 9741282 9368568 8845177 7839172 6747505
5097 6747505 5908359 5287647 4857902 4506711 4172485 3987555 3819872 3619559 3450615 3295223
5087 3295223 3209951 3117668 3055113 2988126 2841854 2769089 2721687 2673290 2602030 2597041 2525299
5076 2525299 2424899 2357592 2308886 2291883 2251344 2245355 2197553 2112990 2071821 2045005 2048096 2007620
5064 2007620 2015207 1987711 1957675 1912273 1873795 1902886 1871690 1865638 1827141 1834521 1847525 1853667
5052 1853667 1813056 1832749 1803777 1782677 1755543 1738956 1704471 1673998 1649361 1650561 1639859 1615689
5040 1615689 1612132 1582443 1561104 1510311 1514273 1505309 1538158 1567951 1534900 1524850 1555411 1555416 1594248
5027 1594248 1587359 1585977 1542092 1554906 1573159 1550160 1597117 1580118 1580320 1568616 1578860 1602467
5015 1602467 1553533 1564818 1617264 1571179 1564235 1551741 1553157 1569605 1593801 1649021 1641621 1634242
5003 1634242 1614601 1653282 1682097 1688460 1722533 1755930 1776716 1811819 1829690 1847925 1898900 1963961
4991 1963961 2026995 2071718 2178355 2312011 2419659 2575409 2712884 2819544 2911832 2958698
4981 2958698 2917308 2881031 2815717 2773258 2721248 2619385 2536886 2417856 2363943 2321111 2255839
4970 2255839 2272845 2323632 2397425 2377971 2374370 2367645 2401664 2453239 2503113 2638835 2741696
4959 2741696 2922464 3125991 3373537 3639925 3829996 3951404 3916460 3869819 3760563 3633359
4949 3633359 3466088 3279531 3031336 2753794 2556592 2423075 2285037 2120671 2032882 1993351
4939 1993351 1989190 1886031 1827769 1826831 1842688 1868785 1862667 1844193 1809996 1855342 1898657 1987422
4927 1987422 2092164 2153904 2248668 2293696 2303348 2282101 2189693 2070649 2017591 1934533 1774368
4916 1774368 1652365 1490729 1399989 1372627 1327181 1261445 1228713 1257912 1214204 1161477 1145389
4905 1145389 1111909 1095390 1114678 1064504 1094951 1104906 1098992 1052751 1026975 1030875 1030234 998197
4893 998197 989632 968536 999560 959765 981626 990949 974273 905192 967454 993462 958143 994560
4881 994560 1004362 996624 953357 949839 948305 941715 906860 920778 924612 895338 893468 886014 893105
4868 893105 911458 901201 926887 893269 888206 853420 846842 853777 843380 860107 817026 815558
4856 815558 838689 808472 850778 877808 858974 820959 813007 812973 822901 838593 828410 829836 830997
4843 830997 846606 822026 808563 825809 836389 853285 842441 847253 775395 812060 804247 796459
4831 796459 827250 824239 835660 803649 773824 786455 849184 815110 772040 771414 754906 769093
4819 769093 774820 791667 751107 729940 745003 720840 761435 763364 733554 711709 737159 747742
4807 747742 690851 703076 757526 779444 740227 763891 762674 744508 802874 803324 804005 839956 848083
4794 848083 841081 839693 799493 794727 822118 779736 821567 836612 824904 814337 834485 854547
4782 854547 881520 883612 855018 855759 876476 885170 852943 872475 871767 863858 875667 878927 878392 897034
4768 897034 928986 927781 970337 971371 937767 954051 992961 994884 957496 973431 984677 1013365
4756 1013365 1011594 1044770 1064021 1054296 1068509 1098854 1086802 1081000 1090499 1070940 1085495 1096582
4744 1096582 1099933 1155127 1211883 1232027 1246461 1225373 1239332 1281227 1284498 1309448 1389779 1454229
4732 1454229 1448381 1427024 1447045 1499844 1572205 1588889 1528353 1533426 1577300 1625850 1599898 1577212
4720 1577212 1667174 1709256 1764334 1795920 1879868 1980887 2045068 2061506 2162071 2263287 2387670
4709 2387670 2551506 2662747 2861721 3048523 3268195 3588749 3863895 4191220 4657096 5156310
4699 5156310 5779397 6594121 7671914 8926092 10270209 11396932 12074757 12237654 11914723
4690 11914723 11305078 10624349 9675156 8451737 7116543 5985978 5113940 4516837 4070476
4681 4070476 3695852 3380100 3145551 2936656 2784618 2656070 2562001 2493762 2438767 2333612
4671 2333612 2295921 2239776 2254072 2253635 2154119 2162725 2159667 2121271 2042814 2030856 2003702 2011624
4659 2011624 1944633 1885780 1902726 1950011 1948008 1940097 1931403 1983132 2013911 2045414 2061169 2056557
4647 2056557 2064564 2097797 2173390 2237619 2305751 2431034 2512237 2606440 2764935 2933411 3106696
4636 3106696 3250725 3465028 3718153 4044638 4414129 4893081 5505251 6167802 7086759 8253962
4626 8253962 9467285 10587924 11468963 11872014 11848224 11464458 10792737 9854389 8751207
4617 8751207 7595103 6475555 5453078 4657035 4060231 3653659 3332044 3018229 2761317
4608 2761317 2526052 2382563 2283147 2150835 2006916 1949939 1859925 1782267 1774457 1729711 1679792
4597 1679792 1637718 1569929 1489590 1425713 1491507 1483745 1397980 1380326 1346740 1331263 1269139 1264715
4585 1264715 1224573 1204628 1170514 1114250 1107728 1117819 1107334 1094344 1046755 1035899 1022929 998290
4573 998290 1006985 1062165 1040938 1013696 972005 963074 966835 943763 918030 834345 818347 833533
4561 833533 843210 831579 867159 823081 816609 810654 796263 831925 788502 770337 792254 757628
4549 757628 713680 732162 792232 731035 729647 733843 750557 775387 745766 742837 737710 736267 749869
4536 749869 771946 776336 764416 739303 708159 718372 728103 771608 774511 759564 793578 769303
4524 769303 735641 760366 748581 724435 669717 711713 731627 741147 694972 691203 709267 707860
4512 707860 669023 695754 716224 719042 733477 712188 745301 757656 750264 771642 794915 788281
4500 788281 768586 818816 864554 852553 880543 895316 927723 912385 932044 923862 920674 892825
4488 892825 904854 895342 867701 915349 887231 842514 820178 850230 854584 850980 780048 808407
4476 808407 847282 776420 826972 886702 898716 915735 896503 881508 910434 955638 1007939 1060279
4464 1060279 1051941 1098530 1141484 1157182 1240275 1308170 1360455 1366631 1387993 1375101 1333905 1270507
4452 1270507 1228166 1195971 1196274 1137759 1085043 1084646 1082784 1030151 1024183 1069157 1063981 1041275 1089583
4439 1089583 1072358 1066051 1060546 1110319 1144219 1149514 1145830 1160833 1168428 1189952 1183339 1151943 1088887
4426 1088887 1091261 1105646 1149517 1113722 1116607 1107461 1081308 1125262 1144025 1184230 1235376 1262783
4414 1262783 1237279 1261063 1255229 1272576 1290720 1330201 1372726 1390414 1429993 1417350 1347813 1407118
4402 1407118 1464790 1494681 1509412 1493699 1471113 1457102 1457906 1467582 1478123 1510260 1498851 1478648
4390 1478648 1471355 1475379 1509939 1568926 1609337 1576839 1571789 1626452 1665495 1658702 1698022 1781004
4378 1781004 1866425 1926211 2020481 2154511 2253572 2394248 2539005 2727087 2896312 3048938
4368 3048938 3159345 3219075 3192001 3138867 3006755 2917914 2773532 2584347 2431821 2286592
4358 2286592 2203840 2150939 2078753 2025895 2006456 1951555 1928478 1912881 1880290 1889968 1887436 1884268
4346 1884268 1870518 1902086 1897380 1900518 1936129 1975792 2020210 2055627 2112716 2146148 2194429 2247352
4334 2247352 2255536 2265899 2269725 2211684 2180092 2199512 2120003 2119997 2089667 2019207 2020493 2013394 2012003
4321 2012003 2059200 2029747 2003777 2016835 2031761 2090631 2123319 2152918 2217343 2282655 2322284
4310 2322284 2444558 2579972 2753783 2869963 2940105 3064562 3142861 3175769 3186473 3125638
4300 3125638 3057949 2932652 2857052 2742517 2598127 2501833 2461723 2418625 2407493 2424958 2410451
4289 2410451 2440306 2463910 2439617 2418838 2433211 2516540 2574976 2616753 2649202 2616019 2608602 2643348
4277 2643348 2684841 2713139 2709503 2767282 2771945 2826599 2881626 2882594 2911541 3044066 3109494 3180205
4265 3180205 3296579 3408685 3564769 3768550 3929632 4064553 4180699 4295481 4343834 4333197
4255 4333197 4298942 4184712 4074192 3921841 3827311 3688223 3618712 3595764 3594112 3617212 3639251
4244 3639251 3638132 3675457 3780513 3854860 3950390 4073839 4186271 4311211 4428338 4601915
4234 4601915 4762900 4962973 5101068 5187529 5186604 5215578 5248840 5188869 5101520 5048682 4967776
4223 4967776 4937045 4922819 4834930 4858468 4897237 4977864 5001376 5125235 5237632 5356129 5439020
4212 5439020 5563369 5742188 5879705 6040303 6149741 6303497 6554159 6778314 6969861 7238750
4202 7238750 7595613 7928746 8374546 8922216 9600418 10443690 11441483 12401170 13174563 13614468
4192 13614468 13621817 13438512 13177543 12862590 12317742 11627890 11008004 10542682 10130361 9770306
4182 9770306 9459861 9204523 8955600 8684569 8489977 8437685 8320822 8265532 8314052 8314237 8387842
4171 8387842 8466574 8558259 8658780 8835601 8959894 9152604 9436558 9656287 9973748 10276720
4161 10276720 10527531 10768495 10993263 11246957 11435531 11616376 11791244 11954543 12103510
4152 12103510 12266404 12552275 12783046 13025529 13349674 13668886 13974838 14292908 14614626
4143 14614626 14957215 15297459 15638043 16011191 16477678 16900917 17341684 17831050 18328377
4134 18328377 18888573 19443243 20098832 20769516 21468774 22236360 22925898 23728466 24513297
4125 24513297 25295356 26047894 26822862 27652582 28412088 29092860 29782628 30492318 31240198
4116 31240198 32073878 32982055 34041341 35106637 36081226 37080954 38026345 38986398 40041429
4107 40041429 41228605 42517441 43977492 45717079 47731933 50044878 52604439 55481775
4099 55481775 58774255 62431335 66681511 71556485 77070836 83315490 90418758 98748173
4091 98748173 108578144 120310383 134455491 151363177 170753924 191633214 213601299
4084 213601299 237293906 264356693 293447787 318973690 334304792 335285781 323717379
4077 323717379 305148701 281716668 252961454 219647948 185464595 156230546 133592711
4070 133592711 116529799 103504248 93332040 85143432 78401520 72758957 68082214 64137033
4062 64137033 60872037 57993826 55377276 52888674 50400253 48023758 45875339 43728772
4054 43728772 41594187 39698612 37995832 36447987 34965042 33413519 32033935 30781501
4046 30781501 29554345 28402401 27309236 26320418 25448929 24644284 23932496 23309044 22699249
4037 22699249 22204779 21738666 21338875 20997275 20694163 20338334 20028631 19764933 19466936
4028 19466936 19121142 18893483 18552983 18229188 17995738 17793282 17667688 17632415 17651232 17565728
4018 17565728 17430411 17232894 16988682 16732622 16358544 15980572 15543703 15122833 14752718
4009 14752718 14422507 14176179 14000495 13823611 13649869 13601307 13567284 13568115 13544651 13518041 13445176
3998 13445176 13406225 13374783 13336870 13365072 13324627 13309910 13305466 13271286 13249555 13197030 13174798
3987 13174798 13156909 13178389 13259487 13338390 13486104 13747056 13971789 14136218 14321745 14498611
3977 14498611 14726971 14915088 14931911 14768918 14447904 14041559 13746775 13487433 12998538 12534013
3967 12534013 12191656 11953969 11776257 11579814 11404359 11148179 10784336 10427108 10029893
3958 10029893 9596516 9177075 8842130 8582606 8277808 8080047 7953483 7808179 7676469
3949 7676469 7572701 7529788 7486505 7472335 7492560 7512603 7512937 7481395 7468058 7397339 7373168 7266430
3937 7266430 7144669 7048490 6963504 6887445 6742550 6657871 6593952 6495738 6399892 6333079 6295144
3926 6295144 6172810 6070648 6031506 5987040 5950968 5906932 5849144 5845590 5855206 5850853 5830149 5857288
3914 5857288 5860317 5840715 5835538 5828030 5855142 5868460 5899363 5949032 5991120 6065024 6126215 6208618
3902 6208618 6300898 6372065 6455818 6578890 6729496 6858544 6913847 6980061 7051198 7135009 7183405
3891 7183405 7249920 7355484 7479788 7649217 7904409 8197146 8505680 8852778 9288222 9781831
3881 9781831 10323193 10811738 11221462 11501561 11556187 11377647 11039174 10553118 9934791 9251038
3871 9251038 8629072 8059274 7550586 7158352 6793208 6475263 6149404 5919385 5724998 5573635
3861 5573635 5375848 5252818 5134288 5017030 4895785 4833154 4739984 4673145 4589256 4573612
3851 4573612 4485525 4418445 4343170 4312541 4268281 4291927 4214556 4104924 4100405 4093146 4116724 4146403
3839 4146403 4167124 4153090 4153143 4225760 4305302 4378067 4521837 4675099 4920098 5148301 5330953
3828 5330953 5399219 5395471 5294581 5184907 5120049 4921888 4648965 4429356 4242939 4120543
3818 4120543 4008956 3955874 3891523 3851570 3851691 3860068 3826599 3831324 3881569 3922309 3904558 3985675
3806 3985675 4118930 4205559 4305206 4408156 4528893 4667798 4817724 5005505 5205715 5449717
3796 5449717 5787128 6070789 6386093 6783801 7198347 7629264 8101086 8544929 8899170 9291243
3786 9291243 9650683 10020340 10320516 10407837 10416176 10188733 9709618 9183486 8531999 7856592
3776 7856592 7237306 6613148 6107135 5693891 5321675 5007171 4684487 4437967 4217635 4029393
3766 4029393 3872139 3739712 3605117 3472220 3334523 3225856 3192399 3100347 3029988 2939668
3756 2939668 2888622 2814459 2745523 2659258 2586917 2537912 2447562 2400050 2373803 2303839 2253264
3745 2253264 2206677 2101239 2028469 1999656 1985803 1925555 1901460 1854946 1886385 1800777 1789494
3734 1789494 1771432 1700549 1709963 1745140 1717669 1711462 1691256 1633929 1606575 1609352 1601701 1582915
3722 1582915 1604735 1584461 1581224 1568663 1504300 1477503 1493375 1480147 1513056 1487602 1441802 1434838
3710 1434838 1461406 1489739 1508283 1449728 1459495 1465692 1499355 1521459 1468068 1484181 1513906 1508989
3698 1508989 1468739 1449899 1470948 1453399 1461227 1437731 1409142 1386708 1405327 1410800 1387753 1368258
3686 1368258 1342029 1320845 1319529 1329668 1326454 1328324 1286670 1258964 1269007 1264851 1296471 1322672
3674 1322672 1320329 1315287 1293964 1276250 1307411 1277038 1296185 1271495 1287707 1313025 1280460 1295370
3662 1295370 1264599 1291816 1260512 1274111 1273095 1260073 1272680 1271966 1297510 1324362 1354948 1399533
3650 1399533 1378306 1369717 1426698 1438326 1407023 1409540 1385594 1389715 1373807 1398046 1437954 1444462
3638 1444462 1500424 1551819 1556142 1612609 1713963 1726603 1753050 1804870 1822324 1788446 1757824
3627 1757824 1695289 1671703 1632537 1611054 1616027 1626653 1609777 1543117 1511475 1481774 1458592 1412790
3615 1412790 1373509 1342109 1369628 1332891 1260121 1258731 1284482 1289998 1245461 1234490 1228878 1247040
3603 1247040 1333033 1311685 1348328 1319227 1287569 1331342 1377307 1352724 1378925 1406849 1430236
3592 1430236 1494658 1513292 1526637 1496034 1591131 1607635 1633281 1668936 1680839 1701738 1741159
3581 1741159 1735708 1763459 1817669 1788175 1791719 1823241 1812707 1812708 1778907 1740953 1686294 1643657 1590910
3568 1590910 1561343 1539009 1468808 1422537 1423881 1469506 1507926 1431342 1446619 1454275 1430860 1427111
3556 1427111 1476914 1496654 1472327 1441674 1429236 1442580 1387630 1369047 1406661 1391761 1360467
3545 1360467 1381619 1376323 1402751 1396308 1422061 1489636 1502664 1520040 1561326 1618384 1670842 1741726
3533 1741726 1771626 1761378 1784117 1819722 1829705 1819426 1814965 1733012 1737316 1674025 1610360 1568458
3521 1568458 1583539 1618214 1653125 1664964 1678943 1700856 1693473 1744521 1792622 1841233 1883701 1922765
3509 1922765 2007227 2078679 2147429 2244661 2323957 2334754 2325532 2318919 2294399 2243145 2202330 2109527
3497 2109527 2024409 2001096 1937486 1892978 1877835 1860148 1850214 1813407 1814067 1856468 1833569 1788243
3485 1788243 1812820 1823184 1819331 1842657 1860181 1854281 1875162 1875221 1897430 1938002 1981380 2025117
3473 2025117 2013676 2000305 2006300 2002979 2010843 2031566 2021297 2025267 2004211 2020212 2044520 2050023
3461 2050023 2054704 2070861 2079611 2052446 2016359 2013088 2062432 2113167 2075474 2024735 2042391 2025371
3449 2025371 2052905 2145673 2185105 2187329 2201802 2200286 2220974 2240296 2259725 2293709 2256761 2278256
3437 2278256 2347607 2363795 2335956 2333230 2407161 2479970 2522018 2606474 2684444 2744313 2766445 2839570
3425 2839570 2869158 2876962 2942389 2954116 3003750 3125974 3178185 3195798 3255816 3326430 3399607
3414 3399607 3392111 3452391 3528122 3646894 3700081 3774276 3877207 3985172 4088457 4102150 4207800
3403 4207800 4348996 4506230 4592664 4730806 4867632 5062736 5308155 5575365 5751684 6007913
3393 6007913 6297672 6619286 7013145 7399568 7822274 8291988 8830348 9547715 10265336 11179909
3383 11179909 12387763 13907736 15728149 17526115 18781691 19194837 18892409 18221250 17482809
3374 17482809 16325129 14736945 13196061 12061295 11248025 10728322 10428396 10257549 10185409
3365 10185409 10180697 10297190 10499478 10716413 10957719 11327798 11844834 12399453 13052160 13884800
3355 13884800 14852338 16006697 17383616 19161731 21401681 24334854 27957743 31372196
3347 31372196 33628647 34213433 33254979 31603155 29935695 27277967 23676802 20396608
3339 20396608 17929618 16197472 14958015 14069183 13429150 12944383 12586672 12362118 12212717
3330 12212717 12109066 12161368 12282171 12420992 12577751 12779524 13148289 13574193 14096036 14843565
3320 14843565 15690324 16847659 18326057 20067802 21773455 23000693 23426976 23166887 22633607
3311 22633607 22038872 21123978 19757533 18467041 17555337 16882029 16333323 15832114 15325707
3302 15325707 14825361 14415889 14044137 13693083 13457590 13357548 13294918 13316978 13355579 13430333
3292 13430333 13514320 13641452 13885456 14077527 14293414 14557975 14754256 14922796 15054320 15256813
3282 15256813 15423458 15547438 15787042 16027732 16230532 16520236 16864074 17252939 17712866
3273 17712866 18276671 18907388 19617394 20425122 21222675 21976241 22741216 23559498 24477779
3264 24477779 25434821 26457493 27702311 29101597 30722897 32609632 34743755 37161867
3256 37161867 39887382 43010547 46796710 51284594 56725098 63710724 72931519 84920925
3248 84920925 97827162 107670549 112049132 110691293 105567535 100740814 94666366 83664216
3240 83664216 72056050 63300135 57296604 53266685 50701390 48979721 47877649 47367508
3232 47367508 47340245 47839793 48796999 50303974 52321766 54798465 57956106 61993001 66962473
3223 66962473 73238282 81467875 92337052 105124211 116262249 122168589 121856739 116282052
3215 116282052 109313734 102343134 90861157 76500375 64301686 55110066 48433835 43349868
3207 43349868 39399090 36204708 33507282 31237363 29300709 27579234 26142460 24829135
3199 24829135 23699523 22693132 21867973 21077833 20377076 19695083 19063010 18480358 17922294
3190 17922294 17349529 16694558 16087196 15542726 14970956 14463703 13920306 13378528 12929709
3181 12929709 12508317 12089027 11750815 11416325 11162371 10932987 10711213 10562353 10470971 10382860
3171 10382860 10316870 10273557 10341750 10453043 10665908 10861186 11038537 11182391 11217162 11160576
3161 11160576 10985378 10703526 10304561 9849068 9408536 9007611 8639210 8309006 8123199
3152 8123199 7939990 7802723 7669901 7575638 7446615 7258498 7110102 6950861 6786533 6508828
3142 6508828 6244483 6099621 5956646 5826131 5710140 5614096 5535003 5434119 5363393 5274707
3132 5274707 5244392 5179415 5160735 5152032 5143152 5136510 5095154 5147724 5200327 5186959 5226737 5380050
3120 5380050 5563275 5704475 5789223 5751428 5639878 5491410 5385107 5266630 5061488 4771913
3110 4771913 4555894 4366907 4273637 4154118 3999917 3933738 3919916 3876579 3777587 3734003 3671155
3099 3671155 3638132 3661796 3609416 3591030 3558721 3456288 3406031 3420807 3413903 3400855 3446217
3088 3446217 3537508 3603317 3661275 3627016 3512712 3468662 3371685 3280476 3216014 3044312 2933250
3077 2933250 2798916 2776577 2754077 2656515 2567841 2497831 2484553 2473283 2499018 2472000 2451469
3066 2451469 2428678 2411029 2392842 2345406 2357057 2298510 2319385 2329370 2317563 2289079 2272421 2278600
3054 2278600 2199725 2141366 2095684 2082074 2069142 2035071 2016231 1992534 1979377 1944396 1907811
3043 1907811 1918842 1893428 1848377 1838036 1900514 1872773 1856794 1829445 1877879 1882300 1854521 1816065
3031 1816065 1785727 1789664 1777963 1768880 1715609 1721810 1735254 1726082 1695966 1623718 1591338 1627326
3019 1627326 1606401 1631244 1626085 1588821 1525661 1505343 1509747 1515219 1551648 1500109 1569463 1552297
3007 1552297 1513888 1499571 1465862 1492275 1497593 1526160 1512623 1494392 1475547 1486691 1588755
2996 1588755 1601282 1534875 1527500 1543890 1548417 1597938 1578423 1585379 1605179 1568534 1516902 1559128
2984 1559128 1600111 1591841 1559838 1550333 1528950 1556421 1568231 1563745 1585204 1594191 1649756 1642195
2972 1642195 1634346 1627373 1652333 1701052 1704186 1663409 1667417 1738621 1742684 1746990 1797384 1882126 1997978
2959 1997978 2035792 2052862 2126893 2177361 2167862 2182524 2145697 2159554 2101936 2068568 1973441 1892729
2947 1892729 1864131 1817872 1783052 1822364 1889964 1941244 1907942 1868544 1942080 1957620 1985009
2936 1985009 1972884 1967614 1945301 1952407 1982569 2017249 2020518 2001814 1978466 2033320 1993619 1925677
2924 1925677 1933403 1912891 1897174 1878783 1871881 1900257 1877630 1915915 1908465 1860499 1927807 1932394
2912 1932394 1955667 1969986 1990501 1971344 2026800 2058775 2074454 2097720 2102924 2126229 2086933 2042530
2900 2042530 2086677 2195320 2163912 2137988 2176301 2164104 2112502 2105027 2123918 2145210 2219827
2889 2219827 2227808 2237849 2311540 2329426 2325096 2360443 2424817 2457847 2468872 2529972 2625155 2675687
2877 2675687 2735812 2842479 2885444 2974763 3035358 3111713 3126463 3155192 3113217 3003223 3002285
2866 3002285 2955310 2877031 2818535 2760291 2709968 2650085 2642872 2618296 2630696 2649428 2651659 2683013
2854 2683013 2662954 2645050 2623663 2594890 2534415 2605790 2619995 2642290 2599964 2601322 2586384 2562985
2842 2562985 2568333 2520764 2495216 2470496 2407661 2345936 2358960 2317517 2254635 2230399 2265927 2235852
2830 2235852 2138662 2077416 2027580 1994315 1964765 1903508 1879417 1881397 1841067 1764726 1689208 1589232
2818 1589232 1621968 1588585 1463089 1414440 1390193 1343075 1238706 1208167 1213912 1183593 1171470
2807 1171470 1126986 1058303 1124757 1074641 997014 968433 980263 944069 950952 955102 935237 907463
2795 907463 875959 917225 878983 873591 854723 861260 838783 786016 773618 737652 738861 730365
2783 730365 705296 695413 696707 681176 641580 661114 618493 617513 628171 614670 627033 588412
2771 588412 594389 630467 637946 596860 561859 567439 582767 564607 533941 512026 522472 560450
2759 560450 541311 518116 515647 532911 524585 508461 461643 471759 468535 475013 480828 462672 438918
2746 438918 460636 432000 449760 424457 416180 431097 389329 406489 374915 376013 419124 450324
2734 450324 450195 466767 477345 435848 374255 448330 465230 392689 454482 454867 452411 451336 458527
2721 458527 447689 450225 469441 421725 422350 446440 440245 390824 410079 416567 409338 461480 487520
2708 487520 477363 479249 507937 534931 522554 493598 519884 535745 546416 598557 605469 615410
2696 615410 607892 660281 705632 771279 781788 771678 759009 801641 812547 851445 844101 890850
2684 890850 877156 868724 905596 907961 901745 868786 825415 779179 765092 699890 695897 669605
2672 669605 655460 654347 598003 534711 541454 500464 458456 438967 448364 469342 468234 416702
2660 416702 435601 439267 410644 390260 348862 342357 348021 365715 389283 345805 339436 354197
2648 354197 333362 336589 330656 301422 282552 301792 301741 300082 291345 275748 283908 285384 313008
2635 313008 288763 285576 338027 298263 277714 305926 314165 327138 314345 308256 308641 327583 353334
2622 353334 337964 351845 316044 320952 307522 279650 290045 271846 271603 311332 348521 337548
2610 337548 343266 352594 351931 315775 289351 322495 272371 248106 274418 256662 260939 254200 282736
2597 282736 302438 324625 349163 297815 246765 283989 312543 278839 289809 296726 290332 294391
2585 294391 292793 249364 296937 315449 307963 372801 353360 375009 341825 343212 313101 312107 301424
2572 301424 308022 331353 317508 251310 258944 252525 243589 222478 245027 258520 264438 281239 236837
2559 236837 252723 246701 253072 272645 325555 304446 268979 252493 286575 291519 301143 252904
2547 252904 258187 270093 275991 299837 338641 311182 298500 255891 225467 247932 245306 206033
2535 206033 216785 224180 165983 139070 173461 200371 147669 173592 125920 132263 163588 183928
2523 183928 144257 134688 216412 185731 171180 173891 126363 101306 119396 148746 147680 173941
2511 173941 199415 197823 169537 134596 118640 119377 109422 123054 123554 103048 114081 100221 94019
2498 94019 87814 111119 80255 66035 90515 92660 107217 58328 52335 88894 71046 120303
2486 120303 90698 99394 96766 61973 88707 45126 -4971 11610 55654 69033 79723 48498
2474 48498 75390 93991 55487 12710 40995 109997 85381 60471 41493 26433 31025 40150
2462 40150 32003 51047 65418 16940 31147 10214 36250 46376 74999 110274 51892 38142
2450 38142 46159 35600 1456 18276 34047 20555 67863 68448 76859 91793 41766 34439 -9871
2437 -9871 -6985 14648 25902 30829 3522 40106 58533 36399 22544 -20276 -453 23392
2425 23392 3548 36928 97420 66829 90895 86999 38103 29432 7161 6593 16934 39069 1714
2412 1714 -24810 14292 63689 49109 51806 30159 32899 43685 -8276 -17646 27311 17109 25435
2399 25435 62176 29162 -1969 23814 42762 -1310 16845 15981 29963 37402 51908 23592
2387 23592 33094 53390 11899 45689 58379 51985 32312 72454 114431 82592 66981 37261
2375 37261 12292 -6961 37599 36350 -17039 1995 -4913 -37457 -27393 16560 10412 13604 33884
2362 33884 44926 16892 40046 56189 37064 71623 51938 44998 46867 13646 29396 37445
2350 37445 58502 28282 38971 62523 41537 52283 80785 133248 92879 37066 46541 72878
2338 72878 63763 36887 62877 37665 64583 39804 41171 38013 8610 5423 -26579 13038 39392
2325 39392 63187 37380 16869 -1408 10447 15147 8076 -35157 -38550 -20255 9436 48830
2313 48830 25738 20081 18694 21135 23825 29894 15371 52089 53276 35600 58655 73531 24821
2300 24821 35804 58157 81483 87775 39628 43654 12776 -25978 25335 43809 79360 51206
2288 51206 66912 68566 11222 3783 1596 -3256 20040 3767 2117 21113 27322 34139 20284
2275 20284 13743 57997 100281 69174 79724 54633 51625 48887 4054 -5991 33160 43563
2263 43563 40860 85591 64174 -699 -8742 -1665 42759 54205 51732 16309 38866 13501 27136
2250 27136 30959 54335 49161 41301 56093 25742 1445 58707 51467 -8605 23036 29741 -11274
2237 -11274 -7992 54242 44309 32196 13122 21074 69612 62996 25567 21459 86340 71049 89886
2224 89886 114324 98538 84985 74445 40176 20384 49895 63313 64341 27066 37467 125220
2212 125220 69359 70477 105395 56303 62983 78826 67790 111287 143036 143596 98752 105479 68540
2199 68540 39094 58846 54852 89332 83503 75590 127245 124988 81492 78328 55786 63978 60949
2186 60949 98224 100499 100703 101936 107974 84190 107985 107506 124677 120709 142337 143657 146168 152983
2172 152983 116600 87379 128543 143558 133957 147263 161751 175190 157270 183160 142923 151133
2160 151133 185084 217459 197267 174874 235481 202001 198014 222401 230054 213822 230797 270298
2148 270298 303076 288974 275731 240430 265708 267215 296696 258159 277307 282832 260144 282981
2136 282981 355690 372491 353724 328741 305256 329586 334694 326676 361011 422879 400287 449035
2124 449035 454348 438262 473146 529689 550601 541031 567957 518516 548513 579089 574334 597968
2112 597968 623911 684370 650623 656185 689058 726348 730102 727828 751770 745034 809320 825233
2100 825233 878749 931463 986273 1089896 1095791 1155666 1213144 1348936 1469227 1573978 1720862
2089 1720862 1897742 1986100 2127884 2258933 2473424 2690885 2898648 3157120 3593998 4073627
2079 4073627 4702481 5559180 6752093 8218396 9863787 11133464 11491987 10837294 9963625
2070 9963625 9156169 7600188 5940843 4714939 3858901 3251871 2877847 2556794 2337086
2061 2337086 2134234 1982698 1850813 1733124 1660332 1576959 1445344 1366486 1274761 1183336
2051 1183336 1106483 1036670 968313 904600 862460 858298 851954 792289 761279 722330 741413 678920
2039 678920 641067 636600 586119 546088 517119 529181 522478 457537 442096 410993 386698 372659
2027 372659 352969 395451 435197 462798 398943 395997 415965 359372 346857 308748 264927 259913
2015 259913 249630 278320 220358 193581 214665 200762 189632 187584 252234 256872 264305 210233
2003 210233 207609 196336 212956 213355 170318 133995 169761 218253 191607 205925 190806 198956
1991 198956 168331 173427 164751 172697 189844 211296 197699 208987 173094 161037 156589 113714
1979 113714 105363 118411 117546 138489 153323 85187 85981 93016 136136 126409 119632 113434 91241
1966 91241 68665 30947 54267 94583 88204 98452 92941 95872 63373 66553 51848 41430 21079
1953 21079 61186 34006 -20824 15958 50190 42305 41886 70332 69678 53634 22267 33717 54867
1940 54867 42084 17867 53823 41164 78937 78950 119799 104563 96970 91833 37081 11976 47595
1927 47595 32561 63139 67092 67129 69928 52970 52904 28529 55350 23285 -30297 -43870 -17113
1914 -17113 -6216 32614 71510 41712 23194 5753 1964 29642 8395 -28384 13032 16560
1902 16560 47306 70568 75914 58173 54087 -9748 4221 9669 -14274 -14641 -21002 26820 30509
1889 30509 -44 -19671 -10101 7555 45654 23765 19328 5157 -9355 21286 -22222 38525
1877 38525 96255 27933 51108 35728 45197 14886 11603 2458 -22188 -4295 -8022 10078 14732
1864 14732 25169 10117 384 53651 95461 49109 18153 32565 16304 38331 47655 20956
1852 20956 28438 33322 48399 16520 -10207 -14834 -13674 63519 23685 -18574 -17286 -13208 12587
1839 12587 26179 38524 5110 12254 41803 7672 -15705 -18036 35025 41294 41843 55058 49343
1826 49343 22986 -18470 43078 68118 50019 30492 -13278 16814 12268 10730 22404 22181 35691
1813 35691 38425 14204 49705 31916 -9141 -6483 44134 52952 52291 59900 57798 34541 50027
1800 50027 46511 55363 78717 91976 37861 11547 3796 -11616 -26602 -64610 -34849 -4732
1788 -4732 18839 26561 43779 43720 30614 59349 86782 61342 59798 46207 30890 20939 -9618
1775 -9618 -7304 -7339 -19396 -5837 11695 -23538 -13400 -6985 14948 21332 -33068 23300 41376
1762 41376 6838 15921 49201 52465 22235 47471 69814 34458 33186 3854 5142 33938 21217
1749 21217 -57437 -49534 -55204 -8473 40486 18955 -3101 4532 5190 -35573 -47543 -40196 -51973
1736 -51973 -26442 -14061 -58849 -23805 -29948 -35492 -11905 -19572 5958 31962 1978 3893 14970
1723 14970 2217 24252 -19830 -8788 12323 37622 44917 17783 21672 31385 -9713 25832
1711 25832 13956 10322 30004 3889 9977 6932 39634 58445 -29761 11003 58819 -7936
1699 -7936 -24657 5887 -34570 -25354 8211 -25534 -38002 10305 26296 -13095 -4655 20439
1687 20439 5638 27215 10529 -16954 -32175 -44911 -41879 14004 32324 11593 14747 9735
1675 9735 40546 44864 53049 23228 1631 28942 6261 17129 11243 -15156 42814 6794 15705
1662 15705 52506 66692 17555 16940 11115 -11675 852 20325 27535 -18119 -54895 -65163 -34763
1649 -34763 -32963 -15634 13497 -23709 11827 -3088 -4798 8365 8440 16910 17815 12709 20914 -6675
1635 -6675 -51631 36542 99360 45333 -826 -678 31273 -10715 21424 33131 -942 -34239
1623 -34239 -10523 15104 -14713 11731 28920 55996 63446 42317 11412 -10231 13602 12772
1611 12772 -40726 -54385 15202 11877 27665 31210 33996 51153 -15251 -25309 -11677 -19264 3142
1598 3142 9442 20917 4468 36332 27322 2749 -8269 -5573 -45225 -65101 -32961 -64637 -37025
1585 -37025 -4801 -36084 17154 82624 70114 -13477 -41830 -5256 -29765 -10792 5368 -7642
1573 -7642 -43516 -1046 14880 1574 -23264 -31604 -15529 -29163 -43710 -29094 -12190 -50724
1561 -50724 -52930 -25149 -26405 4481 9144 -4811 -23242 -17600 25989 9161 6121 49794 58720
1548 58720 71618 58190 13349 -57249 -57365 6798 -14611 -2883 13232 -31861 -41871 -50087
1536 -50087 -31189 -7458 -13978 -40458 -26228 1789 -29440 -28871 -10355 -49281 -20015 6472
1524 6472 16034 17887 -2936 3205 -21671 610 6960 -43838 -37778 13908 25857 -14219 -20627
1511 -20627 -42435 -48904 -25660 -48465 -33641 -27988 6820 59442 17622 29553 11268 24167
1499 24167 -21006 20926 17134 -2220 -15714 21980 25764 10198 7422 18582 24096 -1405 9394
1486 9394 12402 24758 5539 -25101 -28502 -55881 -43408 -8034 40957 -2813 -36382 -22595
1474 -22595 54382 78121 52958 15593 -13914 -18365 -26365 -53922 -45681 -18057 -42974 13863
1462 13863 3748 -6615 -40469 -20788 -14588 -28220 -44537 7967 9048 790 -14802 11300
1450 11300 20144 -10914 -21570 20886 19500 -1043 -35313 1536 -24982 -30250 9897 21606
1438 21606 -26987 -36656 -42519 -19294 -4557 -18773 -22697 12301 -18056 -25749 -10318 21948 44391
1425 44391 56009 44164 37557 -8573 -45393 -42827 -27504 -24391 -18467 11536 -15135 7975 -25048
1412 -25048 -15853 -344 -37116 -68500 -33735 -74039 -34263 14592 3339 -37494 -53515 -236
1400 -236 1104 -16036 -51892 -2171 14762 -362 -32907 -8532 23777 -14750 -6935 -22122 -4724
1387 -4724 -7225 18878 6722 15448 -4739 3896 6899 59838 30585 -32105 -44149 -63222 -21427
1374 -21427 43576 1486 14875 4716 -41473 36595 22690 -25149 -19850 -5247 441 -16336
1362 -16336 -3002 -4452 -9611 8926 -52344 -28168 -25433 -41186 -34600 22550 -7864 -41669 15725
1349 15725 -197 -32765 -25071 -33660 2472 -9210 -67421 -50935 -8820 -2831 -19599 35387
1337 35387 19844 -71875 -65148 -3451 49169 55965 39433 -11959 -31440 10000 43334 35339
1325 35339 7242 -32337 -45920 -24822 -46387 -7439 6696 -6559 5130 39493 24845 4434
1313 4434 33518 49914 18864 -1933 -16433 -10627 5288 -15901 -45592 10531 22326 -8016
1301 -8016 -34380 -30479 -33646 -25187 4466 20592 46135 -3533 -16009 15520 33730 22351 39641
1288 39641 6724 -40409 -32504 -14277 -15139 -17116 719 10593 6650 -941 -51089 -44722 -31307
1275 -31307 -32424 -9234 -76521 -16146 -7271 -7071 -12743 -21725 -45074 -762 32040 -4514 -18993
1262 -18993 -104304 -85746 -42884 -64254 -66282 -29544 -42245 -54483 -40142 -26650 -99624 -37880
1250 -37880 -21429 -25557 -27387 -35684 -22013 -2294 -36488 -39520 -19497 -21729 29901 29397 1757
1237 1757 24742 45140 -9782 1073 -37122 -47460 -41159 -13102 -6873 22195 23858 2827 -18921
1224 -18921 -29151 -32387 -13056 -33228 -65140 -75410 -27581 5458 -18643 -30612 27 11183
1212 11183 -29067 -33194 -15008 16273 19112 22840 11875 37197 921 -33136 -4965 9342
1200 9342 42947 18141 30660 16948 -14394 44014 -12196 1029 45965 21347 9168 17641
1188 17641 6808 -8399 1549 29008 5653 -9034 10639 9145 -21909 -14467 12652 13552 -11368
1175 -11368 -19966 -66110 -57765 -39482 -8860 4705 677 26203 28704 -23570 46204 57230 26571
1162 26571 25008 34165 12340 -5007 1729 23374 25110 -43059 -27723 28981 25325 9938 -30894
1149 -30894 -24192 -16037 -39607 -6198 -61580 -26865 7014 16537 -5314 31360 29249 30655 -12800
1136 -12800 43772 32557 -21664 10312 4117 -46924 -45479 -2921 36639 20597 -5038 3263
1124 3263 33902 44132 1410 -49795 -59298 -18887 -23826 14573 22244 50000 22663 -18406 13647
1111 13647 35392 1941 -34526 -26338 22129 -7142 -18401 -28676 -12148 21870 -11682 -1402
1099 -1402 17687 14024 1389 33424 20205 -6955 -9158 19159 50908 20091 9622 10753 12778
1086 12778 -46493 -58020 -15393 -36062 -43426 -2308 3687 36593 -6191 -15267 11131 -2221
1074 -2221 10412 6495 -30778 -70538 -59662 -3578 8404 -11359 6477 26268 11401 6123
1062 6123 -33674 -35954 9654 14350 -12236 -30879 -7350 -12670 -16438 -23930 -20843 -18208 -252
1049 -252 314 30528 -12151 15666 42991 19767 -26535 -18152 -10868 291 6342 -10889 -13050
1036 -13050 -24773 -11367 22687 -597 -27761 13754 1752 -13859 -36810 -27888 7128 10462
1024 10462 10603 -5847 -23832 -33467 20471 22202 10401 -42979 -24987 2947 18025 25011 -7355
1011 -7355 -4959 35274 14146 -15020 9329 -449 -18262 -21726 -45257 -37704 -16121 8651 25544
998 25544 7640 -16738 -54102 -69255 -63482 25708 13994 24673 14881 -11785 -55007 -20506
986 -20506 -32309 -25674 -12066 -26345 -13035 -27813 -30866 929 -1299 -8016 43904 59656 14255
973 14255 21073 37797 28564 -7932 -22170 -25245 20209 8238 -37461 -21448 8349 50155 1030
960 1030 -25782 -22217 -29507 -20801 -14891 -15508 -36859 1834 14348 -6415 -106 -42 -8520 -10732 -11057
945 -11057 -4825 25931 6942 22819 13946 17177 31793 -7939 4767 20074 17910 9639 2137
932 2137 13529 -24584 -45617 3871 17921 1750 -3106 -22706 -25675 -550 7772 7089 -13552
919 -13552 -21512 -63097 -23134 -57645 -72104 -43920 -38684 -39327 -29180 -19613 -48056 4594 19820
906 19820 11001 8314 221 16788 46142 24591 5301 -15175 -13843 -27971 -27134 -38596 12538
893 12538 -1244 -26934 -26992 -52273 -37123 -32006 -19740 -28078 -19117 12153 -12548 -34225 -69785
880 -69785 -52969 2127 21220 10746 -6807 9379 46656 11343 -17868 8095 14808 6091
868 6091 16996 11416 26059 1147 -11798 5383 33705 39753 20075 64425 32173 -6939 -18852
855 -18852 -9058 10379 -7836 -45842 -47434 417 -8351 -7343 -10521 14252 29729 56429 29258
842 29258 -17289 -23953 -18902 -23178 -7458 11820 4347 -9535 -11865 -22600 -29063 2231 1295 10297
828 10297 1190 46939 47640 -8544 25252 7812 -6164 50213 50803 4338 -15992 -16292 -22706 -20573
814 -20573 -8926 47905 10330 7285 5463 -19810 -25791 -28955 387 -5890 1133 5085 -7013
801 -7013 -34321 -24057 -44652 -5058 20865 -20761 -32541 -18577 -1434 -16596 -13391 -50661
789 -50661 -608 25090 3674 4191 -13934 -34096 -13463 11118 12873 -19994 11493 -23946 -35409
776 -35409 5223 -16650 -14524 -27799 -47440 11814 32720 35713 40442 8596 -3173 11908 16195
763 16195 42711 2468 -39961 3130 -12200 634 -17644 -2402 14264 29344 18569 -6009
751 -6009 -12420 -7785 28642 20464 10609 -9638 -13610 -32093 -7140 -33833 -57287 -1258 -28085
738 -28085 -3937 -19543 -54550 -34615 1039 10759 19444 15513 31288 50918 28249 6874 -28151
725 -28151 -55822 -44972 -25071 -15779 -4929 -14542 -20462 -36704 -24637 -21030 -39825 -23183 8655
712 8655 -7516 45442 27539 3900 16852 -17063 -13488 20818 17967 71161 79230 33017 23049
699 23049 13455 -26408 -30135 -9150 1185 -2510 7293 18971 -54295 -66957 4437 -20858 -51616
686 -51616 -8589 -1118 13514 -3919 14560 6236 -11752 3637 16878 18163 25277 -4527 -22255
673 -22255 -34221 -29299 -49319 -29519 -3027 -4923 290 27126 23514 -11717 -41952 -23310 28951
660 28951 18648 -9247 -20091 -2526 -6867 -23264 2959 19676 21948 29902 15003 -3635 18237
647 18237 48286 14835 21711 11860 -31141 3223 2123 -18926 -60074 -8937 -479 4931 -18054
634 -18054 29812 41840 30744 1610 2299 69091 63780 37924 11897 -11736 -8133 7895 35022
621 35022 39186 14481 -29764 -54412 -27905 -32289 -5917 10565 56037 58552 36454 24185 -4360
608 -4360 12343 447 -8805 3661 -4139 10787 -20009 -1052 -5755 -11309 -18952 -22251 -9143
595 -9143 10977 -35656 -24122 2071 -28579 -31686 -10009 -32448 -33739 -15644 6828 11836 -5712
582 -5712 -5793 -2417 7863 5305 35800 77489 61526 56718 -1788 -29666 -53353 -10714 33120
569 33120 -10794 -23505 23498 46707 -10042 -14506 -20242 -2863 95 5610 10218 -10446 -5558
556 -5558 11242 -5713 -75874 -52505 -34259 -29071 -6241 13117 13076 -8325 5342 10819 -9206
543 -9206 27284 19519 10402 12275 -1451 -4161 25213 -24772 12203 23333 19582 34022 44666
530 44666 -48782 -65681 -5432 -13621 26248 -3211 5724 -46670 -64551 -25319 49387 31662
518 31662 -39926 -63717 -10937 -38112 -20983 -16534 -7630 36 -53147 -61263 -2771 -7731 -53072
505 -53072 -48783 -8359 -29724 -20657 -23971 -35154 -35426 -2175 -33136 -67164 -50529 -4 9165
492 9165 -18716 -34548 -85272 -68826 -16356 -5300 -18448 -32026 -6246 -1911 -11717 31153 47670
479 47670 82648 97272 55135 32455 33157 59627 30658 -36689 -40205 -44253 -34746 -59401 -77405
466 -77405 -19540 -3996 -12059 16692 -33962 -4195 15475 24366 -6360 -26513 -15641 -27715
454 -27715 41456 65400 62008 70610 47781 43741 24808 43787 40291 12075 52074 29805 32164
441 32164 11583 45805 33395 -46492 -47486 -33239 -44106 -25252 -39681 9360 46164 28522
429 28522 39778 22841 -26585 -13870 12689 -2742 -5530 -36179 -62865 -64901 -25681 -41761
417 -41761 -20249 -20004 7108 1288 -20140 -27448 -9961 -25697 3808 28945 38138 16670 -23313
404 -23313 6002 -12332 23314 63138 35702 11762 2358 -18594 1491 45278 8359 -25603
392 -25603 -38139 -43598 -12227 -37527 -51606 -21751 -315 -9936 18018 42690 3526 -10547
380 -10547 -17911 -23089 -6038 29617 17548 36577 21070 -21843 -2491 34125 1890 -22062
368 -22062 -9250 -19656 -23816 2036 -24953 -14267 4833 -36058 14536 22456 33409 -29331
356 -29331 -13371 14642 -2362 27631 -3648 17358 34894 51645 1989 -10399 9139 14211
344 14211 -11187 13818 3370 24428 27696 45023 11432 -6121 -3516 -70738 -6527 -14700 24602
331 24602 21863 11347 46843 7320 22184 -4162 -47312 6837 30955 53235 -16220 -11255
319 -11255 -43703 -14034 48381 44526 40548 33865 24681 39529 -2455 2208 28748 13567 -17508
306 -17508 -9824 4796 -6131 -14951 -9746 7614 20227 22497 37130 -29571 -49167 -12153 -39003
293 -39003 -38831 -17948 -35009 -19765 -12652 -35831 34963 -4523 -15621 30913 35384 -18374 -15843
280 -15843 -29547 -33741 9611 39453 -1624 13516 -31583 -47327 2012 36228 -21069 -16457
268 -16457 19543 39573 19268 13283 32283 -12054 -3213 -13815 -24783 -14091 -7683 33947 18699
255 18699 -18777 33570 30291 -6565 -24671 -3733 14069 25509 -3344 -45474 -53170 -27249
243 -27249 -3740 -5210 -55072 -42513 -30142 -13699 49656 68091 29947 26777 41080 28311
231 28311 2373 35513 7824 -11099 31262 21994 32017 21580 12356 6672 37739 56762 13440
218 13440 12685 30899 6568 -31634 -18169 13025 29123 -19516 -14835 27757 -8317 -11966 3820
205 3820 18952 -3498 -8068 -7492 -18605 -25436 2713 28831 31228 26007 33326 24345 784 -3588
191 -3588 40918 850 -40167 -45869 -86540 -49634 -40722 -22704 -33152 3367 29263 -9342 2462
178 2462 3118 10046 20685 6922 33731 9553 -8506 -31018 -43604 -48822 -35107 -18579 14865
165 14865 61662 51179 7985 -9116 -20539 -19189 -8703 53965 44563 12807 3130 1959 20417
152 20417 -5488 -22527 -15654 -21706 -45337 -41427 -29773 -27406 -40183 -11231 -26538 -46629 -10488
139 -10488 7075 1699 32839 -6962 -14817 -28397 19569 33810 -23047 -29811 -10725 1665 19529
126 19529 32890 64110 30293 36738 -555 18580 -1290 22756 49602 -12172 -16286 22496
114 22496 37027 44360 32773 9049 13861 -22246 -25230 -23094 12832 19772 28179 -11923 19438
101 19438 6785 -5573 -14414 -7620 2243 7773 7414 15300 28093 -16238 -6938 -2922 23192 -9175
87 -9175 10457 955 -35134 -7415 5467 -18681 -12734 8096 9529 -7576 -14895 -17091 7188
74 7188 24511 37315 51540 43225 25448 10490 9915 -20512 -7987 -15957 -384 -2099 24009
61 24009 -8968 -11319 -4605 19592 13815 -19878 -20107 3476 -1608 -6812 -27260 -17298 -5014 -3089
47 -3089 2820 -36037 -33192 -13727 -19575 -4642 14838 5390 -23158 -16397 -24203 -34288 1234 9865
33 9865 -16821 -3439 3552 -7809 17117 29912 23806 35286 23593 -15633 -16708 -9048 6566
20 6566 3060 1020 -7734 -34830 -34921 -11118 18270 41104 -2090 -15247 17255 1336 -4846 -8076
6 -8076 -4414 2469 10939 -1965 22117 16645
0 16645
$$ Imaginary data points
##PAGE= N=2
##DATA TABLE= (X++(I..I)), XYDATA
16383 -798288 -801699 -767386 -728458 -702080 -723896 -717691 -674857 -642658 -622593 -621646 -596136 -578660
16371 -578660 -544241 -540662 -556138 -473832 -451578 -440127 -403221 -421117 -414589 -376091 -363959 -313438
16359 -313438 -306967 -289071 -278582 -258373 -245071 -215319 -185056 -205765 -155066 -155522 -156152 -99481
16347 -99481 -93411 -91937 -60731 -50735 -38218 -46949 7200 43630 8074 47030 73507 78392 125255
16334 125255 129807 149574 173678 204448 221323 274151 307087 290569 318927 344661 344651 347816
16322 347816 365580 379564 347346 380687 413130 459300 498211 518385 549073 570061 547834
16311 547834 575125 572295 532625 596140 631783 630852 640390 644256 677946 733781 705035 704560 747057
16298 747057 759766 831639 803202 799395 810208 806440 839600 858682 871856 910567 929404 926681
16286 926681 941319 940987 998442 1007669 1027013 1033628 1041012 1034204 1055320 1056923 1084800 1117331 1075519
16273 1075519 1112426 1179365 1150758 1154097 1188631 1182919 1224958 1258234 1276106 1273537 1269476 1308399
16261 1308399 1308268 1313406 1307246 1307131 1372988 1394915 1355911 1343984 1370703 1368158 1398555 1423596 1477194
16248 1477194 1508113 1476233 1461102 1463667 1455225 1442406 1462478 1496223 1504671 1514226 1537136 1537568
16236 1537568 1558447 1573600 1562950 1562466 1604379 1620151 1666531 1656947 1647047 1655490 1644753 1698892
16224 1698892 1701107 1695414 1685479 1699058 1728861 1730692 1728215 1773420 1756421 1751237 1762494 1775188
16212 1775188 1841800 1852749 1820638 1835816 1840439 1840268 1828568 1843070 1882741 1855066 1850300 1893796
16200 1893796 1883792 1872808 1839419 1878931 1922664 1928268 1930797 1983199 1971567 1956624 1958436 1924725
16188 1924725 1944919 1963791 1994491 1972889 2004746 2001914 1972431 1975344 2006620 2049739 2048146 2053512
16176 2053512 2053726 2029379 1984901 2007788 2058661 2078838 2098583 2119721 2123324 2104485 2111216 2096566
16164 2096566 2121765 2104352 2122833 2130000 2120624 2098127 2114376 2148092 2169392 2138232 2140017 2143151
16152 2143151 2151340 2163982 2159513 2128439 2145664 2198116 2144927 2152572 2176356 2149982 2173090 2178238
16140 2178238 2223047 2195447 2157843 2193301 2208323 2228110 2217750 2213164 2231249 2170780 2149447
16129 2149447 2194948 2214916 2231066 2218881 2257880 2278541 2228803 2245517 2283975 2252382 2250061
16118 2250061 2259430 2245346 2254913 2264226 2234916 2223083 2222496 2240201 2257526 2287619 2306895 2278973
16106 2278973 2269370 2304200 2279280 2262295 2301522 2297279 2294719 2269482 2249853 2240199 2257818 2320977
16094 2320977 2306218 2284385 2266491 2314941 2317800 2292372 2306074 2326896 2317434 2323677 2331565 2298351
16082 2298351 2288686 2260871 2251560 2252290 2283007 2315650 2306200 2306867 2300597 2334178 2328577 2286955 2262341
16069 2262341 2275941 2295784 2316185 2323455 2342428 2333086 2365770 2368564 2305018 2317737 2298070 2280838
16057 2280838 2344763 2350007 2335709 2354351 2386304 2344967 2322576 2356910 2358000 2291189 2284161 2324027
16045 2324027 2304118 2319164 2318676 2315616 2315376 2360735 2334528 2319034 2331812 2345567 2334836 2329361
16033 2329361 2320355 2340127 2332354 2369141 2376028 2365261 2340563 2315101 2384542 2382780 2360557 2357725
16021 2357725 2333889 2378124 2420017 2408139 2390133 2372327 2372802 2354647 2377333 2401387 2405023 2411100
16009 2411100 2367730 2349380 2313402 2337308 2387590 2396467 2408224 2371197 2365174 2367281 2396053 2337472
15997 2337472 2371018 2348245 2348580 2357231 2332104 2308279 2376129 2361593 2387759 2413961 2344557 2334901
15985 2334901 2369346 2374549 2392433 2411222 2370604 2404487 2395019 2362048 2339773 2375657 2378233 2351369
15973 2351369 2360300 2349479 2321150 2338463 2364845 2373001 2367743 2397791 2366245 2336480 2310186 2368513
15961 2368513 2356692 2337768 2346688 2352345 2362859 2398353 2388479 2382255 2385891 2374603 2381023 2392190
15949 2392190 2420736 2398851 2394210 2424702 2421263 2408578 2395033 2374160 2430945 2439585 2412935 2355121
15937 2355121 2325833 2346172 2306885 2341326 2389046 2421675 2375130 2389428 2400694 2347539 2337734
15926 2337734 2378734 2363489 2347996 2340728 2321424 2373324 2334988 2319675 2331020 2367464 2367457 2362276
15914 2362276 2325344 2327614 2352744 2345738 2315430 2333153 2355892 2335641 2372981 2420667 2428043 2371897
15902 2371897 2393187 2389772 2410992 2420256 2433758 2417117 2380675 2374999 2386721 2391906 2370094 2412490
15890 2412490 2404787 2406296 2424251 2387242 2371159 2387883 2403424 2374957 2398841 2367013 2372928 2376679
15878 2376679 2347523 2376417 2385012 2406373 2422279 2414728 2361806 2346511 2348592 2385206 2395847 2414483
15866 2414483 2369776 2368132 2387535 2399043 2438644 2446587 2422702 2437857 2452499 2406048 2391063 2396299
15854 2396299 2397531 2388461 2378368 2416805 2430519 2423847 2394513 2357161 2373893 2384494 2366375 2361974
15842 2361974 2349186 2298553 2340515 2337129 2343461 2383849 2412636 2429603 2365766 2352066 2367432 2366392
15830 2366392 2393864 2454166 2444058 2395694 2367505 2385338 2395273 2379735 2384601 2396333 2389564 2361268
15818 2361268 2364162 2391465 2394889 2458456 2419527 2389276 2395619 2401426 2416825 2421470 2392052 2366904
15806 2366904 2390992 2400827 2390618 2424109 2435671 2439219 2426835 2426271 2451142 2500947 2483499 2418135
15794 2418135 2386684 2433473 2438858 2350132 2401977 2424420 2444885 2410544 2410561 2365851 2394064 2409806
15782 2409806 2431568 2479926 2450608 2402063 2441592 2430395 2397511 2434124 2395245 2398278 2431375
15771 2431375 2422767 2418505 2434752 2371792 2404372 2400207 2361957 2337483 2423405 2431671 2434372 2446213
15759 2446213 2455203 2417547 2409393 2453751 2435862 2419562 2397111 2448985 2436051 2422422 2410965 2419426
15747 2419426 2415934 2419684 2428851 2450009 2413010 2397515 2413231 2439998 2431775 2427786 2404442 2388110
15735 2388110 2397095 2451423 2444120 2451231 2410836 2409412 2440492 2425639 2410035 2427435 2447731 2387081
15723 2387081 2384467 2457865 2448338 2406583 2399759 2397470 2415558 2422034 2433442 2405870 2428013 2419260
15711 2419260 2439941 2406227 2425105 2443134 2409205 2449044 2478758 2458300 2419430 2446015 2448659
15700 2448659 2466503 2456559 2448354 2411581 2416628 2434889 2400160 2428189 2454521 2462347 2438176 2465379
15688 2465379 2470957 2425491 2474880 2487962 2410939 2402561 2436251 2414946 2412346 2443148 2502451 2490735
15676 2490735 2450811 2448613 2431824 2466247 2474515 2474996 2430431 2457371 2449746 2427197 2460623 2475590
15664 2475590 2480372 2471394 2473510 2474440 2499455 2480269 2502257 2523586 2471742 2461178 2456188 2442360
15652 2442360 2455057 2464585 2471215 2474496 2466379 2447654 2413300 2427508 2458671 2435506 2422042 2468705
15640 2468705 2472285 2440648 2442705 2452737 2478741 2454520 2403994 2436563 2469543 2472027 2449182 2420561
15628 2420561 2465913 2471192 2480314 2475926 2470876 2479288 2491265 2484987 2449360 2442916 2484450 2483707 2468455
15615 2468455 2478739 2459535 2456430 2433317 2435185 2461118 2492669 2466209 2460175 2452620 2432697 2420632
15603 2420632 2477858 2513740 2507350 2501371 2461411 2472621 2495258 2481930 2473594 2498702 2498940 2471201
15591 2471201 2505150 2453986 2454783 2467233 2481135 2500437 2497005 2530110 2487023 2454820 2471320 2521466
15579 2521466 2531819 2497316 2461195 2462282 2436066 2449265 2491806 2484723 2414028 2420025 2487466 2508416
15567 2508416 2521764 2495247 2510378 2503274 2485582 2479522 2509870 2513157 2521820 2485541 2496764 2518568
15555 2518568 2509230 2478366 2475291 2520558 2497373 2505198 2437852 2458582 2525707 2499263 2483720 2483833
15543 2483833 2470046 2480899 2461487 2464347 2484059 2513907 2503099 2483955 2527859 2531580 2502252 2454665
15531 2454665 2409880 2430145 2479045 2535411 2526873 2514538 2487022 2490933 2481557 2505925 2521558 2553491
15519 2553491 2557585 2509520 2489907 2466248 2458639 2486918 2521186 2501898 2463832 2491556 2509948 2499900
15507 2499900 2517720 2550526 2489966 2486283 2520219 2498718 2494639 2534318 2532512 2498458 2467679 2477527
15495 2477527 2520052 2528008 2565278 2535995 2532157 2533902 2561116 2551242 2531771 2494104 2517237 2543585
15483 2543585 2533755 2522977 2517806 2520727 2535876 2501222 2524482 2526318 2507333 2485756 2442347 2508887
15471 2508887 2504363 2511836 2532335 2545170 2522787 2502174 2480244 2439696 2488968 2508898 2564039 2526109
15459 2526109 2539529 2556405 2505722 2506580 2508507 2517511 2470290 2467229 2487778 2507980 2515857 2516018 2557095
15446 2557095 2524925 2494960 2494795 2493397 2521797 2537222 2514035 2442965 2449348 2478437 2519534 2557610
15434 2557610 2552888 2512743 2515642 2517479 2493630 2536174 2566956 2522755 2486922 2485109 2511444 2532645
15422 2532645 2538954 2532321 2543099 2490883 2499954 2492163 2481875 2481431 2504194 2545256 2540315 2557790 2562601
15409 2562601 2549530 2542321 2529225 2509915 2525696 2514355 2516969 2539610 2533833 2520451 2532489 2575588
15397 2575588 2519205 2503038 2516563 2524832 2548958 2529300 2539065 2551900 2549075 2506382 2536154 2537293
15385 2537293 2558755 2529231 2506122 2509932 2537966 2562695 2572528 2585949 2546457 2527491 2560349 2531660
15373 2531660 2525053 2555431 2548260 2556871 2541802 2543132 2595340 2550956 2513507 2477109 2475980 2522521
15361 2522521 2522653 2546052 2554686 2506878 2481700 2516645 2476045 2432885 2459641 2472979 2495394 2522067
15349 2522067 2520316 2521034 2552887 2563760 2582531 2597774 2537795 2534946 2555884 2585371 2575973 2551018
15337 2551018 2565380 2562328 2544235 2547854 2588190 2576574 2571475 2599312 2578386 2576359 2606460 2589270
15325 2589270 2536002 2586600 2570905 2517829 2519183 2542192 2562861 2559611 2554854 2565716 2577839 2590155
15313 2590155 2588146 2607790 2608706 2618244 2607762 2571302 2535214 2529523 2553177 2533501 2521172 2573525
15301 2573525 2562735 2552278 2548572 2534497 2561717 2577593 2588497 2575010 2565754 2524518 2552944 2533349
15289 2533349 2513660 2560069 2601328 2583200 2591695 2618322 2619589 2626045 2644767 2591033 2545562 2567406
15277 2567406 2558312 2554811 2595553 2595346 2572043 2564114 2590050 2634190 2642138 2614322 2611799 2555218 2516144
15264 2516144 2525143 2539962 2529700 2535839 2522996 2553788 2583382 2559443 2556966 2578493 2530185 2536954
15252 2536954 2586488 2596085 2578211 2569897 2587595 2583559 2616052 2573715 2553777 2572891 2590424 2582859
15240 2582859 2600872 2569056 2553685 2561925 2579883 2588455 2573053 2568933 2586422 2572196 2580845 2584473
15228 2584473 2628927 2601479 2574043 2564170 2547387 2547286 2577382 2561150 2573000 2551704 2582543 2622712
15216 2622712 2610610 2626208 2630343 2606539 2619930 2582546 2576692 2605666 2597488 2593726 2550510 2579001
15204 2579001 2634237 2615939 2574344 2579665 2597026 2603134 2644281 2609735 2584223 2600314 2567195 2586147
15192 2586147 2612545 2622567 2586365 2569074 2586793 2645102 2589339 2603458 2603069 2626109 2631658 2613161
15180 2613161 2631357 2588859 2607095 2595723 2633062 2624493 2602048 2581866 2591861 2602444 2569056 2558657
15168 2558657 2563438 2588916 2592847 2622555 2577238 2567253 2578706 2584724 2562022 2585699 2613039 2642805
15156 2642805 2595450 2592952 2631041 2644447 2612383 2585576 2640152 2649061 2624731 2635835 2612478 2573436
15144 2573436 2584770 2567584 2630528 2644097 2625571 2646161 2597628 2560233 2563530 2629235 2616849
15133 2616849 2637426 2639250 2619401 2611806 2595463 2578224 2585803 2611855 2603101 2584549 2604824 2607267
15121 2607267 2576829 2582710 2621193 2631100 2596327 2600385 2646837 2641765 2633005 2627845 2586047 2599034
15109 2599034 2607775 2602075 2575387 2617195 2610998 2594534 2602554 2638707 2682588 2633573 2594423 2610921
15097 2610921 2655627 2684846 2668566 2598118 2617971 2690238 2680438 2643329 2631261 2661036 2656429 2655435
15085 2655435 2677500 2675884 2658290 2640206 2651958 2664224 2639311 2624993 2635207 2634817 2647913 2611690
15073 2611690 2593480 2650807 2664066 2663142 2604857 2583072 2594210 2622908 2610670 2594265 2610656 2608014
15061 2608014 2586351 2627029 2639258 2623183 2666009 2707106 2642121 2639502 2655485 2672180 2643054
15050 2643054 2618041 2663646 2631090 2607682 2614009 2648511 2670765 2668630 2644222 2636841 2675314 2668078
15038 2668078 2642955 2679347 2707099 2670012 2672757 2674634 2651865 2656405 2678203 2697130 2671399 2634243
15026 2634243 2649533 2599982 2594325 2615998 2632340 2660852 2615631 2638810 2669181 2675212 2649979 2657177
15014 2657177 2655080 2645326 2631165 2659735 2679797 2643439 2645988 2690237 2691423 2684268 2673908 2654065
15002 2654065 2653643 2659768 2673319 2676408 2680073 2681612 2716082 2723308 2676061 2685893 2682896 2672010 2673255
14989 2673255 2679791 2698392 2655873 2650793 2677523 2689951 2666458 2625230 2626887 2631819 2695387 2660882
14977 2660882 2626412 2621339 2635979 2638714 2664021 2697378 2637621 2664956 2659773 2660109 2648800 2667748
14965 2667748 2673138 2673828 2665157 2653146 2689584 2656054 2645775 2720052 2726664 2692503 2708977 2713248
14953 2713248 2701845 2696334 2704426 2690469 2681699 2682981 2666214 2643698 2653314 2668338 2652048 2630598
14941 2630598 2628009 2668151 2699210 2727489 2714491 2690169 2662956 2676211 2697677 2665258 2669414 2686899
14929 2686899 2704956 2751387 2775279 2673774 2656608 2662599 2659126 2648131 2656111 2672538 2683397 2666348
14917 2666348 2705773 2703490 2664890 2676257 2646892 2681036 2644349 2665945 2675588 2674205 2684877 2677831
14905 2677831 2708944 2727302 2711354 2709246 2745793 2720382 2691133 2709415 2703909 2672087 2674053 2717049
14893 2717049 2703096 2643570 2697125 2662042 2690401 2712504 2711613 2725310 2756467 2757687 2703175 2686131
14881 2686131 2631191 2648110 2693710 2676041 2708993 2726417 2695318 2692184 2721336 2711935 2728742 2701147
14869 2701147 2702889 2705119 2671365 2689254 2691499 2685468 2656421 2697986 2678779 2656124 2675117 2713161
14857 2713161 2706281 2682900 2694263 2707919 2659034 2656668 2665801 2666093 2726402 2758376 2728160 2692280
14845 2692280 2645683 2681124 2715559 2724416 2742675 2675378 2643979 2679174 2711778 2735508 2723852
14834 2723852 2723305 2744987 2714222 2666719 2682754 2716380 2738415 2741778 2717204 2691367 2703724 2685345
14822 2685345 2704816 2724686 2742783 2740715 2690488 2714338 2731041 2674780 2707098 2714852 2730209 2713175
14810 2713175 2691334 2745297 2723095 2731181 2698028 2708655 2705112 2719646 2724825 2712691 2733722 2748829
$$ [...]
##END NTUPLES=NMR SPECTRUM
##END=
