##TITLE=1H_CA-9030-2
 CDCl3
 8 sc, 
 6.07.2022
##JCAMPDX= 6.0         $$ Bruker NMR JCAMP-DX V2.0
##DATA TYPE= NMR SPECTRUM
##DATA CLASS= NTUPLES
##ORIGIN= UXNMR, Bruker Analytische Messtechnik GmbH
##OWNER= root
$$ XWIN-NMR		Version 3.5
$$ Wed Jul  6 14:18:05 2022 Russian Standard Time (UT+4h)  she@DPX200
##.OBSERVE FREQUENCY= 200.1313499994
##.OBSERVE NUCLEUS= ^1H
##.ACQUISITION MODE= SIMULTANEOUS
##.ACQUISITION SCHEME= undefined
##.AVERAGES= 8
##.DIGITISER RES= 18
##SPECTROMETER/DATA SYSTEM= spect
##.PULSE SEQUENCE= zg30
##.SOLVENT NAME= CDCl3
##.SHIFT REFERENCE= (INTERNAL, CDCl3, 0, 15.7634)
##AUDIT TRAIL= $$ (NUMBER, WHEN, WHO, WHERE, WHAT)
$$ ##TITLE= Audit trail, XWIN-NMR		Version 3.5
$$ ##JCAMPDX= 5.01
$$ ##ORIGIN= Bruker BioSpin GmbH
$$ ##OWNER= she
$$ F:/spectra/data/she/nmr/H-F/1/pdata/1/auditp.txt
$$ ##AUDIT TRAIL=  $$ (NUMBER, WHEN, WHO, WHERE, WHAT)
(   1,<2022-07-06 14:16:53.25 +0400>,<she>,<DPX200>,
      <created by zg, POWCHK disabled, PULCHK disabled
       configuration hash MD5:
       00 E9 B6 7A A2 85 ED C7 34 08 36 98 17 FE 4E 26
       data hash MD5: 16K
       3B 55 AA A5 9B B0 6E DD F5 0C 37 AF 28 55 3A 93>)
(   2,<2022-07-06 14:16:55.64 +0400>,<she>,<DPX200>,
      <Start of raw data processing
       efp BC_mod = 2 LB = 0.24 FT_mod = 6 PKNL = 1 PHC0 = -18061.58 PHC1 = 15.80069 SI = 16K 
       data hash MD5: 16K
       39 26 17 36 FB D4 93 12 A8 F4 0B B7 B2 C0 04 88>)
(   3,<2022-07-06 14:17:12.50 +0400>,<she>,<DPX200>,
      <pk PHC0 = 2.819207 PHC1 = -5.2 
       data hash MD5: 16K
       21 30 1A 37 80 4A 18 EE 0E 8F 2E 3A C2 E1 CF A8>)
(   4,<2022-07-06 14:17:15.92 +0400>,<she>,<DPX200>,
      <abs ABSG = 5 
       data hash MD5: 16K
       60 40 AC 7E AD 37 15 F8 F4 C3 8F DF 19 2C 8A 5C>)
$$ ##END=
$$ 
$$ hash MD5
$$ D7 52 D0 44 CE 58 9B BF 52 39 16 4C 50 92 17 FD
##$RELAX= 
##$RELAX= 
##$RELAX= 
##$RELAX= 
##$RELAX= 
##$RELAX= 
$$ Bruker specific parameters
$$ --------------------------
##$DU= <F:/spectra>
##$EXPNO= 1
##$NAME= <H-F>
##$PROCNO= 1
##$TYPE= <nmr>
##$USER= <she>
##$AMP= (0..31)
100 100 100 100 100 100 100 100 100 100 100 100 100 100 100 100 100 100 
100 100 100 100 100 100 100 100 100 100 100 100 100 100 
##$AQSEQ= 0
##$AQ_mod= 1
##$AUNM= <au_zg>
##$AUTOPOS= <>
##$BF1= 200.13
##$BF2= 200.13
##$BF3= 200.13
##$BF4= 200.13
##$BF5= 200.13
##$BF6= 200.13
##$BF7= 200.13
##$BF8= 200.13
##$BYTORDA= 1
##$CFDGTYP= 0
##$CFRGTYP= 5
##$CHEMSTR= <none>
##$CNST= (0..31)
1 1 145 1 1 1 1 1 1 1 1 1 1 1 1 1 1 1 1 1 1 1 1 1 1 1 1 1 1 1 1 1 
##$CPDPRG= <>
##$CPDPRG1= <>
##$CPDPRG2= <>
##$CPDPRG3= <>
##$CPDPRG4= <mlev>
##$CPDPRG5= <mlev>
##$CPDPRG6= <mlev>
##$CPDPRG7= <mlev>
##$CPDPRG8= <mlev>
##$CPDPRGB= <>
##$CPDPRGT= <>
##$D= (0..31)
0 1.2 0 0 0 0 0 0 0 0.06 0 0.03 0 0 0 0 0.0002 0 0 0 0 0 0 0 0 0 0 0 0 
0 0 0 
##$DATE= 1657102612
##$DBL= (0..7)
120 120 120 120 120 120 120 120 
##$DBP= (0..7)
150 150 150 150 150 150 150 150 
##$DBP07= 0
##$DBPNAM0= <>
##$DBPNAM1= <>
##$DBPNAM2= <>
##$DBPNAM3= <>
##$DBPNAM4= <>
$$ [...]
##$SUBNAM2= <"">
##$SUBNAM3= <"">
##$SUBNAM4= <"">
##$SUBNAM5= <"">
##$SUBNAM6= <"">
##$SUBNAM7= <"">
##$SUBNAM8= <"">
##$SUBNAM9= <"">
##$SW= 18.0517283424941
##$SWIBOX= (0..15)
0 0 2 0 0 0 0 0 0 0 0 0 0 0 0 0 
##$SW_h= 3612.71676300578
##$TD= 16384
##$TD0= 1
##$TE= 0
##$TE2= 300
##$TE3= 300
##$TEG= 300
##$TL= (0..7)
0 120 120 120 120 120 120 120 
##$TP= (0..7)
150 150 150 150 150 150 150 150 
##$TP07= 0
##$TPNAME0= <>
##$TPNAME1= <>
##$TPNAME2= <>
##$TPNAME3= <>
##$TPNAME4= <>
##$TPNAME5= <>
##$TPNAME6= <>
##$TPNAME7= <>
##$TPOAL= (0..7)
0.5 0.5 0.5 0.5 0.5 0.5 0.5 0.5 
##$TPOFFS= (0..7)
0 0 0 0 0 0 0 0 
##$TUNHIN= 0
##$TUNHOUT= 0
##$TUNXOUT= 0
##$USERA1= <user>
##$USERA2= <user>
##$USERA3= <user>
##$USERA4= <user>
##$USERA5= <user>
##$V9= 5
##$VALIST= <valist>
##$VCLIST= <CCCCCCCCCCCCCCC>
##$VD= 0
##$VDLIST= <DDDDDDDDDDDDDDD>
##$VPLIST= <PPPPPPPPPPPPPPP>
##$VTLIST= <TTTTTTTTTTTTTTT>
##$WBST= 1024
##$WBSW= 4
##$XGAIN= (0..3)
0 0 0 0 
##$XL= 0
##$YL= 0
##$YMAX_a= 406805
##$YMIN_a= -678570
##$ZGOPTNS= <>
##$ZL1= 120
##$ZL2= 120
##$ZL3= 120
##$ZL4= 120
##$ABSF1= 15.74028
##$ABSF2= -2.311569
##$ABSG= 5
##$ABSL= 3
##$ALPHA= 0
##$AQORDER= 0
##$ASSFAC= 0
##$ASSFACI= 0
##$ASSFACX= 0
##$ASSWID= 0
##$AUNMP= <proc_1d>
##$AZFE= 0.1
##$AZFW= 0.1
##$BCFW= 0
##$BC_mod= 2
##$BYTORDP= 0
##$COROFFS= 0
##$CY= -3
##$DATMOD= 1
##$DC= 0
##$DFILT= <>
##$DTYPP= 0
##$F1P= 0
##$F2P= 0
##$FCOR= 1
##$FTSIZE= 16384
##$FT_mod= 6
##$GAMMA= 0
##$GB= 0
##$INTBC= 1
##$INTSCL= 0
##$ISEN= 128
##$LB= 0.24
##$LEV0= 0
##$LPBIN= 0
##$MAXI= 10000
##$MC2= 0
##$MEAN= 0
##$ME_mod= 0
##$MI= 1.114404
##$NCOEF= 0
##$NC_proc= -6
##$NLEV= 6
##$NOISF1= 3.799351
##$NOISF2= 2.8
##$NSP= 0
##$NTH_PI= 0
##$NZP= 0
##$OFFSET= 15.76342
##$PC= 1
##$PHC0= -18058.76
##$PHC1= 10.60069
##$PH_mod= 1
##$PKNL= yes
##$PPARMOD= 0
##$PSCAL= 0
##$PSIGN= 0
##$REVERSE= no
##$SF= 200.130001626239
##$SI= 16384
##$SIGF1= 3
##$SIGF2= 2
##$SINO= 5.538805
##$SIOLD= 16384
##$SREGLST= <1H.CDCl3>
##$SSB= 0
##$STSI= 16384
##$STSR= 0
##$SW_p= 3612.71676300578
##$SYMM= 0
##$S_DEV= 0
##$TDeff= 16384
##$TDoff= 0
##$TI= <>
##$TILT= no
##$TM1= 0
##$TM2= 0
##$TOPLEV= 0
##$USERP1= <user>
##$USERP2= <user>
##$USERP3= <user>
##$USERP4= <user>
##$USERP5= <user>
##$WDW= 1
##$XDIM= 16384
##$YMAX_p= 395974283
##$YMIN_p= -287016
$$ End of Bruker specific parameters
$$ ---------------------------------
##NTUPLES= NMR SPECTRUM
##VAR_NAME=  FREQUENCY,     SPECTRUM/REAL,   SPECTRUM/IMAG
##SYMBOL=    X,             R,               I
##VAR_TYPE=  INDEPENDENT,   DEPENDENT,       DEPENDENT
##VAR_FORM=  AFFN,          ASDF,            ASDF
##VAR_DIM=   16384,         16384,           16384
##UNITS=     HZ,            ARBITRARY UNITS, ARBITRARY UNITS
##FACTOR=    0.220516191357247, 1,           1
##FIRST=     3154.73329124483, 0,            0
##LAST=      -457.983471760951, 0,           0
##MIN=       -457.983471760951, -287016,     0
##MAX=       3154.73329124483, 395974283,    0
$$ Real data points
##PAGE= N=1
##DATA TABLE= (X++(R..R)), XYDATA
$$ [...]
9181 16215026 16325937 16153447 15808526 15539549 15551266 15278881 15256806 15129504 14727215 14307695
9171 14307695 14081804 13728697 13450071 13327400 13237512 13169696 13282215 13495779 13687244 13903430
9161 13903430 14147356 14319763 14299760 14258383 14237462 14196197 14228035 14068420 13882600 13843583
9151 13843583 13579725 13232702 12925429 12559623 12291165 12013252 11915520 11874161 11941008 11844786
9141 11844786 11745125 11778147 11749217 11432906 11024081 10577804 10115002 9922896 9731309 9592530
9131 9592530 9410936 9383618 9278537 9129807 9224556 9220207 9207764 9273802 9407111 9327472 9405464
9120 9405464 9533140 9579053 9494174 9420377 9320783 9048863 8775607 8456347 8262119 7999037
9110 7999037 7728545 7625065 7501382 7326565 7220030 7162699 7153137 7166098 7089724 6971055
9100 6971055 6946492 6922962 6860704 6817323 6872115 6810455 6810737 6689913 6855139 6844548 6810111
9089 6810111 6764060 6650098 6657611 6478645 6483946 6483062 6417686 6373038 6436576 6386168 6394489 6406102
9077 6406102 6360334 6328844 6383400 6406545 6332588 6446277 6424439 6499070 6478661 6483336 6466772
9066 6466772 6445434 6556246 6599216 6558177 6553554 6613466 6522405 6646083 6727400 6789098 6935857
9055 6935857 6962887 6989829 7020825 7120312 7174101 7354379 7470481 7570712 7614666 7729483 7791921
9044 7791921 7733858 7942166 7986124 8131694 8306498 8315162 8451944 8515310 8624629 8821750
9034 8821750 9067390 9270197 9367940 9579343 9754469 9907597 10130429 10327311 10732661 11102760
9024 11102760 11441157 11885944 12405805 12971546 13463126 14036114 14627956 14876571 15151403
9015 15151403 15182111 14902647 14623408 14593808 14599216 14616604 14807318 15044640 15152413 15390953
9005 15390953 15666469 15749624 16136555 16409469 16671126 17063858 17810690 18476477 19115971 19738771
8995 19738771 20205271 20409468 20556343 20564646 20671632 20787526 21167830 21641282 22247441 23050755
8985 23050755 23798722 24688354 25537499 26412834 27129842 27744196 28345659 28876261 29268401
8976 29268401 29407531 29479439 29433312 29246069 29195209 29138894 29045954 28866635 28960702 28892362 29023001
8965 29023001 29345694 29736476 30325337 31020426 31607756 32350193 33155695 33792421 34196333
8956 34196333 34508182 34806057 34694713 34737603 34679316 34508827 34278917 34104310 33649466 33250001
8946 33250001 33064685 32860613 32831241 33050589 33430789 33630214 33972178 34135138 33964806 33554194
8936 33554194 33073689 32655114 32364157 32252981 32106349 32169196 32132231 31910709 31716804 31364749
8926 31364749 30967034 30625980 30296172 29975536 29859531 30012687 30221153 30350166 30551206
8917 30551206 30447044 30014394 29590205 28951218 28223769 27629798 27140763 26676968 26467384
8908 26467384 25931642 25345931 24820261 24117066 23336314 22607262 21967397 21319452 20703323
8899 20703323 20252690 19864453 19582402 19319146 19027884 18664477 18299815 17904831 17530921
8890 17530921 17176127 16806651 16286502 15602139 15149100 14578689 14069366 13741346 13369734
8881 13369734 12971586 12753201 12554242 12311829 12155690 11942342 11749705 11505755 11197447
8872 11197447 11006753 10844928 10663934 10411722 10255522 10009870 9782967 9455225 9234884
8863 9234884 9044359 8894546 8613129 8429461 8300939 8102274 7862069 7759800 7587096 7406365
8853 7406365 7453581 7227462 6984513 6868113 6905139 6738695 6702428 6731771 6560279 6441276
8843 6441276 6450129 6387168 6301967 6329223 6212109 6183458 6124634 6108157 5956578 5991045 5990979 5893309
8831 5893309 5962954 5924103 5840659 5813850 5817941 5765174 5799184 5797728 5748979 5804263 5658391 5695602
8819 5695602 5700028 5699549 5636094 5601954 5619073 5634759 5668692 5644975 5730205 5731202 5844922 5777934
8807 5777934 5730013 5717774 5874497 5905054 5832437 5849506 5860477 5949299 5999812 5987115 5921937
8796 5921937 5986277 6027123 5996782 5993689 6114376 6141244 6085929 6110214 6034785 6134604 6235823
8785 6235823 6242951 6152390 6333885 6454849 6420730 6560839 6610743 6604392 6705096 6801260 6849235
8774 6849235 6841899 7060924 7105820 7064557 7229945 7415191 7354128 7453717 7610776 7609669 7661930
8763 7661930 7824118 8023724 8164912 8265129 8345508 8615696 8763212 8871226 8963153 9043382
8753 9043382 9181611 9304000 9472933 9626088 9738493 10038038 10083233 10193921 10536531 10624740
8743 10624740 10751981 11046615 11181144 11294311 11521968 11876339 11991724 12353687 12728809
8734 12728809 12843908 13171228 13368403 13570248 13904577 14306756 14469559 14842380 15185142
8725 15185142 15458528 15695450 16181942 16444331 16744220 17204021 17584837 17961780 18526047
8716 18526047 19175441 19577768 20229233 20960447 21641345 22340707 23314930 24056253 25002079
8707 25002079 26416194 27682313 29390424 31791467 34448379 36898997 39082284 39834362
8699 39834362 38612666 36997284 35663997 34565873 34141081 34172137 34369362 34855679 35638461
8690 35638461 36382223 37260386 38335854 39377807 40549296 41797419 43162378 44619710
8682 44619710 46252753 47941803 49893419 52065009 54365285 56776820 59595585 62549989
8674 62549989 65716391 69010947 72016317 74471879 76218549 77158219 77135546 76569708 75919955
8665 75919955 75263757 74881226 74901532 75075220 75331981 75746134 76019703 76326341 76780333 77562171
8655 77562171 78812670 80520362 82711774 85593252 88661207 91922627 94935039 97109653
8647 97109653 98621058 99451767 99602090 99539206 99609823 100038433 100691834 101658433 103053855
8638 103053855 104475501 105910506 107832547 109866158 112154868 114918090 117629217 119696910
8630 119696910 120682840 120226315 117982966 114325415 109889225 105253216 100965922 97581373
8622 97581373 94996510 93200356 92287523 92021416 91957399 92298191 92869419 93628303 94923045
8613 94923045 96405671 98200363 100381278 102279449 103621041 103820783 102419044 99327314
8605 99327314 94773140 89192254 83192813 77336960 72140244 67609185 63921735 60990594
8597 60990594 58409391 56363704 54794555 53276566 51932014 50753479 49617177 48345481
8589 48345481 47361523 46485652 45785713 45221907 44907226 44519828 44229941 44271643 44241866 44343887
8579 44343887 44740708 45103990 45563514 46402701 47222394 47989709 49078556 50245851 51478224
8570 51478224 52814944 54610210 56295750 58018789 60013664 61951434 63993874 66262345
8562 66262345 68809425 71582261 75076156 79182208 83967474 89482870 95614266 101878215
8554 101878215 108013782 113073305 116372351 117186905 115793640 112350275 107964021 103385465
8546 103385465 99072683 95480612 92621550 90356210 88582810 87354334 86218341 85450675
8538 85450675 85217468 85145726 85364914 86083071 87300965 88574488 89975000 91591197 93005620
8529 93005620 94549977 96365795 98143075 100454191 103324450 106760221 110870822 115688409
8521 115688409 121391970 127761172 134544946 141649427 148274403 153732672 157435551 158722141
8513 158722141 157679853 154494651 149627278 143438904 136642492 129595945 123073686 117023677
8505 117023677 111928678 107578817 104183268 101472644 99297205 97572112 95989909 94688520
8497 94688520 93699426 92790967 91864460 91163713 90497209 89845516 89334127 88888576 88472326
8488 88472326 88220354 88154189 87982491 88020923 88136956 88266611 88564720 89251612 89962032 91019045
8478 91019045 92332987 93660606 94803264 95130526 94516591 92818593 90229349 87107188
8470 87107188 83965983 80882843 78591759 76975495 76014090 75335873 75086421 74992090 74816100
8461 74816100 74496915 73950291 73134013 72049917 70810488 69350883 67827050 66344806 64773588
8452 64773588 63228482 61494620 59887189 58306737 56731729 55302756 53930186 52696927
8444 52696927 51610316 50612986 49490399 48727122 47959161 47291417 46747154 46268066 45998851
8435 45998851 45828839 45877643 46098093 46463333 46820739 47315171 47778731 48345088 48755727 49271386
8425 49271386 49690386 50202189 50402274 50537076 50255952 49544723 48492958 47089776 45509287
8416 45509287 43799172 42314753 40853566 39631685 38523766 37547863 36507426 35553484
8408 35553484 34709942 33736774 32920943 32078945 31168076 30295657 29592949 28863935 28167194
8399 28167194 27599142 27048187 26587134 26081003 25946026 25623871 25371158 25304781 25303736 25154252
8389 25154252 25114123 25073268 24841395 24636380 24483652 24031303 23510689 23097395 22533743 21753109
8379 21753109 21040463 20429344 19776515 18979110 18468118 17898698 17262750 16717351 16337698
8370 16337698 15786552 15161040 14790407 14228808 13843466 13333112 12861003 12458508 12120617
8361 12120617 11720630 11335533 10964699 10768098 10484605 10198659 9932101 9711604 9583985
8352 9583985 9416972 9252599 9015067 8828896 8541076 8325970 8138443 7836991 7774643 7571161
8342 7571161 7274578 7013922 6884988 6915176 6659346 6589660 6390061 6232900 6080916 6126193
8332 6126193 5944049 5790540 5635627 5572889 5482974 5496969 5501610 5274507 5115543 5061300 5061892
8321 5061892 4973636 4918254 4872644 4717737 4730388 4687122 4671511 4564381 4563659 4520638 4469863
8310 4469863 4507889 4443881 4614416 4395587 4402018 4376531 4285274 4109169 4178146 4115966 3997477
8299 3997477 4054245 4098212 3967962 3925911 4005210 3976433 3964822 3818268 3731217 3709691 3722458
8288 3722458 3697294 3634824 3647831 3608716 3564521 3543221 3453647 3358269 3477887 3442350 3341900
8277 3341900 3379749 3357693 3362726 3364616 3351203 3278462 3255966 3235641 3287378 3211859 3196911 3036377
8265 3036377 3082362 3118696 3006531 3073934 3067179 2940925 2889082 2958825 2832561 2828866 2889769
8254 2889769 2898618 2763216 2849302 2783813 2589055 2634392 2596388 2449244 2463212 2646070 2579274
8243 2579274 2491688 2654634 2598353 2476693 2433419 2548302 2456300 2349686 2351462 2283832 2199721
8232 2199721 2294932 2226865 2250246 2329451 2325569 2186154 2279226 2338069 2156206 2119689 2146318
8221 2146318 2110780 2058480 2079426 1993801 2018063 2079942 1963451 1925127 1926810 1940028 2005928
8210 2005928 1968241 1928054 1832910 1856643 1882738 1869809 1853588 1874328 1831388 1826679 1795314 1970228
8198 1970228 1974976 1998002 1911562 2133577 2079743 2364025 1503903 836466 1384828 1365345 1468112
8187 1468112 1569059 1762753 1840295 1683784 1698281 1755548 1576845 1701040 1692618 1670120 1528295
8176 1528295 1774221 1669906 1573242 1678354 1712989 1711200 1657714 1679412 1573938 1598719 1737589
8165 1737589 1668823 1639911 1814018 1741380 1702775 1722392 1678269 1674472 1688099 1706351 1729624
8154 1729624 1619195 1646156 1867912 1802350 1792031 1850818 1992459 1956722 1888498 1930881 1810305
8143 1810305 1811274 1805402 1822037 1733245 1656117 1703020 1683514 1728184 1804428 1683251 1638233 1623273
8131 1623273 1652317 1715864 1730036 1747065 1621077 1625213 1709430 1762484 1686905 1606109 1622977
8120 1622977 1596762 1589841 1570142 1517000 1462388 1599415 1591951 1580104 1575588 1519009 1549695 1570396
8108 1570396 1506492 1597187 1570444 1589492 1611807 1547454 1489406 1446382 1450062 1443023 1467758 1396403
8096 1396403 1325339 1369669 1383265 1434100 1401077 1414267 1432216 1447892 1323678 1417583 1405708
8085 1405708 1334601 1342929 1224979 1372216 1411406 1295192 1319063 1330843 1211263 1206508 1300695
8074 1300695 1135064 1085152 1185968 1199734 1120651 1218163 1199970 1088920 1214614 1345609
8064 1345609 1266479 1092627 1166912 1135119 1102584 1138145 1032610 1056618 1109603 1122007 1156522
8053 1156522 1145201 1207257 1131663 1161551 1084320 1081609 1056341 1052124 993159 979073 1102741 1080870
8041 1080870 987613 1019235 1015785 997194 978795 1077449 989962 1005997 919461 940088 952278 968928
8029 968928 929471 946988 941913 922396 924454 926291 906438 950489 980406 949941 968975 865732
8017 865732 1025708 1039183 1040967 939575 851149 913123 910584 926989 809047 783084 905264
8006 905264 993562 873926 920367 954354 912841 993748 953041 1004923 932777 954629 928945
7995 928945 835485 804176 805509 719306 816264 912687 760617 796198 835608 819777 888768 894893
7983 894893 923883 834427 810114 785408 924523 907379 874526 910412 870954 951923 898683
7972 898683 903227 856496 825522 934388 972188 870566 877245 804035 840898 808212 756879 738507
7960 738507 772695 846638 858289 878662 858849 898001 832198 830415 842019 747995 727322 865362
7948 865362 769432 773639 718583 696532 859768 907578 769922 735833 785350 686225 699561
7937 699561 842588 778211 684168 812042 777870 838735 766716 722868 636700 637438 689239 643416
7925 643416 729650 807273 681667 740056 805350 686110 727727 742483 742060 756675 741319 673027
7913 673027 676067 624475 756460 710352 696458 822125 789401 718783 779155 678725 689011
7902 689011 691190 777394 700436 714316 848793 793094 813777 805551 684918 699796 646182 658096
7890 658096 698445 701514 724220 717542 860835 808106 675075 702938 688227 681620 653192 653082
7878 653082 685816 830968 825901 662950 774843 818105 736307 763610 760353 639295 695707
7867 695707 706972 676366 732218 704436 753258 731898 718370 814765 763065 739143 754846 820175
7855 820175 773856 685991 713240 729627 740185 769877 661175 683510 634369 694353 715873
7844 715873 695856 698315 675330 749859 767758 779572 789614 713775 702895 786519 783901 743120
7832 743120 783550 766182 867865 646463 702252 736091 714877 763490 748298 706203 799117
7821 799117 783592 697068 829198 916763 701867 627988 665473 531739 683119 709308 659488
7810 659488 639714 660502 620201 676589 758562 808346 826740 762701 750393 755374 905320 912905
7798 912905 739611 792037 866980 813673 809889 822916 807386 876811 926947 902884 891322 1004389
7786 1004389 980962 942113 1032489 1033575 966397 924869 920674 814805 776882 793847 855315 819926
7774 819926 900593 925435 938744 913414 894259 788780 713787 735506 773000 755485 700750
7763 700750 744161 777736 743857 737713 881948 854330 735559 768840 797852 720016 914979
7752 914979 968339 1005539 906635 884310 845895 783444 793365 853611 733535 815323 882187 883060
7740 883060 813064 939264 900328 808901 788538 834910 788628 683253 876417 882357 796309
7729 796309 861846 861771 775116 790620 966397 832484 903386 1030511 862280 805920 890761
7718 890761 866536 869440 963103 907063 926010 902503 963515 928801 1026985 920812 869788 929339
7706 929339 1008046 895426 942462 1086070 1020849 995137 939521 940078 883032 904613 929955 936821
7694 936821 976673 1019875 957755 913702 1017819 891387 868915 977018 936998 869789 835757
7683 835757 853841 820139 888089 763689 824762 845031 792595 835802 839297 931337 839637 863204
7671 863204 937566 791558 805559 893108 905548 840632 880294 876945 793935 882249 954590 909292
7659 909292 950377 977368 964517 793698 878195 979795 868836 856200 933136 985554 925565
7648 925565 1005015 862545 916867 862183 1002201 875062 963400 1004923 814078 813429 911254
7637 911254 1035475 964514 934788 949345 998273 992199 925395 919477 989134 969094 855151 938418
7625 938418 905956 916874 917409 967057 849093 922946 943287 959776 974061 1079808 1123449 969433
7613 969433 944566 989077 890297 968634 1017323 990676 921771 968684 994592 911790 953055 1093363
7601 1093363 979230 935067 972682 990296 957501 833338 977795 941496 1128979 1080766 1061259
7590 1061259 1065169 1209192 1086457 993740 1052069 1034318 1116739 1140303 1052673 1101667 1058999
7579 1058999 1052519 1100998 1100269 981145 987753 961737 963064 962494 1031025 954918 1062243 1166108
7567 1166108 1279101 1047793 1081105 1145106 1067644 1085110 1111051 1067276 1067430 1145442 1151725 1031986
7555 1031986 1040667 1068751 1028321 1109813 1063668 1125012 1154442 1147940 1220300 1208601 1157155 1148285
7543 1148285 1148496 1103393 1055035 1017824 995130 989306 1109955 1173023 1040494 1098812 1099166 999221
7531 999221 1072200 1156931 1088916 1083991 1117176 1188486 1120632 1227611 1214040 1142242 1154792 1171414
7519 1171414 1049504 1033879 1108104 1072764 978781 1102328 1151367 1111139 1088960 1102762 1175168
7508 1175168 1131053 1212684 1157217 1065472 1110692 1233603 1156370 1070891 1231679 1256284 1225503
7497 1225503 1264984 1220108 1138570 1175319 1246066 1166826 1136397 1266751 1300432 1308440 1292477
7486 1292477 1384792 1268832 1191031 1291927 1373480 1361490 1397269 1390236 1287687 1366844 1490019
7475 1490019 1420540 1324111 1444569 1521247 1380917 1328395 1284761 1320392 1371024 1466859 1449984
7464 1449984 1335384 1329069 1373893 1362625 1357035 1261901 1380401 1288130 1325502 1373507 1364039 1383519
7452 1383519 1505143 1389602 1405566 1375292 1356306 1403966 1420876 1470090 1416437 1448700 1408536
7441 1408536 1469684 1439959 1380319 1364424 1438248 1402846 1404751 1442493 1432676 1440194 1545929 1595487
7429 1595487 1580202 1476383 1494243 1441044 1420149 1389828 1462812 1498907 1589691 1545014 1524175
7418 1524175 1575232 1523466 1474763 1484931 1515057 1521524 1448545 1411511 1441327 1468516 1371309 1423885
7406 1423885 1423069 1411252 1465071 1552855 1546236 1541820 1395259 1356272 1363321 1422437 1425181 1458360
7394 1458360 1495011 1575707 1566862 1412020 1311809 1474244 1667369 1610385 1514828 1494508 1459584
7383 1459584 1408593 1480744 1588753 1561869 1552172 1565178 1537864 1587542 1598454 1558210 1548204
7372 1548204 1558433 1484992 1558023 1584215 1579678 1527802 1600467 1528980 1443871 1610813 1610748 1596533
7360 1596533 1581349 1590228 1619226 1618896 1554646 1621551 1617505 1575199 1653042 1636195 1566496 1621817
7348 1621817 1646337 1644034 1642104 1737676 1710504 1579910 1734169 1679688 1635250 1712251 1851892
7337 1851892 1674443 1607077 1698247 1652339 1668880 1694923 1748235 1611100 1605024 1663365 1641131
7326 1641131 1762803 1718053 1691330 1735864 1811354 1709522 1702968 1588279 1674590 1658540 1707826
7315 1707826 1717090 1773143 1704056 1759367 1774971 1774015 1817055 1769226 1802529 1702214 1747175 1756235
7303 1756235 1642495 1747152 1791054 1698701 1804166 1848256 1768775 1719570 1772303 1786741 1761498
7292 1761498 1857652 1904413 1936176 1918279 1859061 1827422 1813059 1810223 1856329 1974056 1951619
7281 1951619 1912335 1994097 2114843 2059660 2284786 2388640 2337348 2403440 2581051 2398524
7271 2398524 2318132 2312863 2129650 2032085 2081259 2010043 1886265 1968741 1984764 1940759 2026628
7260 2026628 2172605 2058433 2012455 2022062 1868629 1914198 1998582 1991421 1972762 2089202 2034578
7249 2034578 2018376 2156106 2042723 1995806 2075817 1968756 2054926 2049197 2083419 2017967 2022446
7238 2022446 1961372 1942546 2032421 2058229 1968389 1983827 1996460 1967470 2024622 2084694 2084349 2005644
7226 2005644 2127816 2030637 2061789 2048318 2123360 2171551 2220585 2240621 2241109 2239991 2227059 2129958
7214 2129958 2127857 2138204 2055250 2183757 2123718 2061954 2231692 2325062 2283364 2250663 2271636
7203 2271636 2174366 2243244 2282964 2248963 2289189 2394328 2303295 2350349 2281737 2336057 2248445
7192 2248445 2239702 2333369 2302321 2279029 2365985 2315614 2347923 2495898 2450228 2366367 2397080
7181 2397080 2453240 2326096 2480828 2494105 2468852 2455779 2562345 2464233 2479717 2546175 2621067
7170 2621067 2568237 2590868 2652633 2590350 2684584 2769046 2771807 2816855 2840169 2873755 2843039 2921012
7158 2921012 3003570 2950739 3059061 3121906 2981566 3002110 2905931 2765511 2807404 2947615 2795647
7147 2795647 2735695 2810055 2771753 2709385 2655057 2641853 2631158 2764932 2770436 2689525 2792178
7136 2792178 2832136 2706730 2732730 2827812 2712980 2750597 2757650 2717845 2777582 2842460 2836549
7125 2836549 2700916 2764553 2797654 2759392 2764541 2800352 2801806 2893173 2921165 2944901 3030469 2962386
7113 2962386 2889285 2926792 3031303 3055754 2970987 2965320 2985366 3031041 2969594 3029415 3060794
7102 3060794 3143256 3107700 3153288 3174960 3147952 3214711 3180859 3137745 3125466 3215381 3235500
7091 3235500 3242474 3371484 3379640 3399515 3411545 3444657 3442054 3401526 3404785 3404563 3325435 3425613
7079 3425613 3373760 3375106 3488621 3481012 3500010 3561059 3715205 3666251 3690725 3853246 3850769
7068 3850769 3822347 3905545 3922379 4037541 4153739 4157257 4230289 4319901 4359895 4390079 4447756
7057 4447756 4614677 4552142 4767174 4762118 4886971 5041403 5043073 5098192 5327468 5540251 5588103
7046 5588103 5828806 6051011 6271078 6672949 7174571 7394792 7961525 8618419 9441234 10259967
7036 10259967 11381373 12670196 13678362 14498248 14897354 14510888 13551989 12461479 10993382
7027 10993382 9626637 8596399 7825151 7097084 6633990 6345621 6015845 5860659 5682672
7018 5682672 5393934 5225937 5138314 5031451 5010955 5031337 4968552 4853686 4801767 4683638
7008 4683638 4682019 4741817 4724299 4573208 4644334 4624433 4593238 4539201 4686785 4584550 4595663
6997 4595663 4651671 4439803 4521782 4528666 4566000 4509127 4601325 4560385 4664148 4738259 4639474
6986 4639474 4709680 4736099 4804341 4837141 4932030 4887275 4953427 4977482 4907421 4972838 4921720
6975 4921720 5021422 4995403 5009696 4910301 4870757 4937941 4971405 4968695 5012713 5129058 5099782
6964 5099782 5259937 5168086 5237316 5215586 5281898 5303820 5341052 5478614 5457288 5502104 5609235
6953 5609235 5672387 5687579 6015535 5919204 5918326 6070279 6164938 6066398 6141891 6226412 6252476
6942 6252476 6333004 6479239 6423832 6618946 6765319 6818585 6907456 7137176 7094291 7184352 7431423
6931 7431423 7535741 7496298 7671548 7804993 7949322 8197114 8368643 8427963 8635310 8820445
6921 8820445 8851382 9121401 9272070 9346127 9562614 9824090 9875820 10001000 10324548 10494774
6911 10494774 10723991 11026651 11327153 11605991 12033478 12419486 12644055 13069889 13347723
6902 13347723 13702035 14094170 14607317 14939720 15266652 15800914 16229151 16717879 17363837
6893 17363837 17950714 18529317 19410764 20422411 21403430 22555672 24100307 25961730 28120249
6884 28120249 30742326 33803095 37561402 41823817 47157757 54463773 64270253 76866153
6876 76866153 91511813 108101210 123272961 123779427 117112643 103644755 82806744 64764999
6868 64764999 50882796 41815975 35575072 31337782 28038143 25430075 23348337 21698186
6860 21698186 20314543 19298190 18287777 17574356 16736494 16169767 15585425 15297581 14680789
6851 14680789 14228422 13856274 13508058 13133302 12831650 12666547 12302743 12053811 11816745
6842 11816745 11651398 11478898 11398350 11328114 11212342 11244652 11176730 11106047 11133349 11058890 10958645
6831 10958645 10914376 10836126 10899341 10832266 10849249 10846494 10852375 10848170 10820606 10918122 10981722 11013857
6819 11013857 11100585 11161601 11147748 11348642 11432944 11514332 11669963 11844835 11948236 12064902
6809 12064902 12273909 12359821 12540677 12692917 12776824 12917045 13126089 13315858 13544752 13757463
6799 13757463 13978999 14172221 14350826 14606523 14734464 15131715 15607431 15847991 16230365
6790 16230365 16657388 17034381 17413925 17928341 18496119 18958722 19471042 19956863 20457224
6781 20457224 20998717 21546030 22263625 23017233 23748002 24546581 25387987 26288914 27364965
6772 27364965 28508622 29827819 31364200 32965927 34821851 36995031 39401947 42131822
6764 42131822 45408142 49121078 53365986 58393710 64046690 70439804 77575575 85607518
6756 85607518 93930264 102306199 110196632 116976862 121629078 123837296 123319836 120030835
6748 120030835 114040132 106168432 97064355 87422206 78144269 69331265 61676784 55018766
6740 55018766 49352300 44589277 40694809 37311292 34413225 32188285 30052832 28082118
6732 28082118 26447041 25096890 23808404 22702983 21735102 20628639 19684891 18996300 18345577
6723 18345577 17506859 16948332 16424013 15849281 15377869 15045585 14594004 14202544 13942472
6714 13942472 13580301 13290601 13040716 12763806 12472804 12243918 12018378 11755089 11541837
6705 11541837 11333703 11284440 10974390 10810117 10630182 10470492 10400457 10357481 10134024 9995352
6695 9995352 9914263 9728502 9570228 9600302 9621955 9420290 9269021 9259702 9154505 9065555 9023514
6684 9023514 8912205 8751763 8733366 8584557 8475812 8451546 8412319 8380934 8230559 8221934 8193332
6673 8193332 8167606 8094378 7950722 7876637 7868454 7844232 7872052 7790085 7727838 7712975 7577155
6662 7577155 7588134 7593572 7520766 7500819 7457608 7386027 7290743 7376615 7401333 7323480 7299216 7283148
6650 7283148 7221157 7183931 7144228 7049467 7045179 7100368 6915051 7004686 7141302 7115557 7113615
6639 7113615 7211160 7124245 6947377 6908102 6963220 7018660 6967328 7065769 7156379 7101210 7010272
6628 7010272 6959304 6982189 6947166 6851382 6729943 6934852 6910413 6819538 6789369 6878411 6860709
6617 6860709 6922149 6930694 6859801 6863733 6837287 6887669 6869288 6857071 6777940 6734111 6829266 6880760
6605 6880760 6915808 6874934 6927104 6947764 6984203 6919123 6890366 6885613 6841739 6861079 6787061 6808542
6593 6808542 6813468 6828273 6848806 6940358 6909412 6917833 6889448 6846697 6817979 6853282 6796651 6871927
6581 6871927 6861025 6894406 6883501 6925363 6923862 7028142 7064990 6946033 6937201 6941752 6925899 6935326
6569 6935326 6894556 6773872 6829092 7024258 6993140 6940413 7084752 7141403 7016601 6998924 6985387
6558 6985387 6930534 6968301 7022230 6870008 6843017 6936177 6951185 6975893 6913049 6960051 6856131
6547 6856131 6982999 7126004 6997474 7077976 7142180 7096918 7124221 7115090 7094560 7041702 7103709
6536 7103709 7085323 7010232 7130093 7089071 7094933 7111331 7016936 7081636 7190212 7168162 7184054
6525 7184054 7228073 7193102 7178708 7232582 7217313 7213900 7321644 7273173 7230043 7432487 7462312
6514 7462312 7326579 7416036 7423318 7250166 7352625 7350212 7363512 7442226 7420786 7293997 7268094
6503 7268094 7269274 7242059 7310496 7338331 7336099 7276737 7352002 7313916 7348455 7349569 7383456 7322560
6491 7322560 7520633 7532372 7497242 7529132 7530879 7548419 7759490 7696083 7547160 7549472 7594885
6480 7594885 7507703 7480089 7524339 7465371 7512382 7617900 7573691 7559473 7636368 7870398 7813988
6469 7813988 7899044 7993736 7870553 7970364 7831675 7743049 7621448 7641415 7469694 7604278
6459 7604278 7650535 7598967 7624946 7638115 7516658 7502857 7601619 7447860 7362492 7481486 7439784
6448 7439784 7319374 7474209 7488803 7362369 7425020 7412174 7304837 7305534 7395362 7234465 7299166
6437 7299166 7411890 7306990 7259969 7363766 7356750 7310835 7471628 7386492 7346921 7509853 7520343
6426 7520343 7351704 7330293 7384477 7326088 7303184 7355805 7305252 7276312 7469406 7382257 7267516
6415 7267516 7305736 7363233 7305767 7313877 7412665 7324454 7404675 7338281 7378237 7303090 7307511 7255165
6403 7255165 7205995 7393298 7430062 7407702 7336800 7357439 7395267 7485617 7288726 7280856 7394937
6392 7394937 7307169 7200506 7275224 7251588 7251783 7311748 7414622 7362266 7315359 7407295 7357589
6381 7357589 7203772 7166918 7162534 7203063 7295928 7235041 7221712 7293544 7246490 7177509 7261112
6370 7261112 7213395 7158454 7289229 7254848 7127785 7251314 7331578 7264120 7223782 7358300 7275892
6359 7275892 7311687 7382162 7328964 7314566 7322202 7266177 7243051 7328174 7400496 7340508 7421518 7551111
6347 7551111 7459018 7370124 7481242 7580857 7594768 7692728 7691655 7490109 7475581 7457811 7430331
6336 7430331 7435264 7457477 7395301 7300174 7252413 7162683 7196821 7167656 7223757 7172333 7144507 7061050
6324 7061050 7059331 7035462 7071592 7061173 7011402 7055770 6983009 6991715 6924682 7049841 6951478 7006975
6312 7006975 6895145 6881835 6859939 6880276 6903189 6908171 7004646 6959674 6897065 6908407 6879166
6301 6879166 6907815 6876209 6893052 6870088 6881388 6950678 6931548 6797233 6756228 6752897 6649749
6290 6649749 6794614 6762516 6789963 6672285 6777672 6721056 6814299 6723987 6802037 6717131 6748375
6279 6748375 6729792 6706314 6665586 6585919 6645957 6574175 6561588 6657182 6684492 6580199 6462586
6268 6462586 6567880 6556050 6644893 6602834 6563171 6499629 6461111 6484315 6537464 6532752 6499706
6257 6499706 6574059 6500378 6551236 6485390 6463900 6455497 6564251 6489227 6448511 6526272 6417500
6246 6417500 6384637 6422397 6375545 6429181 6391300 6425693 6376468 6477656 6403232 6417979 6389145
6235 6389145 6479637 6422855 6547192 6540484 6531450 6457776 6510564 6470291 6559233 6643984 6579838 6627825
6223 6627825 6547564 6490773 6504608 6462581 6307504 6308527 6337278 6195909 6260672 6277512 6221166
6212 6221166 6215980 6329427 6225334 6146591 6243226 6145398 6011475 6152607 6195958 5967135 6173046
6201 6173046 6196895 6072329 5949077 6125857 6062395 6055941 6111100 5982318 5954938 6079267 5962535
6190 5962535 5937482 6078195 5984358 5927373 5983501 5966397 5882432 5945132 6006562 5681052 5660216
6179 5660216 5898704 5867704 5892222 5957041 5905616 5867347 5805591 5913494 5812292 5896753 5934140
6168 5934140 5710956 5675729 5755619 5782916 5883311 5906786 5854097 5732761 5687022 5793518 5839478
6157 5839478 5863456 5833038 5800436 5736124 5844796 5783378 5807584 5900677 5960433 5964926 6074807
6146 6074807 6149296 6110936 6163912 6254634 6438313 6441097 6519388 6404354 6350526 6380755 6480156
6135 6480156 6483713 6598573 6794877 6775064 6901309 7107650 7224814 7289016 7240929 7066064
6125 7066064 6782799 6559682 6304604 6147971 6015792 5847398 5714446 5657013 5623067 5616276
6115 5616276 5520991 5518944 5526240 5421861 5349473 5378221 5427806 5285699 5273358 5268182 5267015 5252177
6103 5252177 5343810 5217072 4984112 5014110 5180390 5122988 5161712 5233208 5020016 5024567 5080254
6092 5080254 5062655 4944472 5074181 5024251 4910550 4991672 4933142 4805250 4915988 4996484
6082 4996484 4877773 4883654 4865348 4890956 4865829 4881570 4859131 4932144 4821307 4810565 4849566
6071 4849566 4820747 4688310 4786594 4804503 4758013 4777874 4766013 4617406 4697202 4743236 4587505
6060 4587505 4607385 4722094 4611205 4557980 4640479 4667424 4658861 4680147 4555252 4502865 4671145
6049 4671145 4631746 4416699 4509891 4650964 4497149 4540157 4598976 4507695 4509709 4554310 4481081
6038 4481081 4449303 4569967 4538718 4569573 4614442 4613239 4456497 4430129 4519900 4518619 4490948
6027 4490948 4536663 4433059 4376257 4467003 4507429 4271357 4371024 4395676 4279885 4397617 4382182
6016 4382182 4343360 4315322 4446934 4405163 4356521 4471520 4411722 4361491 4425911 4311775 4235330
6005 4235330 4243416 4398103 4283994 4346295 4325063 4254912 4162073 4259187 4153066 4134748 4196718
5994 4196718 4228332 4097498 4168081 4261208 4182164 4212411 4302303 4301660 4179162 4172269 4148368 4170420
5982 4170420 4136699 4281246 4254269 4183892 4218812 4266411 4215924 4107302 4307480 4214525 4057850
5971 4057850 4180703 4149961 4258330 4209811 4293249 4229494 4189060 4207809 4167072 4075320 4119182
5960 4119182 4182178 4091786 4194841 4160147 4106999 4120142 4181704 4106262 4249768 4205037 4239356
5949 4239356 4246327 4301030 4178064 4184643 4197682 4095770 4138574 4199298 4220500 4033383 4175199
5938 4175199 4261323 4251315 4265446 4284095 4303134 4220174 4275988 4301798 4414808 4448318 4420182
5927 4420182 4358259 4416831 4346987 4229494 4241352 4347487 4294236 4387735 4286600 4331706 4376413
5916 4376413 4302207 4333244 4408267 4449070 4412414 4323198 4400405 4520768 4581005 4530694 4599526
5905 4599526 4640448 4595481 4690007 4527393 4585536 4606067 4745894 4664813 4772734 4798167 4788973
5894 4788973 4780311 4881219 4834769 4896521 5000352 4964575 4943832 5075327 5294004 5287616 5278639
5883 5278639 5469092 5484664 5604936 5647892 5916260 6021437 6095862 6125033 6174244 6328239
5873 6328239 6318419 6295847 6382363 6440792 6493772 6557633 6567274 6644351 6663883 6790471 6859130 6872149
5861 6872149 6900533 7020554 7303319 7411440 7466458 7623145 7644933 7623950 7633590 7709148 7542100
5850 7542100 7563733 7631612 7550031 7655377 7553649 7542941 7540027 7563226 7569737 7582500 7773813
5839 7773813 7610505 7695206 7909353 7779033 7876616 8112032 8146845 8214567 8266121 8357736 8180030
5828 8180030 8278905 8443815 8426332 8529341 8723655 8839884 9038854 9401200 9593480 9715113
5818 9715113 10040031 10290650 10318644 10485205 10517447 10242545 10087584 10101685 9840406 9822150
5808 9822150 10048247 10075201 10159087 10370231 10420889 10727581 11083414 11569560 11901304 12359131
5798 12359131 12712767 12832003 13065912 13251693 13043691 12896419 12616617 12208517 11842888
5789 11842888 11521208 11050763 10605734 10422013 10247685 10044330 10054299 10073271 10018192 10098735
5779 10098735 10259559 10406542 10337098 10594298 10637819 10564793 10501298 10264065 9801367 9239372
5769 9239372 8800137 8314079 7831412 7614021 7169932 6791962 6577605 6396975 6127436 6133631
5759 6133631 6052348 5870425 5822643 5634813 5436105 5514887 5443342 5383728 5308765 5259065 5187289
5748 5187289 5201867 5250935 5254139 5177339 5199744 5100364 5115080 5162350 5074826 4967964 5198660
5737 5198660 5034959 5017088 5114521 5109320 4997852 5037392 5134953 5008521 4997417 5060358 5024712
5726 5024712 4919052 5037969 5061257 4861731 4925714 5077629 4984164 4918479 5112018 5102589 5094181
5715 5094181 5225016 5174326 5135223 5180194 5237292 5093087 5174971 5084741 5171944 5334912 5398570
5704 5398570 5314720 5359995 5495524 5438320 5371482 5518462 5423244 5542111 5644646 5614241 5607664
5693 5607664 5668973 5622375 5640570 5695310 5684207 5713488 5788183 5768381 5657698 5827867 5968836
5682 5968836 5894701 6062807 6041490 5964736 6027031 6156552 6193623 6277710 6453286 6393997 6467557
5671 6467557 6706720 6651622 6685750 6912115 7005435 6979205 7248255 7310850 7157331 7245248 7457777
5660 7457777 7545465 7594707 7643402 7811420 7940131 8138704 8412347 8616630 8843118 9008767
5650 9008767 9338869 9685594 10001798 10391305 10893635 11210309 11673191 12306168 12683261 13003147
5640 13003147 13224078 13409878 13426154 13383393 13456349 13349225 13395848 13562862 13627800 13667932
5630 13667932 14030766 14355736 14628808 15172994 15666099 16093953 16553081 16959993 17220212
5621 17220212 17458610 17607639 17388417 17066024 16853643 16588330 16206769 15831887 15502502
5612 15502502 15045678 14853849 14675353 14563531 14437614 14533124 14700478 14853804 15054862 15158704
5602 15158704 15109053 15039347 14986615 14721146 14403651 13920324 13396474 12891948 12379046 11839440
5592 11839440 11430750 11148188 10910348 10623814 10579151 10462584 10270312 10215181 10096749 10038870
5582 10038870 10083579 10013290 9941716 10051057 10167997 10106375 10220751 10505499 10628763 10730676
5572 10730676 11038731 11279182 11521956 11848329 12245995 12521551 12913632 13390053 13731580
5563 13731580 14239224 14626345 14724440 14812211 14847798 14681238 14607542 14466313 14357820 14225898
5553 14225898 14254225 14240008 14255960 14447383 14473157 14696031 14987573 15448952 15678706 16021801
5543 16021801 16281417 16653219 16950203 17140622 17120546 17140583 16925994 16578432 16265037 15986407
5533 15986407 15537077 15131994 14894115 14618593 14447657 14406043 14316368 14360105 14339399 14379068
5523 14379068 14495626 14609802 14710116 14822127 14735051 14812751 14675156 14519573 14356840 13926247
5513 13926247 13565504 13240646 13092785 12826837 12673508 12585381 12513818 12397822 12446728 12350445
5503 12350445 12359418 12441040 12476724 12483744 12666731 12669935 12738956 12933253 13254785 13263063 13412788
5492 13412788 13583337 13638888 13744929 14115475 14294221 14326468 14573139 14697968 14540233 14874202
5482 14874202 15199846 15210082 15391125 15756382 15914462 16147549 16558671 16664954 16749706 17112369
5472 17112369 17297207 17272454 17640618 17933052 18121548 18400719 18798871 18918523 19191938 19566180
5462 19566180 19822542 20033058 20426831 20700016 20949342 21422809 21773081 22272431 22728225
5453 22728225 23127387 23463051 23897762 24395484 24794401 25458950 26044598 26534112 27286174
5444 27286174 27950108 28574592 29250449 30274465 30777898 31498282 32358379 33229398 34042836
5435 34042836 35134728 36208577 37032764 38098622 39071170 39847155 40798931 41764537 42534264
5426 42534264 43432201 44332596 44928323 45400397 46096593 46467556 46807285 47299123 47839806
5417 47839806 48225180 48929071 49755465 50504289 51402738 52549860 53615647 54935184 56329664
5408 56329664 57682729 59081719 60488658 61853036 63338982 64958773 66403071 67815795
5400 67815795 69260777 70622789 71547497 72502554 73362260 73586593 73891535 74032670 74036554
5391 74036554 73934047 74180405 74422460 74904832 75983282 77311125 78830369 80679494 82814684
5382 82814684 85057025 87622738 90219505 92773033 95356362 98006125 100432384 102483354
5374 102483354 104251789 105729992 106749815 107361892 107544686 107502034 107698836 107794036 107804763
5365 107804763 108159386 108615660 109278750 110254415 111700389 113519926 115729842 118393746 121372612
5356 121372612 124559493 128042474 131700593 134996481 137877636 139957385 141138856 141275835
5348 141275835 140148714 137709601 134356864 130420757 125980281 121293886 116912489 112970363
5340 112970363 109497597 106757525 104640406 103069373 102061290 101629823 101597571 101724969 102220422
5331 102220422 102711675 103047596 102992676 102252583 100874195 98700478 95833884 92234255 88164918
5322 88164918 83706675 79220899 74727159 70394012 66407376 62615697 59097419 55970324
5314 55970324 53122322 50472000 48198232 46071888 44020289 42379334 40778199 39120513
5306 39120513 37839222 36576805 35313015 34206203 33217932 32188149 31391007 30590916 29653089
5297 29653089 28847061 28275999 27598387 26825803 26400422 25966095 25411162 25147746 24740731
5288 24740731 24254775 23878550 23514129 23262018 22982752 22657650 22352335 22093249 21812239
5279 21812239 21567966 21221729 20987640 20569122 20221089 19911759 19641338 19281737 19034405
5270 19034405 18823301 18595132 18474936 18288808 17968647 17880940 17768307 17477297 17464949 17525459
5260 17525459 17379198 17196593 17204863 17170536 17177470 17157860 17116978 17132059 17186620 17183853 17126523
5249 17126523 17160806 17239528 17259814 17395985 17510083 17342055 17545505 17744145 17737137 17878830
5239 17878830 18155144 18155877 18377144 18682608 18774287 18907542 19135496 19427212 19550159 19886261
5229 19886261 20138804 20231693 20383491 20711006 20879395 21109506 21350854 21387870 21745079 22134423
5219 22134423 22380732 22549021 23028508 23253115 23622459 24130351 24592407 25014079 25405245
5210 25405245 26009338 26373535 27066186 27636380 28280001 28829459 29593815 30294993 31051238
5201 31051238 31985500 32773376 33760855 34784668 35880163 36966817 38135894 39415572 40672986
5192 40672986 42051247 43483239 45097649 46833295 48559341 50451568 52564316 54840926
5184 54840926 57243255 59941252 62824648 65941792 69297617 72879063 76721631 80673815
5176 80673815 84523636 88289683 91859434 95073269 97584819 99454302 100778868 101290152
5168 101290152 101387902 100900447 100272190 99691389 99100901 99119599 99474234 100186872 101521694
5159 101521694 103439540 105616246 108393730 111628876 115258946 118760108 122304767 125449306
5151 125449306 127868055 129512362 129834831 128901864 126704108 123639448 119564690 114843644
5143 114843644 110085032 105420058 101023971 97293166 93961018 91078500 88896877 87425821
5135 87425821 86075594 85221541 84855758 84508527 84317797 84280914 83833024 83143059 82417052
5126 82417052 81198458 79336367 77228262 74829717 71969909 68857965 65900853 62668729
5118 62668729 59738051 57146873 54640412 52525409 50679951 49073009 47603952 46456021
5110 46456021 45480101 44492113 43617095 42825882 41897125 41110135 40400420 39468746 38630019
5101 38630019 37761993 36881082 36231329 35593410 35125153 34878802 34847035 34878322 35327323 35951388
5091 35951388 36613262 37433508 38590528 39954580 41562271 43012704 43406604 42541313 41191381
5082 41191381 39582474 37154263 34177322 31278657 28743147 26520691 24933447 23612836
5074 23612836 22127460 21067038 20186359 19329002 18579293 17976917 17250862 16683408 16229003
5065 16229003 15665912 15192112 14783946 14511937 14007006 13517004 13164707 12857615 12462038
5056 12462038 12284730 11956387 11655879 11507642 11267760 11168003 10892711 10675010 10380534 10201195
5046 10201195 9898603 9717061 9546366 9361220 9159808 8968362 8875147 8671264 8577522 8449731
5036 8449731 8313690 8201516 8074492 7960283 7774961 7675273 7500454 7412610 7238016 7144507
5026 7144507 6994466 6842097 6777202 6706589 6609283 6417726 6318534 6162193 6130063 6075494 6017889
5015 6017889 5872862 5846829 5770666 5672633 5673388 5408047 5391022 5352934 5208795 5219213 5157050
5004 5157050 5003675 4944879 4942489 4794414 4768373 4780610 4651306 4544984 4566684 4505760 4376335
4993 4376335 4485141 4413135 4250912 4227906 4183539 4059702 4082992 4142011 3945465 3907237 4008606
4982 4008606 3892437 3747287 3811541 3780337 3699219 3538500 3679962 3696905 3605202 3593456 3669115
4971 3669115 3597611 3590546 3464956 3303965 3283867 3360313 3225130 3212069 3273634 3254355 3082847
4960 3082847 3160593 3080694 3033614 3008432 3006498 2915361 2809575 2867864 2954367 2984059 3005185
4949 3005185 3013874 2967353 2950135 2877526 2816500 2792548 2623474 2644751 2759379 2703801 2593551
4938 2593551 2644069 2649482 2501130 2612317 2577486 2400468 2425367 2596246 2401276 2543970
4928 2543970 2576808 2553105 2374115 2427765 2338438 2188362 2301722 2299082 2252873 2258391 2280963
4917 2280963 2272920 2167140 2269120 2084539 2091592 2121143 2034327 1918101 2072759 2049588 1939844
4906 1939844 1931713 1973221 1796050 1782143 1942605 1909515 1825990 1864099 1871165 1679128 1737030
4895 1737030 1813671 1702497 1667847 1766960 1717564 1659379 1647459 1707990 1637296 1679292 1611550
4884 1611550 1614665 1606434 1626227 1643778 1740799 1648355 1587403 1567884 1599633 1561694 1572285 1610869
4872 1610869 1439415 1504331 1620683 1537636 1585569 1682298 1576869 1541545 1611473 1594094 1599996
4861 1599996 1643553 1636778 1659127 1719558 1641516 1658484 1611570 1593951 1527373 1451688 1721847
4850 1721847 1743197 1687860 1699857 1599909 1655537 1628257 1640140 1756464 1708153 1717574 1737919
4839 1737919 1807522 1647799 1665139 1745666 1706618 1577233 1773807 1759839 1688526 1760211 1706349
4828 1706349 1687428 1711105 1864138 1715834 1611564 1647125 1660920 1652563 1614435 1590172 1579752
4817 1579752 1590098 1587477 1542108 1599821 1565391 1485571 1388037 1457725 1555144 1531882 1513829 1526300
4805 1526300 1492423 1484355 1394829 1522269 1542292 1450030 1430067 1437158 1413169 1452243 1430908 1306034
4793 1306034 1277075 1414159 1375107 1395064 1283622 1320166 1251456 1186484 1312153 1305675 1269569
4782 1269569 1287257 1296883 1206364 1265659 1201679 1204656 1097948 1172687 1158472 1171401 1148381 1175318
4770 1175318 1223253 1125589 1114067 1274630 1199487 1041871 1112920 1033880 940453 1112494 1200841
4759 1200841 1085183 1254364 1216151 1068264 1099779 1142722 1121645 1178134 1151771 1174473 1105386
4748 1105386 1114531 1118519 1145543 1180905 1075133 1034727 1081958 1101481 1063631 992113 982092 1056815
4736 1056815 1252801 1141220 1191789 1294509 1094414 1098528 1070260 1174489 1110047 1122279 1095902
4725 1095902 1118730 999919 1060950 958925 1017677 1018926 1004093 966828 930632 947657 995873
4714 995873 998011 968807 917273 968377 966544 866834 941976 927805 953744 931312 956980 913511
4702 913511 891694 921529 929294 974977 1027202 938765 975845 944356 897589 922061 1019891 915766
4690 915766 993523 1031481 975389 980363 1000757 893244 850283 952991 872043 850836 882396
4679 882396 945892 899539 986478 1052826 1008967 1033251 992699 933005 891877 1030423 1014022
4668 1014022 996710 960926 822396 893055 889104 993299 1001401 1154853 1112703 1116279 1100217
4657 1100217 1161767 1092740 1142919 1256511 1164084 1226471 1217159 1359447 1234543 1187252 1285693
4646 1285693 1303461 1248208 1256548 1310799 1200699 1206802 1156191 1201620 1224352 1242450 1198675 1123007
4634 1123007 1151560 1198429 1261549 1240278 1253705 1191950 1124335 1240588 1207091 1237980 1238730 1247065
4622 1247065 1308690 1241969 1352639 1374251 1390762 1312076 1386032 1338271 1488661 1485922 1478813
4611 1478813 1408600 1337702 1353726 1318025 1359677 1464392 1516278 1487561 1512425 1464037 1451888
4600 1451888 1542321 1634964 1529924 1568053 1615837 1476376 1517438 1527245 1702751 1645130 1632067
4589 1632067 1640036 1684764 1646506 1663937 1747897 1679709 1729940 1591613 1626519 1631348 1728641 1708558
4577 1708558 1715062 1732512 1731299 1822274 1793633 1635863 1610688 1857303 1675942 1715758 1804210
4566 1804210 1758751 1675042 1687979 1682730 1694789 1781374 1847300 1724436 1784524 1915999 1717134
4555 1717134 1898936 1945969 1979547 1882794 2037909 1988476 2003026 2106770 1966183 1927800 2039738
4544 2039738 2030292 1951878 2045425 2107547 1987893 2064628 2203084 2149383 2101578 2066245 2113627
4533 2113627 2043079 2189234 2268169 2077892 2212344 2311446 2181705 2125273 2197157 2214682 2333270
4522 2333270 2399740 2310081 2204458 2435368 2486356 2308598 2337176 2431811 2463579 2554058 2616956
4511 2616956 2478304 2569148 2778826 2781409 2632313 2752643 2741414 2692521 2897020 2841423 2806523
4500 2806523 3019396 3020857 2948188 3096452 3301558 3240827 3353652 3408543 3447506 3615941 3747508
4489 3747508 3764165 3818928 3967145 3975149 4032435 4260652 4426601 4538623 4835660 5061194
4479 5061194 5141017 5399745 5718433 5806840 6088074 6582136 6870581 7185608 7622314 7879454
4469 7879454 8063373 8348024 8640278 8776130 8758780 8715911 8673722 8552817 8539866 8397057
4459 8397057 8084408 8014982 7947944 7959634 7950217 7999729 8110981 8185200 8436577 8548047 8885747
4448 8885747 9155372 9357703 9754377 10348331 10707389 11162463 11918163 12602872 13152275 13656866
4438 13656866 13925326 14119332 14106694 13868078 13523073 12998591 12491955 11905384 11430741 11094586
4428 11094586 10780495 10541704 10387909 10287172 10045245 10010410 10047575 9936809 10034824 9932555
4418 9932555 9836356 9589370 9476780 9529064 9453673 9517841 9586225 9605027 9680716 9690191 9566989
4407 9566989 9368221 9407638 9299839 8924334 8581133 8432831 8154205 7671088 7469487 7344153
4397 7344153 6991655 6821478 6779228 6582345 6328700 6238114 6226690 6103201 5925803 6044034
4387 6044034 5934454 5922167 6006866 5836576 5796201 5823489 5841627 5873494 5940771 5937611 5795399
4376 5795399 5833349 5948737 5897834 5941679 6058192 5954922 5942887 5993695 6048103 6039225 6082920
4365 6082920 6205120 6102807 6245631 6280624 6285066 6384634 6587412 6460692 6547403 6670266
4355 6670266 6595327 6755440 6895002 6890215 7026861 7223611 7281673 7418186 7553995 7712652
4345 7712652 7870996 8029528 8326604 8403229 8519558 8741227 8997766 9169994 9411655 9689282
4335 9689282 9977962 10278966 10584664 10890639 11071044 11453005 11845895 12233278 12564596 13127653
4325 13127653 13596090 14094048 14613753 15199504 15680296 16239138 16924229 17528463 17977104
4316 17977104 18504734 18967116 19238689 19643655 20093744 20588659 20830095 21313590 21558115
4307 21558115 21756101 22191148 22417657 22618113 22885060 23301678 23520783 24052904 24557445
4298 24557445 24875204 25189670 25722882 26150731 26603031 27165977 27601258 27849934 28198363
4289 28198363 28430419 28568861 28889232 29080336 29218513 29443953 29765830 29864086 29943624 30134344
4279 30134344 30145515 30154561 30154868 29915261 29638362 29493776 29140175 28774214 28424189 28241174
4269 28241174 28045430 27888057 27901745 27807619 27870565 27856560 27843083 27913825 28005794 28109330 28244218
4258 28244218 28252961 28329334 28355879 28345908 28194324 27996358 27632183 27247559 26657451 25999153
4248 25999153 25305822 24485589 23871860 23450191 22797701 22132766 21399114 20822295 20166371
4239 20166371 19763231 19290286 18793948 18550138 18204338 17842378 17726299 17615299 17549973 17435487
4229 17435487 17441757 17304277 17138299 17187340 17234695 17118300 17247652 17375641 17321410 17281193
4219 17281193 17426031 17541734 17617355 17838471 18054125 18243604 18442528 18671745 19048943 19477332
4209 19477332 19857629 20215533 20511555 20891723 21277017 21767192 22114264 22444932 22735605
4200 22735605 23000646 23283350 23581364 23916042 24290356 24826705 25390766 25860627 26474436
4191 26474436 27135793 27737884 28403001 29159143 29734488 30356623 30951000 31788068 32519558
4182 32519558 33415506 34329527 35070718 35800674 36333081 36887974 37577227 38252255 39021541
4173 39021541 39719851 40653134 41637264 42817525 43867007 45106341 46390321 47705651 49183315
4164 49183315 50770630 52240788 54033160 55934047 57796681 59789689 61981858 64156477
4156 64156477 66521894 68896010 71387061 74199695 77297511 80637638 84373090 88228227
4148 88228227 92595556 97612044 103298984 109729780 117029122 125348072 134784167 145762547
4140 145762547 158334236 172929352 189823477 209367829 231594073 256552471 284128836
4133 284128836 313358525 342139930 367617282 386172059 395974283 395460183 383567914
4126 383567914 361662730 333402405 301767644 269246881 238535723 211611933 188770607
4119 188770607 169935436 154450715 141795426 131314462 122668750 115265443 109005498
4112 109005498 103775635 99205149 95162269 91926862 89060912 86509047 84540667 83114632
4104 83114632 81794367 80764776 80114339 79741466 79745084 80299506 81326985 82636962 84759935
4095 84759935 87462506 90655220 94388241 98960424 103769104 108488567 112239559 113671207
4087 113671207 112042541 107542924 100830787 92845911 84866503 77941594 72086424 67323920
4079 67323920 63501349 60149833 57357007 54936817 53027481 51257531 49748804 48499687
4071 48499687 47446252 46502075 45683775 44873770 44220261 43559150 43146306 42738267 42391040
4062 42391040 42155048 41994148 41824961 41760839 41795987 41861299 42206557 42663390 43337654 44282742
4052 44282742 45729228 47496002 49825679 52557987 55766810 59044827 62269627 64949579
4044 64949579 65875389 64669320 61955848 57852476 53060344 48567239 44949550 41944219
4036 41944219 39640999 38038501 36718360 35743688 35256820 34806152 34006818 33388975 32587476
4027 32587476 31657813 30931981 30462003 30131416 29947211 29679689 29720000 29661872 29693309 29728408
4017 29728408 29797643 29900743 29877487 29998962 30138690 30261904 30390272 30401795 30386972 30507757
4007 30507757 30728141 30827069 30815525 30916667 30855228 30795350 30566058 30340792 30002766 29709915
3997 29709915 29484252 29302379 29009922 28916237 28959371 28793287 28704601 28696128 28546837 28106071
3987 28106071 27833561 27392554 27057832 26859808 26783134 26683673 26601572 26774183 26985166 27064533
3977 27064533 27348954 27717328 27981612 28358280 28815222 29216258 29820438 30278085 30808469
3968 30808469 31557353 32495308 33551808 34697979 36240380 37775203 39598568 41499622
3960 41499622 43265663 44829980 46305737 47301257 47640978 47440789 46995937 46254674 45647039
3951 45647039 45206540 45193900 45463909 46022014 46308196 46224512 45485112 44334628 42881416
3942 42881416 41191203 39428512 38086789 37050849 36132637 35359143 34724093 33910475 33394396
3933 33394396 32934502 32633293 32330353 32272316 32305771 32359520 32693754 33007440 33326227 33660852
3923 33660852 34284614 34717287 35313940 35807196 36458075 37118833 37904136 38642436 39639495
3914 39639495 40811157 42041573 43485945 45196148 47089637 49223783 51680905 54090751
3906 54090751 56575580 59234994 61354125 62654779 62956380 62247640 60216148 57393110
3898 57393110 54073816 50450127 47099791 43922397 40874354 38381388 36091887 34102484
3890 34102484 32363985 30731869 29444156 28298143 27256252 26328489 25504879 24684460 23903585
3881 23903585 23337831 22625827 21924924 21357476 20800667 20170751 19665521 19256992 18857421
3872 18857421 18489068 18232500 18014617 17703597 17445020 17202580 17018941 16873430 16749190
3863 16749190 16544628 16484468 16340226 16115340 15969393 15796738 15595158 15559428 15405804 15085313
3853 15085313 14839493 14719592 14710340 14635774 14647655 14602112 14656784 14699047 14761456 14918459 15069625
3842 15069625 15356785 15493303 15792473 16173040 16499870 16740850 17041134 17565689 17866846
3833 17866846 18143753 18548820 18996783 19385675 20097443 20842586 21522874 22319793 23368898
3824 23368898 24562268 25958132 27283489 28667675 29585390 29912667 29688398 28843449 27480693
3815 27480693 25859983 24242389 22857898 21580475 20492699 19628820 18685728 17910197 17220833
3806 17220833 16466850 15680056 15147806 14632908 13954363 13565398 13360861 12869043 12593138
3797 12593138 12420852 12208878 11987824 11916606 11747861 11592375 11639704 11544299 11201634 11176687
3787 11176687 10964023 10806604 10529938 10327505 10052052 9658782 9402039 9156212 8929015
3778 8929015 8761012 8584261 8428750 8344875 8342138 8185118 8136441 8148364 8101663 7969863 7870598
3767 7870598 7996312 7960010 7901407 7981069 7977201 8019877 8043293 8090155 7910858 7806926 7818486
3756 7818486 7702927 7556772 7386233 7201982 6975452 6893794 6718546 6565907 6372385 6276524
3746 6276524 6213765 6047189 5786120 5845809 5663955 5567220 5671045 5578588 5260874 5195740
3736 5195740 5244483 5177729 5192276 5334439 5237551 5152605 5348513 5303842 5291876 5453264 5525248
3725 5525248 5424253 5464368 5394640 5183419 5110347 5052593 5001313 4829123 4596471 4386197
3715 4386197 4346929 4425381 4261180 4207072 4282529 4208199 4025420 4125668 3929379 3887485 3996377
3704 3996377 4028816 3844765 3930410 4009370 3792603 3823094 3893662 3850758 3871900 3934899 3760942
3693 3760942 3776801 3947465 3819827 3627490 3782695 3787752 3577821 3558062 3657737 3544716
3683 3544716 3614948 3896228 3804958 3705727 3859855 3793184 3821034 3992522 3994743 3853501 3845583
3672 3845583 3734979 3774289 3700759 3706687 3587871 3575923 3646283 3568449 3554097 3672878 3407529
3661 3407529 3364304 3319674 3260429 3119306 3126268 3016241 2785988 2751019 2854142 2834143 2633036
3650 2633036 2681876 2621387 2538871 2392788 2524938 2421878 2339661 2312892 2288945 2167621 2257646
3639 2257646 2198357 2092744 2200458 2141201 2005154 2057301 2099616 2102863 2027088 2026879 2052713
3628 2052713 2032933 2057013 2030071 1846404 1949727 2003108 1936188 2046326 2071425 1906909 1968252
3617 1968252 2088884 2019227 1951137 2060443 2031681 2064248 2065455 1960192 1886878 1977489 2012786
3606 2012786 1844376 1945043 1918535 1843223 1887660 1947257 1801895 1783948 1819348 1834254 1643954
3595 1643954 1788630 1715045 1650130 1658942 1623303 1652823 1685305 1755325 1665884 1548130 1550939
3584 1550939 1559341 1607177 1620168 1559762 1518873 1628023 1500573 1436156 1598691 1549174 1530302
3573 1530302 1519662 1567344 1495465 1646382 1595124 1538291 1534963 1546520 1463328 1439243 1520821
3562 1520821 1526846 1308371 1296704 1378577 1366344 1380157 1404226 1339591 1286724 1311838 1432965
3551 1432965 1435293 1481924 1447471 1513031 1623022 1697649 1687214 1745950 1872129 1910155 1906284
3540 1906284 1830216 1731647 1646364 1541166 1570144 1581883 1563228 1685104 1615740 1595406 1559616
3529 1559616 1695358 1539367 1416595 1520725 1580768 1484819 1598035 1673005 1581225 1577814 1778052
3518 1778052 1787725 1795851 1927319 1952288 2017559 2050911 2036854 2016538 2113934 1903973 1760321
3507 1760321 1681542 1735887 1717305 1678360 1710243 1613749 1597852 1625200 1706457 1656871 1593540
3496 1593540 1548039 1577307 1465065 1450027 1442522 1446179 1402241 1480843 1490379 1450610 1425807 1404578
3484 1404578 1352798 1278503 1226918 1313302 1282061 1254344 1247279 1261458 1258206 1276055 1326506 1387146
3472 1387146 1301558 1360342 1361383 1387778 1424203 1364510 1336745 1361388 1296164 1285710 1262565 1248328
3460 1248328 1251568 1133738 1216102 1098221 1055095 965754 1050872 1094995 1107443 1033967 1015059
3449 1015059 1017950 1011870 998114 907223 915798 931721 838742 807527 865700 913990 916941 916871 951595
3436 951595 878452 802312 915346 799525 686507 712030 834361 797005 727244 839194 851733
3425 851733 843394 900605 844355 716457 745659 872447 837066 745036 825337 909599 853655
3414 853655 864547 946487 880202 790160 870007 732016 831868 871770 961985 949015 1049015
3403 1049015 981257 1035885 1099544 1014842 947378 958788 985650 1052861 938880 888410 946083
3392 946083 983323 983712 979396 1013032 921251 929223 1034824 885987 862778 936902 962777 1000444
3380 1000444 947481 1150702 1024485 1097709 1154864 1091041 1047248 1079274 1076537 1095853 1168337
3369 1168337 1296675 1106471 1165099 1293838 1313399 1271056 1384420 1403119 1299700 1377140
3359 1377140 1257680 1164429 1340328 1272230 1254613 1313767 1257206 1164946 1231700 1282580 1247222
3348 1247222 1332891 1419328 1321943 1317596 1317185 1309113 1285733 1433042 1329392 1344676 1395279 1434485
3336 1434485 1455868 1506408 1567988 1601041 1653064 1778267 1751985 1828653 1747181 1700182 1783330
3325 1783330 1717921 1662254 1717571 1716573 1626778 1658172 1714322 1586266 1693912 1844397 1621963
3314 1621963 1540735 1536855 1498505 1635223 1867211 1649638 1686737 1803016 1797122 1683179 1810875
3303 1810875 1825813 1826921 1917827 2072360 1814556 1991385 2290427 2108862 2038352 2273818
3293 2273818 2309645 2258916 2496089 2554972 2492724 2687622 2728093 2485132 2585837 2774510
3283 2774510 2665234 2649560 2770486 2823714 2855913 3031726 3070881 3121632 3153645 3195337 3153147
3272 3153147 3342900 3432915 3529073 3758637 3872695 4041324 4130685 4122029 4270592 4545084
3262 4545084 4839171 5043405 5329581 5621483 5990516 6612050 7216064 7879344 8495844 8941036
3252 8941036 9045902 8948600 8581515 8205196 7841629 7709909 7620594 7542958 7452834 7465388
3242 7465388 7551602 7537246 7780276 7957637 8139130 8430346 8779442 9153915 9476599 9935784
3232 9935784 10548496 11181039 11892774 12861242 13958729 15160727 16254416 17388661 17834990
3223 17834990 17891369 17391279 15983901 14412063 12964233 11449629 10233008 9434287 8535358
3214 8535358 7875757 7442281 7106527 6653403 6365288 6127294 5775486 5446995 5280455 5142155
3204 5142155 4820630 4687978 4544196 4216418 4129114 4153279 4057890 3786176 3777570 3631174
3194 3631174 3404659 3366720 3346000 3204794 3114315 3164427 3044749 2970153 2940662 2981967 2784163
3183 2784163 2790640 2806067 2763685 2697454 2646347 2718719 2612277 2522732 2469123 2414430 2401827
3172 2401827 2397494 2284359 2205549 2149147 2112194 1980985 2019807 2012782 1994761 1987624 2027668 1885879
3160 1885879 1864243 1966336 1937891 1934976 1903211 1969716 1824115 1792209 1789491 1893010 1926698
3149 1926698 1976806 1948615 1893283 1944045 1908692 1909354 1895459 1797694 1848548 1871097 1744681 1782961
3137 1782961 1775635 1736746 1822667 1716974 1724809 1662081 1750344 1841715 1723333 1664132 1800220
3126 1800220 1811161 1752759 1829795 2008770 2152910 2311507 2517112 2725055 2790924 2812019
3116 2812019 2767495 2800467 2575522 2360182 2370115 2121357 2103240 2003064 1876591 1785198 1739506
3105 1739506 1708270 1675751 1611671 1536298 1508237 1576343 1709287 1671560 1568314 1682910 1783772
3094 1783772 1932735 2146836 2312160 2430563 2493244 2537715 2344383 2207762 2141167 1801565
3084 1801565 1619894 1597487 1439462 1311859 1196757 1291101 1251097 1199669 1161887 1124557 1028904
3073 1028904 1008159 1017500 982440 929666 934528 797120 842400 884466 884593 864387 802416 930134
3061 930134 844496 818702 773176 793359 695890 681684 705284 730171 705270 755264 692824 730120
3049 730120 749438 781825 659263 681715 671803 703546 713539 756525 671492 666748 630087 628951
3037 628951 596030 623623 625702 726195 675684 583365 618892 665199 708851 622813 609266 617967
3025 617967 656362 626651 581621 617753 507576 601172 526953 576563 643372 606073 707747
3014 707747 690532 667960 659907 741740 679208 599633 537120 579950 518765 566577 529199 592155
3002 592155 579224 575918 578150 611237 560917 497334 595697 609665 534298 599304 584679 474262
2990 474262 394084 555197 498956 510527 554291 546278 490344 551800 502803 450327 477843 493570
2978 493570 444266 496783 422020 420144 510726 613057 494270 558077 498038 574262 663717
2967 663717 649842 603976 545851 635913 509539 510116 626702 568137 456326 598763 482347
2956 482347 514788 619224 634297 483263 548492 661446 577875 600113 738579 682341 637160
2945 637160 655710 710026 616886 727766 850135 783890 657228 695668 656603 704987 750123
2934 750123 698791 776316 696585 673428 610371 701559 747226 713911 664694 744867 726009 726736
2922 726736 739446 672233 760685 716822 712008 849055 941025 957789 970326 992019 1113021
2911 1113021 1102980 1075922 1153130 1017196 1115020 1176097 1141023 1120561 1235744 1263884 1083853
2900 1083853 1222398 1268626 1226218 1143479 1274924 1284633 1304483 1429513 1349756 1328576 1506493
2889 1506493 1584848 1519261 1537756 1582903 1624597 1657303 1784849 1837382 1971980 2124088 2093383
2878 2093383 2236638 2238842 2286845 2271733 2256125 2083927 2060706 1994077 1762795 1814965 1776176
2867 1776176 1710775 1695780 1679248 1594151 1604144 1648885 1729985 1695024 1697882 1704178 1741645 1677610
2855 1677610 1845237 1834399 1751178 1873340 2123021 2026744 1931929 1997010 1856876 1739131
2845 1739131 1806651 1703932 1646211 1693431 1515709 1463409 1403392 1382482 1404996 1374445 1413081
2834 1413081 1323548 1281270 1309313 1324348 1198000 1128481 1048677 953242 1009843 927934 1037685
2823 1037685 993658 991476 928499 943872 824257 796556 755475 846060 762670 624398 680951
2812 680951 520251 471312 597343 635167 510195 625232 614262 374095 578605 590540
2802 590540 479355 553863 546806 441645 445348 296864 299348 363385 394456 418893 373450 391050
2790 391050 376664 301241 277890 319068 177667 77397 238604 209433 161339 242465 323858
2779 323858 226479 262019 320629 326661 238220 242627 242312 173656 249731 263097 201467 187239
2767 187239 276054 203196 137580 173641 352260 207118 157260 113603 68678 18958 193691
2756 193691 187870 175475 282192 274832 77800 99317 152607 146615 57344 58075 187921 84669
2744 84669 78627 -4668 -1398 -1225 95310 287676 120935 206030 189132 216869 71913 121724
2732 121724 239986 180308 130143 114132 24315 71825 180854 127771 145031 38426 76534
2721 76534 25921 -9063 92321 3202 8545 36319 88562 38322 23025 102455 45624 62832
2709 62832 12431 1118 43377 55846 40169 -85234 561 106556 15515 110922 99482
2698 99482 14740 17011 3878 67790 -113657 15305 59856 -57901 91120 42260 -61271
2687 -61271 -75227 32847 -16461 93210 151438 16743 86578 43720 51409 34665 67792
2676 67792 97287 34809 56029 -8267 -467 -30905 22087 -10719 -856 -33565 -46138 -32458
2664 -32458 67840 -11259 -11081 61031 138682 66152 36166 -120889 43327 -2141 -11831 -11967
2652 -11967 77082 -26299 4527 79314 -45392 103042 112495 -11462 -223255 -48175 24694
2641 24694 82993 125043 40165 29982 -61018 73576 -19207 62518 25354 -47442 65154
2630 65154 187461 55183 -88886 -24034 7047 70516 7089 -40370 -21592 20723 -38513
2619 -38513 -110446 -111901 -61925 -217821 -77735 23083 13186 80444 16998 -44148 24560 26372
2607 26372 85266 -21275 -3111 14627 -36195 -64944 66852 98775 91048 42435 -29881 -90984
2595 -90984 5189 -75818 -65158 6132 139283 53759 22969 125978 53469 63126 35050 -129038
2583 -129038 -38743 38185 -58047 -40363 68075 68382 9114 8068 -60093 -68336 5025 -63792
2571 -63792 -21334 -19626 -86485 -120389 -24805 81588 19883 -23456 -77404 -113012 -27315 87263
2559 87263 52011 43845 21315 -32707 -58310 12339 36236 -16443 56027 18364 -78860 114928
2547 114928 111077 49880 43606 86492 -110786 -20795 39763 -110303 -88592 9316 -129471
2536 -129471 -121850 -32364 -62522 -75427 18091 25580 938 51485 18180 -10271 10307 55209
2524 55209 12456 140678 104104 -24135 6902 27237 -11109 18166 54587 90966 -28697
2513 -28697 -14637 -68390 -87269 -34926 22788 -11271 -58120 15960 -58910 36204 29886 -92140
2501 -92140 -27567 25099 -56448 -159154 -132971 -97682 -137212 -102084 -90828 -76747 -94431 20517
2489 20517 -17925 -75606 -67226 -41897 -199682 -14644 -14984 -117753 -142790 -80630 -73160 -67473
2477 -67473 53321 -21546 -45171 -55270 969 -38333 9758 -17364 -159051 -102056 -40468
2466 -40468 -105924 -68713 19600 -35707 -101206 -1313 -35570 -96332 -146011 -77760 -56620 34044
2454 34044 31367 117158 61699 -62462 -111348 -56468 -41024 -111101 32698 12212 -69191 56005
2442 56005 2062 -93865 -79038 120637 -7438 -30232 42695 -150094 -149133 -70633 -65661 -1708
2430 -1708 2475 3019 27646 -692 29333 -76059 35740 -63395 -122257 -30524 -93354 -56466
2418 -56466 17740 5060 -125172 -20514 -66933 -182488 -43403 -31302 -72790 52862 41961
2407 41961 -134095 -45510 -9358 -89293 -73253 79711 -102984 -126257 -30703 -64010 -76343
2396 -76343 57142 1218 -89957 -12092 26325 -143185 -114755 26804 -52856 -11668 50809
2385 50809 -28629 -11582 67771 -99073 -162281 25430 -90702 -157886 21266 -28988 -122043
2374 -122043 59751 102926 -78684 5692 47777 -26924 7532 94979 -21239 7045 73815
2363 73815 100936 23980 -1718 -56571 52229 8139 20520 92467 39891 -28716 -28211 24751
2351 24751 56426 20852 -43922 61279 58529 130283 190043 83675 24497 14235 -3041 -8788
2339 -8788 -57269 -92850 12546 53646 -29658 19176 -67425 -73906 -66619 -26174 -96371 -48556
2327 -48556 -6233 -10035 74254 111184 47402 110475 121105 -5302 -4256 5893 84642 -74118
2315 -74118 -47679 58115 38069 -9554 79601 -26276 -1265 84224 1618 -7347 19261 8914
2303 8914 -93978 18781 25416 -22205 13749 -16936 -102270 -2329 55330 -55232 9987 113990
2291 113990 93157 77542 164562 112141 -101822 27965 -18187 -146011 -59333 -9099 -44545
2280 -44545 -18330 83795 -9957 41232 47998 194360 103217 27356 107154 114036 92476 -38138
2268 -38138 717 17288 -37646 -25665 39480 202 25639 114621 100189 92567 180551 70406
2256 70406 -123410 -23741 27916 -32445 93098 22191 -76040 49214 60406 25727 160533
2245 160533 79316 -10991 46168 107378 71395 81203 109561 -16232 -13746 286066 77681
2234 77681 17085 229038 195072 -16074 68362 86448 -207274 -124059 80298 7537 -128895
2223 -128895 79273 42987 -55029 62264 97821 -38037 62215 190369 23100 37162
2213 37162 169589 119808 42747 161694 139422 -97563 41878 252586 246992 233366 222931
2202 222931 40012 93651 259764 140415 102589 174189 105350 -6318 102932 119607 -27436
2191 -27436 48137 90059 49931 84245 292835 216031 188824 121763 268504 179139 165825
2180 165825 266957 192042 224356 175356 243328 233706 211953 285162 321247 283929 287798 224594
2168 224594 224568 326790 328372 286753 363042 319362 364021 297870 358059 406748 321896 307532
2156 307532 350814 301705 350105 495552 475289 318401 390717 464989 411704 418651 384538
2145 384538 371352 466252 526520 577316 548362 612670 592773 598995 636645 647897 741111 745152
2133 745152 765829 750537 744184 797769 789784 957501 1033990 945800 1028954 1068801 1132528 1106946
2121 1106946 1220161 1045175 1075104 1224321 1190366 1249167 1363876 1348342 1500927 1529471
2111 1529471 1587403 1539068 1755451 1862354 1858952 2040333 2166045 2147854 2221302 2393028 2464249
2100 2464249 2619673 2788246 2809690 2882260 3268751 3571752 3738616 4099567 4511810 4594831
2090 4594831 5025429 5360251 5699966 6151943 7028146 7835075 8812393 10297282 12244617
2081 12244617 14849891 18468316 22173764 25990835 26977452 25675308 22113108 17275371
2073 17275371 13537859 10310397 8371952 7064229 6200218 5270285 4834067 4349576 3998300
2064 3998300 3842481 3658800 3479877 3301615 2912492 2636473 2497508 2379013 2058777 1902970
2054 1902970 1838068 1779728 1689644 1700499 1441621 1227927 1386220 1280502 1147295 1188748
2044 1188748 1295554 1185254 1130256 1067595 1040676 969397 992774 858061 696131 743267 651965
2033 651965 727626 870296 696960 621358 778296 732328 716908 700298 629335 510403 533098
2022 533098 758174 483893 458555 603077 550709 478167 585987 662095 463187 530749 542978
2011 542978 384635 330841 587857 409929 310193 394076 236426 224633 355051 348355 247226
2000 247226 256018 165125 84316 264939 299111 189465 309690 312438 150986 278150 356228
1989 356228 236440 49630 209447 202724 100389 254240 300418 285101 215182 229796 48110
1978 48110 163704 164529 209956 153169 258554 167614 53461 168124 224429 123346 79570
1967 79570 158832 196231 186367 150411 233995 28582 151866 200645 106176 52196 39785 163849
1955 163849 75214 123230 -2472 -81100 51260 75278 181315 151621 128643 124694 129246
1944 129246 36575 37166 48545 143901 123357 132511 123114 128059 121285 215967 148942 166155 65982
1931 65982 112081 201100 137743 142581 87270 55548 -24193 90814 114046 88077 83629 129506
1919 129506 43368 86987 73616 -68604 -96497 45526 -21564 67665 126392 25710 24980
1908 24980 156037 167408 54567 -33256 150 -29766 -68373 32877 32922 1816 33715 24591
1896 24591 -85747 61915 34679 -1497 18677 48123 -98922 -97300 87046 -24245 -59362
1885 -59362 -7213 -8615 -88674 23754 36822 -22741 -35547 19780 -56102 -25859 46630 -30841
1873 -30841 -10946 99264 6674 -1942 112895 -17198 -61762 83002 -10155 -47568 165504
1862 165504 137760 68105 121735 91249 -94526 -3048 87547 32579 69762 139051 -41391
1851 -41391 -109963 120771 72102 -23519 -69058 -25664 -61762 -74134 -4888 -29514 51735 40140
1839 40140 -5544 -46724 85748 37624 -135568 -44496 -3397 92641 72170 65713 44369 -39890
1827 -39890 7882 139558 43676 -3191 23642 -3146 -97083 -68522 -5448 -110066 66719
1816 66719 56056 27084 -15897 75045 471 76309 184736 46222 137936 95479 115181
1805 115181 36398 40662 131700 -47203 -75156 9031 235 16641 77809 -27534 39716 95132
1793 95132 57620 76014 18533 9208 -98170 44752 65089 74908 84296 125350 79317 48698
1781 48698 127705 14671 49546 73678 51585 -2865 29114 42379 -74533 -101532 -130050
1770 -130050 -113387 -54922 -106855 -100991 -74946 -84730 -50386 -1391 15938 39013 -70250 32871
1758 32871 79808 -18413 -143035 -135839 10248 40148 19406 -98853 92687 55059 -40859
1747 -40859 52246 123783 69798 -71448 58515 -27776 -73342 39826 4953 -94853 89024
1736 89024 -54823 -109376 985 -91177 -98148 -30120 54878 -40497 11048 94411 29557 -52530
1724 -52530 8276 15233 -35737 55070 -52789 50841 13887 -43165 18940 -793 38629 85210
1712 85210 31608 149443 8884 49094 78203 -136375 -104295 6619 -52577 -47451 47631
1701 47631 -53588 -131109 -117553 -77543 -249264 3162 -47514 -63471 -86508 -12396 -76283
1690 -76283 -154234 -102339 -52506 -60852 -133033 -21298 54912 -80172 -106364 -118653 -106173 -81354
1678 -81354 -14803 -70994 -36265 -48808 18142 62090 -21314 57548 58987 0 -41157 -120712
1666 -120712 -117276 2508 28581 61770 63680 9719 -150376 -93399 40667 124726 -22332
1655 -22332 -79936 -107765 -147052 -124307 -125738 -93509 -41864 22581 39093 -62158 -51918 12644
1643 12644 5573 100377 12789 -16782 25082 98071 -21081 -18346 -82016 -101877 22416 9223
1631 9223 -91679 -42392 45551 -77931 -148362 -55751 35663 -44891 13245 46254 -65271
1620 -65271 -56321 156883 -14270 -126471 -52570 -7213 -115944 -42734 -4334 -92979 66144
1609 66144 42062 -19603 -13964 -18595 -152180 -27530 101071 27867 -23027 -15775 -19174 -92272
1597 -92272 7472 -90651 -64048 29691 22495 -11164 36089 31639 11334 -105541 -76292 -145894
1585 -145894 -98586 -47852 -174540 -132416 -111957 -124891 -109249 -15499 -144279 -160477 -74756
1574 -74756 -116282 -37071 42954 30796 -148649 -72831 -29714 -76947 -65707 -35741 -151654
1563 -151654 -114336 -162385 -116036 73201 57655 11789 33018 93478 -17492 -59533 -59962 -92713
1551 -92713 -77099 -23232 -26943 -9757 41536 49985 -18730 91456 12937 -21726 -24900 34029
1539 34029 -52456 -44225 -63988 -101596 -78794 -37639 -44280 -76143 -21715 -49161 44016 30024
1527 30024 28796 84964 61456 -54376 -20472 -2050 -32831 10872 14215 -113722 -125337 116819
1515 116819 29192 -96816 80859 29457 -96756 45344 28243 -21678 143475 68096 -105159
1504 -105159 83381 95218 -101751 -78600 34058 -120279 -35710 13344 -49937 -90777 -77599
1493 -77599 -94822 -151019 -80963 -76214 -41504 21814 4973 -15974 -8765 -111364 -115859 -36919
1481 -36919 -56884 -34862 -56156 -24984 -27794 -44690 -17916 -12695 2797 -1709 -7377 42282 5597
1468 5597 12021 -50425 -43728 25869 49435 -1405 -69163 -181222 -189596 -103977 1695 -35699
1456 -35699 -87269 41470 53456 116268 27889 44397 14263 17146 40657 170965 50679
1445 50679 51279 14002 -23776 -43302 27612 18124 -32775 3537 -13695 -77431 -78930 -38093 -208953
1432 -208953 -19301 21950 13821 92156 60663 28608 27357 78317 -41500 8307 68165 -51297
1420 -51297 -56365 88094 8948 -77207 -55310 -56079 20644 2258 -21969 -140013 -39151 -23832
1408 -23832 -5525 81302 -28444 -36651 -32933 33049 33502 -65968 -45889 -104337 -40578 -25123
1396 -25123 -76353 -558 118332 43132 -108477 -27544 4752 -49362 -49413 87902 80597 67449
1384 67449 -48201 -32966 37096 -51552 -5719 41560 34191 57655 45158 -25044 -81340 -8075
1372 -8075 -14157 -64879 99982 19996 -54479 -38740 6079 44480 -50270 53494 -5543 -54439
1360 -54439 -49622 -110414 -64912 98029 2107 -62819 197749 32525 -64482 37149 -34887
1349 -34887 -138209 -68554 -29147 -33483 -12573 20345 -112101 -136831 -11187 -5058 -68457 80584
1337 80584 -7900 -132817 88394 -34069 -124165 -106113 -118174 -117154 -46888 -31388 -138980
1326 -138980 -13090 -14428 -184793 -112589 25258 -42592 -56923 -5373 -52799 -40753 -40664 54449
1314 54449 -30759 80900 93454 -52222 12629 36867 -9826 -6214 9485 -87081 -29014 23865
1302 23865 27590 -24586 -89914 -53691 29208 53145 -33924 32068 -28995 -100330 -61640 -31197
1290 -31197 -125318 -56407 41438 61452 11065 40630 74862 -37989 96059 64309 -7493
1279 -7493 -26271 46887 -7679 -4689 106110 -7745 -28103 73201 -45815 -108324 10894
1268 10894 62663 -42484 107580 12184 -15198 69942 60774 -8279 -75279 -22106 -106784 -83758
1256 -83758 -115523 -32613 -81121 -60737 -11666 -13260 -27293 -37474 22939 -13962 3263 -122584
1244 -122584 -69129 -71226 43283 55346 -28338 -25280 -12354 20307 -62223 54986 27763 79808
1232 79808 53445 90662 20321 -47160 -41401 -89225 -63481 -63284 -109796 -178659 -21863 -66177
1220 -66177 -99427 -44701 98083 -32579 -69219 41276 6503 26665 73599 52693 -46799
1209 -46799 116643 5092 16088 -16236 -14693 35304 60279 147524 -35118 11393 51638
1198 51638 -111028 -98369 100648 -5690 -107175 -36189 -42344 -128880 -91489 18871 12016
1187 12016 86110 38684 -24790 -60167 12028 -15655 -109995 -93123 -51707 15388 -128298 -30520
1175 -30520 22689 -52951 -63657 19782 -11424 -107162 -11820 893 68949 -64782 17309 31538
1163 31538 -126043 -28602 -72655 -97558 -3699 73116 80717 16738 36140 3826 -160033 -54851
1151 -54851 699 -27486 2039 9478 117068 -32215 -48240 21774 -57441 -90685 -78591 -6310
1139 -6310 -41747 40962 -33589 -59728 -62583 -105090 -42948 29508 116994 -51890 -22760 46602
1127 46602 5821 -13298 95414 -60494 -20740 26980 -17681 -51186 11207 26923 -35074
1116 -35074 36960 79318 -40689 -42349 101562 -26280 -5421 23188 -35830 -3046 113267
1105 113267 108673 30336 137796 94407 22428 54829 -31573 25715 -35927 -60362 -28496 66412
1093 66412 28819 -120193 -67265 -11695 -140471 -50487 163894 -11191 -21944 37684 -23830
1082 -23830 -42405 73474 26985 21046 132074 -59036 -115625 -40078 -36351 -130501 -41924 10916
1070 10916 36852 -71300 73702 85559 69175 87313 13643 73971 29728 56178 51424 42862
1058 42862 -123923 -74264 22130 1658 -40461 -72733 -43147 -79217 -33230 -69145 -1185 -21328
1046 -21328 -42047 652 34784 61809 14854 40186 108346 -5663 -150905 -58520 -60157 -49341
1034 -49341 50946 79552 11030 15430 38696 50272 10267 -55885 6168 27451 70194 79930
1022 79930 -13715 -44597 -1545 12329 -71732 -680 45487 42098 111048 152989 105541 18302
1010 18302 -1938 -69609 -6443 13457 70085 -15319 30060 7520 47091 98168 81737 11059
998 11059 -95304 -4800 -21646 -16468 36717 9954 -87087 -814 88430 32550 9823 25868
986 25868 -100351 -261182 -154495 -35676 -85302 -124319 -78901 -136471 -65649 -28759 -63623
975 -63623 -32518 -73934 -43845 -54323 18357 -34416 36063 15039 24231 16703 -132 -2572 88152
962 88152 10339 -34824 -31810 75861 56687 82318 73602 49032 11743 28665 26157 -82696
950 -82696 6599 31891 -139897 -106518 23683 -55595 -164665 -58682 -10018 -19598 204901
939 204901 67159 -67946 29119 54845 5721 -124189 -38763 -27062 -32003 30793 -6417
928 -6417 -52346 -51589 -36488 -49683 -99920 -92042 9864 90205 14370 33460 87704 5126 -12309
915 -12309 63119 88874 -26074 -46322 -49604 7980 -3079 -43853 -44866 54980 -13459 -6619
903 -6619 -71176 -84516 -45895 -7381 -24748 -34344 -17972 107361 15213 -61004 36467 3008
891 3008 -67343 -41112 22804 -28250 -9496 -21440 -148493 -86734 40214 56193 -84549 75152
879 75152 6511 -18709 33223 21138 -9169 -82922 -75458 -101913 -23615 38206 -67531 -72434
867 -72434 -35261 -74801 -106531 -24440 -29053 23438 -17669 -69981 -54969 -30183 32619 72313
855 72313 11266 -76978 3411 23798 102645 52413 -44686 -25834 -62909 -150451 -130138 -58185
843 -58185 140299 107610 56761 43646 -18068 -112709 106439 234854 16932 -42973 41651
832 41651 -30366 -71249 -54058 6827 70800 117635 -8536 9450 149767 116461 -20742
821 -20742 -53164 -168076 -58079 -117049 -69625 -45065 -13895 -78155 -125606 -121551 -10818 30232
809 30232 21285 54371 -100091 -39123 27149 -37733 25888 5316 -180576 -133129 42540 52441
797 52441 -120685 -58891 -23676 -57499 -45053 -33870 -140092 -72220 15502 -69382 -79837 39998
785 39998 -65092 -80061 28666 -55455 -168240 -34631 30428 -172286 -105155 126714 -3791
774 -3791 5815 61139 -61529 9698 63593 -69543 -17483 161344 131773 -26374 65960 -21886
762 -21886 -167169 63691 111378 -38762 80722 -16921 -165300 -89430 93247 -50968 -90751
751 -90751 62786 -43454 -62826 32609 -256 -138117 50836 74551 37083 127421 85586
740 85586 -43290 -74320 -29886 43948 35281 83158 -92447 -104320 51110 -58685 -61412 2784
728 2784 -11504 14680 27826 -46316 -89368 10920 57570 40443 -82096 24249 50443 -15678
716 -15678 116220 30349 -9103 -12155 -77399 -34844 163680 24497 15827 89608 97008 -9510
704 -9510 67259 17255 -86484 -128353 36133 -90247 -27089 46849 -51985 -120344 -26651 -46061
692 -46061 -26192 108744 117195 87843 37013 147341 -75180 2117 -11424 -134984 -6037
681 -6037 161220 -49969 -33845 192766 142604 1482 116646 86109 59238 62360 51964
670 51964 -103261 -30573 155516 32569 -62940 173647 11588 -86572 96 29922 -75929
659 -75929 -39787 -51145 -133063 -15935 106435 15591 -53403 89458 -79735 -58216 89105
648 89105 28667 -182608 9908 -11665 7273 185564 106601 32575 114338 84318 -8010
637 -8010 -31933 -19806 -103732 -79753 -77874 -115223 -54189 -51799 -117580 -53677 -4348 -46174 -16950
624 -16950 -56792 -89118 -49491 41215 -72886 -72756 2403 -9392 -213157 -41322 18469 -232550
612 -232550 -110806 60609 -85011 -42222 106989 -28681 -124898 47409 18322 16224 90833
601 90833 82713 -50337 -14950 19355 -21714 9999 18092 -43343 -9773 67768 -26161 -14313
589 -14313 36958 136165 139409 134476 76617 -36693 -84179 61797 57978 85269 142237 173855
577 173855 -3363 -66545 -77595 7411 105969 7729 -102399 52701 59102 -34570 -2489
566 -2489 71664 -60894 25835 147479 -42844 -13711 12121 -26087 -30263 -7919 25620 -27254
554 -27254 -123854 66484 32999 26634 96365 -20905 -82897 10779 42982 -61581 -44377 -75289
542 -75289 50301 103698 39232 87666 43738 71353 73561 -5797 28840 103652 60825 14057
530 14057 42606 123229 -90031 -64320 34289 -75972 -14373 100448 -1558 -109526 87456
519 87456 -17018 46662 78211 36279 -29007 82303 90445 -41729 -16230 -340 -33627 71253
507 71253 96518 -62574 -62718 15872 -139468 49041 70817 76243 76694 159111 98108 -34839
495 -34839 91313 19441 -17658 13318 31144 -176498 -83671 -51821 3756 65025 109587 11468
483 11468 71535 76473 -124066 -33463 85419 40667 83685 157382 44071 -115944 -44608
472 -44608 26049 86381 77613 -1297 -93728 -42280 6777 -61980 -69081 46818 18464 98336
460 98336 121321 166806 81485 -5959 -19007 29936 -7794 21110 -6902 1457 -41558 -16503
448 -16503 39993 -7655 31171 69891 -8656 -3904 156695 123720 28830 190904 133313 11782
436 11782 93832 60952 -76486 -120127 -33368 -78460 -52607 62702 -41655 -15964 109818
425 109818 28996 -872 -13549 44250 64896 2773 55499 -8547 4371 32179 -90097 -85327
413 -85327 -26944 -87498 -75465 -3833 -28790 36010 42402 61821 -33364 89243 -15551 16508
401 16508 13430 -106419 11163 -11231 -43493 35457 77723 6066 -56697 47964 -23398 -9805
389 -9805 39257 -55538 -33750 1424 -8832 -7296 44270 150207 86625 105377 56258 21328
377 21328 -38300 -32178 -47289 -56069 90116 18666 7804 82190 123320 81696 52349 66856
365 66856 40064 -64132 29492 120467 73461 105258 4888 -70797 -53815 32853 -56758 -69653
353 -69653 -11435 -38929 -6923 53767 -20700 -22230 82812 115286 -77316 -29825 51610 8871
341 8871 20338 18834 -45469 -16335 98171 87058 17405 157830 29149 18637 118401 129554
329 129554 -6352 -12712 123757 -25710 33128 37432 -92413 -73743 -39271 -12186 78651
318 78651 128582 36931 2916 52637 -91398 -57403 94721 -45115 -72508 222443 94253
307 94253 -94806 12037 67361 -28935 85820 49953 -78823 -84540 150802 61599 19201
296 19201 66479 42656 84933 73458 44181 -34367 77645 98736 4270 -4264 33808 -43993
284 -43993 -44641 32687 -130005 -143010 35655 38119 -32491 62318 -37498 -120557 -15485 11311
272 11311 32924 139383 44320 37099 -23641 104641 16906 87717 147339 168104 -5353 113656
260 113656 46782 17067 -42196 -22027 41496 34385 121723 85294 119073 940 92795 44559
248 44559 49786 44123 58711 -12185 -16497 39229 -14418 16661 -22481 -45121 -27213 -63700 28540
235 28540 82276 -77334 -133693 109148 24290 1671 -28544 -73394 1616 71918 69798 28511
223 28511 52966 12606 6592 -42980 -85517 53773 81309 31645 52141 126752 -107738 -19854
211 -19854 156311 10693 -91705 166663 -1454 -18040 223286 89577 58417 164948
201 164948 18270 -63572 7831 151940 20030 59919 55391 95420 -1878 145392 78471
190 78471 -49847 65775 42282 -110063 54198 163215 -132232 -72880 90646 -40689
180 -40689 -69880 184410 77119 19369 121326 20966 -31054 14591 54413 52759 90837
169 90837 122861 -4415 57821 72902 127597 44383 95463 131711 166468 126339 33585 -89092
157 -89092 47161 42394 2179 50250 69108 -49496 27671 80815 53082 84256 144261 21516
145 21516 -30169 82714 140266 1065 1502 -23548 -168279 -55776 -17163 -47377 -23254 42095
133 42095 56495 -353 33311 180080 135213 84268 70197 135408 37689 52258 72764 23654
121 23654 -40485 11483 36444 23691 22829 28916 -30928 -53880 130380 81454 -18474 55461
109 55461 104860 4278 48787 128366 -15296 33147 128609 106082 53352 115939 94052 18037
97 18037 94636 55629 -60208 12538 40942 -39459 94410 122299 68326 -7095 60404 -74060
85 -74060 -116004 -10899 -42680 -6197 54428 47132 25340 93968 63191 -53444 -7460 4301
73 4301 -10939 39549 97854 17804 18853 148533 55771 10356 126312 80041 -4944 117684
61 117684 184678 -10601 25496 79761 34631 51303 34357 72198 30637 105640 68070 32086
49 32086 63079 39142 47758 74002 75292 28663 38420 30254 30500 32590 108009 109594 56849 117705
35 117705 117892 184745 49475 122451 68674 56473 12023 -24952 -43823 3748 54825 -10517
23 -10517 33364 12052 54366 -1307 16586 84752 54400 24482 113821 101595 45787 27964
11 27964 85359 39406 46387 51036 39499 64802 51738 60156 65566 41969 71459
0 71459
$$ Imaginary data points
##PAGE= N=2
##DATA TABLE= (X++(I..I)), XYDATA
16383 -1182996 -1087670 -1024496 -1022831 -973722 -932338 -906462 -841935 -789493 -825168 -840031 -748287
16372 -748287 -764748 -783595 -723947 -663014 -675994 -641703 -564968 -538117 -513397 -436404 -396152
16361 -396152 -422697 -363402 -363026 -325824 -272289 -253307 -311711 -287527 -172871 -238203 -134001
16350 -134001 -39058 -29056 -85170 6478 57612 36180 44736 141406 125734 117587 202351 159824
16338 159824 186569 311833 280074 289376 359999 411877 413526 378944 391647 454783 493112 545591
16326 545591 597525 569304 576909 556175 643604 711970 720994 744520 789622 803404 872254 932229
16314 932229 882768 925088 1042836 931648 935174 970925 1034814 1046424 1051772 1137015 1118263
16303 1118263 1118508 1216211 1168390 1164277 1306908 1224583 1273194 1355972 1433960 1347860 1368994 1508913
16291 1508913 1423790 1483866 1586863 1503764 1470796 1535968 1589054 1573715 1582840 1620241 1593718
16280 1593718 1561752 1755959 1765467 1669514 1753940 1789881 1780553 1828503 1972402 1906778 1965935
16269 1965935 1917972 1930016 1928138 1942668 2001244 1990121 2064661 2126981 2118911 2083188 2148934 2148063
16257 2148063 2064647 2131938 2158668 2192086 2243914 2356070 2360061 2303832 2284711 2247118 2167836
16246 2167836 2314536 2490821 2391039 2321969 2366004 2397059 2370189 2400734 2458092 2389192 2473399
16235 2473399 2547818 2545378 2538182 2635821 2712583 2574936 2590879 2692681 2659621 2703168 2759645
16224 2759645 2719271 2752732 2795802 2701439 2753824 2833812 2849433 2834157 2711851 2864951 2807644
16213 2807644 2774912 2774389 2809929 2865208 2914181 2957595 3001791 3052886 2959659 2955317 2993304 2978726
16201 2978726 3004658 3041952 3108229 3053739 3010552 3024252 2925821 3066150 3208184 3104976 3127189
16190 3127189 3094696 3060570 3006616 3119704 3050947 3128195 3304521 3259294 3070959 3183507
16180 3183507 3360840 3273792 3330037 3453733 3319645 3272188 3364748 3345560 3305312 3218833 3245029
16169 3245029 3263318 3368582 3363660 3383461 3374383 3342143 3372649 3300846 3368098 3382309 3384262 3365271
16157 3365271 3383897 3429977 3447840 3479504 3417930 3458884 3404363 3467452 3515495 3497147 3430793
16146 3430793 3475919 3433097 3444800 3500644 3452852 3461892 3461612 3469987 3621845 3545170 3410311 3577860
16134 3577860 3694717 3546685 3531714 3549124 3489258 3458768 3576771 3581938 3616762 3561635 3513013
16123 3513013 3497383 3582102 3631299 3507050 3567723 3577067 3547262 3602186 3641215 3627195 3638011
16112 3638011 3693294 3654210 3610774 3739360 3557787 3549694 3583199 3576010 3524830 3695605 3636624
16101 3636624 3592745 3629941 3763028 3664228 3580407 3698874 3631278 3631114 3652351 3563887 3513437
16090 3513437 3583887 3651253 3610963 3557832 3655769 3706022 3741407 3689274 3783258 3809561 3630830
16079 3630830 3698741 3741562 3726463 3635879 3675848 3707917 3556562 3648184 3659767 3523174 3560216
16068 3560216 3718831 3552839 3576574 3772694 3750781 3579042 3751312 3696629 3569903 3721163
16058 3721163 3737270 3742581 3666669 3872452 3615564 3659675 3664227 3582190 3599568 3631392 3757009
16047 3757009 3727192 3752948 3651268 3714502 3688522 3693465 3602478 3683830 3709671 3706484 3792350
16036 3792350 3684551 3649184 3771463 3783843 3731162 3674819 3591123 3640460 3770372 3732577 3752251
16025 3752251 3722619 3693954 3610691 3623603 3618842 3685574 3655848 3782474 3775776 3733598 3775890
16014 3775890 3826093 3683502 3682429 3855748 3774566 3679573 3736584 3793784 3731812 3779868 3784735
16003 3784735 3621850 3593656 3756714 3805740 3772068 3809967 3865216 3810297 3715580 3812160 3787782
15992 3787782 3652877 3740490 3872432 3859236 3843387 3860171 3771828 3734537 3776266 3722903 3828584
15981 3828584 3838370 3777035 3841283 3833558 3835884 3767616 3790283 3775035 3848274 3782577 3757592 3706865
15969 3706865 3679389 3682202 3729455 3803363 3732744 3745004 3909227 3837166 3818902 3835274 3662219
15958 3662219 3679373 3739708 3779101 3695406 3675887 3710483 3709724 3781509 3779212 3746081 3657088 3698830
15946 3698830 3681210 3617129 3589975 3717558 3693443 3682958 3641749 3716182 3749382 3872783 3838345
15935 3838345 3856167 3847172 3811256 3768847 3772364 3723315 3700229 3763120 3771689 3674033 3730764 3945451
15923 3945451 3869022 3720963 3753575 3777736 3752562 3728867 3739016 3777967 3682235 3737816 3734547
15912 3734547 3665237 3736875 3780705 3762518 3723003 3768203 3760828 3670132 3696737 3802793 3833743
15901 3833743 3774529 3738168 3793304 3887537 3877009 3923061 3917549 3830956 3757735 3779162 3852265
15890 3852265 3795079 3843057 3814692 3737657 3733961 3665861 3796676 3827999 3833924 3762465 3808467
15879 3808467 3840129 3889261 3792244 3734294 3750508 3858572 3791338 3785047 3807155 3772136 3800598
15868 3800598 3916760 3846190 3951811 3962197 3828219 3696120 3803557 3800267 3828743 3786885
15858 3786885 3744261 3871350 3885761 3884467 3814543 3772550 3789019 3719258 3770759 3786271 3781905
15847 3781905 3796491 3806765 3772186 3790926 3861217 3743980 3707104 3619196 3774291 3829314 3798734
15836 3798734 3780858 3836406 3845866 3945417 4013070 3941217 3840909 3899922 3840956 3824309 3867123
15825 3867123 3883841 3780742 3784804 3826094 3905814 3899328 3903703 3812847 3761472 3758787 3842887 3887602
15813 3887602 3881433 3846374 3781317 3789433 3735816 3845838 3851053 3895109 3877029 3899298 3873049 3920392
15801 3920392 3852047 3808322 3929435 3912062 3866035 3831470 3896222 3848505 3761900 3846695 3887400
15790 3887400 3748271 3862629 3851789 3791882 3755656 3901607 3923673 3783420 3849596 3821061
15780 3821061 3798702 3875653 3814984 3794929 3790550 3813915 3804888 3871796 3897526 3764799 3734649
15769 3734649 3809612 3786312 3854700 3941495 3822049 3873947 3824881 3796424 3744396 3998129 3919262
15758 3919262 3957307 3955494 3833768 3765643 3757833 3834359 3765125 3902852 4000337 3821369 3813211
15747 3813211 3971041 3919985 3825094 3891428 3827518 3663162 3904672 3982360 3831830 3913357
15737 3913357 4001276 3936070 3923147 3984140 3773021 3789961 3915244 3800348 3777656 3812302 3792245
15726 3792245 3719843 3929612 3910088 3782927 3835257 3850990 3808608 3889226 4019426 3863049
15716 3863049 3856840 3954194 3880711 3805135 3795261 3766964 3768290 3903100 3770191 3723699 3788653
15705 3788653 3757646 3772687 3942120 3961720 3774002 3857302 3901932 3760039 3759753 3936129 3859993
15694 3859993 3711733 3906607 4001854 3851479 3844833 3953571 3861038 3932302 3948899 3883347 3874140
15683 3874140 3891297 3923321 3870051 3965208 4034823 3940119 3917634 3929429 3818396 3835334 3840242
15672 3840242 3808591 3912541 3922533 3896230 3834834 3914251 3810830 3835353 3862629 3815933 3792696
15661 3792696 3860668 3864106 3835520 3931549 3935353 3856261 3823701 3971297 3921530 3889684 3901717
15650 3901717 3889942 3838958 3888646 3812723 3830508 3809920 3812453 3840784 3996266 4013041 3946131
15639 3946131 3957838 3910176 3875512 3869571 3870163 3871388 3844588 3795344 3826720 3786984 3877591 3854616
15627 3854616 3852315 3923417 3895304 3799973 3909451 3964381 3907293 3896574 3877564 3819395 3849655
15616 3849655 3921581 3923627 3812395 3882562 4005299 3871026 3841342 3979813 3925821 3872855 3938951
15605 3938951 3947333 3863933 3929199 3922831 3911106 3995140 4002709 3871863 3927244 3908184 3712005
15594 3712005 3799917 3855549 3876935 3905759 4034793 3993321 3981730 3913404 3987263 3926362 3983896
15583 3983896 4115714 4073522 3916721 3901793 3985939 3909516 3915246 4004898 3971801 4077869 4019884
15572 4019884 3944908 3938821 3977441 3975112 3979175 3979506 3940686 4053232 4087108 4042137 4070744 4061395
15560 4061395 3955092 3953666 4057384 3944894 3943863 3981993 4062703 4028051 4006876 3956995 3805804
15549 3805804 4097179 4069494 3988402 3972226 4009983 3942127 3931823 3993263 4004919 4094895 4028199
15538 4028199 3914828 3909066 4075159 4039908 4034795 3977228 3973596 4006820 3973199 4009270 3959563
15527 3959563 3906479 3993283 4115317 3938730 3905652 3897632 3878672 3938526 3944096 3985501 4030596
15516 4030596 3902788 3931049 3843717 3893003 3929724 3936972 3994182 3989937 4003842 3950045 3973123
15505 3973123 3941851 3920202 3946550 4000423 3942165 3963579 4064798 3888717 3797202 3942413 4077329
15494 4077329 3907482 4050603 3995208 3952218 3912140 3942585 3935321 3916296 4054707 4049858 4038426
15483 4038426 3900178 3851973 3929971 3995270 4006788 4097232 4108883 4019781 4020120 4086172 3980118
15472 3980118 4011631 4019751 3937233 3941229 3926822 3913805 3952230 3934292 4009188 3937175 3961159 4049825
15460 4049825 3979456 3882907 3901482 3949640 3962445 3942530 3915013 3889949 4059856 4098446 4106039
15449 4106039 4027146 4033321 4005880 3884675 3942214 3970509 3961820 3926644 3965018 4046218 4071255
15438 4071255 4025953 3926438 3985362 4081338 3993266 4037103 4043449 4092040 4012359 4001263 3915614
15427 3915614 3979962 3933235 3885765 3908590 3941099 3948304 4018730 3991752 3973511 3981040 3944790 3854215
15415 3854215 3954048 3960797 3904940 3954316 3914922 3975513 3916661 4023365 4081108 4027652 4020505
15404 4020505 4026166 3993648 3981288 4070041 4118298 4002792 4020989 4095500 3927982 3867759 4035630
15393 4035630 3935027 3799471 3852244 3993740 3959555 4020097 4051838 4110041 4048665 4064630 4122946
15382 4122946 4111509 3982106 4100766 4116042 3998046 3912099 3979455 4053762 3974289 4133168
15372 4133168 4143674 4024462 3956322 4172210 4092377 4002201 4179301 4044062 4000010 4026532
15362 4026532 4017809 3921715 4045110 4121393 3959420 4021643 4049635 3941821 3969923 4078739 4073725
15351 4073725 4070572 4112687 4067836 4128958 3982070 4044532 4108125 4112507 4065212 3997738 4022817
15340 4022817 4006554 3941017 3988990 4055390 3970348 4013805 4101702 4120111 4118162 4124631 4039893 4016164
15328 4016164 3986126 3974214 4057695 4172578 4064169 3975963 4097608 4103416 3958837 3916235 4054734
15317 4054734 4116286 3957802 4035336 4025317 3955823 4050756 4047072 4047183 3922291 4025341 4032580
15306 4032580 3998124 4075430 4042271 3964326 4022911 4119089 3946586 4047062 4041848 3939733 3912455
15295 3912455 4165208 3989092 3919043 4080315 4028612 3990474 4106974 4118165 3934796 3939591
15285 3939591 4069105 4019633 4007461 4148656 4115185 3953233 4084268 4098943 4098566 4068984 3923151
15274 3923151 3955965 3985714 4010460 4028833 4005914 4049258 3971411 4101596 3989550 3977460 4076491
15263 4076491 4170983 4157127 4119862 4140308 4000588 4068526 4010791 3996597 4122628 4083373 4087609
15252 4087609 4093624 4125191 4045042 4010887 4071089 4100021 4054089 4059308 4124124 4065927 4121803 4084633
15240 4084633 4122144 4049975 4161026 4162041 4185555 4130265 4078288 4155355 4225691 4211467 4021728
15229 4021728 4031835 4144036 4057846 4064108 4068025 4070314 4086672 4024683 4062006 4098606 3962238
15218 3962238 3973705 4038788 4095387 4054774 4000121 4009162 4049975 4223965 4261910 4166423 4173953
15207 4173953 4213200 4093386 4196582 4221757 4084984 4087184 4196351 4201559 4075805 4154187 4168614
15196 4168614 4157602 4150423 4211946 4108135 4077117 4073030 4063352 4104366 4195001 4171542 4085830 4038260
15184 4038260 4174023 4180159 4055843 4002472 3989392 4151280 4155276 4126098 4168161 4213519 4136038
15173 4136038 4173202 4171631 4136424 4154060 4208219 4100413 4067500 4115918 3998973 4090711 4122627
15162 4122627 4141503 4191305 4160759 4173653 4181658 4112930 4230354 4225070 4185339 4149883 4122372
15151 4122372 4113464 4179574 4160447 4188555 4250229 4103862 4096014 4137305 4158054 4056536 4115836
15140 4115836 4287379 4187403 4156993 4143810 4136078 4120586 4162755 4159042 4212822 4117061 4105125
15129 4105125 4210843 4149439 4167620 4160283 4126407 4088709 4283424 4197935 4140460 4223051 4200358
15118 4200358 4119819 4186029 4238869 4038397 4065175 4207555 4112193 4156048 4218524 4093605 4071044
15107 4071044 4144610 4116837 4059117 4176215 4259601 4138615 4235364 4245228 4195156 4127387 4244245
$$ [...]
##END NTUPLES=NMR SPECTRUM
##END=
