##TITLE=1H_CA-9030-1
 CDCl3
 8 sc, 
 6.07.2022
##JCAMPDX= 6.0         $$ Bruker NMR JCAMP-DX V2.0
##DATA TYPE= NMR SPECTRUM
##DATA CLASS= NTUPLES
##ORIGIN= UXNMR, Bruker Analytische Messtechnik GmbH
##OWNER= root
$$ XWIN-NMR		Version 3.5
$$ Wed Jul  6 14:14:36 2022 Russian Standard Time (UT+4h)  she@DPX200
##.OBSERVE FREQUENCY= 200.1313499994
##.OBSERVE NUCLEUS= ^1H
##.ACQUISITION MODE= SIMULTANEOUS
##.ACQUISITION SCHEME= undefined
##.AVERAGES= 8
##.DIGITISER RES= 18
##SPECTROMETER/DATA SYSTEM= spect
##.PULSE SEQUENCE= zg30
##.SOLVENT NAME= CDCl3
##.SHIFT REFERENCE= (INTERNAL, CDCl3, 0, 15.7403)
##AUDIT TRAIL= $$ (NUMBER, WHEN, WHO, WHERE, WHAT)
$$ ##TITLE= Audit trail, XWIN-NMR		Version 3.5
$$ ##JCAMPDX= 5.01
$$ ##ORIGIN= Bruker BioSpin GmbH
$$ ##OWNER= she
$$ F:/spectra/data/she/nmr/H-F/1/pdata/1/auditp.txt
$$ ##AUDIT TRAIL=  $$ (NUMBER, WHEN, WHO, WHERE, WHAT)
(   1,<2022-07-06 14:13:29.06 +0400>,<she>,<DPX200>,
      <created by zg, POWCHK disabled, PULCHK disabled
       configuration hash MD5:
       00 E9 B6 7A A2 85 ED C7 34 08 36 98 17 FE 4E 26
       data hash MD5: 16K
       6A 3B 5D CC 05 0F A2 D6 08 A0 9E CB 68 34 4E B4>)
(   2,<2022-07-06 14:13:32.51 +0400>,<she>,<DPX200>,
      <Start of raw data processing
       efp BC_mod = 2 LB = 0.24 FT_mod = 6 PKNL = 1 PHC0 = -18060.48 PHC1 = 15.80069 SI = 16K 
       data hash MD5: 16K
       C3 B3 B4 A3 27 B1 3D 83 38 33 9D 90 91 AA FD 64>)
(   3,<2022-07-06 14:13:49.06 +0400>,<she>,<DPX200>,
      <pk PHC0 = -1.102839 PHC1 = 0 
       data hash MD5: 16K
       BD 43 B7 58 7E 41 B6 07 D4 9B 69 8A 8F C5 62 4E>)
(   4,<2022-07-06 14:13:52.46 +0400>,<she>,<DPX200>,
      <abs ABSG = 5 
       data hash MD5: 16K
       09 25 C9 BD EB 41 91 B9 E6 59 79 72 ED 2D 16 CE>)
$$ ##END=
$$ 
$$ hash MD5
$$ 3E 8A BD 8D A1 80 FD B5 09 E6 5B 4A D7 C1 EE 35
##$RELAX= 
##$RELAX= 
##$RELAX= 
##$RELAX= 
##$RELAX= 
##$RELAX= 
$$ Bruker specific parameters
$$ --------------------------
##$DU= <F:/spectra>
##$EXPNO= 1
##$NAME= <H-F>
##$PROCNO= 1
##$TYPE= <nmr>
##$USER= <she>
##$AMP= (0..31)
100 100 100 100 100 100 100 100 100 100 100 100 100 100 100 100 100 100 
100 100 100 100 100 100 100 100 100 100 100 100 100 100 
##$AQSEQ= 0
##$AQ_mod= 1
##$AUNM= <au_zg>
##$AUTOPOS= <>
##$BF1= 200.13
##$BF2= 200.13
##$BF3= 200.13
##$BF4= 200.13
##$BF5= 200.13
##$BF6= 200.13
##$BF7= 200.13
##$BF8= 200.13
##$BYTORDA= 1
##$CFDGTYP= 0
##$CFRGTYP= 5
##$CHEMSTR= <none>
##$CNST= (0..31)
1 1 145 1 1 1 1 1 1 1 1 1 1 1 1 1 1 1 1 1 1 1 1 1 1 1 1 1 1 1 1 1 
##$CPDPRG= <>
##$CPDPRG1= <>
##$CPDPRG2= <>
##$CPDPRG3= <>
##$CPDPRG4= <mlev>
##$CPDPRG5= <mlev>
##$CPDPRG6= <mlev>
##$CPDPRG7= <mlev>
##$CPDPRG8= <mlev>
##$CPDPRGB= <>
##$CPDPRGT= <>
##$D= (0..31)
0 1.2 0 0 0 0 0 0 0 0.06 0 0.03 0 0 0 0 0.0002 0 0 0 0 0 0 0 0 0 0 0 0 
0 0 0 
##$DATE= 1657102408
##$DBL= (0..7)
120 120 120 120 120 120 120 120 
##$DBP= (0..7)
150 150 150 150 150 150 150 150 
##$DBP07= 0
##$DBPNAM0= <>
##$DBPNAM1= <>
##$DBPNAM2= <>
##$DBPNAM3= <>
##$DBPNAM4= <>
$$ [...]
##$SUBNAM2= <"">
##$SUBNAM3= <"">
##$SUBNAM4= <"">
##$SUBNAM5= <"">
##$SUBNAM6= <"">
##$SUBNAM7= <"">
##$SUBNAM8= <"">
##$SUBNAM9= <"">
##$SW= 18.0517283424941
##$SWIBOX= (0..15)
0 0 2 0 0 0 0 0 0 0 0 0 0 0 0 0 
##$SW_h= 3612.71676300578
##$TD= 16384
##$TD0= 1
##$TE= 0
##$TE2= 300
##$TE3= 300
##$TEG= 300
##$TL= (0..7)
0 120 120 120 120 120 120 120 
##$TP= (0..7)
150 150 150 150 150 150 150 150 
##$TP07= 0
##$TPNAME0= <>
##$TPNAME1= <>
##$TPNAME2= <>
##$TPNAME3= <>
##$TPNAME4= <>
##$TPNAME5= <>
##$TPNAME6= <>
##$TPNAME7= <>
##$TPOAL= (0..7)
0.5 0.5 0.5 0.5 0.5 0.5 0.5 0.5 
##$TPOFFS= (0..7)
0 0 0 0 0 0 0 0 
##$TUNHIN= 0
##$TUNHOUT= 0
##$TUNXOUT= 0
##$USERA1= <user>
##$USERA2= <user>
##$USERA3= <user>
##$USERA4= <user>
##$USERA5= <user>
##$V9= 5
##$VALIST= <valist>
##$VCLIST= <CCCCCCCCCCCCCCC>
##$VD= 0
##$VDLIST= <DDDDDDDDDDDDDDD>
##$VPLIST= <PPPPPPPPPPPPPPP>
##$VTLIST= <TTTTTTTTTTTTTTT>
##$WBST= 1024
##$WBSW= 4
##$XGAIN= (0..3)
0 0 0 0 
##$XL= 0
##$YL= 0
##$YMAX_a= 106542
##$YMIN_a= -262191
##$ZGOPTNS= <>
##$ZL1= 120
##$ZL2= 120
##$ZL3= 120
##$ZL4= 120
##$ABSF1= 15.73477
##$ABSF2= -2.31708
##$ABSG= 5
##$ABSL= 3
##$ALPHA= 0
##$AQORDER= 0
##$ASSFAC= 0
##$ASSFACI= 0
##$ASSFACX= 0
##$ASSWID= 0
##$AUNMP= <proc_1d>
##$AZFE= 0.1
##$AZFW= 0.1
##$BCFW= 0
##$BC_mod= 2
##$BYTORDP= 0
##$COROFFS= 0
##$CY= -3
##$DATMOD= 1
##$DC= 0
##$DFILT= <>
##$DTYPP= 0
##$F1P= 0
##$F2P= 0
##$FCOR= 1
##$FTSIZE= 16384
##$FT_mod= 6
##$GAMMA= 0
##$GB= 0
##$INTBC= 1
##$INTSCL= 0
##$ISEN= 128
##$LB= 0.24
##$LEV0= 0
##$LPBIN= 0
##$MAXI= 10000
##$MC2= 0
##$MEAN= 0
##$ME_mod= 0
##$MI= 1.114404
##$NCOEF= 0
##$NC_proc= -7
##$NLEV= 6
##$NOISF1= 3.799351
##$NOISF2= 2.8
##$NSP= 0
##$NTH_PI= 0
##$NZP= 0
##$OFFSET= 15.74028
##$PC= 1
##$PHC0= -18061.58
##$PHC1= 15.80069
##$PH_mod= 1
##$PKNL= yes
##$PPARMOD= 0
##$PSCAL= 0
##$PSIGN= 0
##$REVERSE= no
##$SF= 200.130006256462
##$SI= 16384
##$SIGF1= 3
##$SIGF2= 2
##$SINO= 5.538805
##$SIOLD= 16384
##$SREGLST= <1H.CDCl3>
##$SSB= 0
##$STSI= 16384
##$STSR= 0
##$SW_p= 3612.71676300578
##$SYMM= 0
##$S_DEV= 0
##$TDeff= 16384
##$TDoff= 0
##$TI= <>
##$TILT= no
##$TM1= 0
##$TM2= 0
##$TOPLEV= 0
##$USERP1= <user>
##$USERP2= <user>
##$USERP3= <user>
##$USERP4= <user>
##$USERP5= <user>
##$WDW= 1
##$XDIM= 16384
##$YMAX_p= 437056636
##$YMIN_p= -1383586
$$ End of Bruker specific parameters
$$ ---------------------------------
##NTUPLES= NMR SPECTRUM
##VAR_NAME=  FREQUENCY,     SPECTRUM/REAL,   SPECTRUM/IMAG
##SYMBOL=    X,             R,               I
##VAR_TYPE=  INDEPENDENT,   DEPENDENT,       DEPENDENT
##VAR_FORM=  AFFN,          ASDF,            ASDF
##VAR_DIM=   16384,         16384,           16384
##UNITS=     HZ,            ARBITRARY UNITS, ARBITRARY UNITS
##FACTOR=    0.220516191357247, 1,           1
##FIRST=     3150.10236517158, 0,            0
##LAST=      -462.6143978342, 0,             0
##MIN=       -462.6143978342, -1383586,      0
##MAX=       3150.10236517158, 437056636,    0
$$ Real data points
##PAGE= N=1
##DATA TABLE= (X++(R..R)), XYDATA
$$ [...]
6995C777660R6802j12631k82167q397M17824j11092j01093q1282k4867o2359j53416
6984C354982K1603K08827M2594o2541j21829J0126N4018o5562K7869P3846K29505
6973C773438j69430k25411J43078j8091l5200M1035J76128K12649R567M5819q8142
6962C865440o1650P4079q1221L8160J42976J69538j30452K15100J24724J80179
6952D536873K707j67201J69153K84748J9193J2258K63992L15317J90736J43284
6942E771060L4218K37336J93569K08142J93442K58276M5308P227K4807L26812
6932G300197K94009J40561J16801K35737K86215J23171K12437K80956L93228N51870
6922I935182M56342K88209P57093P60739N92279Q55729J148119J236973J324471
$$ y = [3777660, 3874462, 3761831, 3479664, 3471267, 3889091, 3777999, 3676906, 3595624, 3570757, 3508398, 3354982, 3376585, 3585412, 3628006, 3565465, 3443636, 3453762, 3507780, 3442218, 3470087, 3543933, 3773438, 3604008, 3378597, 3521675, 3503584, 3468384, 3509419, 3685547, 3898196, 3907763, 3953582, 3865440, 3803790, 3877869, 3796648, 3834808, 3977784, 4147322, 4016870, 4231970, 4356694, 4536873, 4539580, 4372379, 4541532, 4826280, 4845473, 4857731, 5121723, 5437040, 5627776, 5771060, 5805278, 6042614, 6236183, 6444325, 6637767, 6896043, 6941351, 6948578, 6973385, 7300197, 7594206, 7734767, 7851568, 8087305, 8373520, 8496691, 8709128, 8990084, 9383312, 9935182, 10391524, 10679733, 11436826, 12197565, 12789844, 13645573, 14793692, 16030665, 17355136]
6913A7355136J345086J853628K311597K772815L619886M919739O755135R134558
6905E0067580J2200183J7272670J8929619Q529701j1427618k0169180j8477778
6898E6925177j3794616q867235o060575m475365l249016k286423k011561j720527
6890A4459859r97932r95733j294800q36841o68850m30050l65449l46724n66795
6881G956685l55105m27309k68604k86598j20009j72805m87851l31810N6286j94328
6871E368552m38236k21414M1728k82683q8445l60849k08036j00308j55629j17420
6861C437260k99769q8464l9012m9633N064j65274j31388r751J04284J44201j89950
6850B717568m06615Q9683p692j54763j26258J19897q5011m6571J26389j2355r7426
$$ y = [17355136, 18700222, 20553850, 22865447, 25638262, 29258148, 34177887, 40933022, 50067580, 62267763, 79540433, 98470052, 106999753, 95572135, 75402955, 56925177, 43130561, 34263326, 28202751, 23727386, 20478370, 18191947, 16180386, 14459859, 13461927, 12466194, 11171394, 10334553, 9665703, 9235653, 8870204, 8523480, 7956685, 7601580, 7174271, 6905667, 6619069, 6499060, 6326255, 5838404, 5506594, 5562880, 5368552, 4930316, 4708902, 4750630, 4467947, 4379502, 4018653, 3810617, 3710309, 3554680, 3437260, 3137491, 3049027, 3010015, 2960382, 2965446, 2800172, 2668784, 2659033, 2763317, 2907518, 2717568, 2310953, 2400636, 2392944, 2238181, 2111923, 2231820, 2146809, 2100238, 2226627, 2214272, 2116846]
6839B116846k22042j7449J71391j7585j81898j35491L1280j25470j00400j6896
6829A502286K2218P1736J4643k3474j16715J05039k00348j81255J59421J32106
6819A485657n7733O5932j55536K1841j39292P6423o1900p5220j64188j5040K84205
6808A265149j28547M068l1696J14398l1603k41144M8549M1340M8847k06555k71970
6797F10836J86721R5981r333J16041j36576Q925L17965o0556j88953M5249Q051
6786I94351k39887N2930J43630J5086j83066O0674J38454k14972R7467J26976
6776I91643J97428j98197p4724j43479l5090N7481j00460K09556q0463J05789
6766I29484J41637k58225j22068K84465k7037j04504J72855P0926J4276j10331
$$ y = [2116846, 1894804, 1877355, 2048746, 2031161, 1849263, 1713772, 1745052, 1619582, 1519182, 1502286, 1524504, 1596240, 1610883, 1587409, 1470694, 1575733, 1375385, 1194130, 1353551, 1485657, 1427924, 1493856, 1338320, 1360161, 1220869, 1297292, 1235392, 1160172, 995984, 980944, 1265149, 1136602, 1140670, 1108974, 1223372, 1191769, 950625, 999174, 1040514, 1089361, 882806, 610836, 797557, 893538, 884205, 1000246, 863670, 872595, 1190560, 1130004, 941051, 986300, 994351, 754464, 807394, 951024, 966110, 783044, 843718, 982172, 767200, 864667, 991643, 1189071, 990874, 916150, 772671, 737581, 795062, 694602, 904158, 823695, 929484, 1071121, 812896, 690828, 975293, 948256, 843752, 1016607, 1087533, 1101809, 991478]
6756I91478j47109Q8323J56308j57783n2288J8715J93052j10491j09615M8284
6746I18874J42397q6653j24316J52548K77401j10459Q487J69408K3086P3983j03129
6735A341627j51117J23566K15087j60412q0827J58868R6658j89026K5174j18687
6725A260911M251k28023j11302J43591K07183j76197j75905J43162J51373k21558
6715I97486N5741L8853j86105j04862K6366P1657j667j5686K01493p1318k6333
6704I85625K0117j34400p1350L9188J31320j54933J92744j22546P906o6903J72415
6693I99183l897m5586n2135m9786J47841q5934j26711K47162J5692j68218J06187
6682I83798J44651o7703j86245J66141P8647o9442j83184J2301J73692J2438l2011
$$ y = [991478, 844369, 932692, 1089000, 931217, 878929, 897644, 1090696, 980205, 870590, 918874, 1061271, 974618, 850302, 1002850, 1280251, 1169792, 1178279, 1347687, 1370773, 1444756, 1341627, 1190510, 1314076, 1529163, 1368751, 1287924, 1446792, 1543450, 1354424, 1379598, 1260911, 1265162, 1037139, 925837, 1069428, 1276611, 1100414, 924509, 1067671, 1219044, 997486, 1053227, 1092080, 905975, 801113, 827479, 899136, 897469, 881783, 1083276, 1011958, 985625, 1005742, 871342, 799992, 839180, 970500, 815567, 1008311, 885765, 893671, 826768, 999183, 995286, 949700, 897565, 847779, 995620, 909686, 782975, 1030137, 1045829, 877611, 983798, 1128449, 1060746, 874501, 1040642, 1119289, 1049847, 866663, 878964, 1052656, 1065094, 1033083]
6671A033083M5679J25407J31950j85037J90472M0437J83310r3653l0229R2861
6661A534280P1445r4440o2862n4909m9335n778k48679N218j715n9911j09150J59413
6649A083577n2749M5113R8853r700j34164o133l0888j22492P3334K768J04164
6638A051683k84324k6187J70631j66282Q2542J73113m6398L8507o779J54365l7631
6627A103240Q7789J8151j71083J46212l6082R0013k9142J26721l4977J9203J81621
6616A501666j09864K33444L4572l2745K53572J38717n0652m3145J8859p5466k20830
6605A648128k3767J34140O6148j088j77647J68978J85803K07992k75036J10037
6595B043688R7605K75390M9354K9794L15191m3095K15563J81001J43895L11545
$$ y = [1033083, 1078762, 1204169, 1336119, 1151082, 1341554, 1381991, 1565301, 1471648, 1441419, 1534280, 1605725, 1511285, 1448423, 1393514, 1344179, 1338401, 1089722, 1094940, 1093225, 1033314, 924164, 1083577, 1030828, 1075941, 1174794, 1165094, 1030930, 1024797, 993909, 871417, 944751, 947519, 1051683, 767359, 741172, 911803, 745521, 828063, 1001176, 954778, 993285, 986506, 1140871, 1103240, 1191029, 1209180, 1038097, 1184309, 1148227, 1238240, 1209098, 1335819, 1300842, 1320045, 1501666, 1391802, 1625246, 1659818, 1627073, 1880645, 2019362, 1968710, 1925565, 1944424, 1868958, 1648128, 1624361, 1758501, 1824649, 1823561, 1645914, 1814892, 2000695, 2208687, 1933651, 2043688, 2141293, 2416683, 2466037, 2495831, 2811022, 2767927, 2983490, 3164491, 3308386, 3619931]
6585C619931K47285M55392P55667L51901Q6057m21960n61016n33411k97165r8442
6575C604239o6072r0982m7625K387q0817K25258J06559j18150J33188J41545K37500
6564D047030L27331J95479K47590L31147L74370K48589N88960P37554J311497
6555H409547J346565J085588M08301o57963j246699j341024j042371n74510p52053
6546E635381k23435k83448j93094J0395k61992M0768p548K60497k4625O1160L67098
6535E381157L39857K30892L39211N90961N50402O29701R91756J348203J743623
6526A2145763J595821J173772j54951j856572j857949j726955j431814r44332
6518F942783n69578l12868l67433l15545l36204j71588k17435n629R0697p1247
$$ y = [3619931, 3867216, 4322608, 5078275, 5430176, 5516233, 5094273, 4533257, 3999846, 3702681, 3604239, 3538167, 3447185, 3399560, 3401947, 3321130, 3546388, 3652947, 3534797, 3667985, 3809530, 4047030, 4374361, 4569840, 4817430, 5148577, 5522947, 5771536, 6360496, 7098050, 8409547, 9756112, 10841700, 11250001, 10592038, 9345339, 8004315, 6961944, 6387434, 5635381, 5411946, 5128498, 4935404, 4945799, 4683807, 4724575, 4717027, 4977524, 4952899, 5014059, 5381157, 5721014, 5951906, 6291117, 6882078, 7432480, 8062181, 9053937, 10402140, 12145763, 13741584, 14915356, 14760405, 12903833, 11045884, 9318929, 7887115, 6942783, 6373205, 6060337, 5692904, 5377359, 5041155, 4869567, 4652132, 4646503, 4737200, 4665953]
6508D665953K31153K65293m6278J48937K43633O44009N01242Q39189R93726J015433
6498I502290J318016J009345J12475j078415j496350j338065j249675o91136p14125
6489E374360n80970l71716p1615l61326j78388N572l66149j38250n6066J24149
6479C379601j13959J56562k6932o4126L24689K5616J38308L90544M53496K95238
6469D959037L78817L43037k81912p33073n49283n04725j71754l42231j99250M7983
6459B946646j71103k75796k76443k4868J79945J40839k00139j64319K40892j49886
6449B245768j17791m8088J22434J88815r4285K38255M07810J09636R9441L66876
6439C518871M11174L19243R5813n12067k32812m16250n49625l20734N503R2077
$$ y = [4665953, 4897106, 5162399, 5116121, 5265058, 5508691, 6152700, 6653942, 7493131, 8486857, 9502290, 10820306, 11829651, 11942126, 10863711, 9367361, 8029296, 6779621, 6088485, 5374360, 4793390, 4421674, 4350059, 3988733, 3810345, 3815917, 3449768, 3311518, 3255452, 3379601, 3265642, 3422204, 3395272, 3331146, 3655835, 3681451, 3819759, 4210303, 4663799, 4959037, 5337854, 5680891, 5398979, 4665906, 4116623, 3611898, 3440144, 3097913, 2898663, 2946646, 2775543, 2499747, 2223304, 2198436, 2378381, 2519220, 2319081, 2154762, 2395654, 2245768, 2127977, 2079889, 2202323, 2391138, 2296853, 2535108, 2942918, 3052554, 3151995, 3518871, 3930045, 4249288, 4345101, 3833034, 3600222, 3183972, 2634347, 2313613, 2319116, 2411193]
6429B411193l83373Q7308j64522j86959j61616j13089j36293M5007j61315l221
6419A233120Q8428k1556q0945J20771j20262l3812K50082J65825m1887k93379
6409A266385j15292K12060j09200r6395q6165J02943Q9319j25220j31362L7124
6399A044197l7031j84105J03983K10356j9581k49544j77523L12619N6120o3097
6389I96394j55582K4180J39773p6663K7002R1352J49220k7657j90631k8376J62612
6378A111624K13491j18327j79206o9411M2653O6271j11941J11095n5670j08719
6368I01860M0364L06024q3187n0285r827K5771j5025K7193M1468j51962P6402
6357A108796R4310O6952K06560Q1568j81496j73556Q5512n0832j56819O3050J8887
$$ y = [2411193, 2027820, 2115128, 1950606, 1763647, 1602031, 1488942, 1352649, 1397656, 1236341, 1233120, 1321548, 1299992, 1219047, 1339818, 1219556, 1185744, 1435826, 1601651, 1559764, 1266385, 1151093, 1363153, 1253953, 1157558, 1071393, 1174336, 1263655, 1138435, 1007073, 1044197, 1007166, 823061, 927044, 1137400, 1117819, 868275, 690752, 1003371, 1059491, 996394, 840812, 864992, 1004765, 928102, 955104, 1046456, 1195676, 1168019, 977388, 949012, 1111624, 1325115, 1206788, 1027582, 958171, 1000824, 1067095, 955154, 1066249, 1010579, 901860, 942224, 1248248, 1165061, 1114776, 1104949, 1130720, 1115695, 1142888, 1184356, 1032394, 1108796, 1203106, 1270058, 1476618, 1558186, 1376690, 1203134, 1288646, 1237814, 1080995, 1144045, 1162932]
6346A162932n5630j2495J90503J02666j24491k07874J99409J24193J6691k92280
6336A103624n6026J10271m1615L63P3969Q5677J53576o759k37414M4481O7122
6325A297269K77168o2694l5765k16437J61000L9001l0446M0779o6844o2270K8571
6314A369332O2089j6104j18564j04556J5329R6592K9653k45152P2647J68646k850
6303A327062j6139P2931K55260p0861k33036o9904Q2013N7140j59018J06269m6872
6292A304845j05138K27916J88588k9245n0021j78676N0629K10969K5384j18777
6282A526474R2396J5438J51618J66417j26794j60021J05954J25534p7320J24005
6272A943701o7024j09813J2918L28549R162R8094P7737k40414q5986J45320K76745
$$ y = [1162932, 1107302, 1094807, 1285310, 1387976, 1263485, 1055611, 1255020, 1379213, 1395904, 1103624, 1047598, 1157869, 1116254, 1116617, 1190586, 1276263, 1429839, 1423080, 1185666, 1230147, 1297269, 1574437, 1511743, 1475978, 1259541, 1420541, 1459542, 1429096, 1469875, 1403031, 1340761, 1369332, 1431421, 1415317, 1296753, 1192197, 1207526, 1304118, 1333771, 1088619, 1161266, 1329912, 1327062, 1310923, 1383854, 1639114, 1568253, 1335217, 1265313, 1347326, 1404466, 1245448, 1351717, 1304845, 1199707, 1427623, 1616211, 1586966, 1536945, 1358269, 1408898, 1619867, 1645251, 1526474, 1618870, 1634308, 1785926, 1952343, 1825549, 1665528, 1771482, 1897016, 1819696, 1943701, 1876677, 1766864, 1779782, 2108331, 2117493, 2215587, 2293324, 2052910, 1966924, 2112244, 2388989]
6261B388989J47414n2307k12126K44810P0534j10900R0149K02833N4016J14092
6251B937504K95221p3484j44456j14173L17170K73747m1478j18110K06731J74274
6241C712946J78780j22341J26998N1250j34659j71298L01809M85981l4288j42372
6231D252806O1351N6703n4608q8088J97999M87208J23618M857J04115K39038M74032
6220E859031N7134K70708K67278K65385J52630Q3968K45065K48326J22428L76890
6210G948843M84492J96864J23269J72377M98975O2560M4987K4517K13457K48229
6200A0018570K28360J83411N57713N68260N99940O73231J054184Q74069R35705
6191A5693443J000842J354968J519966J800154K197878K860273L639707M594872
$$ y = [2388989, 2536403, 2484096, 2271970, 2516780, 2587314, 2476414, 2566563, 2769396, 2823412, 2937504, 3232725, 3159241, 3014785, 2900612, 3217782, 3491529, 3450051, 3331941, 3538672, 3712946, 3891726, 3769385, 3896383, 3947633, 3812974, 3641676, 3943485, 4429466, 4395178, 4252806, 4314157, 4370860, 4316252, 4228164, 4426163, 4913371, 5036989, 5041846, 5145961, 5384999, 5859031, 5916165, 6186873, 6454151, 6719536, 6872166, 6956134, 7201199, 7449525, 7571953, 7948843, 8433335, 8630199, 8753468, 8925845, 9424820, 9487380, 9532367, 9556884, 9770341, 10018570, 10246930, 10430341, 10988054, 11556314, 12156254, 12829485, 13883669, 14757738, 15693443, 16694285, 18049253, 19569219, 21369373, 23567251, 26427524, 30067231, 34662103]
6183C4662103N967401Q314810J1412721J5970137J7393544Q453372q823831j8261486
6175G5088771j7651189j3415344q727377n762888m101463l299868k508011k031581
6167A7591050j659463j324722j153011r80148p67407o55770o31854l66653m38714
6158I613308n72998m17613k76867l80227l90986l08869j45709K3901m49104k82113
6148F412723k86151j81915j27993k01693j27869o4208l57866r2806l4348L7883
6138D975757l27642j61190p2178j41370J2505k36871Q0806r4607k81219J07867
6128C861858K2322P4949r2540j62349o5676j34334r3805m1438J4997L00781r4180
6117C590585k21425j43521j83720j10348K70209M0427j14202R1045o8789l9627
$$ y = [34662103, 40629504, 48944314, 60357035, 76327172, 93720716, 102174088, 93350257, 75088771, 57437582, 44022238, 35294861, 29531973, 25430510, 22130642, 19622631, 17591050, 15931587, 14606865, 13453854, 12473706, 11706299, 11050529, 10418675, 10052022, 9613308, 9040310, 8622697, 8345830, 7965603, 7574617, 7265748, 7120039, 7143940, 6694836, 6412723, 6126572, 5944657, 5816664, 5614971, 5487102, 5422894, 5065028, 4972222, 4937874, 4975757, 4648115, 4486925, 4414747, 4273377, 4285882, 4049011, 4129817, 4035210, 3753991, 3861858, 3884180, 3959129, 3866589, 3704240, 3638564, 3504230, 3410425, 3368987, 3383984, 3684765, 3590585, 3369160, 3225639, 3041919, 2931571, 3201780, 3242207, 3128005, 3219050, 3150261, 3110634]
6107C110634j36343l23260j14907J14494J26065j53425q817Q4798K47732o3480
6097B883491j7964J05475O96k09685j24725P1263P5610j07364q577j63275J38638
6086B643583L9968n4403J88945N7549J50441J20874j33532O0578J01187j42155
6076C033035j02937j35681J35857J07574r2602L3509lk76885J0787J28176j7477
6065B823353J85086p442p6467R9373J06168M2593r7768K09955o7059R0084P7858
6054C385734J61562J52647P54J15055j11254M4622K02508j39404j1084j78115
6044C623025k6445N9586m9389j16618j50207Q7980J58786N5777J36138K50437
6034D029070K8813m3536K20144K50368j15950R2226K26602k12116Q1995J31085
$$ y = [3110634, 2974291, 2651031, 2536124, 2650618, 2776683, 2623258, 2614441, 2699239, 2946971, 2883491, 2865527, 2971002, 2971698, 2762013, 2637288, 2708551, 2784161, 2676797, 2668220, 2504945, 2643583, 2683551, 2629148, 2818093, 2875642, 3026083, 3146957, 3013425, 3074003, 3175190, 3033035, 2930098, 2794417, 2930274, 3037848, 2945246, 2978755, 2978752, 2701867, 2712654, 2840830, 2823353, 3008439, 3000997, 2924530, 3023903, 3130071, 3172664, 3074896, 3284851, 3217792, 3307876, 3385734, 3547296, 3699943, 3700697, 3815752, 3704498, 3749120, 3951628, 3812224, 3801140, 3623025, 3596580, 3656166, 3606777, 3490159, 3339952, 3427932, 3586718, 3642495, 3778633, 4029070, 4057883, 4014347, 4234491, 4484859, 4368909, 4461135, 4687737, 4475621, 4557616, 4688701]
6024D688701k02493k05613P7788o0668r5117r093R3928n6232J16950K0426J6563
6013D385140r4839m0229l7235J58600K85076o8924o7022k4989J02474J40421K05470
6002D943943J02324J44348M3933J54881p3506q5095K35122k6551P2822K34486
5992E746707K91214L0772J47431J63437R0703L8727j51156K74495K20047j32209
5982F720168l9612L24587M02582L16079o6539K18379K96246P18K42272J51882
5972H566762L84058J16449J55195L83786J77516P8482Q6948L89094M00612L28458
5962A1067360J78166N33100N04745M65123L45429P70555O81500L23130N24814
5953A5393922Q20258J175948J432963J225177J607428K462785K844314K690413
$$ y = [4688701, 4486208, 4280595, 4358383, 4297715, 4202598, 4193505, 4287433, 4231201, 4348151, 4368577, 4385140, 4290301, 4250072, 4212837, 4371437, 4656513, 4587589, 4520567, 4495578, 4598052, 4738473, 4943943, 5046267, 5190615, 5234548, 5389429, 5315923, 5230828, 5465950, 5439399, 5512221, 5746707, 6037921, 6068693, 6216124, 6379561, 6470264, 6508991, 6357835, 6632330, 6852377, 6720168, 6680556, 7005143, 7407725, 7723804, 7657265, 7875644, 8171890, 8172608, 8414880, 8566762, 8950820, 9067269, 9222464, 9606250, 9783766, 9862248, 9949196, 10338290, 10738902, 11067360, 11245526, 11778626, 12283371, 12748494, 13093923, 13864478, 14545978, 14869108, 15393922, 16214180, 17390128, 18823091, 20048268, 21655696, 24118481, 26962795, 29653208]
5945B9653208J900272L77109j376353j973411j775987r48426n81113k81090L14763
5936B5308972O49339Q93785P76342R60479J294738J302456J622156J862128J342225
5927C6012620J215578J322745J147872L76717q59017j588509j730192r06057j81872
5918C4809885K43095l6775o49062q35099n47733m16849n29849l38851J9447N33894
5908C2252103J166774J772728K302600K775875L001630J896662k30406k325966
5900D2612000l516414l037846k258581j406265p46513k36672M9875J06099M02295
5891C1967978Q00352J130829J688173J668274K027712K355902K283697J985136
5883D5908053K253525L155120L887408M925227M916710M058588J708528j110411
$$ y = [29653208, 31553480, 31930589, 30554236, 28580825, 26804838, 25856412, 25275299, 24994209, 25308972, 25958311, 26852096, 27628438, 28588917, 29883655, 31186111, 32808267, 34670395, 36012620, 37228198, 38550943, 39698815, 40075532, 39216515, 37628006, 35897814, 34991757, 34809885, 35052980, 35016205, 34367143, 33532044, 32984311, 32567462, 32037613, 31698762, 31718209, 32252103, 33418877, 35191605, 37494205, 40270080, 43271710, 45168372, 44937966, 42612000, 39095586, 36057740, 33799159, 32392894, 31646381, 31409709, 31459584, 31565683, 31967978, 32768330, 33899159, 35587332, 37255606, 39283318, 41639220, 43922917, 45908053, 48161578, 51316698, 55204106, 60129333, 65046043, 69104631, 70813159, 69702748]
5875F9702748k783521l557802l200729k184463j067765k27058K88188O67527R06792
5866E8543917J811535K459140L922159N479843O932650Q161553Q246486O550469
5858A02107752L349402P54007q43562j661027j898904k815954n011481o727090
5850H7253143p778559p129267n827144l474498k119491q61491M14591J449683
5842F1926967K203745K072484L016635M230943N143183M548308J898902k215585
5834H2825582o121826q308019q408094o816356n346892l989913k731579j919104
5826C9183799q68899l96100M75918J302780P18780j133229l271857l871934l520146
5817B8619112k908116j942715j585268j081216j300894j053009o73630p47843
$$ y = [69702748, 66919227, 63361425, 60160696, 57976233, 56908468, 56681410, 56969598, 57637125, 58543917, 60355452, 62814592, 66736751, 72216594, 79149244, 87310797, 95557283, 102107752, 105457154, 106211161, 105367599, 103706572, 101807668, 98991714, 93980233, 87253143, 79474584, 72345317, 66518173, 63043675, 60924184, 60062693, 60477284, 61926967, 64130712, 66203196, 69219831, 73450774, 78593957, 83142265, 85041167, 82825582, 76703756, 68395737, 59987643, 53171287, 47824395, 43834482, 41102903, 39183799, 38314900, 37918800, 38394718, 39697498, 40416278, 39283049, 36011192, 32139258, 28619112, 25710996, 23768281, 22183013, 21101797, 19800903, 18747894, 18074264, 17326421]
5809A7326421o11380o44906k68012j72933n88973l75910j43828j16473m19796
5800A3984210k02098l9592l29924J86113n1571L08241K76450L11525P57820P62909
5790A5964083M19223l59749r47945j099846j015938j054824p31138j65747j56554
5781A0851565k08683k85334k41259J28049n18191l22307r804p5265j31448o2770
5771I124553k60210k80665j51766J78961Q0145k00445k75111k7741J92192n0616
5761H329297m992J28317O6562m1352m2192K46611J05835K59671K46171Q3944n1189
5750I326683M3566P0894p4430k46683m61233k52295j6860J05435k07082N3649
5740H341644L67313j9892j21476J82801J60510J36616k2321J39284J75338n4375
$$ y = [17326421, 16715041, 16070135, 15802123, 15629190, 15040217, 14664307, 14520479, 14404006, 13984210, 13782112, 13742520, 13412596, 13598709, 13547138, 13855379, 14131829, 14443354, 15201174, 15964083, 16383306, 16023557, 15075612, 13975766, 12959828, 11905004, 11173866, 11008119, 10851565, 10642882, 10357548, 10116289, 10244338, 9726147, 9403840, 9394036, 9318771, 9187323, 9124553, 8864343, 8583678, 8431912, 8610873, 8691018, 8490573, 8215462, 8187721, 8379913, 8329297, 8324305, 8452622, 8519184, 8477832, 8435640, 8682251, 8788086, 9047757, 9293928, 9377872, 9326683, 9370249, 9441143, 9366713, 9120030, 8658797, 8406502, 8389642, 8495077, 8287995, 8341644, 8708957, 8689065, 8567589, 8750390, 8910900, 9047516, 9025195, 9164479, 9339817, 9285442]
5730I285442n5750K26879N2198J57009J76481K17573M00016L72876N4415M640
5720A0891779k69089k74909J4966J75361j61489J45693J85180O2398p4004k2504
5710A0673382J18931K76428K38918r8996m1928L60222L82746J27807q0686M17856
5700A2374680M57951L54896M81415L33387N23570L64212M43066L94200K03537
5691A5930914l4202J017J56743L11735K6002O9849M97794N20231J06985J52169
5681A7739237M08627M15801L95010M05391N93735P69756O28559M39000Q08245
5672B2603361J042185P91101P15976J094223J371398R90882J042852J234833J558925
5663C2445736J319131J558988K312216K897142L421963L731103M978550O335555
$$ y = [9285442, 9229692, 9456571, 9508769, 9665778, 9842259, 10059832, 10459848, 10832724, 10887139, 10891779, 10622690, 10347781, 10362747, 10538108, 10376619, 10522312, 10707492, 10769890, 10695886, 10673382, 10792313, 11068741, 11307659, 11208663, 11166735, 11526957, 11909703, 12037510, 11956824, 12374680, 12832631, 13187527, 13668942, 14002329, 14525899, 14890111, 15333177, 15727377, 15930914, 15896712, 15897729, 16054472, 16366207, 16392209, 16462058, 16959852, 17480083, 17587068, 17739237, 18147864, 18563665, 18958675, 19364066, 19957801, 20727557, 21356116, 21795116, 22603361, 23645546, 24436647, 25152623, 26246846, 27618244, 28609126, 29651978, 30886811, 32445736, 33764867, 35323855, 37636071, 40533213, 43955176, 47686279, 52664829, 59000384]
5655E9000384P156357P791151P275350M635979K49295l881254n483829n369292
5647G1374141m446159k917375k197786j639104j218896k00192P81313J638624
5639F1174566K925926L935943M606713M624621L680145L208103L653069L948787
5631I1757873L235431J659409j294999m500743p009119p853380o973788n737506
5623F3283178m182973k632582j528379q81047n35441p0006M91380O05098J187549
5614E5736777K333567L001202L169296K134715l5502k498499m798346n541711
5606E3501499m937094m248323l583116k576308k006180j438698j183626r21309
5598C2606845m12619j07817O9096K05358L35837Q25640R03522Q36580J127543
$$ y = [59000384, 66156741, 73947892, 81223242, 85859221, 86108516, 82227262, 76743433, 71374141, 66927982, 64010607, 61812821, 60173717, 58954821, 58754629, 59535942, 61174566, 64100492, 68036435, 72643148, 77267769, 80947914, 84156017, 87809086, 91757873, 94993304, 96652713, 95357714, 90856971, 83847852, 75994472, 69020684, 63283178, 59100205, 56467623, 54939244, 54058197, 53522756, 53452750, 53944130, 54549228, 55736777, 58070344, 61071546, 64240842, 66375557, 66340055, 63841556, 59043210, 53501499, 48564405, 44316082, 40732966, 38156658, 36150478, 34711780, 33528154, 32606845, 32194226, 32086409, 32155505, 32360863, 32696700, 33522340, 34425862, 35262442, 36389985]
5589C6389985R29903M63041m4710m67062n39055q04632o58183J2797N28634J094432
5579C6905150J499511K330929K876375L499617L447691K134408M46970q50390
5571E2290261j037354k53876R27894J687779J796500R97000J37755j381275j636869
5562E3527815j117111j08647M51703K53145j81621l94208j6638N07821P67641
5553E3689900L24044q00668k012716k246000j777363j181927q38817m92075l7996
5544D4626382Q73233J373005J206712N38807m76199k057363k707926j980387r24669
5535D0471595j48775P70412J271853N44058q00347k278086k974735k745995k724145
5526C1385835k958293k066818j631508j459200j089254r45526m13540o71317q56783
$$ y = [36389985, 37319888, 37782929, 37738219, 37271157, 36732102, 35927470, 35269287, 35282084, 35810718, 36905150, 38404661, 40735590, 43611965, 47111582, 50559273, 52693681, 53140651, 52290261, 51252907, 50999031, 51926925, 53614704, 55411204, 56408204, 56545959, 55164684, 53527815, 52410704, 52302057, 52753760, 53006905, 52825284, 52431076, 52414438, 52922259, 53689900, 54013944, 53213276, 51200560, 48954560, 47177197, 45995270, 45156453, 44664378, 44626382, 45499615, 46872620, 48079332, 48618139, 48141940, 46084577, 43376651, 41396264, 40471595, 40322820, 41093232, 42365085, 42909143, 42108796, 39830710, 36855975, 34109980, 31385835, 28427542, 26360724, 24729216, 23270016, 22180762, 21235236, 20821696, 20150379, 19293596]
5517A9293596k92714l04444m35090k88886k97153l28344m61970q6422o2873j50682
5507A6585018K46021O5539K27085J53972p6088J31773K43582N7180k48415o06414
5497A6779253n26285m00445l36742k52890j75731j26295J33683J79730J84402
5488A5458680K57319o1275l86852j16146N081j27155j83887K79708M89604l9165
5478A5575912l23321k11544r420j47249k13313k31985j97044J6721J07450n963
5468A4360244J77729K58921J44150R6799J61462L00639R2772J03180M47788K26506
5458A6370190K56754J54217m4454K2476J83345J56484O4145k2835j85696j50797
5448A6803829j01037o21070r5550j29222Q0445J86491m1957K8243K23683J50663
$$ y = [19293596, 19000882, 18696438, 18261348, 17972462, 17675309, 17346965, 16884995, 16798573, 16735700, 16585018, 16831039, 16896578, 17123663, 17277635, 17201547, 17333320, 17576902, 17634082, 17385667, 16779253, 16252968, 15852523, 15515781, 15262891, 15087160, 14960865, 15094548, 15274278, 15458680, 15715999, 15654724, 15267872, 15151726, 15156807, 15029652, 14845765, 15125473, 15615077, 15575912, 15252591, 15041047, 15031627, 14884378, 14671065, 14439080, 14242036, 14258757, 14366207, 14360244, 14537973, 14796894, 14941044, 15037843, 15199305, 15499944, 15592716, 15695896, 16143684, 16370190, 16626944, 16781161, 16736707, 16759183, 16942528, 17099012, 17163157, 17140322, 16954626, 16803829, 16702792, 16081722, 15986172, 15856950, 15937395, 16123886, 16081929, 16110172, 16333855, 16484518]
5438A6484518K6134J6768O0143n326K12573k7696J65917J10315k871L35148N21651
5427A7897274L64693M78364L54547K47167K46863k7839n7146M044N5425K41002
5417A9804394M07472M84618J117599J312396J773649K317747K659661K264191
5409C2141727J572203j57215j594673k421395k475909k005623j462998j063602
5401B2532515p97180k95944J5146J95108L78358O48429J173865Q33553O13118
5392B5296968P44796J055565R13653M39834K50535P27186J211730J642262J194282
5383C3476811J69429r26520k074889k463425k498895j912751j626229j426345
5375B0717186j026222p98729o39350m45614j75321r2808r2128L7272L36720P82494
$$ y = [16484518, 16510652, 16527420, 16587563, 16582237, 16794810, 16767114, 16933031, 17043346, 17040475, 17375623, 17897274, 18261967, 18740331, 19094878, 19342045, 19588908, 19561069, 19503923, 19507967, 19563392, 19804394, 20211866, 20696484, 21814083, 23126479, 24900128, 27217875, 29877536, 32141727, 33713930, 33556715, 31962042, 29540647, 27064738, 25059115, 23596117, 22532515, 21735335, 21439391, 21454537, 21649645, 22028003, 22676432, 23850297, 24683850, 25296968, 26041764, 27097329, 28010982, 28450816, 28701351, 29428537, 30640267, 32282529, 33476811, 33646240, 32719720, 30644831, 28181406, 25682511, 23769760, 22143531, 20717186, 19690964, 18892235, 18252885, 17807271, 17631950, 17539142, 17447014, 17484286, 17821006, 18603500]
5365A8603500P37367P49365P75824L22507o7592q17055q68129j245934j335053
5356A6854800j519700j139482o96557n12182n02907l47448j51897k25408l94453
5347A1364766k59927j19708m32988j76205m78118l41379m1979o0254k98493j36659
5337I019056j0584n6049m07968j11782j1989j02245l1966N9195n3463O1863j74178
5326H179890k82606K10280j04529j57269k38909K61334o4681l04017j42524k967
5316G354002K7807j88052k2398J32927J12333j0562j96705J25545J09879n4267
5306G390509J12762J28301p844j58678M8652q5701N7294J5515J3187K85q9881
5295G424401P808j19520j18310J49337o4601l5826j8837p7922J04905k72845K659
$$ y = [18603500, 19340867, 20090232, 20866056, 21188563, 21120971, 20303916, 19435787, 18189853, 16854800, 15335100, 14195618, 13499061, 12986879, 12483972, 12136524, 11984627, 11759219, 11364766, 11104839, 10985131, 10552143, 10375938, 9897820, 9556441, 9514462, 9454208, 9155715, 9019056, 9008472, 8952423, 8544455, 8432673, 8420684, 8318439, 8286473, 8345668, 8292205, 8354068, 8179890, 7897284, 8107564, 8003035, 7845766, 7606857, 7868191, 7803510, 7499493, 7356969, 7354002, 7381809, 7193757, 7171359, 7304286, 7416619, 7406057, 7209352, 7334897, 7444776, 7390509, 7503271, 7631572, 7623728, 7465050, 7513702, 7428001, 7485295, 7500810, 7513997, 7514282, 7424401, 7432209, 7312689, 7194379, 7343716, 7279115, 7243289, 7224452, 7146530, 7251435, 6978590, 6981249]
5284F981249K56357J09551m6927j02180n9828n2412L4945o7167l0616K808K4643
5273G050423J32184O4029j99059j06267o0726N7370m2496K00798j27444j29254
5263F839558K2519J48009K097K4206J8731j22005M6531J4907M9891K2009m7473
5252G018980J31037j88613M9515j82691j70973K39438J25477k20525j70813K9429
5242F660261K70118Q5611R6109M5682q3664K19607p4120J07059J17386l3244m3590
5231G367215p8350q3934r718J47818N7472m9740l9547k84520J56602p4741J10683
5220G219240K47331P0498Q0761J14927M7972n9416Q3523K0622Q8799R8411K370
5209H015038J88086R980N5341N5051Q1149J80266n5225K04860L73006Q1053J61324
$$ y = [6981249, 7237606, 7347157, 7300230, 7198050, 7138222, 7085810, 7120755, 7053588, 7022972, 7025780, 7050423, 7182607, 7246636, 7047577, 6941310, 6880584, 6937954, 6895458, 7096256, 6968812, 6839558, 6862077, 7010086, 7012183, 7036389, 7055120, 6933115, 6979646, 6994553, 7044444, 7066453, 7018980, 7150017, 6961404, 7010919, 6828228, 6657255, 6896693, 7022170, 6801645, 6630832, 6660261, 6930379, 7015990, 7112099, 7157781, 7074117, 7293724, 7219604, 7326663, 7444049, 7410805, 7367215, 7288865, 7204931, 7195213, 7343031, 7400503, 7350763, 7311216, 7026696, 7183298, 7108557, 7219240, 7466571, 7537069, 7617830, 7732757, 7780729, 7721313, 7804836, 7825458, 7914257, 8012668, 8015038, 8203124, 8213104, 8268445, 8323496, 8404645, 8584911, 8529686, 8734546, 9107552, 9188605, 9349929]
5198I349929J05317M93948L56269K04981J96292J23172R9245k55532k88181k43733
5188A0141707l44507k65458k62147k01648j66712j71756j42591k79034j21312
5179H186542j19194l567k90581j17814Q469j23362l61526k27974J61288J39310
5169G251591r3205O9604J709m7190j22020o0849J98554p5117k36113k06536K0952
5158F701380r7253j40071n7977j1824P8761k11102k42233J92929J6526K6763m23993
5147E831906J42826J44020l3219r979p6894M3452k8869k87195m1425K10769j7598
5136E877794k77824o0366K49528j05550M2734j31026j15820m942j76381L2118
5126E330265N3174R8230j02597j09168J46884L7263k5910j90441O1516Q5319M3513
$$ y = [9349929, 9455246, 9949194, 10305463, 10510444, 10706736, 10829908, 10929153, 10673621, 10385440, 10141707, 9797200, 9531742, 9269595, 9067947, 8901235, 8729479, 8586888, 8307854, 8186542, 8067348, 8063781, 7773200, 7655386, 7663855, 7540493, 7178967, 6950993, 7112281, 7251591, 7158386, 7227990, 7229699, 7182509, 7060489, 6999640, 7198194, 7123077, 6886964, 6680428, 6701380, 6604127, 6464056, 6406079, 6394255, 6473016, 6261914, 6019681, 6212610, 6229136, 6255899, 5831906, 5974732, 6118752, 6085533, 6075554, 5998660, 6042112, 6013243, 5726048, 5684623, 5895392, 5877794, 5599970, 5539604, 5789132, 5683582, 5726316, 5595290, 5479470, 5474528, 5298147, 5330265, 5383439, 5481669, 5379072, 5269904, 5416788, 5454051, 5428141, 5237700, 5299216, 5384535, 5428048]
5115E428048L1818k1368N0682k00612j29247R6628J52253M7249j17586M3003J12430
5104E493298M8679n8583J2722K44385J2291k43127Q9456K90097L03374k2194K67882
5093F438280J94138K51019J98349N74513O65680L33744j0475m25174l48701m53326
5083G418047l47109m68256n9906N3902m7180j94411j4257J19233k13356m9970
5073F196737J42301K756J94L41176J66268J82487L15936J19150K55991O39945
5063H362941M27167P70773J071329N90045l0687n77921q27070j074985n98352
5054H113240k84569l15067l06208j58223k50872j46962j96558j80182O4374j26239
5044F212734J51602m6980R4459P3726l4133J48409N8268K13822J04454J57879
$$ y = [5428048, 5459866, 5438498, 5489180, 5288568, 5159321, 5255949, 5408202, 5455451, 5337865, 5380868, 5493298, 5541977, 5483394, 5496116, 5740501, 5752792, 5509665, 5599121, 5889218, 6192592, 6170398, 6438280, 6632418, 6883437, 7081786, 7656299, 8321979, 8655723, 8645248, 8220074, 7871373, 7418047, 7070938, 6602682, 6542776, 6596678, 6549498, 6355087, 6340830, 6460063, 6246707, 6196737, 6339038, 6341794, 6341988, 6683164, 6849432, 7031919, 7347855, 7467005, 7722996, 8362941, 8790108, 9560881, 10632210, 11222255, 11191568, 10613647, 9786577, 8711592, 8113240, 7828671, 7513604, 7207396, 7049173, 6798301, 6651339, 6454781, 6274599, 6338973, 6212734, 6364336, 6317356, 6411815, 6485541, 6451408, 6599817, 6658085, 6871907, 6976361, 7134240]
5034G134240M14207L30350J39166R5038r6647l96231l66520n29877l54704l3581
5024F335441K6520j37093j81684M5288o6453Q4323K2653o7288L8175j45850m5828
5013E908204l4887L5129k2698p3738P3625j4930J32588J9989q1928l180M5718
5002E983892J14131L6394m0526j50894R051o0301Q7539k1208j00167Q9877J37467
4991F085255j74017L6756O6001o5415q826r1938o2197j258K44322j15722j88168
4980E724793J74915j86057j42663L9097J75623O8589j65851J76025J13049n1204
4970E926316r7883o7349J22426j1225l55687J15679N2123O6566j28707j05223
4960E517036J31336K09895n0679j51097j95237n5227M25988M8434n0873O4164
$$ y = [7134240, 7548447, 7878797, 8017963, 8113001, 8016354, 7620123, 7253603, 6723726, 6369022, 6335441, 6361961, 6224868, 6043184, 6088472, 6022019, 6106342, 6128995, 6061707, 6099882, 5954032, 5908204, 5873317, 5908446, 5885748, 5812010, 5885635, 5870705, 6003293, 6023282, 5941354, 5938174, 5983892, 6098023, 6134417, 6093891, 5942997, 5952048, 5891747, 5979286, 5958078, 5857911, 5947788, 6085255, 5911238, 5947994, 6013995, 5948580, 5939754, 5847816, 5785619, 5784361, 6028683, 5912961, 5724793, 5899708, 5713651, 5570988, 5610085, 5785708, 5854297, 5688446, 5864471, 5977520, 5926316, 5828433, 5761084, 5883510, 5872285, 5516598, 5632277, 5684400, 5750966, 5622259, 5517036, 5648372, 5858267, 5807588, 5656491, 5461254, 5406027, 5832015, 5880449, 5829576, 5893740]
4950E893740J19019l11243j46696J17202J53229l182r6969K35702J20931j56200
4940E925533O4728K19244j11162p6744k9393J34135k6166q3813k4617j57166Q3135
4929E917714J53663j95840q1916J56057L64740k09035j18825N2123P2101q5237
4919F025545J81326j16577k0659l9015j02856J54306O8053O7041M5918J09236
4909F372318J2389j04505n2804J15945J36832K0783L2891p7360J5092P7118j2438
4898F536261k9939L1725p71l1604N9065N1184K8653j39767M2406J77806P5195
4887F800214j81685j22582J15367J70370j18784n5095M956J176r0463l1448K20132
4876F712158K2358j04425k06463O7903L25212O0464n7510L3480J55209j73410
$$ y = [5893740, 6012759, 5701516, 5554820, 5672022, 5825251, 5822069, 5725100, 5960802, 6081733, 5925533, 5990261, 6209505, 6098343, 6021599, 5992206, 6126341, 6100175, 6016362, 5991745, 5834579, 5917714, 6071377, 5875537, 5793621, 5949678, 6314418, 6105383, 5986558, 6038681, 6110782, 6025545, 6206871, 6090294, 6069635, 6030620, 5927764, 6082070, 6150123, 6217164, 6263082, 6372318, 6384707, 6280202, 6227398, 6343343, 6480175, 6500958, 6533849, 6456489, 6471581, 6548699, 6536261, 6506322, 6538047, 6537276, 6505672, 6564737, 6615921, 6644574, 6504807, 6547213, 6725019, 6800214, 6618529, 6495947, 6611314, 6781684, 6662900, 6607805, 6612761, 6613937, 6523474, 6492026, 6712158, 6734516, 6630091, 6423628, 6491531, 6816743, 6877207, 6819697, 6853177, 7008386, 6834976]
4866F834976j05635M5932K91222N9387O2671r1339Q689k0090j56715j53147N8176
4855F834127O1302n6775P3078J33252K403K9588l6132N0571m6560L1634p958J78836
4843G247366j2865j32013N3912L4311r8756P1881J73235p2430j54461J15283J92461
4832G417924j49252M4427J02950n0547j02190l0498J14122j33862J6535j60006
4822G069603R6177J85078q914j13816J07303J52985j45083j363J25654p4891L0973
4811G423706J65385p2724l5283k0226j57508k73188K87320M2206J8261J40576
4801G518525J23846J264O3601k82516J79812l8364k9305q8904J53497J32931k75664
4790G458723Q2122J58858j09552r8287l534R4483K07759j63513k10548K36754
$$ y = [6834976, 6729341, 6775273, 7066495, 7125882, 7188553, 7097214, 7105903, 7085813, 6929098, 6775951, 6834127, 6895429, 6838654, 6911732, 7044984, 7047387, 7076975, 7040843, 7091414, 7044854, 7076488, 7068530, 7247366, 7234501, 7102488, 7156400, 7190711, 7091955, 7163836, 7337071, 7264641, 7110180, 7225463, 7417924, 7268672, 7313099, 7416049, 7365502, 7263312, 7232814, 7346936, 7213074, 7229609, 7069603, 7165780, 7350858, 7341944, 7228128, 7335431, 7488416, 7343333, 7341970, 7467624, 7392733, 7423706, 7589091, 7516367, 7481084, 7460858, 7303350, 7030162, 7317482, 7359688, 7377949, 7518525, 7642371, 7643635, 7707236, 7424720, 7604532, 7566168, 7536863, 7447959, 7601456, 7734387, 7458723, 7540845, 7699703, 7590151, 7491864, 7488330, 7582813, 7790572, 7627059, 7416511, 7653265]
4780G653265J13565m2400K4686k48497m2514q4559j2713R4031J41746R2370j45669
4769G543311K22844m0179r5416o684M0078N5217q2308k7637L1900O3508k03209
4758G501425J36728L4923P3694j83674m720L21679k9698k88396R8990J09064k07726
4747G562289r371J38204J10806j95390P2847L7164k9631J26174k33556q2654K29495
4736G726377L173k08055P6350K30779r7806n1216q5120J68996p4997j08851N3438
4725G633068J89458R0993k58233j17660p2909Q8502m9038J00905L6857K2258j28371
4714G535830m0060R7981j820j2972j6648J3720k21060J2799P0230M9665n1499
4703G436166M8860J79059j19617K1380K2196j25483L0661q7938N2120J99291r1163
$$ y = [7653265, 7766830, 7724430, 7749116, 7500619, 7458105, 7373546, 7360833, 7454864, 7596610, 7688980, 7543311, 7766155, 7725976, 7630560, 7623876, 7663954, 7719171, 7636863, 7609226, 7641126, 7704634, 7501425, 7638153, 7673076, 7746770, 7563096, 7558376, 7880055, 7850357, 7561961, 7660951, 7770015, 7562289, 7552918, 7691122, 7801928, 7606538, 7679385, 7716549, 7686918, 7813092, 7579536, 7496882, 7726377, 7729550, 7521495, 7597845, 7828624, 7730818, 7679602, 7594482, 7763478, 7688481, 7579630, 7633068, 7822526, 7913519, 7655286, 7537626, 7464717, 7553219, 7504181, 7605086, 7641943, 7664201, 7535830, 7495770, 7593751, 7591931, 7578959, 7562311, 7576031, 7354971, 7367770, 7438000, 7487665, 7436166, 7485026, 7664085, 7544468, 7565848, 7588044, 7462561, 7493222, 7405284, 7457404, 7656695, 7565532]
4692G565532k88669J04172L60747j35651l11494J8386K18237j26060p955m2209
4682G355036K27289N910j86827K0986K6282O4189P1661J1455j39007j13097j11909
4671G231968J11460J67487R42k24604J1391K6361p6321o0331J2944q1684l9723
4660G079890q7271J3057O5237J05297o8059K7211L2349p1193j17079j1986K3619
4649F991072R5174j26671j16667q8322P062O5704M3501j12971k4338J00630O3250
4638F897424p2235p9051M9194k53977P3399P7674p5722l5315j207J79698L3206
4627F793088j84774j2278O5722J29486o9562q2437q7582M2817P7066j94166O9674
4616F547054J77942k64325o6124K6750K35762k50719j67266k1302J33355J079
$$ y = [7565532, 7276863, 7381035, 7741782, 7606131, 7294637, 7313023, 7531260, 7405200, 7397245, 7355036, 7582325, 7588235, 7401408, 7422394, 7448676, 7512865, 7584526, 7595981, 7456974, 7343877, 7231968, 7343428, 7510915, 7511857, 7287253, 7298644, 7325005, 7248684, 7188353, 7201297, 7119613, 7079890, 6992619, 7005676, 7070913, 7176210, 7108151, 7135362, 7167711, 7096518, 6979439, 6967453, 6991072, 7086246, 6959575, 6842908, 6754586, 6761648, 6827352, 6870853, 6757882, 6733544, 6834174, 6897424, 6825189, 6746138, 6795332, 6541355, 6614754, 6692428, 6616706, 6581391, 6580184, 6759882, 6793088, 6608314, 6596036, 6661758, 6791244, 6721682, 6639245, 6551663, 6594480, 6671546, 6477380, 6547054, 6724996, 6460671, 6394547, 6421297, 6657059, 6406340, 6239074, 6217772, 6351127, 6352206]
4606F352206k42543J42483Q6729r8868J11329q6461K066j8829k34321J31423J26658
4595F271872J38897l3171n0425j30550q1412j1998k2476L1779L8604j17101o9615
4584E964404K14140p9703j66504k7857M9135L3096j52932j4994L69270P411j38795
4573F056671j32945J36082k5191M410p5835m9969J27248K8053l4135K9404l0021
4562F033772M1331p4977j77288R485J13837K9291j77114J82715K7433j10672R6447
4551E994260n1269K4397j67948o966R4972r9845K00281k3398J10876J9071R0090
4540F184521M9831j25101o0444O7175J46403j90451j81117J72248M1568j1680
4530F092953j22922J47940K14909O7682O0062Q3628P9048j8900Q072k548K4197
$$ y = [6352206, 6109663, 6252146, 6338875, 6240007, 6351336, 6264875, 6266941, 6248112, 6013791, 6145214, 6271872, 6410769, 6377598, 6327173, 6196623, 6115211, 6103213, 6080737, 6112516, 6151120, 6034019, 5964404, 6178544, 6098841, 5932337, 5904480, 5953615, 5986711, 5833779, 5818785, 6188055, 6195466, 6056671, 5923726, 6059808, 6034617, 6039027, 5963192, 5913223, 6040471, 6068524, 6034389, 6063793, 6033772, 6075103, 6000126, 5822838, 5832323, 5946160, 5975451, 5798337, 5981052, 6008485, 5897813, 5994260, 5942991, 5967388, 5799440, 5792474, 5887446, 5787601, 5987882, 5964484, 6075360, 6094431, 6184521, 6234352, 6109251, 6048807, 6115982, 6262385, 6071934, 5890817, 6063065, 6104633, 6092953, 5970031, 6117971, 6332880, 6400562, 6460624, 6544252, 6623300, 6604400, 6612472, 6609924, 6634121]
4519F634121q1215n9130k8744k05296J37700o2193j36183k3640J48610o6530n2227
4508F205273K4906K93624O2738j9926J28740J85629L6041J85189L89312L25260
4498G816786L18097N2808k72512J22561j51015l55278k00377l82700k67970j64582
4488F515818q9825j43476n9846k14275m3519k7510j70419J10961n2863J73653
4478E998699j07129j65215J88087j42977p6289K62362m6442P7668m0665P6618
4468F024717J90175j88453J0570j59017P0130k5722m3252k3721J09649j97031
4458E768045k59808o8202P7262n8284k05616j2067K9200k9318J20148q0866j039
4447E279455J06881J18967j34114j19020K2698r7913O2497R8212q5674j91977
$$ y = [6634121, 6552906, 6493776, 6465032, 6259736, 6397436, 6335243, 6199060, 6175420, 6324030, 6257500, 6205273, 6230179, 6523803, 6586541, 6566615, 6695355, 6880984, 6917025, 7102214, 7491526, 7816786, 8134883, 8187691, 7915179, 8037740, 7886725, 7531447, 7331070, 6948370, 6680400, 6515818, 6425993, 6282517, 6222671, 6008396, 5964877, 5937367, 5766948, 5877909, 5825046, 5998699, 5891570, 5726355, 5914442, 5771465, 5695176, 5957538, 5911096, 5988764, 5948099, 6024717, 6214892, 6026439, 6037009, 5877992, 5948122, 5922400, 5879148, 5855427, 5965076, 5768045, 5508237, 5440035, 5517297, 5459013, 5253397, 5241330, 5270530, 5241212, 5361360, 5280494, 5279455, 5386336, 5505303, 5371189, 5252169, 5274867, 5176954, 5239451, 5337663, 5251989, 5060012]
4437E060012J6902K73456K6979k05616m0427J35556k75777J1783K64618o5971
4427E201515j89559J82306J85120J26418j34087j11846J38877K10505J51778M0536
4417E801563K37684L74334J36457K40169K55390n8739l89081m00955l11693j81458
4407E703671j06026m3457j10982n2434J43004K3522j59286J10872M9134j89997
4397E368021q656k9451n7573j13359J7774p1203O0380J65835o4556j01927P9507
4386E244792J3706J11449o6620N5892K4040j09273J07615K74813J63097r9983
4376E719528K39478J17096J17217m7892k86594J27270K63055m2822j68175o8352
4366E969809m6101K1660k41793k5544L8191M9640L9037j6679M4315l181k1490
$$ y = [5060012, 5076914, 5350370, 5377349, 5171733, 5131306, 5266862, 4991085, 5002868, 5267486, 5201515, 5011956, 5194262, 5379382, 5505800, 5371713, 5259867, 5398744, 5609249, 5761027, 5801563, 6039247, 6413581, 6550038, 6790207, 7045597, 6986858, 6597777, 6196822, 5885129, 5703671, 5597645, 5554188, 5443206, 5390772, 5533776, 5557298, 5398012, 5508884, 5558018, 5368021, 5359365, 5329914, 5272341, 5158982, 5176756, 5105553, 5165933, 5331768, 5267212, 5165285, 5244792, 5258498, 5369947, 5303327, 5359219, 5383259, 5273986, 5381601, 5656414, 5819511, 5719528, 5959006, 6076102, 6193319, 6145427, 5858833, 5986103, 6249158, 6206336, 6038161, 5969809, 5923708, 5945368, 5703575, 5678031, 5716222, 5765862, 5804899, 5788220, 5832535, 5829354, 5807864]
4355E807864r7168R1748J22539n4341j22364K65300M35267N1259K02002L30095
4345G032201K30295K19275K74516Q4521j11180k03738l25870j06946J1475k81995
4335F822554p2561k6138L45740l8962n8114j15252J67418J70050L8925K25293
4325G458953m1411j45675Q8688J75969k2278J27043p11j30408m4838K98231J66507
4314G930070j94743N2672L73616L01309K06718K77287N71441O89350J95928j34609
4304A0269039J85566l20526m30938l67744j98704K88433p1067l70200l7039M364
4294H951184k08271k88335j66838L7991J29906j70995m7527J92119L2369l6618
4284H424985M425M80963J602K25958M29612L90611M71938P8255K14733M47483
$$ y = [5807864, 5710696, 5802444, 5924983, 5870642, 5748278, 6013578, 6448845, 6500104, 6702106, 7032201, 7262496, 7481771, 7756287, 7840808, 7729628, 7525890, 7200020, 7093074, 7104549, 6822554, 6749993, 6723855, 7069595, 7030633, 6972519, 6857267, 7024685, 7194735, 7233660, 7458953, 7417542, 7271867, 7360555, 7536524, 7514246, 7641289, 7640578, 7510170, 7465332, 7763563, 7930070, 7735327, 7787999, 8161615, 8462924, 8669642, 8946929, 9518370, 10207720, 10403648, 10269039, 10454605, 10134079, 9703141, 9335397, 9136693, 9425126, 9354059, 8983859, 8946820, 8951184, 8742913, 8454578, 8287740, 8325731, 8455637, 8284642, 8237115, 8429234, 8461603, 8424985, 8429410, 8910373, 8911975, 9137933, 9567545, 9958156, 10430094, 10508349, 10723082, 11170565]
4274A1170565J2339m54635l87650k18096p7711l29766k32586N1865J15926j68798
4264I481453l5465M9363N9218K50479K20692K38583K13351L86080K00172K11697
4254A1275623M66240M45100M89620N54935P87125Q66694R75959J365639J698926
4245A8925861J565343J578188J265801j4259j225650j720603j453690r43294r02822
4236A7074875o84229m63637k44508p2302l2476J21664J65035k78129k20576k87155
4226A5078562j48764k18830l26487l34055j8152M0506J09023J85424P6o0147L2132
4215A4339288Q1164n586K509K04220J17211J22280N6509L91453K67314O5364J76975
4204A5818701J46161J75211K19101K33256M24821L16238K42601M0110n6879L20394
$$ y = [11170565, 11182904, 10728269, 10340619, 10122523, 10044812, 9715046, 9482460, 9534325, 9650251, 9481453, 9445988, 9495351, 9554569, 9805048, 10025740, 10264323, 10477674, 10863754, 11063926, 11275623, 11741863, 12186963, 12676583, 13231518, 14018643, 14885337, 15861296, 17226935, 18925861, 20491204, 22069392, 23335193, 23320934, 22095284, 20374681, 18920991, 17977697, 17074875, 16390646, 15927009, 15682501, 15610199, 15577723, 15699387, 15864422, 15586293, 15365717, 15078562, 14929798, 14710968, 14384481, 14050426, 14032274, 14072780, 14181803, 14367227, 14367303, 14307156, 14339288, 14420452, 14414866, 14417375, 14621595, 14738806, 14861086, 14917595, 15309048, 15576362, 15641726, 15818701, 15964862, 16140073, 16359174, 16592430, 17017251, 17333489, 17576090, 17616200, 17559321, 17879715]
4194A7879715k4063J20746L67188K58778L03550K53358L98851N60436M23233K64119
4184B0805911M64366O69861L79416M35206M59549P08819N76850K44712L29614
4175B5074304Q93931O25745P69905O82926R23280Q79480P44013P76397J078638
4166C2448619J026391J139313J190663J099519J051393J059885J054790R78565
4158D1049138J185323J096290J263299J567060J545323J835841J701922K058416
4150E3302612K285843K421728K496307K015224J630646K177736K829302L221219
4142G2380617L806661M481008M793956M962036N211015O552707Q371980J0200909
4134A20760889J2653082J6124034K0894480K7600789L5948428M7094738N8301035
$$ y = [17879715, 17855652, 17976398, 18343586, 18602364, 18905914, 19159272, 19558123, 20118559, 20541792, 20805911, 21270277, 21940138, 22319554, 22754760, 23214309, 23923128, 24499978, 24744690, 25074304, 25968235, 26593980, 27363885, 28046811, 28970091, 29849571, 30593584, 31369981, 32448619, 33475010, 34614323, 35804986, 36904505, 37955898, 39015783, 40070573, 41049138, 42234461, 43330751, 44594050, 46161110, 47706433, 49542274, 51244196, 53302612, 55588455, 58010183, 60506490, 62521714, 64152360, 66330096, 69159398, 72380617, 76187278, 80668286, 85462242, 90424278, 95635293, 102188000, 110559980, 120760889, 133413971, 149538005, 170432485, 198033274, 233981702, 281076440, 339377475]
4127C39377475N9254988L8424173q62190m0584314o3008491o2036320n0004129
4120B20561192l6557023k6523502j9791014j5045521j1780814r943226q038006
4113I2882086o827164n678501m823406m223024l745121l212370k821006k560681
4105E8990813k234431j657810j335161j029460j109939j094315r94198q75491
4097D8660008o68073j393915j859282j650734j437679j006943n62737j74976l8081
4088C9867588K32337j08999j315375j183209j237562j014551o30168k45708q9596
4079C4274757j82472m3519k20268q6258o05490n69803p15597n90081m37458m15805
4069C0408006l82879j67303p9008l65230l86050n00121j94307j10215k06926L0740
$$ y = [339377475, 398632463, 437056636, 436194446, 395610132, 332601641, 270565321, 220561192, 184004169, 157480667, 137689653, 122644132, 110863318, 100920092, 92882086, 86054922, 80376421, 75553015, 71329991, 67584870, 64372500, 61551494, 58990813, 56756382, 55098572, 53763411, 52733951, 51624012, 50529697, 49535499, 48660008, 47991935, 46598020, 44738738, 43088004, 41650325, 40643382, 40080645, 39905669, 39867588, 40099925, 39990926, 38675551, 37492342, 36254780, 35240229, 34610061, 34364353, 34274757, 34092285, 34048766, 33828498, 33742240, 33136750, 32566947, 31851350, 31261269, 30823811, 30408006, 30025127, 29857824, 29778816, 29413586, 29027536, 28527415, 28333108, 28222893, 28015967, 28046707]
4059B8046707L90690K84573j79147o41446p77203o43021o11178l37971l70766
4050B5161238m14921j45797j91631j64028m6999r1915M2642K87917J98458k77597
4040B4357367m12636k98122m21101n73907p62672o57551n24148n07357n45834
4031A9654039m89362k72039j45769j37268j02298j06868k59680l11208p3453l1754
4021A7724340n10M8806K13050N15679M78173N81472R58580J092538J369253R94424
4011B3975805M42419n99634j181172r84722p89196o53859l16117n34887k90358
4002A9068279k09944m40178n22524n88622m77193l76051k26232k34937k84476
3993A5708122j22017j65600r9592k8618q8863K9600K80649N6437J06407p0981
$$ y = [28046707, 28437397, 28721970, 28542823, 27901377, 27124174, 26481153, 25869975, 25532004, 25161238, 24746317, 24600520, 24408889, 24244861, 24197862, 24105947, 24148589, 24436506, 24634964, 24357367, 23944731, 23646609, 23225508, 22651601, 21888929, 21231378, 20707230, 20199873, 19654039, 19164677, 18892638, 18746869, 18609601, 18507303, 18400435, 18140755, 17829547, 17756094, 17724340, 17723830, 17772636, 17985686, 18501365, 18979538, 19561010, 20519590, 21612128, 22981381, 23975805, 24418224, 23818590, 22637418, 21652696, 20863500, 20209641, 19893524, 19358637, 19068279, 18858335, 18418157, 17895633, 17307011, 16829818, 16453767, 16227535, 15992598, 15708122, 15586105, 15420505, 15320913, 15292295, 15203432, 15233032, 15513681, 15570118, 15676525, 15605544]
3983A5605544m50106j81516q0684J51440J86625r5416j56254j57261L71j23535
3973A4699208j70607l6316M7625P8196J25205L58033L89566o7458J52311k6871
3963A5548892j58785j49418j64122K40990P9224J32382j62068O5146m0903l22149
3953A5069189k68708q5002L9199l6081k07744q9392M3922J64454j28827o5701
3943A4435309K24897P9006O5435l1702L26790J09951J08611J92708K04413K67944
3933A5983362m3162l0054J93983N92414O52241P42099N69407M79787P17640Q82230
3923B0739947R79864Q61862P71298L85110j78104m80140j065032j324572j192672
3914A9497561j176449j062063r82782r17865p93947m57805m53046o85903m20646
$$ y = [15605544, 15155438, 14973922, 14893238, 15044678, 15231303, 15135887, 14979633, 14822372, 14822743, 14699208, 14528601, 14492285, 14539910, 14618106, 14743311, 15101344, 15490910, 15423452, 15575763, 15548892, 15390107, 15240689, 15076567, 15317557, 15396781, 15529163, 15367095, 15432241, 15391338, 15069189, 14800481, 14715479, 14754678, 14718597, 14510853, 14421461, 14465383, 14629837, 14501010, 14435309, 14660206, 14739212, 14804647, 14772945, 15099735, 15209686, 15318297, 15511005, 15715418, 15983362, 15940200, 15910146, 16104129, 16696543, 17348784, 18090883, 18660290, 19140077, 19857717, 20739947, 21719811, 22581673, 23352971, 23738081, 23559977, 23079837, 22014805, 20690233, 19497561, 18321112, 17259049, 16276267, 15358402, 14564455, 14106650, 13653604, 12967701, 12547055]
3905A2547055k09597l29486l24936o6044k67033l23894j17630l04880l33089j11062
3895A0159404k76194j28584K9346n3841k16737j09452R1460J6789J31305K7918
3885I671414p5845j0686o4860J23353J82814M36257K33099N7628k4810j69915
3875A0358449p12209n71575k89803n02319k35587o7365r0814q4930j05703m6811
3865G651333l13596o6929M09j2469j97850k37179m7228J23193m9613l65179P9384
3854F564276M6428o2373N1576R3795O8554J01524j16883m7416J95559K69356j63249
3843G001147l7250J24450K0706j13935j30316K85265L07633K19084J98699J69
3833G875652j29761k26350n15979o3261r2331k44320j16810m9199N6844K636k00485
$$ y = [12547055, 12337458, 12007972, 11683036, 11616992, 11349959, 11026065, 10908435, 10603555, 10270466, 10159404, 9883210, 9754626, 9783972, 9730131, 9513394, 9403942, 9495402, 9512191, 9643496, 9671414, 9595569, 9584883, 9520023, 9643376, 9826190, 10262447, 10495546, 10553174, 10528364, 10358449, 9646240, 9074665, 8784862, 8282543, 8046956, 7979591, 7888777, 7803847, 7698144, 7651333, 7337737, 7270808, 7271217, 7258748, 7060898, 6823719, 6776491, 6899684, 6850071, 6484892, 6564276, 6610704, 6548331, 6599907, 6693702, 6762256, 6863780, 6746897, 6699481, 6895040, 7164396, 7001147, 6963897, 7088347, 7109053, 6995118, 6864802, 7150067, 7457700, 7676784, 7875483, 7875652, 7745891, 7519541, 7003562, 6940301, 6847970, 6603650, 6486840, 6437641, 6494485, 6497121, 6296636]
3822F296636P9352J79155p080k03148n7130L04989J5419j52952p3967J06300J11240
3811F598814k01385l08569J85720J59629L2347j1314J990L7946R5221m155J22803
3800F709047J2879J27431K57369L27253L108J51286J82089K28257J24847K65680
3790H389246N47757N44505N05578M13675N98923P68156R31882Q28358J125387
3781A4653467J020841O39849L69857R5093m32582j243915j239893q78369q03593
3772A2180755r77805r56005o11841l96926r54877m24627j34735m29295o04870
3763F689774k59486l2700l02276k89050l95076K7875o4169l35709J32394j6436
3753E155141k04377k72249n2599j26810j6678k81678l1287J9719j01120k64157
$$ y = [6296636, 6375988, 6555143, 6548063, 6344915, 6287785, 6592774, 6608193, 6455241, 6381274, 6487574, 6598814, 6397429, 6088860, 6274580, 6434209, 6466556, 6455242, 6457232, 6495178, 6590399, 6586244, 6709047, 6721926, 6849357, 7106726, 7433979, 7437087, 7588373, 7770462, 7998719, 8123566, 8389246, 8937003, 9481508, 9987086, 10400761, 10999684, 11767840, 12699722, 13528080, 14653467, 15674308, 16314157, 16684014, 16779107, 16346525, 15102610, 13862717, 12984348, 12180755, 11202950, 10246945, 9635104, 9238178, 8283301, 7858674, 7723939, 7294644, 6689774, 6430288, 6397588, 6095312, 5806262, 5411186, 5439061, 5374892, 5039183, 5171577, 5155141, 4950764, 4678515, 4625916, 4499106, 4482428, 4200750, 4169463, 4189182, 4088062, 3823905]
3743C823905n234J15624Q1192j05749k56833J01652P9830p2125o1146Q1750j63318
3732C619548M3681O3744j78832n9022j24163r4866P629J14603k83600o0314M73795
3721C522203j64074j31056j19536M0177p5924j57122p7664J89836j28679J0136
3711B908297j30369R5306J48405k26515l9922L00587J8346j44300k13222K56873
3701B973486L5548m7228m4785n4490Q0303J26012j52096j0272k6570r2221j38893
3690B648794J34979N7691r2091q2752L74969K58030p6215j36140L8742J09225
3680C235232k19302P064J6519r9862l3807J17526p4829M4189N1737j66542m9656
3669B828269q4800q8753r0839j21759K27731k5786j66877o554m8441J59952m185
$$ y = [3823905, 3818671, 3934295, 4015487, 3909738, 3652905, 3754557, 3834387, 3762262, 3701116, 3782866, 3619548, 3663229, 3726973, 3548141, 3489119, 3364956, 3270090, 3277719, 3392322, 3108722, 3048408, 3522203, 3358129, 3227073, 3107537, 3147714, 3071790, 2914668, 2837004, 3026840, 2898161, 2908297, 2777928, 2873234, 3021639, 2795124, 2755202, 3055789, 3074135, 2929835, 2716613, 2973486, 3009034, 2961806, 2917021, 2862531, 2942834, 3068846, 2916750, 2906478, 2879908, 2787687, 2648794, 2783773, 2841464, 2749373, 2666621, 3041590, 3299620, 3223405, 3087265, 3126007, 3235232, 3015930, 3022994, 3039513, 2939651, 2905844, 3023370, 2948541, 2992730, 3044467, 2877925, 2828269, 2743469, 2654716, 2563877, 2442118, 2669849, 2644063, 2477186, 2470632, 2422191, 2582143, 2577958]
3658B577958o8314J90310L9168j98550j23437P3013p3150o9163n9182J63622j6517
3647B435758J02206P4999j33753K00960q8289j05138L766j45596k22029P6458
3637B199342K89018p3689m4592J11945K23215j09639k1145O3093J08188R5867
3627B841603j93681O2775J61035q9860N0057j07895p5268R0294K23054O3140j15809
3616B909445j69477K1348Q4721p9502j99766o9553J87539O931n4758j81055j43786
3605B312087p9434J24444J97411L3050j34046j17K18101J32526k26470k54724
3595B322828k2357N0880K07537k94084L5532K73713J5632j79186J00600L8848
3585B549943l0608k3187Q4434N8849J68689k2788O1717J2584m0090R2741m9556
$$ y = [2577958, 2509644, 2699954, 2739122, 2540572, 2417135, 2490148, 2416998, 2347835, 2288653, 2452275, 2435758, 2537964, 2612963, 2479210, 2680170, 2591881, 2486743, 2490509, 2344913, 2122884, 2199342, 2488360, 2414671, 2370079, 2482024, 2705239, 2595600, 2574455, 2637548, 2745736, 2841603, 2647922, 2710697, 2871732, 2781872, 2831929, 2724034, 2648766, 2739060, 2962114, 3025254, 2909445, 2739968, 2761316, 2846037, 2766535, 2566769, 2497216, 2684755, 2691686, 2636928, 2455873, 2312087, 2232653, 2357097, 2554508, 2587558, 2453512, 2453395, 2671496, 2804022, 2577552, 2322828, 2300471, 2351351, 2558888, 2264804, 2300336, 2574049, 2589681, 2410495, 2511095, 2549943, 2519335, 2496148, 2580582, 2639431, 2808120, 2785332, 2847049, 2859633, 2819543, 2912284, 2862728]
3574B862728J40574j23267j81815J2962k7144p3924k447M943j62849J18801J2804
3563B581366q0089m2418Q1183Q3517p03o9822l1534K2896R1836P2472J07271o4167
3551B751808J52743K46457q8956j86111L8991J12805J07852l6315j28719q9814
3541B880741J13889j3227j59692M4415J88791J07924j8069k06153j79813L05032
3531C063838j07301J2803j2344M873p0916O851L2168j43093j36749k17709K33298
3520B665719L08698n760j72266j33696O9960J57180m7936j19645R0605k38654
3510B574205J48827K7093J04383j56857Q785Q2728K14107J37958o8197K5396Q0135
3499C178563J65166K4328o8757J15215M5986j8870q3365j68154m7491Q7361J11781
$$ y = [2862728, 3003302, 2880035, 2698220, 2711182, 2684038, 2610114, 2607667, 2612610, 2449761, 2568562, 2581366, 2501277, 2458859, 2540042, 2623559, 2622856, 2553034, 2521500, 2544396, 2636232, 2708704, 2815975, 2751808, 2904551, 3151008, 3062052, 2875941, 2914932, 3027737, 3135589, 3099274, 2970555, 2880741, 2994630, 2981403, 2821711, 2866126, 3054917, 3162841, 3144772, 2938619, 2758806, 3063838, 2956537, 2969340, 2956996, 2961869, 2890953, 2897804, 2929972, 2786879, 2650130, 2432421, 2665719, 2974417, 2968657, 2796391, 2662695, 2732655, 2889835, 2841899, 2722254, 2812859, 2574205, 2723032, 2750125, 2854508, 2697651, 2706436, 2789164, 3003271, 3141229, 3073032, 3098428, 3178563, 3343729, 3368057, 3299300, 3414515, 3460501, 3441631, 3358266, 3190112, 3142621, 3229982, 3341763]
3488C341763P4974k89956l1385K94859j18791j94954P8662J32714q16j20514J61652
3477C328208R2628m3630j23463Q9613J72022L2928j92808j25051K92653L06715
3467C829815j29388R447K21865J09477J8727r936L22569l1060j3654j59949j87820
3456C980093K69523j8010J9545O149K55539M6260j590K32343K5218J52858K04309
3445E172237n8999M9006K70662K23142J0582l2181K42397J63687J32292K04436
3435F377261L19019O4188J50447L13020K19107L53925O56204M75724M95747O80885
3425A0105527R37340J040973J534175J866990K482767K852241K821013Q28056
3417B4469082j660791k709973k705945k104148j460970r76723r08649o48164j99279
$$ y = [3341763, 3416737, 3126781, 3095396, 3390255, 3271464, 3076510, 3155172, 3287886, 3287070, 3166556, 3328208, 3420836, 3377206, 3253743, 3343356, 3515378, 3548306, 3355498, 3230447, 3523100, 3829815, 3700427, 3709874, 3931739, 4041216, 4059943, 4050007, 4372576, 4341516, 4327862, 4167913, 3980093, 4249616, 4231606, 4251151, 4257300, 4512839, 4559099, 4557509, 4789852, 4815070, 4967928, 5172237, 5113238, 5162244, 5432906, 5656048, 5666630, 5634449, 5876846, 6040533, 6172825, 6377261, 6696280, 6760468, 6910915, 7223935, 7443042, 7796967, 8453171, 8928895, 9424642, 10105527, 11042867, 12083840, 13618015, 15485005, 17967772, 20820013, 23641026, 24469082, 22808291, 20098318, 17392373, 15288225, 13827255, 12850532, 11941883, 11293719, 11094440]
3408A1094440o6245m5184j75503o3075R2635K18418L60231L37102K90576N23003
3398A2566398N44269O88437P04406R86144J306385J504954J720570K637213L806201
3389B6464977M568519N788248N273859J424671l577638n849246n658815m379539
3381B4055036l171135k128246j455700j103252q26075o75736m06736l31744n44926
3372A3411486l64471j0758O3991J17706k555Q9451K64159M67434L15334M36512
3362A4788289M81341O85501J012687J259457J636696K460209K796667K385506
3354B7506353P30007j588647k480509k427700j755084j228075n91130k95214k00062
3345A7669939J05461L86229Q7864j65159K0017q9869k12632o01392j37629j81789
$$ y = [11094440, 11028195, 10983011, 10807508, 10744433, 10837068, 11055486, 11415717, 11752819, 12043395, 12566398, 13110667, 13799104, 14503510, 15489654, 16796039, 18300993, 20021563, 22658776, 26464977, 31033496, 36821744, 42095603, 43520274, 39942636, 34093390, 28434575, 24055036, 20883901, 18755655, 17299955, 16196703, 15370628, 14694892, 14288156, 13956412, 13411486, 13047015, 13036257, 13100248, 13217954, 13215399, 13304850, 13569009, 14036443, 14351777, 14788289, 15269630, 15955131, 16967818, 18227275, 19863971, 22324180, 25120847, 27506353, 28236360, 26647713, 24167204, 21739504, 19984420, 18756345, 18165215, 17870001, 17669939, 17775400, 18161629, 18249493, 18084334, 18104351, 18014482, 17801850, 17200458, 17062829, 16881040]
3335A6881040m23808k81341j58172J18985J86345K36238K11265K67401K2795n9610
3325A7001138L77427N16032L97577K96173M98850M59467M19271L53184L81401
3316B0700520M45657N02834O36568P00239Q07644N94879Q80154J011336J654844
3307B7934675J719508J615438K283865K211304K648694K784711K725167K962873
3299D6886235L356705L951146N608054P636480J0575183J4300736J8775235K2916101
3291A34005875J8761828J063377j7361939k2834058k0457068j4876282r872576
3284F8429157o627534m787217l358018k354310j586389j040106m32100k59948
3276D7983535J78608Q52964J584686J505970J760235K292996L011367M189238
$$ y = [16881040, 16457232, 16175891, 16017719, 16136704, 16323049, 16559287, 16770552, 17037953, 17060748, 17001138, 17378565, 17894597, 18292174, 18588347, 19087197, 19546664, 19965935, 20319119, 20700520, 21146177, 21649011, 22285579, 22985818, 23793462, 24388341, 25268495, 26279831, 27934675, 29654183, 31269621, 33553486, 35764790, 38413484, 41198195, 43923362, 46886235, 50242940, 54194086, 59802140, 67438620, 78013803, 92314539, 111089774, 134005875, 152767703, 153831080, 136469141, 113635083, 93178015, 78301733, 68429157, 61801623, 57014406, 53656388, 51302078, 49715689, 48675583, 48243483, 47983535, 48162143, 49015107, 50599793, 52105763, 53865998, 56158994, 59170361, 63359599]
3268F3359599N942336Q572514J1938170J6009502K0571704K0951828Q700877j1471488
3260A44575042k2037383k2143325j7095033j1942323q741811o260512m738800
3253E1615855l467388k916732k223557j746647j532407j264627r35355m96405
3245C7032737j96069o2341J66255M68062N81175J70620L01827k33934r53667j655586
3235C5619079k096821k267449j860762j926087j540896r49414j037478j031473
3227B2908699r91564p78336r07406r10063p63409o34557m14538n81415l83704
3218A6543707n60763n08289l32966j81050l99769l24352k91598k33941k4913J1165
3208A3697231n9764j3061J91533k10289J0184L71427K2561J52435L53286N95637
$$ y = [63359599, 69301935, 77874449, 89812619, 105822121, 126393825, 147345653, 156046530, 144575042, 122537659, 100394334, 83299301, 71356978, 62615167, 56354655, 51615855, 48148467, 45231735, 43008178, 41261531, 39729124, 38464497, 37529142, 37032737, 36836668, 36774327, 36940582, 37408644, 37989819, 38160439, 38462266, 38228332, 37274665, 35619079, 33522258, 31254809, 29394047, 27467960, 25927064, 24977650, 23940172, 22908699, 21917135, 21138799, 20231393, 19321330, 18557921, 17923364, 17508826, 16927411, 16543707, 15982944, 15474655, 15141689, 14960639, 14560870, 14236518, 13944920, 13710979, 13686066, 13697231, 13637467, 13624406, 13815939, 13605650, 13615834, 13987261, 14009822, 14162257, 14515543, 15111180]
3198A5111180K52025M45424M15656P8443k56391k47168l30465l54372l2427J29411
3188A5211316K44392N46001J058282J719597K507793L127550J895958q68669k686676
3179B2755544l207677k671058j863348j396238p29635m35059l83478j30303j43462
3170A1795286N3105L5887j83814k12824l44235o9756j23923J45853L71615J33821
3160A1601015P45346R42049J348217J843429K517074K801133J320620j414406
3152B1704477k893444k946900k451719j763954j085843q18942o29137l93731j79323
3143H541484k72005k37885l70349l43613j07622m55824n81610k84817l5963k12327
3133E639469k20541J2472k02727l53801K5153K214k6857j33251j82220m0876m0113
$$ y = [15111180, 15363205, 15808629, 16224285, 16302728, 16046337, 15799169, 15468704, 15114332, 15081905, 15211316, 15455708, 16001709, 17059991, 18779588, 21287381, 24414931, 26310889, 25442220, 22755544, 19547867, 16876809, 15013461, 13617223, 12887588, 12452529, 12069051, 11938748, 11795286, 11848391, 11884278, 11700464, 11487640, 11143405, 11073649, 10949726, 11095579, 11467194, 11601015, 12346361, 13288410, 14636627, 16480056, 18997130, 21798263, 23118883, 21704477, 18811033, 15864133, 13412414, 11648460, 10562617, 9743675, 9114538, 8720807, 8541484, 8269479, 8031594, 7661245, 7317632, 7210010, 6754186, 6172576, 5887759, 5851796, 5639469, 5418928, 5431400, 5228673, 4874872, 4900025, 4902239, 4875382, 4742131, 4559911, 4519035, 4478922]
3122D478922k09501k61810j51314K5420N5074j83560r6293N600j50995j48931
3112C362612N0569l4831l0625k29837J3946K51354q3602k45284j22671K14077
3102C145708K02399j18089l65807K7527J26508m0999J42171l3980J3170k92245
3092B806363j54765K8500Q5955o8738p7781l250j40514j93237k9540Q1965J15656
3081B450614J03710k15076l6768l659N1842k91663M9594J44136o2985Q4978J40603
3070B415326J7362j11934j06712Q407J97202L456n0390N3906L6075j18640p7719
3059B266339k30796o6922k5284q2364J12189j5024R5033k1927k75155l7150k9140
3048A689799k0408n0057J27323P9877m9037J8245q886J57199o5678r7595o3174
$$ y = [4478922, 4269421, 4007611, 3856297, 3881717, 3936791, 3753231, 3656938, 3662538, 3511543, 3362612, 3413181, 3378350, 3347725, 3117888, 3131834, 3383188, 3299586, 3054302, 2931631, 3145708, 3348107, 3230018, 2864211, 2891738, 3018246, 2977247, 3119418, 3085438, 3098608, 2806363, 2651598, 2680098, 2766053, 2697315, 2619534, 2616284, 2475770, 2282533, 2252993, 2334958, 2450614, 2554324, 2339248, 2302480, 2298821, 2350663, 2059000, 2108594, 2252730, 2189745, 2274723, 2415326, 2432688, 2320754, 2214042, 2222449, 2419651, 2423107, 2372717, 2426623, 2462698, 2344058, 2266339, 2035543, 1968621, 1943337, 1860973, 1973162, 1958138, 2053171, 2031244, 1756089, 1718939, 1689799, 1669391, 1619334, 1746657, 1826534, 1777497, 1795742, 1786856, 1944055, 1878377, 1780782, 1717608]
3037A717608p4644K2470j07619J72213L0023m736j45916N8517K08231N9440k9464
3026A906123j97189K9064k4036M5929r229R9205K40810j70316j58136p078J2386
3015A767533J05929O4878r4281K8215l1897m9261j11832K64877J04779j09006
3005A939934p5138J67850J84595j30752N5729J61212k1537m8708N372K274j2230
2994B228601j04759L9464q1157P2998j10976P5632j0326P0976j18058j40519J72622
2983B094498r2601j20121k05365l6223K61344J06145K43424K9677J3646P5484
2973B369908J38597J8663N9976P5711j83283n6996j43038j34502K66615J8542
2963B430193O1228L3567l0257r0298j28253l2942J69355o2456j81229O3917N0932
$$ y = [1717608, 1642964, 1665434, 1557815, 1730028, 1760051, 1755315, 1609399, 1667916, 1876147, 1935587, 1906123, 1708934, 1737998, 1713962, 1759891, 1750662, 1849867, 2090677, 1920361, 1762225, 1755147, 1767533, 1873462, 1938340, 1844059, 1872274, 1840377, 1791116, 1679284, 1944161, 2048940, 1939934, 1864796, 2032646, 2217241, 2086489, 2142218, 2303430, 2281893, 2233185, 2238557, 2240831, 2228601, 2123842, 2163306, 2082149, 2155147, 2044171, 2119803, 2109477, 2180453, 2062395, 1921876, 2094498, 2001897, 1881776, 1676411, 1640188, 1901532, 2007677, 2251101, 2280778, 2294424, 2369908, 2508505, 2527168, 2587144, 2662855, 2479572, 2422576, 2279538, 2145036, 2411651, 2430193, 2491421, 2524988, 2494731, 2404433, 2276180, 2243238, 2412593, 2350137, 2168908, 2232825, 2283757]
2952B283757j80038j5590P4571r5178O424j94011J33787J14606m1782N3393j7550
2941B122389J04847p0026J90454O6682k45963O0696M9814l4668K72911j9470m1556
2930B456110J46335O83k223M5917J33996N0708m1069j2705J32601j22920L8636
2919B826069j1035P6336j46090k88631R0139K85513O8206j17695r8169R9203K7273
2908B811119j3809p4905J58232J63224j07196L8810K19607R9009Q80K33252J85522
2897C713745l445J29467M2204M0669j78323m08799j77363k7710p0194p3652r3060
2886B893539K4813j32565O4188O6441P1255j47184Q4905J86096j65489q6666j12117
2875B747216J48981J85614L6925J61034J34105K5089k38411k88948J27681J50937
$$ y = [2283757, 2103719, 2088129, 2162700, 2067522, 2073946, 1879935, 2013722, 2128328, 2086546, 2139939, 2122389, 2227236, 2157210, 2347664, 2414346, 2168383, 2229079, 2278893, 2244225, 2517136, 2497666, 2456110, 2602445, 2603128, 2600905, 2646822, 2780818, 2831526, 2790457, 2777752, 2910353, 2787433, 2826069, 2815034, 2891370, 2745280, 2456649, 2546788, 2832301, 2900507, 2782812, 2684643, 2783846, 2811119, 2797310, 2722405, 2880637, 3043861, 2936665, 2975475, 3195082, 3294091, 3294971, 3528223, 3713745, 3710300, 3839767, 3881971, 3922640, 3744317, 3335518, 3158155, 3130445, 3060251, 2986599, 2893539, 2918352, 2785787, 2849975, 2916416, 2987671, 2840487, 2925392, 3111488, 2945999, 2859333, 2747216, 2896197, 3081811, 3118736, 3279770, 3413875, 3438964, 3200553, 2911605, 3039286, 3190223]
2865C190223p2647r1723k16595J90221j6932m14041p6320R2625J1670j85974m2368
2854B368139Q4192J26431l66131N896P3059J42396l58716K6795J44260j82590
2844B063731n6410R9767M7571L0347j97634k54783j5411M1252j48404q5347j12144
2833A412535j13580j39370j07949K06860j61643P073m8128l1278k8449L90834
2823A386905k58806l5791k59766J68187Q4283j80793M317m8731O622K19105O3927
2812A149459r4390k71443j01784J16506J33167J80262k26218j73889J5106r011
2802G17765j59116K20791j8108J20973j002j07494j01294J01060j15823N9006
2792G16758j72372K50782j34602K2475m3459j19414K9670q8472R7888n4483j22888
$$ y = [3190223, 3117576, 3025853, 2809258, 2999479, 2982547, 2568506, 2492186, 2584811, 2596481, 2410507, 2368139, 2452331, 2578762, 2212631, 2218527, 2291586, 2433982, 2075266, 2102061, 2246321, 2063731, 2007321, 2107088, 2154659, 2185006, 1987372, 1732589, 1717178, 1758430, 1610026, 1524679, 1412535, 1298955, 1159585, 1051636, 1258496, 1096853, 1103926, 1055798, 1024520, 996071, 1386905, 1128099, 1092308, 832542, 1000729, 1085012, 904219, 908536, 859805, 866427, 1085532, 1149459, 1055069, 783626, 681842, 798348, 931515, 1111777, 885559, 711670, 726776, 717765, 558649, 779440, 761332, 882305, 881303, 773809, 672515, 773575, 657752, 716758, 544386, 795168, 660566, 683041, 639582, 520168, 549838, 461366, 559254, 504771, 381883]
2781C81883J5142K81033r4193j13660j8166K37834p9226j72762k1349m5635m5523
2770C25378q9251L4974K08865K39330k30619J30356O0628K8543j60424k62491
2760B85289J6140J46847j52189j7666K60067M0239n3390l3414R2147p5929j63180
2749C44961N7126J48307j08192M2203k73986J74859p5861k40970P8890P0807J7814
2738B35958R0535P4566Q2418k14184J85315J36224q9676M1018k3660k5836m5775
2727D46903j5445r4748K143j5684L2630M8923J13859j06845J5829P468k6492q0890
2715C27651l1143j85606K94179N5375j64058j99363N6878K93200l68221q691J54411
2704B24612K57243n5478j31029N2168j0958l5970K06406j57576j39843k19989
$$ y = [381883, 397025, 678058, 583865, 470205, 452039, 689873, 610647, 437885, 416536, 370901, 325378, 236127, 271101, 479966, 719296, 488677, 619033, 679661, 708204, 547780, 285289, 301429, 448276, 296087, 278421, 538488, 578727, 525337, 491923, 584070, 508141, 344961, 402087, 550394, 442202, 484405, 210419, 385278, 309417, 68447, 147337, 218144, 235958, 326493, 401059, 483477, 269293, 454608, 590832, 501156, 542174, 518514, 492678, 446903, 431458, 336710, 338853, 323169, 355799, 404722, 518581, 411736, 427565, 435033, 408541, 327651, 296508, 110902, 405081, 460456, 296398, 97035, 153913, 447113, 78892, 70201, 224612, 481855, 426377, 295348, 347516, 336558, 300588, 506994, 349418, 209575, -10414]
2694a0414J40728K06429N6962j78427m8537P0392J06211j42252O7868Q2128l3308
2683C17780j26928k13511J27777j5242l067j21626M871L64686J0635K6065J95295
2672E66735j00585j75769R1589Q4806k72388m2119J47486J77927j59494J3542
2662C31730j40980j70157j22377K10668J33673j4271l1822j84272J55119N7385
2652B24696J05977J62768k08389J34641L8025m6828j15729k0690K20833p5156
2642D20148j49696j02747p1275J76662M3116n1969p8537J48668q3656M0045J05932
2631C96691Q3100q6945j55813k8724P1432k8513L1784j95686J86307R5618p4121
2620B95130r9847Q7623J44880j03143R3112o4447P8154n5331k8923j21156P1680
$$ y = [-10414, 130314, 336743, 393705, 215278, 166741, 237133, 343344, 201092, 268960, 351088, 317780, 190852, -22659, 105118, 89876, 86809, -34817, -29946, 334740, 345375, 371440, 566735, 466150, 290381, 381970, 466776, 194388, 152269, 299755, 477682, 318188, 331730, 190750, 20593, -101784, 108884, 242557, 228286, 196464, 12192, 167311, 224696, 330673, 493441, 285052, 419693, 457718, 410890, 295161, 274471, 495304, 420148, 270452, 167705, 96430, 273092, 316208, 264239, 185702, 334370, 250714, 290759, 396691, 479791, 392846, 237033, 208309, 279741, 251228, 283012, 87326, 273633, 369251, 295130, 195283, 282906, 427786, 324643, 417755, 353308, 431462, 376131, 347208, 226052, 297732]
2609B97732j23104j16483L06772R2900j50060P0118O6071L3085j23280o5203J13263
2598D01811l0119p0621J18423N1050K6806k28662k12628K60108L1668P7104o8209
2587C56731p9793O9266L6414k8132Q8364J10363j55144Q8100k57674K1550M8082
2576B98127K1177M6746q5638J31425l6407j34073R532l2454K6167j05593P7953
2565B16962q9922R9129M8609l2548R5422l0809j90205K7365K6605o1713J4220
2554A23115J43139J428p4412P355q8750K62892R2375k23729N536K1683O3257r1641
2542B42248n7197J24739j33544P6391r6699r4037R6954J06732p8441J00402O9191
2531C56739n6581o9148J52076J03472j37374j5707K2880o307k5959j43944l350
$$ y = [297732, 174628, 58145, 364917, 457817, 307757, 377875, 443946, 477031, 353751, 288548, 401811, 371692, 301071, 419494, 470544, 497350, 268688, 56060, 316168, 347836, 424940, 356731, 276938, 346204, 382618, 354486, 442850, 553213, 398069, 486169, 228495, 250045, 298127, 319304, 366050, 280412, 411837, 375430, 241357, 250889, 218435, 244602, 139009, 216962, 127040, 226169, 274778, 242230, 337652, 306843, 116638, 144003, 170608, 108895, 123115, 266254, 267682, 193270, 200625, 111875, 374767, 467142, 243413, 248949, 270632, 333889, 242248, 185051, 309790, 176246, 252637, 155938, 61901, 158855, 265587, 187146, 287548, 356739, 300158, 231010, 383086, 486558, 349184, 333477, 356357, 350050, 324091, 180147, 176797]
2520A76797J25782k50401J31584q0725K0609K0926j33083J51324R2735k01898
2510E3650o4026R7024L7448j13540j5239j6902q028L9888P63J14793m0751o4157
2498B0923J22338R5937m631l2673j65906J08259l9331N3780j12386J59065J14362
2487C19737j6535j22413j89041P6176m964j85312L22J82487M7152o2703r9738
2476e4832j48211K36332P6167j60592Q0883j02225j37237o0089R1101J96137m6200
2465b8766j54531L3653L96878j0372j59954j4019K4407l1071j47371Q8742J39977
2454A37573r1049o2353m1200J96989N4528j73145r6936K45572l962p6511r4808
2443e302l4670K75637j82797j12762J67681K7151j16011N5355K2457n2894j96899
$$ y = [176797, 302579, 52178, 183762, 103037, 123646, 144572, 11489, 162813, 255548, 53650, -10376, 86648, 124096, 10556, -4683, -21585, -29613, 10275, 11038, 125831, 85080, 20923, 143261, 239198, 234567, 201894, 35988, 144247, 104916, 158696, 46310, 205375, 319737, 303202, 180789, -8252, 67924, 62960, -122352, -122030, 60457, 107609, 44906, -54832, -203043, 33289, 109456, -51136, 29747, -72478, -209715, -269804, -178703, 17434, -28766, -183297, -149644, 247234, 236862, 76908, 62889, 87296, 56225, -91146, -2404, 137573, 46524, -15829, -57029, 139960, 194488, 21343, -75593, 169979, 166017, 89506, -5302, -39972, 235665, 52868, -59894, 107787, 134938, 18927, 74282, 96739, 43845, -153054]
2432a53054j0077L4979J60290j02821k9523K70740n7399o1451L1913j00079J29975
2421A13493L189j03823K73161N4035j39094j76178J2107J95228j37110m04981
2411c09973J84069K85093o2174j58108J96993K77166j95037j1709q4451M3319
2401A65188K1124q5514j32333R8621Q2223R990J7494q1239j04716J4185j9823
2390a4800Q693K0172o1927K0455M3789R5596O0454j25830J07373k23399j2913
2379h2337J41802J28582Q1773q0458j93662j64355N2044J60781J44792K5664r9007
2368A15619K05935n5049n9496J37512j50869N0869J24148j50111M3506J00083
2358C62147j72675q3177o9871k227K08990J7754k88963R9059J28062P2208j34093
$$ y = [-153054, -163131, -128152, 32138, -70683, -100206, 170534, 113135, 51684, 83597, -16482, 113493, 116682, 12859, 286020, 340055, 200961, 24783, 36890, 232118, 95008, -309973, -125904, 159189, 97015, -61093, 135900, 413066, 218029, 206320, 121869, 165188, 186312, 100798, -31535, 67086, 149309, 159299, 176793, 95554, -9162, 5023, -14800, -6107, 14065, -47862, -27407, 16382, 111978, 172432, 46602, 153975, -69424, -82337, 59465, 188047, 269820, 189362, -4300, -168655, -116611, 44170, 188962, 214626, 115619, 321554, 266505, 207009, 344521, 193652, 244521, 368669, 218558, 262064, 362147, 189472, 106295, 36424, 34197, 243187, 260941, -28022, 71037, 199099, 271307, 137214]
2347A37214K6504J13299q9843k02035K68953L1248J03038k0569k28448j3645P1021
2336A96737j66296o7663R2655o3241l11430J61401J33043J26639p6349q4986M5677
2325a3813J79652J84403l9824J7582n8308p9168j76534o203p684l905k2053Q2334
2313E6479l3291O0032j02822J49141O7616j61042o2661l6252J3190J42903Q8723
2302A82016N838p5714o4676n5307J92238N9596N6169J23250K5948l5642l04553
2291A09163j34402Q3979J15392J93429M8646r5909l9296j61756J163J38923K5496
2280B84828j05481j38727K12480o6738m6887K69157j21584J9227q0382j36084
2270H9809J43507j51712m1384K5418K00248K8487n2106j7557j55852J58067j08913
$$ y = [137214, 163718, 277017, 187174, -14861, 254092, 285340, 388378, 367809, 139361, 125716, 196737, 30441, -37222, 55433, -7808, -319238, -157837, -24794, 101845, 25496, -59490, -13813, 165839, 350242, 310418, 328000, 269692, 190524, 13990, 7787, 103, -3802, -25855, 56479, 23188, 83220, -19602, 129539, 197155, 36113, -26548, -62800, -49610, 93293, 182016, 187854, 112140, 47464, -7843, 184395, 243991, 300160, 423410, 449358, 413716, 109163, -25239, 58740, 174132, 367561, 416207, 320298, 281002, 119246, 120409, 259332, 284828, 179347, 40620, 253100, 186362, 139475, 408632, 287048, 306275, 225893, 89809, 233316, 81604, 40220, 65638, 265886, 294373, 242267, 224710, 68858, 226925, 118012]
2259A18012j36752J10107L31990m4751N8980r2340k29594M5825M0395j105n321
2248A95446J44825Q2033r4276L261P957q9975J9127J42187j96380J4941J75992
2237D05138L184j00305o3339m4328M0651O4029o7072o731k2503o028J38218J20983
2225D61897J5967j5835k61409J36824J11253o44J13310j23805L6075J88094j66654
2214D95073j26459M5979K44982j21676k2331r0334M4894L05916j37526j44609
2204D93909J23163j07329k38626q2J95154K21585N3932j11469J56574J01967j01655
2193G87123k83616J28539K71098j75719O3897j7791Q9240Q4692j72990n2162L8663
2182G60974Q9779M9422J39639J6419j84563K4245J46852K63976O9871J43801Q712
$$ y = [118012, -18740, 91367, 423357, 378606, 437586, 345246, 115652, 161477, 201872, 200767, 195446, 340271, 422304, 328028, 331289, 339246, 249271, 268398, 410585, 214205, 229146, 405138, 408322, 308017, 244678, 200350, 241001, 305030, 237958, 231227, 208724, 202696, 340914, 461897, 477864, 462029, 200620, 337444, 448697, 448053, 561363, 437558, 473633, 661727, 495073, 368614, 414593, 659575, 537899, 515568, 425234, 470128, 776044, 638518, 493909, 617072, 509743, 271117, 271035, 466189, 687774, 741706, 630237, 786811, 888778, 787123, 503507, 632046, 903144, 727425, 791322, 773531, 862771, 947463, 774473, 722311, 760974, 850753, 900175, 1039814, 1056233, 871670, 895915, 1042767, 1306743, 1376614, 1520415, 1529127]
2171A529127j63939Q3048p4523J01206P0046K7095j73311J67138Q0363k22335
2161A423915J04259L9508J77932o9383j7493J77282M6602L6858k8359K67881J9158
2150B178160k4598J06321K24859J01043M8715m0440M7834M47680r238O105Q600
2139C095041L18461J64164r5784o686K22303J34481J09383j4365M14932L48294
2129D690224J33654J09671l9692J64317L8131O5208K46892L56471L85798K18085
2119F368759L64162N08208M12322K91598P06575R01089J157312R86055L31894
2110A2027974M13866O39579O96000J256874J752397K113816K809020L531698N045055
2101C0286279O881193Q995349J2632004J3804443N722554q507936j4268788j2984887
$$ y = [1529127, 1365188, 1448236, 1373713, 1474919, 1544965, 1572060, 1398749, 1565887, 1646250, 1423915, 1528174, 1567682, 1745614, 1676231, 1658738, 1836020, 1882622, 1919480, 1891121, 2159002, 2178160, 2153562, 2259883, 2484742, 2585785, 2634500, 2594060, 2641894, 3089574, 3080336, 3086441, 3095041, 3413502, 3577666, 3481882, 3475196, 3697499, 3831980, 3941363, 3926998, 4341930, 4690224, 4823878, 4933549, 4893857, 5058174, 5096305, 5161513, 5408405, 5764876, 6150674, 6368759, 6732921, 7241129, 7653451, 7945049, 8651624, 9552713, 10710025, 11696080, 12027974, 12441840, 13081419, 13777419, 15034293, 16786690, 18900506, 21709526, 25241224, 30286279, 37167472, 46162821, 58794825, 72599268, 78321822, 69813886, 55545098, 42560211]
2093D2560211r357367o319025m744252l187906k591258j897153j605070r74829
2085A1883351o81467m69752l09274m33004p17684p98377o11669o09365n90661
2076F662098n59699m16083m0629l69576j1267k94738m42669k91247j25914j70513
2066C939763j51326k46426j64790j09055l6780k58545j96965r6868L5919k58677
2056B456250j99776K46605k59188k84177p4127k10308K33803K6725o8834j05972
2046A761001K5716m2795m7515O7808j90530O6294o6448m7425n4038N5221n1540
2035A475749k56572K8996K8437L8493J43482l9211j83736l383N4570m2384j91073
2024A053368N6389n0579j29361J74678L7752k10012p4931m7268J9827j31855n479
$$ y = [42560211, 33202844, 26883819, 22139567, 18951661, 16360403, 14463250, 12858180, 11883351, 11201884, 10732132, 10422858, 9989854, 9272170, 8473793, 7862124, 7252759, 6662098, 6102399, 5686316, 5645687, 5276111, 5264844, 4970106, 4527437, 4236190, 4110276, 3939763, 3788437, 3542011, 3377221, 3268166, 3231386, 2972841, 2775876, 2679008, 2714927, 2456250, 2256474, 2503079, 2243891, 1959714, 1885587, 1675279, 1909082, 1935807, 1866973, 1761001, 1786717, 1743922, 1696407, 1764215, 1573685, 1639979, 1573531, 1526106, 1472068, 1527289, 1475749, 1219177, 1248173, 1276610, 1315103, 1458585, 1419374, 1235638, 1232255, 1286825, 1244441, 1053368, 1109757, 1059178, 929817, 1104495, 1142247, 932235, 857304, 810036, 829863, 698008, 692529]
2013F92529J51123J55729j93138j94422j3366K70552P3562k23807r2359J91591
2003H17994l6011j90527k6313l8142l4941l0610P9975J72525L0348k56279Q2754
1992E70773J44315j74187m00731K27554J98684k17685j50941J34706J27704k7315
1982D32877k23133P9961P9412J24372k34564n3346K05805M8789j32334j5101J01234
1971D13972K4088l04677R0663M969K45041k15357p2547J24487q2073l7362j22768
1960F8436J19279q9045J0996J08714J7135Q6784l1162r6603k93695K25397J90707
1949C16943j00375M11j17453J77002J30171l5326j43069r9036J22315M1135p8169
1938B14549M8850M2403m6887k39894Q721J10759J85582n1279j61175J20422K49005
$$ y = [692529, 843652, 999381, 806243, 611821, 598455, 869007, 942569, 718762, 626403, 817994, 781983, 591456, 565143, 527001, 492060, 461450, 541425, 713950, 744298, 488019, 570773, 715088, 540901, 140170, 367724, 566408, 348723, 197782, 332488, 460192, 432877, 209744, 289705, 369117, 493489, 258925, 205579, 411384, 460173, 327839, 312738, 413972, 438060, 133383, 224046, 229015, 474056, 258699, 186152, 310639, 228566, 191204, 68436, 187715, 98670, 109666, 218380, 235515, 322299, 291137, 194534, -99161, 126236, 316943, 216568, 216979, 99526, 276528, 406699, 371373, 228304, 129268, 251583, 292718, 214549, 263399, 305802, 258915, 19021, 27742, 138501, 324083, 272804, 111629, 232051, 481056]
1927D81056j79119r2241o1894J29534n7312N8157j21109k9810k5804l31265J49517
1916h0290K06164M416k28427j80508K58635J95069j07213J72145J07511o9425
1906B78077k35970r8242J66961K28071q6625j31289J7076L3201R598j60637J59280
1895A79501J92341j274j70588o4802O3351j70995m4571j10446R3993K6417j2756
1884a9829Q4891j33699p586j53179K07755J85582k1147N5307L3935J912j48741
1873H5201N0954K4568p4085K2164l7443L089o3051m1384K22934J01335K5762o8885
1861B51159j14148K23161j19439q5935L1072j812j0731k31920L761J72621l1887
1850H5902j00630J00173m2951j0048l3945M6921J37536k22905J18317J30820q553
$$ y = [481056, 301937, 209696, 147802, 277336, 220024, 278181, 157072, 127262, 101458, -229807, -80290, 125874, 130290, -98137, -278645, -20010, 175059, 67846, 239991, 347502, 278077, 42107, -56135, 110826, 338897, 252272, 120983, 138059, 171260, 180858, 20221, 179501, 371842, 370568, 199980, 135178, 198529, 27534, -17037, -127483, -33490, -7073, -19829, 65062, -68637, -76223, -229402, -21647, 163935, 142788, 198095, 232030, 233942, 85201, 136155, 160723, 86638, 108802, 71359, 74448, 11397, -29987, 192947, 294282, 320044, 251159, 137011, 360172, 240733, 154798, 185870, 184058, 173327, -58593, -54832, 117789, 85902, -14728, 85445, 42494, 32446, -1499, 45422, 182958, -39947, 78370, 209190, 200637]
1839B00637j77241L8386K4421J64664k63545l9730J08048Q563K20470J06011J03049
1828D93733o1177k7978l4837j48434j17252L0254J04731l7117j39490R6260J5466
1817A74159l9642j22887j92731Q9581J56407n1174r086J19526O4410j18759Q5236
1806A55040J84405M9666j77450k49505J43012J13162j63770p8355K82718P0215
1796C29138l72615k7513J28404j24278L8255J29809J32684l5837j52865j25464
1786h0282N6125J08103k73548j51403J76741L10011r5936j49734K55788K62713
1776D18578l82098j03000J04780M18331j80440r3467J98567k2310k64560l22480
1766b28099N0819O8776J67170n3527J2200J76731J3033j42975j92285J24921K40991
$$ y = [200637, 23396, 61782, 86203, 250867, -12678, -52408, 55640, 64203, 284673, 390684, 493733, 432556, 404578, 369741, 221307, 104055, 134309, 239040, 201923, 62433, 158693, 174159, 134517, 11630, -181101, -91520, 64887, 13713, 4627, 124153, 188563, 69804, 155040, 339445, 389111, 211661, -37844, 105168, 218330, 54560, -23795, 258923, 329138, -43477, -70990, 57414, -66864, -28609, 101200, 233884, 198047, 45182, -80282, -24157, 83946, -189602, -341005, -164264, 145747, 49811, -99923, 155865, 418578, 36480, -66520, 38260, 456591, 276151, 182684, 381251, 358941, 94381, -228099, -177280, -108504, 58666, 5139, 17339, 194070, 207103, 64128, -128157, -3236, 237755]
1755B37755j75806j96714J87926P0J15859J4477l1583P7584j14195j53114l497
1744d1238J77393k39236k03975J66210K33369r7955j16452q3600N3061J51917
1734e06n3613J00836R1483R88k15050j5916K23780L2514j77353j57254l6943J82218
1722b4816k8356m9043K0996K07362j60852j18577J3125l2243J64551k6086m8495
1711h2434N1884J3942l8295O2898P9988n1186p8235N2527p3585J81030n8845j09828
1699e0139J96412m0551r686k8078k5664K0777j37307M3234L3604J90246j15308
1688G7540Q8412j12298J591j21188J21204Q5737j96164J6821J40530n8946q4379
1677d1140J38384k3527j49089k22354k2010J34399J05599p194o4496J75648J5389
$$ y = [237755, 61949, -134765, 53161, 53231, 169090, 183567, 151984, 229568, 115373, -37741, -41238, 136155, -103081, -307056, -140846, 92523, -5432, -121884, -205484, -152423, -506, -54119, 46717, 138200, 139188, -75862, -91778, 132002, 164516, -12837, -170091, -207034, -24816, -53172, -102215, -81219, 126143, -34709, -153286, -140161, -172404, -7853, -33939, -82434, -30550, -16608, -54903, 7995, 87983, 36797, -41438, 11089, -62496, 118534, 59689, -50139, 146273, 105722, 96036, 67958, 42294, 63071, -74236, -31002, 2602, 192848, 77540, 165952, 53654, 55245, -65943, 55261, 140998, -55166, -38345, 102185, 43239, -41140, 97244, 73717, -75372, -297726, -319736, -185337, -79738, -86932, -151428, 24220, 39609]
1666C9609p0347L9084J79835k9692k07393J54663O0008j13619M2073n9048o8501
1655c3328j71541n0768L4971N5260O9533J4307R2572O3814r7389o633N3142j95377
1643a71437J30045q3200J32047k7517o6131J62896N2943p0336m1004j01406J083
1632h2017O528j3459J29825m6311L7123j17467P4766M1024j62068p2550J60150
1621d4456L4170j90880J08907M3424M2035q0746j45170J62802l086J6453Q1475
1610B4928k1355J04245l11926j32541O3214J28480K00643J5676j61384L3918J87594
1599A31492n9486j37337P4775O5443k26105J08138k8714K6384J06349N3430j2772
1588A01597j12253L2757o0352k12588J13859R1256k0628K00976J05711j3268k21708
$$ y = [39609, -30738, 8346, 188181, 158489, -48904, 105759, 165767, 52148, 94221, 35173, -33328, -204869, -255637, -220666, -165406, -95873, -81566, 11006, 74820, -22569, -29202, 23940, -171437, -41392, -124592, 7455, -20062, -86193, 76703, 129646, 59310, 18306, -83100, -82017, -75489, -88948, 40877, -5434, 31689, -85778, -11012, 30012, -132056, -204606, -44456, -10286, -201166, -92259, -48835, -6800, -87546, -232716, -69914, -73000, -56547, 24928, 3573, 107818, -204108, -336649, -273435, -144955, 55688, 71364, -90020, -56102, 131492, 72006, -65331, 9444, 74887, -151218, -43080, -71794, -45410, 60939, 114369, 101597, -10656, 22101, -38251, -250839, -136980, -45724, -66352, 134624, 240335, 227067, 5359]
1577E359J17135j8888q7207P2020j18897M3465P8975r6883l9521N6020M282m2255
1565b6395L4860p4639L6015L1946p8530j9198J53959J2914j12477Q511M6806j42016
1553a28244k2183R8578j77672j6240K55847R6930m5390l6268o1649l4981o8300
1542a39572l8157K0339J25999O0521j25859l9136J79027l9424k4599l0880K30312
1531A78571j50926k79425J87834J39631L8019j47917N1009R2761J23276m7423
1521A85410k29754J21004J20006k34021L9783J34634k8763p2802N5282M8359j10418
1510B8720j640p714k2264O5348M3600J55755k33957o3887J44770J97230m2284
1499B63677q6727p0817j26513J44719O524k4126j15336j60070l6070J78100J39229
$$ y = [5359, 122494, 103606, 16399, 88419, -30478, 12987, 91962, -4921, -44442, 11578, 15860, -26395, 8465, -66174, -30159, 1787, -76743, -95941, 58018, 70932, -41545, -33034, 13772, -128244, -150427, -51849, -229521, -245761, 10086, 107016, 61626, 25358, -36291, -71272, -139572, -177729, -157390, -31391, 29130, -96729, -135865, 43162, 3738, -20861, -51741, 178571, 27645, -251780, -63946, 75685, 113704, -34213, 16796, 109557, 232833, 185410, -44344, 76660, 196666, -37355, 2428, 137062, 108299, 35497, 90779, 139138, 28720, 27080, 19366, -2898, 62450, 106050, 261805, 27848, -36039, 108731, 305961, 263677, 176950, 106133, -20380, 124339, 130863, 106737, -8599, -168669, -204739, -26639, 112590]
1488A12590j07784r6729K13953K0093o54m4004j80785J15898n5650o2254N2870
1477c2456l2990K1120J26964j89794M5242J20889j10487N6293J9934R5476j28118
1466g927o5651l7109K62116j0724j09185k17356O2564O4957l8272j1786J72828
1455F4455N5732j39260P7704Q2084p0464k94637J56309l0082Q6386L2994k2640
1444a419J8556j73318j14899j64788J12215K20513j49633r9771J29356J00301
1434a22887O2117J16157L3307j67052L4832j32876l8755K01226J886o9597L1814
1423d9828J15422r8478k07309O2350J17747r058J16263R5713n6721M7158k72633
1412a39374k9335K56262o0551r669M0436j00972N8821j00869j93781J19242Q3401
$$ y = [112590, 4806, -91923, 122030, 142123, 141469, 97465, -83320, 32578, -23072, -85326, -32456, -65446, -44326, 82638, -107156, -61914, 58975, -51512, 4781, 24715, 120191, -7927, -73578, -110687, 151429, 140705, 31520, -185836, -123272, -58315, -96587, -108373, 64455, 120187, -19073, 58631, 140715, 70251, -224386, -68077, -98159, -11773, 21221, -1419, 17137, -156181, -271080, -435868, -323653, -103140, -252773, -352544, -223188, -122887, -60770, 55387, 88694, -78358, -43526, -176402, -215157, -13931, -12045, -81642, -49828, 65594, -32884, -240193, -177843, -60096, -69154, 47109, 142822, 86101, 133259, -139374, -168709, 87553, 27002, 17333, 57769, -43203, 15618, -85251, -279032, -159790, -76389]
1401g6389J3160l1668M380L5964K55319L0375l05895k23013K26945J22615k17931
1390a66138R3665J31229O705l9433j43168m4613L8003l2753o3338K44481P0015
1379I4655j27062j49188J8032K80813Q1592j61291j03320Q3890q6200l631K0426
1368e1284J29593Q8515r9648m72k29576L1087J78303r5588j41191P0425J2898
1357a06938j86371P2198J67750R6162j13047p4093P7054N7495J09730j76325Q9561
1346A3176J30615P3145l8613j74039J49977N9056j26148k55617J33658K3161j57037
1335a68666J00456J44684r7629j31906j76283J09081K94370Q4392k12425P462
1325d6464K01516k12184n5143J38098J30300j57156j14478j40811K98298k8166
$$ y = [-76389, -63229, -94897, -90517, -54553, 200766, 231141, -74754, -297767, -70822, 51793, -166138, -72473, 58756, 65461, 26028, -117140, -161753, -123750, -156503, -219841, 24640, 94655, -32407, -181595, -163563, 117250, 198842, 37551, -65769, 18121, -68079, -71710, -51284, 78309, 166824, 67176, 66704, -162872, -131785, 46518, -49070, -190261, -119836, -106938, -293309, -221111, -53361, 42801, -70246, -144339, -67285, -9790, 99940, -76385, 13176, 143791, 216936, 178323, 4284, 154261, 213317, 87169, -168448, -34790, -11629, -168666, -68210, 76474, -21155, -153061, -329344, -220263, 74107, 158499, -53926, -46464, 155052, -57132, -112275, 25823, 156123, -1033, -115511, -256322, 41976, 13810]
1315A3810j45472j3168r4971K51426J22678k43735P9214J08987j41321k2280r1769
1304a76601J99197m0950r2091K33078k7190k25195P3130J06213R8849K877j00653
1293E0664l4602O5107o7709O1011j44825M5789N0076k7108P2072j8389O6336K3563
1281A41985Q3631j67015O2052o5220j1513q3581J18062j02737j86550r1318K57883
1270d4321m3436k8271J49244N5362l4944j37939k009n6567Q5518j44044J18736
1259h2671N0167m0234L3134R3575j49697O6369j0109J34468o6947K054j5211P4260
1247H9158j64110j28255L01722Q0839r5452r4279J02076J09652r5434o6264k1692
1236A7961q9447M6061Q6335Q7288j07728N8560R625k40111N1415o9065K5594N0131
$$ y = [13810, -131662, -144830, -239801, 11625, 134303, -109432, -30218, 78769, -62552, -84832, -176601, 22596, -18354, -110445, 122633, 95443, -129752, -56622, 49591, 148440, 151317, 50664, 16062, 81169, 13460, 74471, -70354, -24565, 25511, -1597, 70475, 52086, 118422, 141985, 225616, 58601, 120653, 55433, 43920, -39661, 78401, -24336, -210886, -302204, -44321, -87757, -116028, 33216, 88578, 53634, -84305, -86314, -142881, -57363, -201407, -82671, -32504, -72738, -39604, 53971, -95726, -29357, -39466, 95002, 28055, 30109, 14898, 89158, -74952, -203207, 98515, 179354, 83902, -10377, 91699, 201351, 105917, 39653, 17961, -71486, -25425, 60910, 148198, 40470, 99030, 108655, -131456, -80041, -149106, -123512, -73381]
1224g3381K6829n2780n4779K8989p0196L12032J1034j57212R2499O2972j29102
1213c095j33316K47148p6335k14139J76662k89574K24628J98305j15940j41998
1203a27654O9146j38193j11843O5788O2238J49562M7983n5510p7243J58926P0283
1192A13483m1075k15173j21479m7258K23601J54202J82214q7593l12262K16162
1182F4822J10638r6011o3485L4384n7606j82607Q5280r3398J39677n5336M5517
1171f8125l9653j00730R3857Q4393Q1433k62887J09210J13774j63299r694K9115
1160a32606J17513j05164o9859j04486J614L15110r2901l589q4251k098j7754
1149a78471k3151J76459P8535k21484O8865o5207l2610l2787O2586N6334j15502
$$ y = [-73381, -46552, -99332, -154111, -125122, -195318, 116714, 127748, -29464, 63035, 126007, -3095, -136411, 110737, 34402, -179737, -3075, -292649, -68021, 130284, 14344, -127654, -58508, -196701, -308544, -242756, -180518, -30956, 17027, -38483, -115726, 43200, 113483, 72408, -142765, -264244, -311502, -87901, 66301, 248515, 160922, -151340, 64822, 175460, 79449, 15964, 50348, -7258, -189865, -104585, -197983, -58306, -113642, -68125, -107778, -208508, -114651, -30258, 51175, -211712, -102502, 11272, -152027, -161721, -132606, -15093, -120257, -190116, -294602, -292988, 22122, -70779, -74368, -158619, -160717, -178471, -201622, -25163, 53372, -168112, -99247, -164454, -197064, -229851, -167265, -110931, -226433]
1138b26433L5587j35872K93179K1550j62179L19456n5001k35046K1395J19581
$$ y = [-226433, -190846, -326718, -33539, -11989, -174168, 145288, 90287, -144759, -123364, -3783]
$$ [...]
##END NTUPLES=NMR SPECTRUM
##END=
