##TITLE=1H_CA-9029xy
 DMSO
 8 sc, 
 1.07.2022
##JCAMPDX= 6.0         $$ Bruker NMR JCAMP-DX V2.0
##DATA TYPE= NMR SPECTRUM
##DATA CLASS= NTUPLES
##ORIGIN= UXNMR, Bruker Analytische Messtechnik GmbH
##OWNER= root
$$ XWIN-NMR		Version 3.5
$$ Fri Jul  1 15:49:36 2022 Russian Standard Time (UT+4h)  she@DPX200
##.OBSERVE FREQUENCY= 200.1313499994
##.OBSERVE NUCLEUS= ^1H
##.ACQUISITION MODE= SIMULTANEOUS
##.ACQUISITION SCHEME= undefined
##.AVERAGES= 8
##.DIGITISER RES= 18
##SPECTROMETER/DATA SYSTEM= spect
##.PULSE SEQUENCE= zg30
##.SOLVENT NAME= DMSO
##.SHIFT REFERENCE= (INTERNAL, DMSO, 0, 15.7865)
##AUDIT TRAIL= $$ (NUMBER, WHEN, WHO, WHERE, WHAT)
$$ ##TITLE= Audit trail, XWIN-NMR		Version 3.5
$$ ##JCAMPDX= 5.01
$$ ##ORIGIN= Bruker BioSpin GmbH
$$ ##OWNER= she
$$ F:/spectra/data/she/nmr/H-F/1/pdata/1/auditp.txt
$$ ##AUDIT TRAIL=  $$ (NUMBER, WHEN, WHO, WHERE, WHAT)
(   1,<2022-07-01 15:47:23.93 +0400>,<she>,<DPX200>,
      <created by zg, POWCHK disabled, PULCHK disabled
       configuration hash MD5:
       00 E9 B6 7A A2 85 ED C7 34 08 36 98 17 FE 4E 26
       data hash MD5: 16K
       CB 48 ED D7 64 E2 53 2C 19 12 1E B0 90 2C 27 D9>)
(   2,<2022-07-01 15:47:28.79 +0400>,<she>,<DPX200>,
      <Start of raw data processing
       efp BC_mod = 2 LB = 0.24 FT_mod = 6 PKNL = 1 PHC0 = -18046.84 PHC1 = 17.60069 SI = 16K 
       data hash MD5: 16K
       9E 9F E4 C6 5B CA F5 A9 4A FA BD B5 2E B2 09 CB>)
(   3,<2022-07-01 15:47:42.50 +0400>,<she>,<DPX200>,
      <pk PHC0 = 2.465701 PHC1 = -7.599999 
       data hash MD5: 16K
       37 8B 3E B2 0E F2 AA 86 39 ED 59 98 4D EF 83 09>)
(   4,<2022-07-01 15:47:46.31 +0400>,<she>,<DPX200>,
      <abs ABSG = 5 
       data hash MD5: 16K
       D6 17 37 5D 60 81 5C C8 D8 88 E5 E8 D0 F9 CD 94>)
$$ ##END=
$$ 
$$ hash MD5
$$ 24 48 64 5D B3 FC CF AB C1 AC 8D F3 33 EF D2 C7
##$RELAX= 
##$RELAX= 
##$RELAX= 
##$RELAX= 
##$RELAX= 
##$RELAX= 
$$ Bruker specific parameters
$$ --------------------------
##$DU= <F:/spectra>
##$EXPNO= 1
##$NAME= <H-F>
##$PROCNO= 1
##$TYPE= <nmr>
##$USER= <she>
##$AMP= (0..31)
100 100 100 100 100 100 100 100 100 100 100 100 100 100 100 100 100 100 
100 100 100 100 100 100 100 100 100 100 100 100 100 100 
##$AQSEQ= 0
##$AQ_mod= 1
##$AUNM= <au_zg>
##$AUTOPOS= <>
##$BF1= 200.13
##$BF2= 200.13
##$BF3= 200.13
##$BF4= 200.13
##$BF5= 200.13
##$BF6= 200.13
##$BF7= 200.13
##$BF8= 200.13
##$BYTORDA= 1
##$CFDGTYP= 0
##$CFRGTYP= 5
##$CHEMSTR= <none>
##$CNST= (0..31)
1 1 145 1 1 1 1 1 1 1 1 1 1 1 1 1 1 1 1 1 1 1 1 1 1 1 1 1 1 1 1 1 
##$CPDPRG= <>
##$CPDPRG1= <>
##$CPDPRG2= <>
##$CPDPRG3= <>
##$CPDPRG4= <mlev>
##$CPDPRG5= <mlev>
##$CPDPRG6= <mlev>
##$CPDPRG7= <mlev>
##$CPDPRG8= <mlev>
##$CPDPRGB= <>
##$CPDPRGT= <>
##$D= (0..31)
0 1.2 0 0 0 0 0 0 0 0.06 0 0.03 0 0 0 0 0.0002 0 0 0 0 0 0 0 0 0 0 0 0 
0 0 0 
##$DATE= 1656676043
##$DBL= (0..7)
120 120 120 120 120 120 120 120 
##$DBP= (0..7)
150 150 150 150 150 150 150 150 
##$DBP07= 0
##$DBPNAM0= <>
##$DBPNAM1= <>
##$DBPNAM2= <>
##$DBPNAM3= <>
##$DBPNAM4= <>
$$ [...]
##$SUBNAM2= <"">
##$SUBNAM3= <"">
##$SUBNAM4= <"">
##$SUBNAM5= <"">
##$SUBNAM6= <"">
##$SUBNAM7= <"">
##$SUBNAM8= <"">
##$SUBNAM9= <"">
##$SW= 18.0517283424941
##$SWIBOX= (0..15)
0 0 2 0 0 0 0 0 0 0 0 0 0 0 0 0 
##$SW_h= 3612.71676300578
##$TD= 16384
##$TD0= 1
##$TE= 0
##$TE2= 300
##$TE3= 300
##$TEG= 300
##$TL= (0..7)
0 120 120 120 120 120 120 120 
##$TP= (0..7)
150 150 150 150 150 150 150 150 
##$TP07= 0
##$TPNAME0= <>
##$TPNAME1= <>
##$TPNAME2= <>
##$TPNAME3= <>
##$TPNAME4= <>
##$TPNAME5= <>
##$TPNAME6= <>
##$TPNAME7= <>
##$TPOAL= (0..7)
0.5 0.5 0.5 0.5 0.5 0.5 0.5 0.5 
##$TPOFFS= (0..7)
0 0 0 0 0 0 0 0 
##$TUNHIN= 0
##$TUNHOUT= 0
##$TUNXOUT= 0
##$USERA1= <user>
##$USERA2= <user>
##$USERA3= <user>
##$USERA4= <user>
##$USERA5= <user>
##$V9= 5
##$VALIST= <valist>
##$VCLIST= <CCCCCCCCCCCCCCC>
##$VD= 0
##$VDLIST= <DDDDDDDDDDDDDDD>
##$VPLIST= <PPPPPPPPPPPPPPP>
##$VTLIST= <TTTTTTTTTTTTTTT>
##$WBST= 1024
##$WBSW= 4
##$XGAIN= (0..3)
0 0 0 0 
##$XL= 0
##$YL= 0
##$YMAX_a= 265042
##$YMIN_a= -248102
##$ZGOPTNS= <>
##$ZL1= 120
##$ZL2= 120
##$ZL3= 120
##$ZL4= 120
##$ABSF1= 15.7535
##$ABSF2= -2.298349
##$ABSG= 5
##$ABSL= 3
##$ALPHA= 0
##$AQORDER= 0
##$ASSFAC= 0
##$ASSFACI= 0
##$ASSFACX= 0
##$ASSWID= 0
##$AUNMP= <proc_1d>
##$AZFE= 0.1
##$AZFW= 0.1
##$BCFW= 0
##$BC_mod= 2
##$BYTORDP= 0
##$COROFFS= 0
##$CY= -3
##$DATMOD= 1
##$DC= 0
##$DFILT= <>
##$DTYPP= 0
##$F1P= 0
##$F2P= 0
##$FCOR= 1
##$FTSIZE= 16384
##$FT_mod= 6
##$GAMMA= 0
##$GB= 0
##$INTBC= 1
##$INTSCL= 0
##$ISEN= 128
##$LB= 0.24
##$LEV0= 0
##$LPBIN= 0
##$MAXI= 10000
##$MC2= 0
##$MEAN= 0
##$ME_mod= 0
##$MI= 1.114404
##$NCOEF= 0
##$NC_proc= -7
##$NLEV= 6
##$NOISF1= 3.799351
##$NOISF2= 2.8
##$NSP= 0
##$NTH_PI= 0
##$NZP= 0
##$OFFSET= 15.78655
##$PC= 1
##$PHC0= -18044.38
##$PHC1= 10.00069
##$PH_mod= 1
##$PKNL= yes
##$PPARMOD= 0
##$PSCAL= 0
##$PSIGN= 0
##$REVERSE= no
##$SF= 200.12999699536
##$SI= 16384
##$SIGF1= 3
##$SIGF2= 2
##$SINO= 5.538805
##$SIOLD= 16384
##$SREGLST= <1H.CDCl3>
##$SSB= 0
##$STSI= 16384
##$STSR= 0
##$SW_p= 3612.71676300578
##$SYMM= 0
##$S_DEV= 0
##$TDeff= 16384
##$TDoff= 0
##$TI= <>
##$TILT= no
##$TM1= 0
##$TM2= 0
##$TOPLEV= 0
##$USERP1= <user>
##$USERP2= <user>
##$USERP3= <user>
##$USERP4= <user>
##$USERP5= <user>
##$WDW= 1
##$XDIM= 16384
##$YMAX_p= 368415323
##$YMIN_p= -1902891
$$ End of Bruker specific parameters
$$ ---------------------------------
##NTUPLES= NMR SPECTRUM
##VAR_NAME=  FREQUENCY,     SPECTRUM/REAL,   SPECTRUM/IMAG
##SYMBOL=    X,             R,               I
##VAR_TYPE=  INDEPENDENT,   DEPENDENT,       DEPENDENT
##VAR_FORM=  AFFN,          ASDF,            ASDF
##VAR_DIM=   16384,         16384,           16384
##UNITS=     HZ,            ARBITRARY UNITS, ARBITRARY UNITS
##FACTOR=    0.220516191357247, 1,           1
##FIRST=     3159.36211764622, 0,            0
##LAST=      -453.354645359562, 0,           0
##MIN=       -453.354645359562, -1902891,    0
##MAX=       3159.36211764622, 368415323,    0
$$ Real data points
##PAGE= N=1
##DATA TABLE= (X++(R..R)), XYDATA
$$ [...]
$$ plain form
15989 -667262 237797 -208143 -96221 -155133 -292042 152952 530448 648533 778025 487801
15979 487801 108639 388502 123522 284184 620325 194646 42107 -78774 -985980 -505959
15969 -505959 -361679 -346017 -550283 -387563 -78785 331742 437886 568317 250521 59322
15959 59322 381596 356042 265978 187940 -172689 443573 261895 194992 -128169 -241649
15949 -241649 -286634 -369976 -453417 -131822 50739 174561 -205920 33516 58004 200454
15939 200454 482729 581799 279430 48884 50960 -6337 -75119 -207842 -234849 -33603 328414
15928 328414 663867 384803 206161 58170 -344167 -26134 -104351 -194849 -482471 -480591
15918 -480591 8091 300016 211111 158010 -380926 3050 61984 -219462 -96280 -27130
$$ packed form
15989f67262R05059m45940J11922n8912j36909M44994L77496J18085J29492k90224
15979D87801l79162K79863k64980J60662L36141m25679j52539j20881r07206M80021
15969e05959J44280J5662k04266J62720L08778M10527J06144J30431l17796j91199
15959E9322L22274k5554r0064p8038l60629O16262j81678o6903l23161j13480
15949b41649m4985q3342q3441L21595J82561J23822l80481K39436K4488J42450
15939B00454K82275R9070l02369k30546K076n7297o8782j32723k7007K01246L62017
15928C28414L35453k79064j78642j47991m02337L18033p8217r0498k87622J880
15918d80591M88682K91925q8905n3101n38936L83976N8934k81446J23182O9150
$$ plain form
15908 -27130 -328567 239110 12001 -185988 50019 56136 -33207 151869 108683 107866 -388415
15897 -388415 -672540 -338980 -547875 -253593 75137 -158119 -234466 209232 -271665 -128298
15887 -128298 -556274 -89573 306879 -346929 30165 198368 -341061 -122517 16835 -528794
15877 -528794 -162776 451824 308221 309418 174218 68386 288464 174106 584532 518740
15867 518740 335995 583940 -268403 7207 128771 -252143 635588 866270 353916 354190
15857 354190 -10828 153288 11059 62170 529998 -260406 105277 -323769 -589174 -61069
15847 -61069 228694 -323321 -486612 -710026 -324710 -497048 -620642 -761986 149993 618071
15837 618071 604344 65179 3016 529832 976514 639786 358584 484096 302154 663420
$$ packed form
15908b7130l01437N67677k27109j97989K36007O117q9343J85076m3186q17m96281
15897c88415k84125L33560k08895K94282L28730k33256p6347M43698m80897J43367
15887a28298m27976M66701L96452o53808L77094J68203n39429K18544J39352n45629
15877e28794L66018O14600j43603J197j35200j05832K20078j14358M10426o5792
15867E18740j82745K47945q52343K75610J21564l80914Q87731K30682n12354K74
15857C54190l65018J64116j42229N1111M67828p90404L65683m29046k65405N28105
15847f1069K89763n52015j63291k23414L85316j72338j23594j41344R11979M68078
15837F18071j3727n39165o2163N26816M46682l36728k81202J25512j81942L61266
$$ plain form
15827 663420 925321 370940 1282524 815797 -141054 192645 65410 281106 -241827 -600873
15817 -600873 -429135 -218532 104633 10671 -575253 -207110 -113995 -449377 -42251 -276494
15807 -276494 -371717 887296 725496 -494090 -294502 354494 -159485 437378 282775
15798 282775 46345 -186972 -81951 49144 -395092 -539599 -656769 -895950 -465262 -432142
15788 -432142 -242136 -175374 -19296 -1033666 -1101298 -360557 -244516 -33170 -429609 -483636
15778 -483636 276986 79736 190946 206510 120125 314699 223204 76559 -13602 410909
15768 410909 545762 372930 144884 40002 65547 776760 888680 169551 -13045 108731
15758 108731 -202710 -421001 -481810 -721410 -618072 -21551 174674 -174152 -90281 360655
$$ packed form
15827F63420K61901n54381R11584m66727r56851L33699j27235K15696n22933l59046
15817f00873J71738K10603L23165r3962n85924L68143R3115l35382M07126k34243
15807b76494r5223J259013j61800j219586J99588O48996n13979N96863j54603
15798B82775k36430k33317J05021J31095m44236j44507j17170k39181M30688L3120
15788d32142J90006O6762J56078j014370o7632P40741J16041K11346l96439n4027
15778d83636P60622j97250J11210J5564q6385J94574r1495j46645r0161M24511
15768D10909J34853j72832k28046j04882K5545P11213J11920p19129j82596J21776
15758A08731l11441k18291o0809k39600J03338N96521J96225l48826Q3871M50936
$$ plain form
15748 360655 -464266 -441518 -91864 -549020 -310151 -120292 -929021 -614970 -79447 -416457
15738 -416457 -480995 -516375 -507124 -647328 -468091 -550404 -474391 -724726 -483655 -495464 -693968
15727 -693968 -856007 -778928 -1051783 -490341 -721056 -695010 -289001 -268393 -318 -102382
15717 -102382 296652 366712 372996 574457 322709 227323 694996 130173 295587 576938
15707 576938 973417 413507 -171437 -280180 155159 536374 923493 -129841 -509471
15698 -509471 -4285 407879 293153 253431 309494 364217 779023 1161548 827668 372875
15688 372875 281417 26867 191247 550732 839984 491238 284318 -37548 368139 499648
15678 499648 548361 -34154 -265289 149224 212046 180384 752476 772921 312430 293711
$$ packed form
15748C60655q24921K2748L49654m57156K38869J89859q08729L14051N35523l37010
15738d16457o4538l5380R251j40204J79237q2313P6013k50335K41071j1809j98504
15727f93968j62039P7079k72855N61442k30715K6046M06009K0608K68075j02064
15717a02382L99034P0060O284K01461k51748r5386M67673n64823J65414K81351
15707E76938L96479n59910n84944j08743M35339L81215L87119j053334l79630
15698e09471N05186M12164j14726l9722N6063N4723M14806L82525l33880m54793
15688C72875r1458k54550J64380L59485K89252l48746k06920l21866M05687J31509
15678D99648M8713n82515k31135M14513O2822l1662N72092K0445m60491j8719
$$ plain form
15668 293711 64479 -49571 633859 270000 -426947 54814 -18846 -27357 299017 163701
15658 163701 -143944 -253833 -196200 33745 -147405 -10188 246541 -211502 -60712 288122
15648 288122 -284815 -482207 -506591 -82621 265180 -78453 171746 253163 123748 29986
15638 29986 -68937 -110561 -322817 226985 467390 118931 304595 137700 -64491 -202402
15628 -202402 -43041 47515 117481 329144 235071 270740 358086 405339 232749 -610816 -584829
15617 -584829 101141 609024 86301 355884 471265 -675772 -188435 -130374 -345701 -516509
15607 -516509 -56036 -48885 -502157 213530 76145 102019 311851 -322520 70380 276081
15597 276081 469897 -27053 377280 491091 -295363 29348 -354674 -356810 -70721 -94813
$$ packed form
15668B93711k29232j14050O83430l63859o96947M81761p3660q511L26374j35316
15658A63701l07645j09889N7633K29945j81150J37217K56729m58043J50790L48834
15648B88122n72937j97392k4384M23970L47801l43633K50199Q1417j29415r3762
15638B9986r8923m1624k12256N49802K40405l48459J85664j66895k02191j37911
15628b02402J59361R0556O9966K11663r4073L5669Q7346M7253j72590q43565K5987
15617e84829O85970N07883n22723K69583J15381j147037M87337N8061k15327j70808
15607e16509M60473P151m53272P15687j37385K5874K09832o34371L92900K05701
15597B76081J93816m96950M04333J13811p86454L24711l84022k136K86089k4092
$$ plain form
15587 -94813 264127 235605 -451662 -803199 -850626 -498771 90992 -58060 -377310 -254631
15577 -254631 -311919 2590 93627 -78054 -396848 -435339 11114 1684 22339 -98006 26017
15566 26017 80914 48203 763176 804341 586922 742828 872094 774068 1171088 1166901 337588
15555 337588 86337 200827 593009 401607 425438 281884 -100284 -157103 -322465 -463792
15545 -463792 -212514 128617 483856 46616 -271167 -369687 -138196 187006 -162340 -394690
15535 -394690 -118264 4659 -222207 134556 181361 -12493 243913 -474585 -94582 5624
15525 5624 875 139703 -559645 -780168 -153580 -144075 -509283 -551685 -454012 -604680 -59954
15514 -59954 518192 -420827 -600545 -476802 189053 22275 -147654 -265299 750523 670611
$$ packed form
15587i4813L58940k8522o87267l51537m7427L51855N89763j49052l19250J22679
15577b54631n7288L14509R1037j71681l18794l8491M46453r430K0655j20345J24023
15566B6017N4897l2711P14973M1165k17419J55906J29266r8026L97020m187q29313
15555C37588k51251J14490L92182j91402K3831j43554l82168n6819j65362j41327
15545d63792K51278L41131L55239m37240l17783r8520K31491L25202l49346k32350
15535c94690K76426J22923k26866L56763M6805j93854K56406p18498L80003J00206
15525E624m749J38828o99348k20523O26588R505l65208m2402R7673j50668N44726
15514e9954N78146r39019j79718J23743O65855j66778j69929j17645J015822p9912
$$ plain form
15504 670611 241266 192947 -73774 468393 828731 388870 148411 -168577 118983 162714
15494 162714 361046 778926 413571 -91252 -183338 -317885 -247195 495929 556714 379444
15484 379444 460049 190610 410813 444519 412004 616116 967263 765231 1018019 1013756
15474 1013756 27631 -214135 476244 912949 386887 198133 281828 348819 556847 227201
15464 227201 340947 926953 462316 7675 -236940 408289 488032 294531 267590 -69548
15454 -69548 307951 319959 84226 -179255 -691061 -1154920 -631007 164315 -380046 -914687
15444 -914687 -255249 -111537 -207474 -413806 -170926 -35927 5957 -318091 -600731 -350669
15434 -350669 -514864 -751900 -488708 -552238 -235352 -226064 202882 71157 -258709 760214
$$ packed form
15504F70611m29345m8319k66721N42167L60338m39861k40459l16988K87560M3731
15494A62714J98332M17880l65355n04823r2086j34547P0690P43124O0785j77270
15484C79444Q0605k69439K20203L3706l2515K04112L51147k02032K52788m263
15474A013756r86125k41766O90379M36705n26062j88754Q3695O6991K08028l29646
15464B27201J13746N86006m64637m54641k44615O45229P9743j93501k6941l37138
15454f9548L77499J2008k35733k63481n11806m63859N23913P95322n44361n34641
15444i14687O59438J43712r5937k06332K42880J34999M1884l24048k82640K50062
15434c50669j64195k37036K63192o3530L16886R288M28946j31725l29866J018923
$$ plain form
15424 760214 -134775 -361203 -36298 -270020 161897 356724 293156 129947 -491909 162934
15414 162934 387932 -463723 -360579 -373650 -147305 124893 117691 429851 345438 249164
15404 249164 -142944 437692 615942 -25106 -69719 200700 -246256 68290 16866 65344
15394 65344 -485402 75194 -107464 113627 375765 279936 -215453 123546 147957 53359
15384 53359 -135861 216955 -102963 376219 234400 -3509 202323 438161 38315 -460102
15374 -460102 19712 -149854 -485261 -142085 -130547 -11118 208328 -238713 77230 92540
15364 92540 -411642 -612582 -41252 -439760 144686 111753 187671 394625 399622 199677
15354 199677 -304952 -949130 -190161 -191716 -29175 -34181 -38462 -278778 -63531 -460233 -64222
$$ packed form
15424G60214q94989k26428L24905k33722M31917J94827o3568j63209o21856O54843
15414A62934K24998q51655J03144j3071K26345K72198p202L12160q4413r6274
15404B49164l92108N80636J78250o41048m4613K70419m46956L14546n1424M8478
15394F5344n50746N60596j82658K21091K62138r5829m95389L38999K4411r4598
15384E3359j89220L52816l19918M79182j41819k37909K05832K35838l99846m98417
15374d60102M79814j69566l35407L43176J1538J19429K19446m47041L15943J5310
15364I2540n04182k00940N71330l98508N84446l2933P5918K06954M997j99945
15354A99677n04629o44178P58969j555J62541n006m281k40316K15247l96702L96011
$$ plain form
15343 -64222 243575 165908 68386 381398 335470 39010 -440009 21532 299393 895483
15333 895483 569080 339981 -41595 247077 460476 342765 -373619 -721376 -675087 -705575
15323 -705575 -229924 277986 474720 47522 -84861 -201671 -225157 47210 596435 811385
15313 811385 682107 20128 191118 119320 474835 634453 416358 352675 405291 31665
15303 31665 262834 -33836 -259322 2200 476242 173761 343030 189941 399362 198127
15293 198127 33711 146433 198956 455099 567911 -345415 -256910 -214951 -460781 -20629
15283 -20629 127536 -296801 -733194 -301840 123300 233211 -119458 -349559 -572341 -480255
15273 -480255 -489679 -379897 6429 -134905 -114682 218483 -379769 -107087 536280 184734
$$ packed form
15343f4222L07797p7667r7522L13012m5928k96460m79019M61541K77861N96090
15333H95483l26403k29099l81576K88672K13399j17711p16384l47757M6289l0488
15323g05575M75651N07910J96734m27198j32383j16810k3486K72367N49225K14950
15313H11385j29278o61979J70990p1798L55515J59618k18095o3683N2616l73626
15303C1665K31169k96670k25486K61522M74042l02481J69269j53089K09421k01235
15293A98127j64416J12722N2523K56143J12812r13326Q8505M1959k45830M40152
15283b0629J48165m24337m36393M31354M25140J09911l52669k30101k22782R2086
15273d80255r424J09782L86326j41334K0223L33165n98252K72682O43367l51546
$$ plain form
15263 184734 -391619 -338993 533833 194800 -57848 319286 118398 22540 205279 84840
15253 84840 -634017 -814780 -102558 -182062 203241 4496 -284567 15924 -144345 -126621
15243 -126621 -21968 -28593 195581 466720 276234 129209 250082 55932 -22232 -377942
15233 -377942 -897097 -495037 -49638 514740 -134648 -634262 -587973 -412274 -8926 205771
15223 205771 170528 171781 -78074 -90744 -246173 61387 27796 -320870 -664296 -344846
15213 -344846 -229703 318318 315601 -675333 -1254697 -625492 -537483 40152 -542014 -1104342
15203 -1104342 -422188 -161208 57684 -66123 -694282 -880267 -744754 -480440 -163730
15194 -163730 -90099 151982 -441049 -637720 -593663 -211357 -43434 -404946 -394770 -429630
$$ packed form
15263A84734n76353N2626Q72826l39033k52648L77134k00888r5858J82739j20439
15253H4840p18857j80763P12222p9504L85303j98745k89063L00491j60269J7724
15243a26621J04653o625K24174K71139j90486j47025J20873j94150p8164l55710
15233c77942n19155M02060M45399N64378o49388m99614M6289J75699M03348K14697
15223B05771l5243J253k49855j2670j55429L07560l3591l48666l43426L19450
15213c44846J15143N48021k717r90934n79364O29205Q8009N77635n82166n62328
15203a104342O82154K60980K18892j23807o28159j85985J35513K64314L16710
15194a63730P3631K42081n93031j96671M4057L82306J67923l61512J0176l4860
$$ plain form
15184 -429630 -736020 -432004 -279374 -235053 9383 21008 -26454 -309326 -47554 -40282
15174 -40282 171097 574017 -158163 -654310 -297462 116998 16787 287036 146341 67652
15164 67652 20598 253853 124131 132021 -299489 -27310 -217589 -90455 23104 588026
15154 588026 569149 595442 -171347 -175460 -207344 -87565 577215 1159435 649943 613978 -4758
15143 -4758 -95518 459870 1035483 804285 250617 295437 -15003 751009 569598 -260070
15133 -260070 -43802 431654 33254 -174930 -440726 -252042 115122 415178 -437613 -479106
15123 -479106 -176908 -133901 -98845 -127770 -622810 -133191 89621 -358280 -198264 -76277
15113 -76277 -481808 -249651 -568188 -204268 -136600 162730 -235012 -435625 -313236 -102884
$$ packed form
15184d29630l06390L04016J52630M4321K44436J1625m7462k82872K61772P272
15174d0282K11379M02920p32180m96147L56848M14460j00211K70249j40695p8689
15164F7652m7054K33255j29722P890m31510K72179j90279J27134J13559N64922
15154E88026j8877K6293p66789m113l1884J19779O64780N82220n09492l5965o18736
15143d758r0760N55388N75613k31198n53668M4820l10440P66012j81411q29668
15133b60070K16268M75456l98400k08184k65796J88684L67164L00056q52791m1493
15123d79106L02198M3007L5056k8925m95040M89619K22812m47901J60016J21987
15113g6277m05531K32157l18537L63920O7668K99330l97742k00613J22389K10352
$$ plain form
15103 -102884 -6826 62256 -560504 -547991 -425111 -1011011 -1011765 -279149 -388974 -718331 -720852
15092 -720852 -1081076 -813428 -850461 -455192 -50093 295293 376132 180581 -1447 155787
15082 155787 880454 765429 -150770 -305570 -458035 -182134 -518921 -433223 -130326 -345433
15072 -345433 -449483 -537014 -411808 -301217 -554636 -537469 -764152 -349983 53399 -207412
15062 -207412 -674713 -537236 -627571 -563246 -180641 -579000 -673725 158632 74111 -439187
15052 -439187 -623670 -484943 13158 -66585 66035 -133898 246840 605071 465869 166554
15042 166554 55858 426052 630263 -207796 -645327 -160220 -58630 -186893 -244762 23730
15032 23730 269731 286459 -27852 -108752 129396 159319 179405 178200 206356 353508 446689
$$ packed form
15103a02884R6058O9082o22760J2513J22880n85900p54P32616j09825l29357k521
15092g20852l60224K67648l7033L95269M05099L45386Q0839j95551j82028J57234
15082A55787P24667j15025r16199j54800j52465K75901l36787Q5698L02897k15107
15072c45433j04050q7531J25206J10591k53419J7167k26683M14169M03382k60811
15062b07412m67301J37477r0335O4325L82605l98359r4725Q32357q4521n13298
15052d39187j84483J38727M98101p9743J32620j99933L80738L58231j39202k99315
15042A66554j10696L70194K04211q38059m37531M85107J01590j28263n7869K68492
15032B3730K46001J6728l14311q0900K38148K9923K0086j205K8156J47152R3181
$$ plain form
15021 446689 621610 475193 547114 736308 463900 -6686 -370956 -18430 118379 236578
15011 236578 -75156 -101168 -47519 -126009 -93942 -225961 -88381 60051 -249747 76880
15001 76880 -322186 -359521 -278117 67226 378610 -312360 -382637 -270654 -36273 240640
14991 240640 181513 -232289 -155370 33463 -83345 203048 145662 -73019 54300 48469
14981 48469 -42345 -19073 179610 -264102 81942 14044 -325136 617568 574728 -63048
14971 -63048 -486907 206897 355524 -406496 -608583 -533006 112407 341686 54659 -111260
14961 -111260 -354260 -599311 -1044075 -534889 -250612 -688125 -590307 -638567 -562872 -122798
14951 -122798 -41789 -694033 -976147 -437001 -236379 -217921 -574082 -544207 -531253 -93506
$$ packed form
15021D46689J74921j46417P1921J89194k72408m70586l64270L52526J36809J18199
15011B36578l11734k6012N3649p8490L2067j32019J37580J48432l09798L26627
15001G6880l99066l7335Q1404L45343L11384o90970p0277J11983K34381K76913
14991B40640n9127m13802P6919J88833j16808K86393n7386k18681J27319n831
14981D8469r0814K3272J98683m43712L46044o7898l39180R42704m2840o37776
14971f3048m23859O93804J48627p62020k02087P5577O45413K29279k87027j65919
14961a11260k43000k45051m44764N09186K84277m37513R7818m8260P5695M40074
14951a22798Q1009o52244k82114N39146K00622J8458l56161K9875J2954M37747
$$ plain form
14941 -93506 58908 -59463 -196301 137141 -157327 -108003 295653 -164066 -505642 -133081
14931 -133081 114614 -69217 -411279 -68912 266514 -325258 327266 -97551 -6090 210042
14921 210042 -263696 -220955 46743 -87641 -95585 -1141079 -217481 -444552 -722418 -422049
14911 -422049 -317823 -711364 260418 -208771 -545011 -339211 -733525 -470586 249756 -129609
14901 -129609 107876 -471882 -128207 -174269 26300 376576 -11364 -145334 -403629 -283274
14891 -283274 -177279 -196555 -145671 557390 173148 -493382 -190719 156284 -272517 204293
14881 204293 120310 -87730 279200 124120 -237928 180701 560 149075 -19419 69160
14871 69160 -31308 333008 287202 -384532 -198704 -3495 -519381 -470931 -1012489 -565275
$$ packed form
14941i3506J52414j18371j36838L33442k94468M9324M03656m59719l41576L72561
14931a33081K47695j83831l42062L42367L35426n91772O52524m24817R1461K16132
14921B10042m73738M2741K67698j34384p944j045494R23598k27071k77866L00369
14911d22049J04226l93541R71782m69189l36240K05800l94314K62939P20342l79365
14901a29609K37485n79758L43675m6062K00569L50276l87940j33970k58295J20355
14891b83274J05995j9276N0884P03061l84242o66530L02663L47003m28801M76810
14881B04293q3983k08040L66930j55080l62048M18629j80141J48515j68494Q8579
14871F9160j00468L64316m5806o71734J85828J95209n15886M8450n41558M47214
$$ plain form
14861 -565275 -294228 -771415 -893898 -468920 76702 -8918 153104 -487059 -503628 -26893
14851 -26893 -140927 261959 -411880 -288015 -67194 -95823 -281442 -40835 -321541 -513196
14841 -513196 -487468 -584390 -634231 -365224 -419468 171591 -338521 -307837 -412059 -358071 -26617
14830 -26617 345850 517708 30047 -82764 -489881 -309860 16626 -318731 -307494 -143376
14820 -143376 -196713 -210030 462120 -145630 72503 14369 -385115 -518269 -497634 -460905
14810 -460905 27883 -336163 246 -416869 -1041421 -794434 -281263 -690943 -634323 -39016
14800 -39016 -330614 -15592 -99299 -100398 -47229 -223902 -125189 214055 -168926 284083 -214777
14789 -214777 3163 -190991 33664 -201896 -282706 -349941 -657521 -739268 -489445 -352313
$$ packed form
14861e65275K71047m77187j22483M24978N45622q5620J62022o40163j6569M76735
14851b6893j14034M02886o73839J23865K20821k8629j85619K40607k80706j91655
14841e13196K5728r6922m9841K69007n4244N91059n10112L0684j04222N3988L31454
14830b6617L72467J71858m87661j12811m07117J80021L26486l35357J1237J64118
14820a43376n3337j3317O72150o07750K18133n8134l99484j33154K0635L6729
14810d60905M88788l64046L36409m17115o24552K46987N13171m09680N6620N95307
14800c9016k91598L15022q3707j099N3169j76673R8713L39244l82981M53009m98860
14789b14777K17940j94154K24655k35560q0810o7235l07580q1747K49823J37132
$$ plain form
14779 -352313 -252992 -622139 -675356 -765719 -542434 -431196 97578 55594 82117 414647
14769 414647 309184 48610 202295 495405 673538 416654 502987 196622 44928 -241861
14759 -241861 -113799 -538286 -370464 -275631 -233396 -324539 -850997 -504406 -25104 -219040
14749 -219040 162457 -468469 -507934 -26922 151683 -273847 -415129 27606 -128920 115153
14739 115153 -305889 67067 27921 -271037 176368 -330098 -663178 -69768 17157 309185
14729 309185 -79176 299785 324007 -470909 -485044 -456146 -115047 -60614 -558403 -381229
14719 -381229 -167593 15385 -12598 -707971 -840108 -187457 193496 -305917 -1037425 -781311
14709 -781311 -688062 -130687 -102947 -933355 -752989 -425948 -387827 -180892 -217175 123705
$$ packed form
14779c52313R9321l69147n3217r0363K23285J11238N28774m1984K6523L32530
14769D14647j05463k60574J53685K93110J78133k56884Q6333l06365j51694k86789
14759b41861J28062m24487J67822R4833M2235r1143n26458L46591M79302j93936
14749b19040L81497o30926l9465M81012J78605m25530j41282M42735j56526K44073
14739A15153m21042L72956l9146k98958M47405n06466l33080N93410Q6925K92028
14729C09185l88361L78961K4222p94916j4135K8898L41099N4433m97789J77174
14719c81229K13636J82978k7983o95373j32137O52651L80953m99413p31508K56114
14709g81311R3249N57375K7740q30408J80366L27041L8121K06935l6283L40880
$$ plain form
14699 123705 34542 -373120 -630854 -487004 550448 209321 -561408 -744250 -337760 -108713
14689 -108713 153793 -250704 -754325 -222304 -257583 -635664 -728032 -638873 -411124 -54297
14679 -54297 66482 -191978 -333024 -42133 -481487 58429 491996 -385275 -503013 -454372
14669 -454372 -356484 -405233 -146610 -127629 -788755 31469 -203931 -585408 -187898 -725096
14659 -725096 -568086 -403061 -443859 -303652 -368110 -530026 -166629 228263 -41260 347451
14649 347451 205681 179512 602113 235677 60200 -111287 243147 173457 193005 616391
14639 616391 8663 240282 384973 170346 -427664 -473638 -575851 -700652 -254573 -294383
14629 -294383 -418714 584990 208877 -67203 -848587 -234860 344344 967006 1138550
$$ packed form
14699A23705q9163m07662k57734J43850J037452l41127p70729j82842M06490K29047
14689a08713K62506m04497n03621N32021l5279l78081r2368Q9159K27749L56827
14679e4297J20779k58460j41046K90891m39354N39916M33567q77271j17738M8641
14669d54372R7888m8749K58623J8981o61126Q20224k35400l81477L97510n37198
14659g25096J57010J65025m0798J40207o4458j61916L63397L94892k69523L88711
14649C47451j41770k6169M22601l66436j75477j71487L54434o9690J9548M23386
14639F16391o07728K31619J44691k14627n98010m5974j02213j24801M46079l9810
14629b94383j24331J003704l76113k76080p81384O13727N79204O22662J71544
$$ plain form
14620 1138550 140479 56122 625073 627480 278228 72971 -120652 20056 272257 33992
14610 33992 -93320 189624 -269954 -60683 28802 13442 408645 470934 152366 407817
14600 407817 -546097 -31336 81886 -100699 494916 560090 512191 -333614 -523001 -33530
14590 -33530 56827 -57616 -487814 -231693 309364 94479 367224 541666 -222002 -123762
14580 -123762 206141 345322 120624 -22897 -315037 -478904 -205747 416637 209771 -109575
14570 -109575 -334310 -723582 -1178585 -1113946 -1045158 -495867 -583341 -800808 -348911 -342735
14560 -342735 -131232 4950 -318906 -563040 79555 40379 -452137 -321133 -56994 -59484
14550 -59484 232819 181795 145047 22551 289962 -461444 -691505 -608084 -326971 -36026
$$ packed form
14620A138550r98071q4357N68951K407l49252k05257j93623J40708K52201k38265
14610C3992j27312K82944m59578K09271Q9485j5360L95203O2289l18568K55451
14600D07817r53914N14761J13222j82585N95615O5174m7899q45805j89387M89471
14590c3530R0357j14443m30198K56121N41057k14885K72745J74442p63668R8240
14580a23762L29903J39181k24698j43521k92140j63867K73157O22384k06866l19346
14570a09575k24735l89272m55003O4639O8788N49291q7474k17467M51897O176
14560c42735K11503J36182l23856k44134O42595l9176m92516J31004K64139k490
14550e9484K92303n1024l6748j22496K67411p51406k30061Q3421K81113K90945
$$ plain form
14540 -36026 -133574 -431787 -573607 -151176 -319057 -665890 -535188 -399047 -347780 -227824
14530 -227824 71233 -15730 -116134 -228269 -764945 -347606 -221016 -281317 -957124 -438469
14520 -438469 -293071 -839716 -434685 -701225 -1016192 -802696 -755193 -1042359 -962753 -90481
14510 -90481 -426047 -822232 -665065 -205013 106852 -356910 -1042509 -385495 405286 412293
14500 412293 375711 44352 105939 -192622 -177308 126814 252703 570837 335866 -286256
14490 -286256 -404057 314059 603234 400893 628961 33948 206385 810909 696480 456014
14480 456014 623787 680290 85091 148862 -267881 -219751 541974 -146932 -848368 -1050749
14470 -1050749 -1279062 -803879 -354845 -532454 -936229 -453778 -321499 -527708 159536
$$ packed form
14540c6026r7548k98213j41820M22431j67881l46833J30702J36141N1267J19956
14530b27824K99057q6963j00404j12135n36676M17339J26590o0301o75807N18655
14520d38469J45398n46645M05031k66540l14967K13496M7503k87166P9606Q72272
14510i0481l35566l96185J57167M60052L11865m63762o85599O57014P90781P007
14500D12293l6582l31359O1587k98561J5314L04122J25889L18134k34971o22122
14490b86256j17801P18116K89175k02341K28068n95013J72437O04524j14429k40466
14480D56014J67773N6503n95199O3771m16743M8130P61725o88906p01436k02381
14470a050749k28313M75183M49034j77609m03775M82451J32279k06209O87244
$$ plain form
14461 159536 441196 -54514 53683 47908 432497 253668 148510 347892 378606 403468
14451 403468 247228 298027 415428 -279926 -92825 172554 169882 -165815 112569 -103883
14441 -103883 -264740 308110 -55310 222865 640684 17798 -73919 237352 629036 456365
14431 456365 228747 575118 7411 177331 343834 523457 434930 111903 -549411 -27185
14421 -27185 228914 397027 0 523539 490740 358239 -30673 230113 536404 658788
14411 658788 628566 435684 -171840 233598 419089 252697 92868 -266467 -550036 -328453
14401 -328453 -616033 -867515 -860725 -1163389 -756024 -775933 -907679 -587666 -855975 -713190
14391 -713190 -211204 -151485 -132557 -44525 191272 -299632 -262472 -92706 216475 315263
$$ packed form
14461A59536K81660m95710J08197n775L84589j78829j05158J99382L0714K4862
14451D03468j56240N0799J17401o95354J87101K65379k672l35697K78384k16452
14441a03883j60857N72850l63420K78175M17819o22886r1717L11271L91684j72671
14431D56365k27618L46371n67707J69920J66503J79623q8527l23027o61314N22226
14421b7185K56099J68113l97027N23539l2799j32501l88912K60786L06291J22384
14411F58788l0222j92882o07524M05438J85491j66392j59829l59335k83569K21583
14401c28453k87580k51482O790l02664M07365j9909j31746L20013k68309J42785
14391g13190N01986N9719J8928Q8032K35797m90904L7160J69766L09181R8788
$$ plain form
14381 315263 291061 149413 18291 159857 321012 204903 31424 310283 393465 94952
14371 94952 -45016 16878 247793 397601 250346 -10789 365204 169344 233787 176379
14361 176379 29291 204978 31928 452272 739689 465892 141969 -512650 -287816 -576251
14351 -576251 -611267 -416727 -7473 514007 347449 96475 -103701 -276010 241468 34385
14341 34385 146701 625675 709588 -57623 -487363 242415 396172 244033 -11488 -388877
14331 -388877 135420 -14656 -26921 -498256 -443797 -415685 -306413 51916 -176268 2989
14321 2989 -52814 -487987 -653136 -715525 -178817 38722 -589538 -497194 -462652 -99806 -84140
14310 -84140 -399393 -327328 -210038 -216108 -260317 -652564 -415749 1584 -174585 -535393
$$ packed form
14381C15263k4202j41648j31122J41566J61155j16109j73479K78859Q3182k98513
14371I4952j39968O1894K30915J49808j47255k61135L75993j95860O4443n7408
14361A76379j47088J75687j73050M20344K87417k73797l23923o54619K24834k88435
14351e76251l5016J94540M09254N21480j66558k50974k00176j72309N17478k07083
14341C4385J12316M78974Q3913p67211m29740P29778J53757j52139k55521l77389
14331c88877N24297j50076j2265m71335N4459K8112J09272L58329k28184J79257
14321B989n5803m35173j65149o2389N36708K17539o28260R2344L4542L62846J5666
14310h4140l15253P2065J17290o070m4209l92247K36815M17333j76169l60808
$$ plain form
14300 -535393 -79209 -416251 -371516 458669 410244 75214 36248 609638 445763 -16104
14290 -16104 121423 -52920 -223792 -125827 229837 223403 501829 672670 -46805 -283446
14280 -283446 -478424 -368323 -565137 -684880 -520597 -492293 -2034 -1505 -210649 -262227
14270 -262227 -232917 -122659 -559938 -838248 -382392 -184216 -202099 127101 279183 188547
14260 188547 162924 -26259 -27791 306263 732950 492192 561410 34883 -433896 26463
14250 26463 275481 77469 -77237 194811 282227 -483650 -317189 -290404 50026 205620
14240 205620 -78686 -593264 -469676 -166761 74023 311600 476939 239395 66433 141068
14230 141068 -10663 -153068 -54798 218966 -744276 -923921 217850 552148 196744 88234
$$ packed form
14300e35393M56184l37042M4735Q30185m8425l35030l8966N73390j63875m61867
14290a6104J37527j74343j70872R7965L55664o434K78426J70841p19475k36641
14280b83446j94978J10101j96814j19743J64283K8304M90259N29k09144n1578
14270b62227K9310J10258m37279k78310M55856J98176j7883L29200J52082r0636
14260A88547k5623j89183j532L34054M26687k40758O9218n26527m68779M60359
14250B6463K49018j98012j54706K72048Q7416p65877J66461K6785L40430J55594
14240B05620k84306n14578J23588L02915K40784K37577J65339k37544j72962P4635
14230A41068j51731j42405R8270K73764r63242j79645J141771L34298l55404j08510
$$ plain form
14220 88234 -234721 -221994 -350590 -188896 -227185 -256083 -197172 -323311 -440892 29656
14210 29656 -206934 -297189 -152948 -195249 106834 -91978 -173807 297147 398203 656892
14200 656892 281142 288105 737372 779034 474130 403757 865938 327095 195016 717813
14190 717813 420349 536639 215782 549755 705970 433406 256636 -122329 -135515 168573
14180 168573 438073 349385 -124205 -712860 -668742 -8911 202202 -44577 -169745 320734
14170 320734 280295 -233533 -86835 277040 286169 -188683 -143616 -291830 17539 122766
14160 122766 291701 253166 -319081 -223893 251986 -261950 -60089 -571 -678568 -615365
14150 -615365 130698 -548779 -142268 314109 123089 359582 262409 185819 300087 542138
$$ packed form
14220H8234l22955J2727j28596J61694l8289k8898N8911j26139j17581M70548
14210B9656k36590r0255J44241m2301L02083j98812q1829M70954J01056K58689
14200F56892l75750O963M49267M1662l04904p0373M62181n38843j32079N22797
14190G17813k97464J16290l20857L33973J56215k72564j76770l78965j3186L04088
14180A68573K69500q8688m73590n88655M4118O59831K11113k46779j25168M90479
14170C20734m0439n13828J46698L63875R129m74852M5067j48214L09369J05227
14160A22766J68935l8535n72247R5188M75879n13936K01861N9518o77997O3203
14150f15365P46063o79477M06511M56377j91020K36493r7173p6590J14268K42051
$$ plain form
14140 542138 494812 -169542 135652 340342 743756 743127 151399 -87455 80589 -18085
14130 -18085 92949 233826 -22149 88272 -29605 464371 262217 153783 253446 15247
14120 15247 -42693 -241685 -236290 -58728 130655 559809 119281 38245 61159 -274745 4031
14109 4031 350809 610184 665373 509360 550304 284143 17874 -13949 109882 -214376
14099 -214376 37099 -95455 164924 -248778 -548567 -207917 -74537 99281 46106 -290753
14089 -290753 -51111 -377105 172517 40433 -74720 -114550 57704 210757 -184172 46828
14079 46828 403335 -51061 -188537 -132340 47770 113426 27183 162845 216871 465916
14069 465916 880912 683778 279504 581568 180871 239466 499193 487002 -24212 253790
$$ packed form
14140E42138m7326o64354L05194K04690M03414o29n91728k38854J68044r8674
14130a8085J11034J40877k55975J10421j17877M93976k02154j08434R9663k38199
14120A5247n7940j98992N395J77562J89383M29154m40528q1036K2914l35904K78776
14109D031L46778K59375N5189j56013M0944k66161k66269l1823J23831l24258
14099b14376K51475j32554K60379m13702k99789L40650J33380J73818n3175l36859
14089b90753K39642l25994N49622j32084j15153l9830J72254J53053l94929K31000
14079D6828L56507m54396j37476N6197J80110O5656q6243J35662N4026K49045
14069D65916M14996j97134m04274L02064m00697N8595K59727j2191n11214K78002
$$ plain form
14059 253790 -373103 -58470 215725 584669 421392 204185 -106018 -346862 -137374 428323
14049 428323 502590 856856 1065147 1075354 1074686 643356 324126 513979 593897 485776 302579
14038 302579 909337 938010 479603 908526 733602 56695 120669 829435 890549 404309
14028 404309 734806 824682 649302 1109505 1305544 567710 448116 837176 548471 970644
14018 970644 860914 239287 535185 864218 132832 -316622 474236 482130 109959 879546
14008 879546 467161 381074 325739 185049 107015 854395 861445 -3441 -418785 -178429
13998 -178429 443416 882898 325365 133819 75733 375518 740219 183077 -76325 75531
13988 75531 31134 310807 246990 -124727 560028 401186 -16358 248274 859772 419227
$$ packed form
14059B53790o26893L14633K74195L68944j63277k17207l10203k40844K09488N65697
14049D28323P4267L54266K08291J0207o68m31330l19230J89853P9918j08121j83197
14038C02579O06758K8673m58407M28923j74924o76907O3974P08766O1114m86240
14028D04309L30497Q9876j75380M60203J96039p37834j19594L89060k88705M22173
14018I70644j09730o21627K95898L29033p31386m49454P90858P894l72171P69587
14008H79546m12385q6087n5335j40690p8034P47380P050q64886m15344K40356
13998a78429O21845M39482n57533j91546n8086K99785L64701n57142k59402J51856
13988G5531m4397K79673o3817l71717O84755j58842m17544K64632O11498m40545
$$ plain form
13978 419227 116324 974608 674484 -91084 320722 371803 386723 694258 1156724 1083349
13968 1083349 556077 914367 909640 995731 940081 1599 -139663 695564 600089 359513
13958 359513 123337 -1801 52477 263317 416998 249440 313818 627555 489892 220311
13948 220311 381344 291724 -34089 705980 229441 -719948 149208 424349 229361 74116
13938 74116 -178664 -526700 -149060 345651 -227721 -399127 118293 451020 366796 600553
13928 600553 674734 345306 519040 338205 -304036 509648 959615 450900 209634 249088
13918 249088 677382 428168 -93112 -416507 -619631 235965 301008 -440956 -51612 622268
13908 622268 826042 539336 715028 767709 888186 530881 322131 397883 588150 957746
$$ packed form
13978D19227l02903Q58284l00124p65568M11806N1081J4920L07535M62466p3375
13968A083349n27272L58290m727Q6091n5650r38482j41262Q35227r5475k40576
13958C59513k36176j25138N4278K10840J53681j67558O4378L13737j37663k69581
13948B20311J61033q9620l25813P40069m76539r49389Q69156K75141j94988j55245
13938G4116k52780l48036L77640M94711n73372j71406N17420L32727q4224K33757
13928F00553P4181l29428J73734j80835o42241Q13684M49967n08715k41266L9454
13918B49088M28294k49214n21280l23395k03124Q55596O5043p41964L89344O73880
13908F22268K03774k86706J75692N2681J20477l57305k08750P5752J90267L69596
$$ plain form
13898 957746 378887 60165 837529 839982 402859 488997 559232 279310 325737 397827 -141639
13887 -141639 -106431 313063 341388 238267 272081 594288 368642 538197 530141 553936 345847
13876 345847 230617 7995 662761 779521 786795 1222682 820992 395884 991879 479643
13866 479643 137677 716563 442130 750152 748168 439323 70212 178927 561616 548716
13856 548716 727373 753587 281166 635815 461765 433776 253683 585793 576890 373123
13846 373123 685176 106736 -28235 15798 -9818 223547 -301421 -870209 -151855 482668
13836 482668 555184 108347 -95088 135783 641981 1094089 1107074 361377 186472 661243
13826 661243 362708 355083 736273 1080690 860859 485989 394580 117718 -190187 -52191
$$ packed form
13898I57746n78859l18722P77364K453m37123Q6138P0235k79922M6427P2090n39466
13887a41639L5208M19494K8325j03121L3814L22207k25646J69555q056K3795k08089
13876C45847j15230k22622O54766J16760P274M35887m01690m25108N95995n12236
13866D79643l41966N78886k74433L08022j984l08845l69111J08715L82689j2900
13856E48716J78657K6214m72421L54649j74050k7989j80093L32110q903k03767
13846C73123L12053n78440j34971M4033k5616K33365n24968n68788P18354O34523
13836D82668P2516m46837k03435K30871N06198M52108J2985p45697j74905M74771
13826F61243k98535p625L81190L44417k19831l74870r1409k76862l07905J37996
$$ plain form
13816 -52191 -638917 -619200 -231208 -469054 -97602 353094 -569 516860 776840 818221
13806 818221 469943 111058 968983 927363 683351 531394 635688 1025657 645291 427259
13796 427259 -180301 -331029 458677 449854 264607 225105 279318 346517 187720 296545
13786 296545 307634 164446 505972 737927 1077264 1261380 887688 864456 -2736 274514
13776 274514 976417 436453 408142 536616 454560 980221 1038307 744013 399421 409168
13766 409168 463636 816533 1280897 775648 667699 867152 287151 127481 913507 409601
13756 409601 233556 146572 371812 615554 691521 325858 872867 1447635 1158600 531969
13746 531969 197465 176371 876096 1082492 975694 788608 608468 843095 550018 124694
$$ packed form
13816e2191n86726J9717L87992k37846L71452M50696l53663N17429K59980M1381
13806H18221l48278l58885Q57925m1620k44012j51957J04294L89969l80366k18032
13796D27259o07560j50728P89706q823j85247l9502N4213O7199j58797J08825
13786B96545J1089j43188L41526K31955L39337J84116l73692k3232q67192K77250
13776B74514P01903n39964k8311J28474q2056N25661N8086k94294l44592R747
13766D09168N4468L52897M64364n05249j07949J99453n80001j59670P86026n03906
13756D09601j76045q6984K25240K43742P5967l65663N47009N74768k89035o26631
13746E31969l34504k1094O99725K06396j06798j87086j80140K34627k93077m25324
$$ plain form
13736 124694 159168 475510 238327 -15630 319512 360508 141365 105439 184453 446514
13726 446514 338582 792112 501238 29551 440279 608797 607652 690348 395178 904233
13716 904233 1440003 1488449 1110190 1567131 1403145 1375715 711133 698847 1230469 1415371
13706 1415371 1076190 916332 891148 1106502 1565820 1342359 580150 1044716 651210 -91991
13696 -91991 378982 840657 937179 744653 442514 6188 630518 1037361 448046 761410
13686 761410 598561 961058 1565146 1413822 1566672 1085960 1639647 1630327 880446 1343818
13676 1343818 1627752 1350846 1694685 1404378 1609290 2589167 2658478 1347618 1001586
13667 1001586 1264244 1535861 1257812 1450828 1421157 1465069 1223025 1125890 1060708 1592195
$$ packed form
13736A24694L4474L16342k37183k53957L35142M0996k19143l5926P9014K62061
13726D46514j07932M53530k90874m71687M10728J68518j145Q2696k95170N09055
13716I04233N35770M8446l78259M56941j63986k7430o64582j2286N31622J84902
13706A415371l39181j59858k5184K15354M59318k23461p62209M64566l93506p43201
13696i1991M70973M61675R6522j92526l02139m36326O24330M06843n89315L13364
13686G61410j62849L62497O04088j51324J52850m80712N53687r320p49881M63372
13676A343818K83934k76906L43839k90307K04912R79877O9311j310860l46032
13667A001586K62658K71617k78049J93016k9671M3912k42044r7135o5182N31487
$$ plain form
13657 1592195 1570233 981692 958403 1025664 1109753 1314691 1373204 1313173 998157 1474286
13647 1474286 1473765 1487774 1835340 1492005 1714202 1279382 1290276 805421 -108657 395315
13637 395315 1067574 1360338 1020054 458697 127174 642963 1201982 670634 420400 1213834
13627 1213834 795642 760304 1372856 1045908 707089 969885 678699 1023630 811204 812938
13617 812938 1044967 1376502 1575029 1185506 588817 417887 960599 1622507 2086735 2026835
13607 2026835 1482206 1097695 1188853 1601242 1726377 1276527 965862 1323036 1286569 1529709
13597 1529709 1654701 1333132 1328982 1160178 1046576 1304050 1118921 928684 1171795 1313738
13587 1313738 1141064 883418 1144079 1230984 1111050 1038756 963312 830248 861261 1136306
$$ packed form
13657A592195k1962n88541k3289O7261Q4089K04938N8513o0031l15016M76129
13647A474286n21J4009L47566l43335K22197m34820J0894m84855r14078N03972
13637C95315O72259K92764l40284n61357l31523N15789N59019n31348k50234P93434
13627A213834m18192l5338O12552l26948l38819K62796k91186L44931k12426J734
13617H12938K32029L31535J98527l89523n96689j70930N42712O61908M64228n9900
13607B026835n44629l84511R1158M12389J25135m49850l10665L57174l6467K43140
13597A529709J24992l21569m150j68804j13602K57474j85129j90237K43111J41943
13587A313738j72674k57646K60661Q6905j19934p2294p5444j33064L1013K75045
$$ plain form
13577 1136306 1304995 1239736 954144 581740 1068443 1009002 1215509 918460 279960 520201
13567 520201 993981 1303727 1268760 652609 915675 492455 1570636 1734055 1007075 659736
13557 659736 1162951 708456 1466990 973434 1156854 1566324 1504842 1341817 1380900 871731
13547 871731 1038830 672948 1158328 1579568 1274610 1435706 1347387 794241 728998 2084518
13537 2084518 1809236 1186681 1413228 1218946 1337295 2223126 2230044 2011352 1772318 2131292
13527 2131292 1970619 1826784 1647974 1693105 1513541 1378875 1981097 2290054 1814594 1776575
13517 1776575 1800725 1764653 1764025 2055244 1467811 1782268 2257211 1952346 2193528 2508339
13507 2508339 2170863 1930993 1850276 1953081 2275858 2495224 2305372 2510155 2034430 1877836
$$ packed form
13577A136306J68689o5259k85592l72404M86703n9441K06507k97049o38500K40241
13567E20201M73780L09746l4967o16151K63066m23220J078181J63419p26980l47339
13557F59736N03215m54495P58534m93556J83420M09470o1482j63025L9083n09169
13547H71731J67099l65882M85380M21240l04958J61096q8319n53146o5243J355520
13537B084518k75282o22555K26547j94282J18349Q85831O918k18692k39034L58974
13527B131292j60673j43835j78810M5131j79564j34666O02222L08957m75460l8019
13517A776575K4150l6072o28K91219n87433L14457M74943l04865K41182L14811
13507B508339l37476k39870q0717J02805L22777K19366j89852K04783m75725j56594
$$ plain form
13497 1877836 2457364 2430125 2099675 1867000 1931409 1583920 1398199 1906147 2083873 2265154
13487 2265154 1926351 2000740 2302498 2184808 2376115 2227961 2686591 3136675 2690865 2631997
13477 2631997 2307387 2558964 2974386 2606544 2386272 2991826 2642455 2520659 2643156
13468 2643156 2428238 2446006 2144898 1666424 1690464 1910368 2208567 1967456 2173244 2274946
13458 2274946 2610223 2192815 2532695 2667465 2409307 2379503 2735417 2438437 2279864 1805389
13448 1805389 2096586 2277023 2167976 2426012 2125908 1515705 2122087 2073514 2040227 2464905
13438 2464905 2687924 2820567 2337873 1924271 2308379 3256373 3237345 2655279 2617885 2792455
13428 2792455 2913658 3024234 3197045 3111114 2612679 2941960 2626421 3198568 3443992 2762271
$$ packed form
13497A877836N79528k7239l30450k32675O4409l47489j85721N07948J77726J81281
13487B265154l38803P4389L01758j17690J91307j48154M58630M50084m45810n8868
13477B631997l24610K51577M15422l67842k20272O05554l49371j21796J22497
13468B643156k14918J7768l01108m78474K4040K19904K98199k41111K05788J01702
13458B274946L35277m17408L39880J34770k58158k9804L55914k96980j58573m74475
13448A805389K91197J80437j09047K58036l00104o10203O06382m8573l3287M24678
13438B464905K23019J32643m82694m13602L84108R47994j9028n82066l7394J74570
13428B792455J21203J10576J72811q5931m98435L29281l15539N72147K45424o81721
$$ plain form
13418 2762271 2740890 2877393 2963573 3795335 4415107 3973235 3659364 3500873 3392596 3756293
13408 3756293 3274408 3414267 3304240 2972408 3460472 3633386 3090551 3270508 3145605
13399 3145605 2489794 2467972 2967656 2759941 3182026 3112960 4170204 3660862 3703894 4239537
13389 4239537 3599926 3511025 3601029 4200701 4433088 3950966 4464107 4323438 4117968 3455582
13379 3455582 3581718 4006729 3779873 3936206 3812570 3683645 3838950 3919282 4090806 4353370
13369 4353370 4351051 4418166 4569750 4193683 4722313 5124878 5188255 5604690 5152426 5153803
13359 5153803 4912827 4633911 4816991 5207041 5954588 5876193 5318451 4641532 4516617 4742133
13349 4742133 5014642 4964456 4975576 4596087 4868165 5889923 5352318 5327703 5279907 5179474
$$ packed form
13418B762271k1381J36503Q6180Q31762O19772m41872l13871j58491j08277L63697
13408C756293m81885J39859j10027l31832M88064J72914n42835J79957j24903
13399C145605o55811k1822M99684k07715M22085o9066J057244n09342M3032N35643
13389D239537o39611q8901R0004N99672K32387m82122N13141j40669k05470o62386
13379C455582J26136M25011k26856J56333j23636j28925J55305Q0332J71524K62564
13369D353370k319O7115J51584l76067N28630M02565O3377M16435m52264J377
13359E153803k40976k78916J83080L90050P47547p8395n57742o76919j24915K25516
13349D742133K72509n0186J1120l79489K72078J021758n37605k4615m7796j00433
$$ plain form
13339 5179474 6057620 5664940 5399595 5713419 6081674 5768550 5357852 6083309 5281034
13330 5281034 5556526 6369184 5861898 6216587 6526244 6542731 6393602 5501943 5902070 6382662
13320 6382662 6532560 6288063 5971591 5712458 6280287 6600141 6789270 6845853 6521050 6781084
13310 6781084 7002048 6854478 6287840 6341596 6830280 6941775 7289064 7251911 7113833 7107439
13300 7107439 7339521 6784674 6816878 7453128 7746541 7996616 8045619 7780177 8037425 7842178
13290 7842178 8326256 8849773 8359619 8112291 8608380 8388275 8119912 8538521 8440110 8915364
13280 8915364 9050755 8762769 9774910 9820352 8951081 8605002 8961653 9883276 10215956
13271 10215956 9415597 9215923 9717456 9782084 9737532 9513507 9498783 9771887 9836279 10467374
$$ packed form
13339E179474Q78146l92680k65345L13824L68255l13124m10698P25457q02275
13330E281034K75492Q12658n07286L54689L09657J6487j49129q91659M00127M80592
13320F382662J49898k44497l16472k59133N67829L19854J89129N6583l24803K60034
13310F781084K20964j47570n66638N3756M88684J11495L47289l7153j38078o394
13300G107439K32082n54847L2204O36250K93413K50075M9003k65442K57248j95247
13290G842178M84078N23517m90154k47328M96089k20105k68363M18609r8411M75254
13280H915364J35391k87986J012141M5442q69271l46079L56651R21623L32680
13271A0215956q00359j99674N01533O4628m4552k24025j4724K73104O4392O31095
$$ plain form
13261 10467374 10213100 9964030 10741046 10485253 10344319 10852475 11383116 11466066 11731673
13252 11731673 11092157 11279075 12245322 12334533 12114507 12638218 12459781 12196636 12200696 12643178
13242 12643178 13046170 12798104 12844248 12845812 13221139 13418358 13444471 13365741 13957102 14176023
13232 14176023 14043401 14491564 14590402 14741969 15305343 15076746 15493188 15444824 16261378 16327378
13222 16327378 16003131 16636004 16667368 16652847 16960672 16889265 16970403 17342678 17554455 17178953
13212 17178953 17140847 17659153 18290937 19135582 19040415 18845681 18718702 19465313 19429421 19561758
13202 19561758 19969277 19956593 20350259 20557061 20450954 21030651 21403619 21600482 21646817 21787731
13192 21787731 21836147 22566495 22971623 22980771 23458625 24134362 24333871 24037856 24644217 24982902
$$ packed form
13261A0467374k54274k49070P77016k55793j40934N08156N30641Q2950K65607
13252A1731673o39516J86918R66247Q9211k20026N23711j78437k63145M060M42482
13242A2643178M02992k48066M6144J564L75327J97219K6113p8730N91361K18921
13232A4176023j32622M48163R8838J51567N63374k28597M16442m8364Q16554O6000
13222A6327378l24247O32873L1364j4521L07825p1407Q1138L72275K11777l75502
13212A7178953l8106N18306O31784Q44645r5167j94734j26979P46611l5892J32337
13202A9561758M07519j2684L93666K06802j06107N79697L72968J96863M6335J40914
13192B1787731M8416P30348M05128R148M77854O75737J99509k96015O06361L38685
$$ plain form
13182 24982902 25133057 25562579 25721529 26562727 27049133 27412119 27347615 27744929 28667002
13173 28667002 28882812 29114794 29187824 29581908 30239788 30509438 31273091 31562274 32349373
13164 32349373 33310359 33874009 34245223 34255938 34735151 35648154 36018471 36528095 36879164
13155 36879164 37376078 38137637 39072425 39693573 39826280 40203782 41059842 42027345 43000670
13146 43000670 43932765 44575484 45674814 46236375 47345861 48456106 49525416 50975532
13138 50975532 51535126 51592760 53117048 54728060 55439294 56710655 57602227 58104140 59584237
13129 59584237 60825146 61179741 63005287 64626660 65755366 67110095 68648630 69719457
13121 69719457 71693126 73487672 74395451 75967583 77756940 79646402 81224453 83171719
$$ packed form
13182B4982902J50155M29522J58950Q41198M86406L62986o4504L97314R22073
13173B8667002K15810K31982P3030L94084O57880K69650P63653K89183P87099
13164C2349373R60986N63650L71214J0715M79213R13003L70317N09624L51069
13155C6879164M96914P61559R34788O21148J32707L77502Q56060R67503R73325
13146D3000670R32095O42719J099330N61561J109486J110245J069310J450116
13138E0975532N59594N7634J524288J611012P11234J271361Q91572N01913J480097
13129E9584237J240909L54595J825546J621373J128706J354729J538535J070827
13121F9719457J973669J794546R07779J572132J789357J889462J578051J947266
$$ plain form
13113 83171719 85378296 87353032 89078172 91200219 93018462 95430590 97994760 100259176
13105 100259176 102236718 104445959 106992382 109801281 112302434 115230839 117745223 120648151
13097 120648151 123939653 126679653 129272710 132356930 136182832 139715746 143042705 146952074
13089 146952074 150241791 154082043 158656136 163020331 167316940 171773465 176539263 181008032
13081 181008032 186361320 191300998 196173968 201712796 206881081 212792323 219218576 225474637
13073 225474637 231927371 237889723 244736321 251467507 258118417 264857146 271355981 278688938
13065 278688938 286396668 293137702 299809684 306511736 313614597 319947344 326451811 333066097
13057 333066097 338571547 344384805 349549260 353840493 357973065 361612025 363964237 365739166
$$ packed form
13113H3171719K206577J974736J725140K122047J818243K412128K564170K264416
13105A00259176J977542K209241K546423K808899K501153K928405K514384K902928
13097A20648151L291502K740000K593057L084220L825902L532914L326959L909369
13089A46952074L289717L840252M574093M364195M296609M456525M765798M468769
13081A81008032N353288M939678M872970N538828N168285N911242O426253O256061
13073B25474637O452734N962352O846598O731186O650910O738729O498835P332957
13065B78688938P707730O741034O671982O702052P102861O332747O504467O614286
13057C33066097N505450N813258N164455M291233M132572L638960K352212J774929
$$ plain form
13049 365739166 367623981 368415323 367116491 365599287 363487828 360691703 357155446 353292827
13041 353292827 348216050 343198536 337407342 330870810 324076471 317379632 309908035 302160411
13033 302160411 294376614 286846016 279427960 272210094 264332758 256703129 249298603 241952276
13025 241952276 234347910 227618311 221174830 214649769 207858548 201610712 195542410 189224331
13017 189224331 183598511 178029281 172986688 167843633 162478194 157781121 153600044 149640073
13009 149640073 145638622 140727968 136929488 133507383 129445690 125516513 121846156 118588987
13001 118588987 115744112 112953304 110172975 106992392 104114424 101091298 98084779 95475803
12993 95475803 94091319 91933950 89209432 87020553 84576457 82579622 81133054 79353783
$$ packed form
13049C65739166J884815P91342j298832j517204k111459k796125l536257l862619
13041C53292827n076777n017514n791194o536532o794339o696839p471597p747624
13033C02160411p783797p530598p418056p217866p877336p629629p404526p346327
13025B41952276p604366o729599o443481o525061o791221o247836o068302o318079
13017A89224331n625820n569230n042593n143055n365439m697073m181077l959971
13009A49640073m001451m910654l798480l422105m061693l929177l670357l257169
13001A18588987k844875k790808k780329l180583k877968l023126l006519k608976
12993I5475803j384484k157369k724518k188879k444096j996835j446568j779271
$$ plain form
12985 79353783 77517669 74969561 72875615 71340673 70031277 68555393 67317745 65763461
12977 65763461 64027207 62472186 61243599 60320929 59276461 58148957 56757377 54904313
12969 54904313 54033931 53071097 52299808 51301171 50246489 48491558 47620127 46748557 46266358
12960 46266358 45491831 44582919 43292610 42598969 41709801 40870170 40262835 39832242 38861262
12951 38861262 37413775 36775862 36346593 35707945 35140789 34811021 34132996 33615254 32819825
12942 32819825 31962943 31522545 31495681 30638899 30073999 29514012 29282785 28923423 28562879
12933 28562879 27863736 26988851 26857958 26441050 26267919 25193416 24829196 24842772 23323428
12924 23323428 23406915 23413462 22869450 22910321 21967799 21348950 21229265 20744516 20495094 20031915
$$ packed form
12985G9353783j836114k548108k093946j534942j309396j475884j237648j554284
12977F5763461j736254j555021j228587r22670j044468j127504j391580j853064
12969E4904313q70382r62834p71289r98637j054682j754931q71431q71570m82199
12960D6266358p74527r08912j290309o93641q89168q39631o07335m30593r70980
12951C8861262j447487o37913m29269o38648n67156l29768o78025n17742p95429
12942C2819825q56882m40398k6864q56782n64900n59987k31227l59362l60544
12933B8562879o99143q74885j30893m16908j73131j074503l64220J3576j519344
12924B3323428Q3487O547n44012M0871r42522o18849j19685m84749k49422m63179
$$ plain form
12914 20031915 19777317 19231027 19703898 19311046 19126092 19011722 17855336 17557923 18165196
12905 18165196 18145299 18030812 17318457 17071621 16918279 17057635 16518566 15594199 15562200 16138503
12895 16138503 16124875 15387775 14735236 14955989 14493941 14068519 14048851 13759065 13891640 14050273
12885 14050273 13534562 13560354 13679413 13594435 13000245 12524079 12332660 12047677 12705334 12626159
12875 12626159 11709359 11805344 11636577 11648937 11720329 11722010 11692967 11498614 11065235 10368572
12865 10368572 10608598 10532929 10525430 10486693 10098432 9559402 9788542 10399504 9929304 9398048
12855 9398048 9320617 8739702 9493075 9689654 8981289 9290354 8692346 8501357 8544617 8372824
12845 8372824 8373910 8597524 8341144 7931845 8149724 8349660 8234148 7599645 7030127 7169750
$$ packed form
12914B0031915k54598n46290M72871l92852j84954j14370j156386k97413O07273
12905A8165196j9897j14487p12355k46836j53342J39356n39069r24367l1999N76303
12895A6138503j3628p37100o52539K20753m62048m25422j9668k89786J32575J58633
12885A4050273n15711K5792J19059q4978n94190m76166j91419k84983O57657p9175
12875A2626159r16800R5985j68767J2360P1392J681k9043j94353m33379o96663
12865A0368572K40026p5669p499l8737l88261n39030K29140O10962m70200n31256
12855I398048p7431n80915P53373J96579p08365L09065n98008j90989M3260j71793
12845H372824J086K23614k56380m09299K17879J99936j15512o34503n69518J39623
$$ plain form
12835 7169750 7146187 7015178 7113221 7456193 7067552 6763212 7286026 6867076 7356364 7296222
12825 7296222 7289611 6760413 6178041 6680049 6779758 6858169 6633928 6177827 6043807 6274529
12815 6274529 6716036 6311324 5493185 5468456 5432021 6320920 6091645 5011827 5115833 5591484
12805 5591484 5580585 5996687 5823300 5813016 6075410 5255612 6031919 5475037 5318962 5858911
12795 5858911 5384608 4517211 5192496 5574412 5152682 5265810 5613011 4388790 3880236
12786 3880236 4010753 4239828 4206386 4868670 4639812 3669533 3720492 3984258 4380215 4837184
12776 4837184 4720992 4027828 4025283 4400186 4327358 4223342 4366022 4118581 3670034 3643984
12766 3643984 4022396 4371173 4303924 3844333 3521674 3398281 3845976 3623277 3355908 3370301
$$ packed form
12835G169750k3563j31009R8043L42972l88641l04340N22814m18950M89288o0142
12825G296222o611n29198n82372N02008R9709P8411k24241m56101j34020K30722
12815F274529M41507m04712q18139k4729l6435Q88899k29275j079818J04006M75651
12805E591484j0899M16102j73387j0284K62394q19798P76307n56882j56075N39949
12795E858911m74303q67397O75285L81916m21730J13128L47201j224221n08554
12786C880236J30517K29075l3442O62284k28858r70279N0959K63766L95957M56969
12776D837184j16192o93164k545L74903p2828j04016J42680k47441m48547k6050
12766C643984L78412L48777o7249m59591l22659j23393M47695k22699k67369J4393
$$ plain form
12756 3370301 3000025 3007758 3386746 3504395 2813062 2923292 3019861 2484678 2642858 2538828
12746 2538828 2515773 2835323 2903570 2913478 3136386 3109801 3015722 3176434 3027576 2887832
12736 2887832 3303032 2950484 2818987 3027722 3191833 3027493 2587817 2669972 2893874 2542120
12726 2542120 2345821 2091118 1767560 2194255 2535767 2331544 2251822 1413934 1485812 2115445
12716 2115445 1837727 2187227 2981101 2344566 2261731 2318021 2909839 2892645 2533159 2624527
12706 2624527 2528125 2811632 2578548 2287899 2307564 2071736 2279600 2539539 2245412 2014033
12696 2014033 1688173 1933392 2204784 2016732 1557863 1839623 2027822 1626506 2074983
12687 2074983 1974482 1720388 1960569 1483026 1458505 1842609 1684407 894528 564865 1149217
$$ packed form
12756C370301l70276P733L78988J17649o91333J10230R6569n35183J58180j04030
12746B538828k3055L19550O8247R908K22908k6585r4079J60712j48858j39744
12736B887832M15200l52548j31497K08735J64111j64340m39676Q2155K23902l51754
12726B542120j96299k54703l23558M26695L41512k04223p9722q37888P1878O29633
12716B115445k77718L49500P93874o36535q2835N6290N91818j7194l59486R1368
12706B624527r6402K83507k33084k90649J9665k35828K07864K59939k94127k31379
12696B014033l25860K45219K71392j88052m58869K81760J88199m01316M48477
12687B074983j00501k54094K40181m77543k4521L84104j58202p89879l29663N84352
$$ plain form
12677 1149217 1555638 1671713 1226141 1292239 1516138 1732699 1830063 1389780 1437214 1898998
12667 1898998 1654333 1541817 1650767 2162604 2503000 2275186 1580892 1231259 1645227
12658 1645227 1767603 1409149 1664069 1382609 1335155 1517024 1646615 1146714 1692667 1897898
12648 1897898 1335299 1167589 1186051 864364 792989 805719 894065 757095 845140 749341
12638 749341 486607 592744 1073089 631315 466753 1203140 1334900 1422812 1321554 1290703
12628 1290703 1287694 1304383 1440953 1353976 796130 1116686 1172676 1078370 467120 686653
12618 686653 880876 1034905 618075 314264 -351087 106644 231543 642554 507158 67608
12608 67608 236861 679584 349020 1003622 1749219 940517 369389 981317 1305196 769279
$$ packed form
12677A149217M06421J16075m45572O6098K23899K16561R7364m40283M7434M61784
12667A898998k44665j12516J08950N11837L40396k27814o94294l49633M13968
12658A645227J22376l58454K54920k81460m7454J81869J29591m99901N45953K05231
12648A897898n62599j67710J8462l21687p1375J2730Q8346j36970Q8045r5799
12638G49341k62734J06137M80345m41774j64562P36387J31760Q7912j01258l0851
12628A290703l009J6689J36570q6977n57846L20556N5990r4306o11250K19533
12618F86653J94223J54029m16830l03811o65351M57731J24899M11011j35396m39550
12608F7608J69253M42723l30564O54602P45597q08702n71128O11928L23879n35917
$$ plain form
12598 769279 842654 866841 353209 966324 1076748 858556 745888 848696 901787 240776
12588 240776 311056 336875 -230021 364889 220369 80027 192156 -3960 753150 1200592
12578 1200592 768355 336598 397957 503212 433402 640243 1084988 1195845 1094464 1362030
12568 1362030 1118425 892723 987181 576714 956193 901171 461737 728223 535046 430559
12558 430559 482748 551872 294328 81427 237367 343479 759598 759315 598462 121449
12548 121449 418540 -74817 67577 809913 305418 26578 514151 887614 620417 607750
12538 607750 383985 -4006 773436 986535 1129631 1183331 750323 427564 747344 1087653
12528 1087653 1031053 901165 879115 659107 727219 542918 439518 52502 95353 182638
$$ packed form
12598G69279P3375K4187n13632O13115J10424k18192j12668J02808N3091o61011
12588B40776P0280K5819n66896N94910j44520j40342J12129j96116P57110M47442
12578A200592m32237m31757O1359J05255o9810K06841M44745J10857j01381K67566
12568A362030k43605k25702R4458m10467L79479n5022m39434K66486j93177j04487
12558D30559N2189O9124k57544k12901J55940J06112M16119k83j60853m77013
12548A21449K97091m93357J42394P42336n04495k78840M87573L73463k67197j2667
12538F07750k23765l87991P77442K13099J43096N3700m33008l22759L19780L40309
12528A087653n6600j29888k2050k20008O8112j84301j03400l87016M2851Q7285
$$ plain form
12518 182638 130876 339701 271749 225001 68869 241084 406778 830583 619358 588774
12508 588774 936695 442949 1027004 839653 584939 832673 112482 82711 296803 815168
12498 815168 526843 135099 516128 199244 870054 658867 -79012 130188 193672 583607
12488 583607 774199 695149 201682 -95432 -285348 -287315 118884 -191230 40933 -12072
12478 -12072 -492644 141527 610426 372639 168721 -315076 -345866 32300 851263 665546
12468 665546 650969 705587 511958 602287 548588 473441 411478 763613 793539 118237 296053
12457 296053 527769 156540 -54920 300719 617239 186390 -158129 -255373 158226 515179
12447 515179 214387 -212767 -130584 -15206 394251 984632 1207303 1090373 916895 554145
$$ packed form
12518A82638n1762K08825o7952m6748j56132J72215J65694M23805k11225l0584
12508E88774L47921m93746N84055j87351k54714K47734p20191k9771K14092N18365
12498H15168k88325l91744L81029l16884O70810k11187p37879K09200O3484L89935
12488E83607J90592p9050m93467k97114j89916j967M06199l10114K32163n3005
12478a2072m80572O34171M68899k37787k03918m83797l0790L78166Q18963j85717
12468F65546j4577N4618j93629R0329n3699p5147o1963L52135K9926o75302J77816
12457B96053K31716l71229k11460L55639L16520m30849l44519r7244M13599L56953
12447E15179l00792m27154Q2183J15378M09457N90381K22671j16930j73478l62750
$$ plain form
12437 554145 -67423 375938 600954 741044 339249 446917 691653 543847 823407 754006
12427 754006 465530 630228 708825 474463 360437 936753 759128 -321175 384713 609596
12417 609596 835315 357509 171013 -314770 -154381 92257 -37755 -334603 7475 316713
12407 316713 372367 96810 136318 -93908 -35642 -283453 319996 357084 132486 198362
12397 198362 -192537 339954 480074 -294279 -363743 -2725 136337 377925 207356 222177
12387 222177 -242782 330519 376594 257333 228442 1165370 1179493 590757 749333 1000342
12377 1000342 549146 609227 585919 597434 295802 693406 178226 -107264 861032 360108
12367 360108 -157364 -19520 310873 200118 -1655 351348 121497 -353373 74350 19521
$$ packed form
12437E54145o21568M43361K25016J40090m01795J07668K44736j47806K79560o9401
12427G54006k88476J64698P8597k34362j14026N76316j77625j080303P05888K24883
12417F09596K25719m77806j86496m85783J60389K46638j30012k96848L42078L09238
12407C16713N5654k75557L9508k30226N8266k47811O03449L7088k24598O5876
12397A98362l90899N32491J40120p74353o9464L61018J39062K41588j70569J4821
12387B22177m64959N73301M6075j19261k8891R36928J4123n88736J58576K51009
12377A000342m51196O0081k3308J1515l01632L97604n15180k85490R68296n00924
12367C60108n17472J37844L30393j10755k01773L53003k29851m74870M27723n4829
$$ plain form
12357 19521 -175546 -689556 -195645 -263915 -466624 -258913 -81777 204536 166499 -309533
12347 -309533 -85266 68686 -162264 -409467 -236679 -237733 -63997 279820 215923 -197118
12337 -197118 224967 -444807 -595389 -313255 -352452 -690483 -338939 -670826 -300257 -360969
12327 -360969 -785156 -684930 -397698 -311234 -51874 7104 -28162 -59863 418121 912217
12317 912217 336125 415351 734594 535298 168302 510290 714188 647851 218041 23356
12307 23356 -136318 441311 622851 563289 310544 258765 508584 539328 178498 387638
12297 387638 -56288 -384940 -315794 293176 363079 280564 5789 -559785 -555776 227525
12287 227525 416727 573662 501642 420274 -140858 -596570 -97298 456237 -295977 -103139
$$ packed form
12357A9521j95067n14010M93911o8270k02709K07711J77136K86313l8037m76032
12347c09533K24267J53952k30950k47203J72788j054J73736L43817o3897m13041
12337a97118M22085o69774j50582K82134l9197l38031L51544l31887L70569o0712
12327c60969m24187J00226K87232Q6464K59360N8978l5266l1701M77984M94096
12317I12217n76092P9226L19243j99296l66996L41988K03898o6337m29810j94685
12307B3356j59674N77629J81540n9562k52745n1779K49819L0744l60830K09140
12297C87638m43926l28652O9146O08970O9903q2515k74775n65574M009P83301
12287B27525J89202J56935p2020q1368n61132m55712M99272N53535p52214J92838
$$ plain form
12277 -103139 -560825 -734562 128274 -14142 -922094 -447348 -347664 -108091 133178 417175
12267 417175 480049 436114 -47935 -143204 -245682 198920 407324 175310 -213137 -232551
12257 -232551 333397 381728 118884 157309 460705 89250 -260921 -327965 -482919 109379
12247 109379 384965 72001 -118083 -490388 -604016 -653918 -268680 -533245 -681735 -189722
12237 -189722 -290888 -504650 -364984 -591319 -633544 -799385 -193620 86740 163979 -263456
12227 -263456 -626880 -997654 -1195305 -1213927 -872276 -327809 362911 441980 156524 -286884
12217 -286884 198582 -140153 -508386 -814794 -365212 -464778 -531085 -365748 -37615 -106850
12207 -106850 163804 -12825 306148 286951 275699 389392 -14730 -633332 -580306 -229916
$$ packed form
12277a03139m57686j73737Q62836j42416r07952M74746R9684K39573K41269K83997
12267D17175O2874m3935m84049r5269j02478M44602K08404k32014l88447j9414
12257b32551N65948M8331k62844L8425L03396l71455l50171o7044j54954N92298
12247A09379K75586l12964j90084l72305j13628m9902L85238k64565j48490M92013
12237a89722j01166k13762J39666k26335m2225j65841O05765K80360P7239m27435
12227b63456l63424l70774j97651j8622L41651N44467O90720P9069k85456m43408
12217b86884M85466l38735l68233l06408M49582r9566o6307J65337L28133o9235
12207a06850K70654j76629L18973j9197j1252J13693m04122o18602N3026L50390
$$ plain form
12197 -229916 786 360728 289661 -181435 39596 40797 -465094 -352994 -1043485 -1069996
12187 -1069996 -245337 -637816 -1247481 -378141 -853353 -681180 -549429 -257673 -83743
12178 -83743 -248740 -315421 -375181 -404255 92049 -153566 -10983 -109291 -210449 -267351 19354
12167 19354 309141 82065 -203247 -766968 -1065335 -956413 -717299 -1058023 -1189790 -850044
12157 -850044 -561668 -750039 -1072821 -914607 -752768 -405216 -319459 -399173 -127686 42342
12147 42342 -295974 -123964 12547 -214923 -727784 -497694 -591999 -960738 -836131 -729043
12137 -729043 -274055 -43430 -359604 -741677 -434669 -800673 -46050 74222 336435 132888
12127 132888 -208213 -410265 -472196 -272692 223956 299882 178510 -1602 664354 229822
$$ packed form
12197b29916K30702L59942p1067m71096K21031J201n05891J12100o90491k6511
12187a069996Q24659l92479o09665Q69340m75212J72173J31751K91756J73930
12178h3743j64997o6681n9760k9074M96304k45615J42583r8308j01158n6902K86705
12167A9354K89787k27076k85312n63721k98367J08922K39114l40724j31767L39746
12157h50044K88376j88371l22782J58214J61839L47552Q5757p9714K71487J70028
12147D2342l38316J72010J36511k27470n12861K30090r4305l68739J24607J07088
12137g29043M54988K30625l16174l82073L07008l66004P54623J20272K62213k03547
12127A32888l41101k02052o1931J99504M96648P5926j21372j80112O65956m34532
$$ plain form
12117 229822 -92151 370814 195357 181435 388359 465969 288381 352171 371782 383441
12107 383441 30540 -816974 -729924 -684327 -604324 -276584 -336820 -682108 -864380 -472539
12097 -472539 -188824 -295596 -523414 -253067 -39695 -207570 -328610 -968750 -653190 112335
12087 112335 -190782 -65584 -34634 -474979 -592478 -176961 -85323 475140 -97901 -452713
12077 -452713 -283228 44239 123724 -319670 -254719 25990 75968 882077 703478 -88317
12067 -88317 -169311 182259 402284 725050 730138 235316 251135 979455 876662 334190
12057 334190 199718 -182525 -149841 145561 29800 -20984 -472993 -502156 -446847 -605808
12047 -605808 -422634 -105161 -232753 -248411 -124669 -331232 -160838 -214519 -168811 -109649
$$ packed form
12117B29822l21973M62965j75457j3922K06924P7610j77588O3790J9611J1659
12107C83441l52901q47514Q7050M5597Q0003L27740o0236l45288j82272L91841
12097d72539K83715j06772k27818K70347K13372j67875j21040o40140L15560P65525
12087A12335l03117J25198L0950m40345j17499M15517R1638N60463n73041l54812
12077d52713J69485L27467P9485m43394O4951K80709M9978Q06109j78599p91795
12067h8317q0994L51570K20025L22766N088m94822J5819P28320j02793n42472
12057C34190j34472l82243L2684K95402j15761n0784m52009k9163N5309j58961
12047f05808J83174L17473j27592j5658J23742k06563J70394n3681M5708N9162
$$ plain form
12037 -109649 -515253 -565161 -180047 42598 123389 -72928 37896 -451520 -558515 114119
12027 114119 -49134 -302248 -195495 -410545 -332370 390244 424405 453491 -252726 -668616
12017 -668616 -387249 3669 -327557 -499166 -965707 -436434 127005 76669 -208113 -239021
12007 -239021 -527907 -458712 -610941 -449697 -966935 -698025 -191598 -408463 -266121 281785
11997 281785 -238043 -261749 -484779 -462938 285134 519015 490309 136475 553440 183006
11987 183006 234296 214632 -29564 -434971 132223 123440 -143183 -328603 164538 -181422
11977 -181422 -464074 -186038 163606 -172399 -596403 -850957 -906967 -446452 -164493 -449023
11967 -449023 -298486 -423598 -565276 -288912 -192777 -575130 -468112 209070 12233 -199101
$$ packed form
12037a09649m05604m9908L85114K22645Q0791j96317J10824m89416j06995O72634
12027A14119j63253k53114J06753k15050P8175P22614L4161K9086p06217m15890
12017f68616K81367L90918l31226j71609m66541N29273N63439n0336k84782l0908
12007b39021k88886O9195j52229J61244n17238K68910N06427k16865J42342N47906
11997B81785n19828k3706k23030K1841P48072K33881k8706l53834M16965l70434
11987A83006N1290j9664k44196m05407N67194q783k66623j85420M93141l45960
11977a81422k82652K78036L49644l36005m24004k54554n6010M60515K81959k84530
11967d49023J50537j25112j41678K76364R6135l82353J07018O77182j96837k11334
$$ plain form
11957 -199101 -64626 -559366 -306002 -496177 -421690 -343610 -172219 -529526 -864569 -434776
11947 -434776 -261061 -53207 95476 -874417 -1034134 -823790 -379313 -326937 -304670 -471612
11937 -471612 -749909 -61418 -375381 -660334 -430265 -588297 -1180684 -1048020 -402215 -1093585
11927 -1093585 -768066 -546042 -359903 145128 -590287 -357965 102082 -170789 285725
11918 285725 -576685 -1075835 -339002 356510 -144939 18149 -130583 -1008459 -473402 -365519
11908 -365519 -562810 -143543 -427026 -187638 41682 -153223 -96122 -54574 -131026 -366732
11898 -366732 318742 804683 -130575 -380276 135334 -278079 -42013 -194142 -166405 -587650
11888 -587650 -716607 -696152 -701371 -467086 -719182 -1000221 -380028 -712872 -486019 -550748
$$ packed form
11957a99101J34475m94740K53364j90175P4487P8080J71391l57307l35043M29793
11947d34776J73715K07854J48683r69893j59717K10344M44477N2376K2267j66942
11937d71612k78297O88491l13963k84953K30069j58032n92387J32664O45805o91370
11927a093585L25519K22024J86139N05031p35415K32322M60047k72871M56514
11918B85725q62410m99150P36833O95512n01449J63088j48732q77876N35057J07883
11908c65519j97291M19267k83483K39388K29320j94905N7101M1548p6452k35706
11898c66732O85474M85941r35258k49701N15610m13413K36066j52129K7737m21245
11888e87650j28957K0455n219K34285k52096k81039O20193l32844K26853o4729
$$ plain form
11878 -550748 -416507 -786631 -485070 -20828 82971 -274676 141037 569219 211611 -313924
11868 -313924 63507 760828 199425 138645 302595 152308 219615 337207 361751 452639
11858 452639 234947 -223682 -84666 -39390 114859 -152334 -127474 121902 798923 974086
11848 974086 712382 378336 -672376 -736626 299404 -289013 -407536 -131626 -162591 -404451
11838 -404451 -689031 -19027 -438778 -272324 -509318 -724491 -612232 -374284 -600603 -554628
11828 -554628 -485185 -519444 -629398 -143636 -654800 -885019 -486361 -434150 -271165 -255345
11818 -255345 -261634 -623666 -801193 -438813 -575537 -927369 -629650 -671710 -976575 -1181482
11808 -1181482 -1032645 -1013862 -943041 -833046 -960522 -1095830 -671555 -76733 -330036 -42120
$$ packed form
11878e50748J34241l70124L01561M64242J03799l57647M15713M28182l57608n25535
11868c13924L77431O97321n61403o0780J63950j50287O7307J17592K4544R0888
11858D52639k17692m58629J39016M5276J54249k67193K4860K49376O77021J75163
11848I74086k61704l34046j050712o4250J036030n88417j18523K75910l0965k41860
11838d04451k84580O70004m19751J66454k36994k15173J12259K37948k26319M5975
11828e54628O9443l4259j09954M85762n11164k30219L98658N2211J62985J5820
11818b55345o289l62032j77527L62380j36724l51832K97719m2060l04865k04907
11808a181482J48837J8783P0821J09995j27476j35308M24275N94822k53303K87916
$$ plain form
11798 -42120 52668 -175240 118185 -24140 -174296 195121 392731 -289964 -682435 -839322
11788 -839322 -331309 176974 258023 -412062 -567738 -486351 33262 31091 -332379 -425567
11778 -425567 -153794 -124652 -14533 -230398 -553583 -550983 -1005246 -1083259 -844190 -564705
11768 -564705 -1095723 -900913 -412087 -711234 -620034 -556238 -1049780 -860249 -81535 154058
11758 154058 -54397 -417462 -285876 -416543 273533 483172 -97908 -9471 179686 303089
11748 303089 243697 18838 -277091 -759501 -488674 -409490 -477378 -183828 -136453 -181380
11738 -181380 -570151 -436422 -483968 -248252 -173377 -161193 -365187 -448082 -925070 -654092
11728 -654092 -608283 -382160 -748107 -383456 -1102168 -1172719 -735664 -494250 -872844 -1228422
$$ packed form
11798d2120R4788k27908K93425j42325j50156L69417J97610o82695l92471j56887
11788h39322N08013N08283Q1049o70085j55676Q1387N19613k171l63470r3188
11778d25567K71773K9142J10119k15865l23185K600m54263p8013K39069K79485
11768e64705n31018J94810M88826k99147R1200O3796m93542J89531P78714K35593
11758A54058k08455l63065J31586j30667O90076K09639n81080Q8437J89157J23403
11748C03089n9392k24859k95929m82410K70827P9184o7888K93550M7375m4927
11738a81380l88771J33729m7546K35716P4875J2184k03994q2895m76988K70978
11728f54092M5809K26123l65947L64651p18712p0551M37055K41414l78594l55578
$$ plain form
11718 -1228422 -1170676 -1171429 -1025319 -460042 -352026 35283 -383753 -575832 -281778 -503909
11708 -503909 -444746 -591969 -364090 -529688 -803315 26401 -290859 -1173720 -360342 -108343
11698 -108343 -409439 -734467 -700372 -357633 -285871 -200771 -312848 -506020 -318309 -112777
11688 -112777 28884 -450624 -539852 185186 39786 -610274 -718733 -742645 -471412 115781
11678 115781 -226796 -220645 314574 -184384 -306701 -217352 165909 -278512 -153884 -325931
11668 -325931 -466472 -75464 -26405 -817089 -266173 -519511 -1202627 -567380 19107 -83111
11658 -83111 -309976 -1030312 -647441 -229382 12537 340091 -575765 -708449 386814 449204
11648 449204 102818 168352 199834 -227136 351319 374248 21439 118427 -98782 -173306
$$ packed form
11718a228422N7746p53J46110N65277J08016L87309m19036j92079K94054k22131
11708e03909N9163j47223K27879j65598k73627Q29716l17260q82861Q13378K51999
11698a08343l01096l25028L4095L42739P1762Q5100j12077j93172J87711K05532
11688a12777J41661m79508q9228P25038j45400o50060j08459k3912K71233N87193
11678A15781l42577O151N35219m98958j22317Q9349L83261m44421J24628j72047
11668c25931j40541L91008M9059p90684N50916k53338o83116O35247N86487j02218
11658h3111k26865p20336L82871M18059K41919L27554r15856j32684J095263O2390
11648D49204l46386O5534L1482m26970N78455K2929l52809R6988k17209p4524
$$ plain form
11638 -173306 -188762 -338921 -893718 -574510 -483371 -783434 -1313293 -1323790 -944705 -983729
11628 -983729 -1089280 -1551845 -1902891 -1622867 -1260617 -585479 -1065278 -939485 -621140 -849963
11618 -849963 -437357 144906 149210 -289347 -64142 -72238 -62599 228513 81960 396167 379389
11607 379389 93394 29206 -9138 -56465 -259434 -97652 234760 500251 41272 -416774
11597 -416774 -590889 179308 695981 28483 -50794 -374879 -142279 -123765 -70154 -439161
11587 -439161 -511549 -87312 -266337 -424465 -606301 -573204 -117304 -548969 -267247 -468921
11577 -468921 259130 -294818 -1070153 -598769 -482762 -102437 -458150 -817698 -983504 -665769
11567 -665769 -512439 -415775 -200925 -83852 342950 695667 -175966 -324557 -366879 126269
$$ packed form
11638a73306j5456j50159n54797L19208R1139l00063n29859j0497L79085l9024
11628i83729j05551m62565l51046K80024L62250O75138m79799J25793L18345k28823
11618h49963M12606N82263M304m38557K25205q096R639K91112j46553L14207j6778
11607C79389k85995o4188l8344m7327k02969J61782L32412K65491m58979m58046
11597d16774j74115P70197N16673o67498p9277l24085K32600J8514N3611l69007
11587d39161p2388M24237j79025j58128j81836L3097M55900m31665K81722k01674
11577d68921P28051n53948p75335M71384J16007L80325l55713l59548j65806L17735
11567f65769J53330R6664K14850J17073M26802L52717q71633j48591m2322M93148
$$ plain form
11557 126269 -449616 3990 -562627 -89715 226247 -224605 -324718 -541568 -461153 318270
11547 318270 42119 -360649 -437896 -210539 -729897 -963455 -311209 -384277 34968 69417
11537 69417 114233 -697499 -635739 -611722 -919917 -515987 -404426 -98117 -520315 -548228
11527 -548228 251928 112054 441543 674968 225737 400115 535561 396371 681254 328377
11517 328377 -342399 305892 405116 -203047 -151807 -273303 -125480 -198103 -220571 -380879
11507 -380879 -455912 -111554 -314002 -702775 -584021 -618112 -798887 -796469 -378028 -506768
11497 -506768 -774335 -1016495 -855071 -349492 -173725 -185700 -97399 -633082 -612664 -303411
11487 -303411 -367571 -459128 -61535 91371 276853 -159119 -131501 -523536 -641617 -570556
$$ packed form
11557A26269n75885M53606n66617M72912L15962m50852j00113k16850Q0415P79423
11547C18270k76151m02768p7247K27357n19358k33558O52246p3068M19245L4449
11537F9417M4816q11732O1760K4017l08195M03930J11561L06309m22198k7913
11527e48228Q00156j39874L29489K33425m49231J74378J35446j39190K84883l52877
11517C28377o70776O48291R9224o08163N1240j21496J47823p2623k2468j60308
11507c80879p5033L44358k02448l88773J18754l4091j80775K418M18441j28740
11497e06768k67567k42160J61424N05579J75767j1975Q8301n35683K0418L09253
11487c03411o4160r1557L97593J52906J85482m35972K7618l92035j18081P1061
$$ plain form
11477 -570556 -154232 -618420 -1146361 -695719 -133888 -28760 -37725 -12133 -381096 -525391
11467 -525391 128760 -246239 -284565 -309065 -235379 348103 104690 40774 -136072 -378224
11457 -378224 -155441 140801 -227154 -729311 -324577 113806 547527 -221284 -715797 -164986
11447 -164986 -198723 -365899 -340018 -168190 -525504 -672201 198811 -267315 -609117 -1256013
11437 -1256013 -1149424 -698284 -1004545 17184 -488593 -716918 -784457 -243708 -111880
11428 -111880 -537155 -321107 -299515 53257 -201660 -888302 -209559 -42863 -42952 -356579
11418 -356579 -314830 -52043 -287025 28116 129357 246590 135793 -222023 -161702 -484281
11408 -484281 -545318 -694317 -739673 -698585 -513825 -1043228 -1085143 -857187 -738117 -739380 -661360
$$ packed form
11477e70556M16324m64188n27941M50642N61831J05128q965K5592l68963j44295
11467e25391O54151l74999l8326k4500P3686N83482k43413o3916j76846k42152
11457c78224K22783K96242l67955n02157M04734M38383M33721p68811m94513N50811
11447a64986l3737j67176K5881J71828l57314j46697Q71012m66126l41802o46896
11437a256013J06589M51140l06261J021729n05777k28325o7539N40749J31828
11428a11880m25275K16048K1592L52772k54917o86642O78743J66696q9l13627
11418c56579M1749K62787k34982L15141J01241J17233j10797l57816O0321l22579
11408d84281o1037j48999m5356M1088J84760n29403m1915K27956J19070j263P8020
$$ plain form
11397 -661360 -843787 -593248 -522606 -297668 -275481 -291734 -111269 -63690 -10715 329520
11387 329520 33877 -134853 5656 -622328 -407350 -459284 -406515 394495 -255200 -295497
11377 -295497 468934 111159 -606824 -170804 -531398 -1002806 67017 -9543 -220314 323947
11367 323947 -667551 -789303 -156959 149683 -533775 -183366 272913 -697955 -957526 -140679
11357 -140679 -479799 -686865 -1135266 -742490 -369392 -460734 -473891 -422680 -273351 -394043
11347 -394043 -334316 -566138 -263072 402960 497136 -98056 -206089 206279 567336 -20401
11337 -20401 131170 345007 337055 406022 657704 -244179 -413186 41713 -326038 -502076
11327 -502076 -259493 -168571 36912 162980 478756 153517 73588 336473 1226 -295418
$$ packed form
11397f61360j82427K50539P0642K24938K2187j6253J80465M7579N2975L40235
11387C29520k95643j68730J40509o27984K14978n1934N2769Q01010o49695m0297
11377b95497P64431l57775p17983M36020l60594m71408J069823p6560k10771N44261
11367C23947r91498j21752O32344L06642o83458L50409M56279r70868k59571Q16847
11357a40679l39120k07066m48401L92776L73098r1342j3157N1211J49329j20692
11347c94043N9727k31822L03066O66032R4176n95192j08033M12368L61057n87737
11337b0401J51571K13837p952O8967K51682r01883j69007M54899l67751j76038
11327e02076K42583R0922K05483J26068L15776l25239p9929K62885l35247k96644
$$ plain form
11317 -295418 -168774 208928 110846 183441 -169486 -543987 -218478 -317059 -7520 -299204
11307 -299204 -490578 -317307 -323923 -380173 -241278 -886546 -1011328 -479161 -152211 -479824
11297 -479824 -79977 -70360 311652 -19505 -64293 -191071 -157136 22883 -31298 -249988
11287 -249988 -255130 -365309 -139931 377565 145566 -318647 -132932 -255280 10063 -132090
11277 -132090 -75245 -98949 -527627 -213404 -183339 -202203 33849 -194850 -37360 -219467
11267 -219467 -547145 -573388 -898997 -570962 -673358 -965336 -1141144 -703547 -531043 -427544
11257 -427544 -429713 -322966 -912474 -849903 -776814 -508573 -14717 109978 -573923 -746606
11247 -746606 -280353 276345 614366 261758 -355769 -491706 -716178 -109155 -254700 130773
$$ packed form
11317b95418J26644L77702r8082P2595l52927l74501L25509r8581L09539k91684
11307b99204j91374J73271o616n6250J38895o45268j24782N32167L26950l27613
11297d79824L99847R617L82012l31157m4788j26778L3935J80019n4181k18690
11287b49988n142j10179K25378N17496k31999m64213J85715j22348K65343j42153
11277a32090N6845k3704m28678L14223L0065j8864K36052k28699J57490j82107
11267b19467l27678k6243l25609L28035j02396k91978j75808M37597J72504J03499
11257d27544k169J06747n89508O2571P3089K68241M93856J24695o83901j72683
11247g46606M66253N56698L38021l52608o17527j35937k24472O07023j45545L85473
$$ plain form
11237 130773 325592 -312345 -448271 -443555 -264541 -676491 -307089 -237109 -212216 -226226
11227 -226226 -718130 -638178 -533721 -198047 -207522 -541365 -612479 -678983 -134723 -326790
11217 -326790 -76152 644631 -89972 -353457 -623784 -41194 -1197 31143 -151043 -362422
11207 -362422 -333777 -103843 -240615 -505477 -78529 -166936 -201028 -253410 -527325 -660753
11197 -660753 -682828 -734079 -1114471 -359041 -655511 -1330247 -453667 -1075027 -1041508 -597598
11187 -597598 -649909 -733690 -673687 -402703 -672425 -783551 3507 310169 130055 -352667
11177 -352667 -191108 -751507 -345545 -381005 -520083 170582 -59032 -315587 -330051 242663
11167 242663 295726 -356248 151694 -452690 -482152 -268822 -319846 96181 -412293 -157632
$$ packed form
11237A30773J94819o37937j35926M716J79014m11950L69402O9980K4893j4010
11227b26226m91904P9952J04457L35674r475l33843p1114o6504N44260j92067
11217c26790K50638P20783p34603k63485k70327N82590L9997L2340j82186k11379
11207c62422K8645K29934j36772k64862M26948q8407l4092n2382k73915j33428
11197f60753k2075n1251l80392P55430k96470o74736Q76580o21360L3519M43910
11187e97598n2311q3781O0003K70984k69722j11126P87058L06662j80114m82722
11177c52667J61559n60399M05962l5460j39078O90665k29614k56555j4464N72714
11167B42663N3063o51974N07942o04384k9462K13330n1024M16027n08474K54661
$$ plain form
11157 -157632 -413423 -271832 208645 31221 -107722 -514126 -830878 -754724 -990902 -456286
11147 -456286 -501570 -420209 -316503 -547852 -527006 -437431 -221678 -41735 -173527 -367006
11137 -367006 -339302 -126355 -254017 -424812 -193628 -201429 -421452 -195482 -25573 267644
11127 267644 -88270 -578688 -168210 -136185 -61293 266199 -227066 -353226 175697 222554
11117 222554 110828 319955 630005 383723 -269778 -396552 -339285 -289239 -310464 95127
11107 95127 -129808 429541 666926 156763 266030 286661 -40295 -128137 -232854 270736
11097 270736 -829 -214394 -171427 -1112912 -816339 92442 -308713 -209763 -227523 -252051
11087 -252051 186246 125388 236503 362726 311903 88818 -189264 568900 1241289 282994
$$ packed form
11157a57632k55791J41591M80477j77424j38943m06404l16752P6154k36178N34616
11147d56286m5284Q1361J03706k31349K0846Q9575K15753J79943j31792j93479
11137c67006K7704K12947j27662j70795K31184p801k20023K25970J69909K93217
11127B67644l55914m90418M10478L2025P4892L27492m93265j26160N28923M6857
11117B22554j11726K09127L10050k46282o53501j26774N7267N0046k1225M05591
11107I5127k24935N59349K37385n10163J09267K0631l26956q7842j04717N03590
11097B70736k71565k13565M2967r41485K96573R08781m01155R8950j7760k4528
11087b52051M38297o0858J11115J26223n0823k23085k78082P58164O72389r58295
$$ plain form
11077 282994 261122 361535 110664 557465 357626 -83039 -107276 -180522 -234851 100340
11067 100340 -8751 -61144 -281314 -561616 141554 436683 631709 449813 -172387 101051
11057 101051 203501 -152860 600127 662256 -507259 -591119 455427 -15623 17627 -694314
11047 -694314 -866681 -676984 -502702 -275130 -213516 -470711 -704245 -754904 -302650 -540752
11037 -540752 71966 -448048 -398805 -730940 -349097 -10220 139032 397348 18823 51425
11027 51425 311071 -229603 260430 481203 695960 654023 629514 192023 114157 508238
11017 508238 74967 -380610 -479397 -405635 79535 414120 18725 -352964 -534925 131746
11007 131746 601844 833006 806943 632307 90404 -300226 -137817 323020 76957 206657
$$ packed form
11077B82994k1872J00413k50871M46801j99839m40665k4237p3246n4329L35191
11067A00340j09091n2393k20170k80302P03170K95129J95026j81896o22200K73438
11057A01051J02450l56361P52987O2129j169515q3860J046546m71050L3250p11941
11047f94314j72367J89697J74282K27572O1614k57195k33534n0659M52254k38102
11037e40752O12718n20014M9243l32135L81843L38877J49252K58316l78525L2602
11027E1425K59646n40674M90033K20773K14757m1937k4509m37491p7866L94081
11017E08238m33271m55577r8787P3762M85170L34585l95395l71689j81961O66671
11007A31746M70098K31162k6063j74636n41903l90630J62409M60837k46063J29700
$$ plain form
10997 206657 -367680 -682338 -770767 -353476 -494248 -502549 -313127 -747776 -345805 -68903
10987 -68903 -548146 -302361 -547053 112231 5120 -582725 -340220 -492197 -852660 -495232
10977 -495232 -486587 -146836 -801299 -495134 -413044 -305311 -204798 -704949 -714518 8652
10967 8652 -287665 -283490 12689 542301 388826 -308036 -487814 234115 170104 -475217
10957 -475217 -513808 -320949 -185839 53560 -637181 -646177 -115860 143236 -583525 -467101
10947 -467101 -59653 -229969 -115729 209050 -158202 12211 79971 314179 -59100 -212568
10937 -212568 207787 208514 -222863 200566 -366490 -174507 -166286 -1225496 -1013268 35712
10927 35712 485510 -266345 -522995 -406153 -457822 -212189 409803 -834372 -602563 -42246
$$ packed form
10997B06657n74337l14658q8429M17291j40772q301J89422m34649M01971K76902
10987f8903m79243K45785k44692O59284j07111n87845K42505j51977l60463L57428
10977d95232Q645L39751o54463L06165Q2090J07733J00513n00151r569P23170
10967H652k96317M175K96179N29612j53475o96862j79778P21929o4011o45321
10957d75217l8591J92859J35110K39399o90741q996N30317K59096p26761J16424
10947d67101M07448j70316J14240L24779l67252J70413O7760K34208l73279j53468
10937b12568M20355P27m31377M23429n67056J91983Q221j059210K12228J048980
10927C5712M49798p51855k56650J16842n1669K45633O21992j244175K31809N60317
$$ plain form
10917 -42246 -267797 -215433 178258 -777763 -571920 -927809 -779274 -805675 -755221 -847732
10907 -847732 -724530 -596782 -457693 -793621 -506024 -915730 -644485 -33204 122805 -143043
10897 -143043 -293920 -182457 -212873 -53164 64493 -144949 -609213 -331858 3748 -450751
10887 -450751 8823 -382630 -438004 -498046 -386276 -197936 -551712 -492626 -377394 -309809
10877 -309809 -370309 -458539 -8989 -5250 -461059 -641865 -86709 -123663 61579 419116
10867 419116 286157 -37188 125236 43903 -596648 -430948 -59646 -583227 -427371 -224979
10857 -224979 64795 -42402 129499 58733 309053 448293 129287 308956 -215470 133987
10847 133987 255768 -171972 192988 20376 -897530 -1094209 -1291453 -694753 -386855 -226798
$$ packed form
10917d2246k25551N2364L93691r56021K05843l55889J48535k6401N0454r2511
10907h47732J23202J27748J39089l35928K87597m09706K71245O11281J56009k65848
10897a43043j50877J11463l0416J59709J17657k09442m64264K77355L35606m54499
10887d50751M59574l91453n5374o0042J11770J88340l53776N9086J15232O7585
10877c09809o0500q8230M49550L739m55809j80806N55156l6954J85242L57537
10867D19116j32959l23345J62424q1333o40551J65700L71302n23581J55856K02392
10857b24979K89774j07197J71901p0766K50320J39240l19006J79669n24426L49457
10847A33987J21781m27740L64960j72612r17906j96679j97244N96700L07898J60057
$$ plain form
10837 -226798 -468194 -96326 -20829 -457247 -407436 -927 -435137 -500388 -577208 -384225
10827 -384225 -337741 109866 228199 -301775 -658553 -761792 -555663 -4695 124124 -434424
10817 -434424 -598835 -10685 58107 488193 827052 127487 -335981 142354 96168 741716
10807 741716 264147 -280393 -172997 -695420 -337788 633936 386036 31826 51145 530863
10797 530863 29580 129912 211436 -67728 -166663 -498841 -343166 191927 247846 -130726
10787 -130726 -328349 -476961 -397165 378027 627887 339237 384597 -119021 -220384 -218268
10777 -218268 110754 59294 -46098 144556 228198 -11325 -302047 -474941 -254897 34327
10767 34327 -290570 -425089 -126163 -224587 -40808 -208274 -854038 -1132982 -853034 -574810
$$ packed form
10837b26798k41396L71868P5497m36418M9811M06509m34210o5251p6820J92983
10827c84225M6484M47607J18333n29974l56778j03239K06129N50968J28819n58548
10817d34424j64411N88150O8792M30086L38859o99565m63468M78335m6186O45548
10807G41716m77569n44540J07396n22423L57632R71724k47900l54210J9319M79718
10797E30863n01283J00332Q1524k79164r8935l32178J55675N35093N5919l78572
10787a30726j97623j48612P9796P75192K49860k88650M5360n03618j01363K116
10777b18268L29022n1460j05392J90654Q3642k39523k90722j72894K20044K89224
10767C4327l24897j34519K98926r8424J83779j67466o45764k78944K79948K78224
$$ plain form
10757 -574810 -543654 -656178 -1187181 -1156606 -775056 -728965 -980592 -655978 -658426 -51038
10747 -51038 688115 -97515 -233918 -534551 -775952 -683819 -264281 -232438 -447309 77814
10737 77814 433680 -447889 -449700 -745899 161320 586155 573263 130762 -156683 334764
10727 334764 396452 462754 187375 -327069 8561 34575 548686 619655 -219796 -481132
10717 -481132 -358805 32486 -557941 -105064 -692771 -1176361 -417925 -254871 -501107 -198662
10707 -198662 121679 197097 -329582 -272283 -225920 -86986 21783 -337791 -57719 168970
10697 168970 -46767 -335446 -86068 588151 532804 -83430 276898 318148 149752 106526
10687 106526 -66318 -445550 -548868 196904 229790 87482 198598 75829 -284029 -622413
$$ packed form
10757e74810L1156j12524n31003L0575L81550M6091k51627L24614k448O07388
10747e1038P39153p85630j36403l00633k41401R2133M19538L1843k14871N25123
10737G7814L55866q81569j811k96199R07219M24835j2892m42501k87445M91447
10727C34764O1688O6302k75379n14444L35630K6014N14111P0969q39451k61336
10717d81132J22327L91291n90427M52877n87707m83590P58436J63054k46236L02445
10707a98662L20341P5418n26679N7299M6363J38934J08769l59574K80072K26689
10697A68970k15737k88679K49378O74219n5347o16234L60328M1250j68396m3226
10687A06526j72844l79232j03318P45772L2886j42308J11116j22769l59858l38384
$$ plain form
10677 -622413 -164187 311737 -16722 156256 263268 216210 484779 287910 -120934 -51056
10667 -51056 -2474 205436 18504 10570 208353 -69274 134425 -97461 36392 339563
10657 339563 361034 322580 63146 -240941 74313 -322472 -232214 18619 277332 -61770
10647 -61770 -425629 -829494 -966425 -747044 -629984 -37098 431650 -54499 -214436 -455871
10637 -455871 77944 241493 18040 351424 -40536 -532582 -196734 2272 -36726 348261
10627 348261 565330 83074 -201798 -189771 -429399 166995 626104 349670 -8143 388416
10617 388416 -155530 241455 438427 691754 602341 395433 55732 -431528 -164556 -34151
10607 -34151 -169776 -64124 -99075 -122918 -717519 -425322 -233078 -218237 -138967 -243732
$$ packed form
10677f22413M58226M75924l28459J72978J07012m7058K68569j96869m08844O9878
10667e1056M8582K07910j86932p934J97783k77627K03699k31886J33853L03171
10657C39563K1471l8454k59434l04087L15254l96785R0258K50833K58713l39102
10647f1770l63859m03865j36931K19381J17060N92886M68748m86149j59937k41435
10637d55871N33815J63549k23453L33384l91960m92046L35848J99006l8998L84987
10627C48261K17069m82256k84872J2027k39628N96394M59109k76434l57813L96559
10617C88416n43946L96985J96972K53327q9413k06908l39701m87260K66972J30405
10607c4151j35625J05652l4951k3843n94601K92197J92244J4841P9270j04765
$$ plain form
10597 -243732 48870 -187221 -174258 -335620 -879260 -629926 -306719 -227146 -332055 18386
10587 18386 -371257 -393908 -60149 -541119 -220746 -170563 -403532 -101609 -30527 236736
10577 236736 421233 238744 -24285 173206 -242727 -115029 -64295 -274849 -261473 -263122
10567 -263122 -424457 -355881 -378392 -678942 -686188 -243740 -403122 -28853 -403211 -654861
10557 -654861 116304 -82127 -378477 -516349 -511171 -733705 -120231 485997 562440 120443
10547 120443 -100419 -508145 -320417 -139326 461770 197312 273154 434669 55732 -132282
10537 -132282 180056 -128276 190751 -251973 -856484 -658367 90046 1013051 -76523
10528 -76523 -573250 -413233 -78517 355694 384587 715852 526987 210589 386394 -116904
$$ packed form
10597b43732K92602k36091J2963j61362n43640K49334L23207P9573j04909L50441
10587A8386l89643k2651L33759m80970L20373N0183k32969L01923P1082K67263
10577B36736J84497j82489k63029J97491m15933J27698N0734k10554J3376j649
10567b63122j61335O8576k2511l00550p246M42448j59382L74269l74358k51650
10557f54861P71165j98431k96350j37872N178k22534O13474O06228P6443m41997
10547A20443k20862m07726J87728J81091O01096k64458P5842J61515l78937j88014
10537a32282L12338l08332L19027m42724o04511J98117P48413R23005j089574
10528g6523m96727J60017L34716M34211K8893L31265j88865l16398J75805n03298
$$ plain form
10518 -116904 125195 135708 434173 329139 -100954 696906 504048 400667 445992 283589
10508 283589 190765 306119 -59922 208598 307601 693119 1114512 780673 96231 269546
10498 269546 475889 606947 522086 606935 136306 -740 465694 219153 303048 303380 15561
10487 15561 253738 242325 -307246 -157605 441334 126314 -235926 484089 431336 396335
10477 396335 274643 156504 -29704 479580 488791 324658 481317 1032484 634529 120550
10467 120550 82272 359023 499670 380364 119781 -284670 -140691 -469940 -486264 -162493
10457 -162493 379497 186843 75706 -195884 -31140 623643 691119 163385 32915 -30696
10447 -30696 308259 315272 -216906 -385579 -4606 -143173 420252 138265 -786320 100006
$$ packed form
10518a16904K42099J0513K98465j05034m30093P97860j92858j03381M5325j62403
10508B83589r2824J15354l66041K68520R9003L85518M21393l33839o84442J73315
10498B69546K06343J31058q4861Q4849m70629j37046M66434k46541Q3895L32k87819
10487A5561K38177j1413n49571J49641N98939l15020l62240P20015n2753l5001
10477C96335j21692j18139j86208N09284R211j64133J56659N51167l97955n13979
10467A20550l8278K76751J40647j19306k60583m04451J43979l29249j6324L23771
10457a62493N41990j92654j11137k71590J64744O54783O7476n27734j30470o3611
10447c0696L38955P013n32178j68673L80973j38567N63425k81987r24585Q86326
$$ plain form
10437 100006 147502 -242653 -382337 -27043 73431 -44093 -425823 -598476 -226245 -143597
10427 -143597 -207300 47042 -206243 -294236 -68292 381072 112007 242969 701983 200713
10417 200713 319333 955541 947749 585022 410559 177020 396311 955309 1135286 654723
10407 654723 -174786 -336727 956937 1317788 549122 -90199 -109709 5893 691846 716671
10397 716671 202337 222341 -413651 -675189 -605030 -307794 100080 162094 -234286 -334275
10387 -334275 -178810 287779 135860 452416 472828 470266 456969 303179 41537 654906
10377 654906 751232 592024 206500 229110 442297 704358 726064 76175 -453870 -8718
10367 -8718 358041 655490 496496 259448 95505 95419 -142091 -180396 107124 138178 222944
$$ packed form
10437A00006M7496l90155j39684L55294J00474j17524l81730j72653L72231Q2648
10427a43597o3703K54342k53285q7993K25944M49364k69065J30962M59014n01270
10417B00713J18620O36208p792l62727j74463k33539K19291N58998J79977m80563
10407F54723q29509j61941J293664L60851p68666o39321j9510J15602O85953K4825
10397G16671n14334K0004o35992k61538P0159K97236M07874O2014l96380r9989
10387c34275J55465M66589j51919L16556K0412k562j3297j53790k61642O13369
10377F54906R6326j59208l85524K2610K13187K62061K1706o49889n30045M45152
10367h718L66759K97449j58994k37048j63943q6k37510l8305K87520L1054Q4766
$$ plain form
10356 222944 232244 -501706 -818376 -149024 -142083 -173234 306844 -230280 184802 350557
10346 350557 -71040 14087 19102 191946 186201 241694 80611 298911 672396 128349 339611
10335 339611 146563 731659 727930 -27652 272129 -4495 747085 282702 -235669 519668
10325 519668 1032431 836707 595591 323814 -126979 -189047 618455 218119 437332 417159
10315 417159 877103 682447 517782 821471 589674 507535 508183 634660 1190714 841084
10305 841084 715565 215514 -125913 -31661 -428687 -426414 673273 630859 828829 388621
10295 388621 813380 865520 1014392 974970 759261 769096 848206 263841 1069243 952841
10285 952841 559516 459509 153143 459253 602142 476444 328667 431815 487329 429589
$$ packed form
10356B22944R300p33950l16670O69352O941l1151M80078n37124M15082J65755
10346C50557m21597Q5127N015J72844n745N5493j61083K18300L73485n44047K11262
10335C39611j93048N85096l729p55582K99781k76624P51580m64383n18371P55337
10325E19668N12763j95724k41116k71777m50793o2068Q07502m00336K19213k0173
10315D17159M59944j94656j64665L03689k31797q2139O48J26477N56054l49630
10305H41084j25519n00051l41427R4252l97026K273J099687m2414J97970m40208
10295C88621M24759N2140J48872l9422k15709R835P9110n84365Q05402j16402
10285I52841l93325j00007l06366L06110J42889j25698j47777J03148N5514n7740
$$ plain form
10275 429589 177415 136486 362060 486529 769721 360215 519150 1584156 560401
10266 560401 463896 1258372 894202 679844 937453 1287711 1681904 1616404 1060137 253360
10256 253360 845217 711901 814047 405354 458269 460887 763496 1093998 826233 792610
10246 792610 183666 140418 451986 680208 1713922 1296343 1200777 1266600 630349 1235460
10236 1235460 1655328 1948913 2074684 1466847 1191760 763834 620555 703318 1247255 984532
10226 984532 1346977 1075379 955153 1199154 1274406 948431 103319 214815 609115 852949
10216 852949 945060 288992 666183 466483 863343 730627 564188 1426385 1321190 743859
10206 743859 611036 1449847 1489354 1122631 1887104 1632661 1306098 1802356 2042709 1837747
$$ packed form
10275D29589k52174m0929K25574J24469K83192m09506J58935J065006j023755
10266E60401r6505P94476l64170k14358K57609L50258L94193o5500n56267q06777
10256B53360N91857j33316J02146m08693N2915K618L02609L30502k67765l3623
10246G92610o08944m3248L11568K28222J033714m17579r5566O5823o36251O05111
10236A235460M19868K93585J25771o07837k75087m27926j43279Q2763N43937k62723
10226I84532L62445k71598j20226K44001P5252l25975q45112J11496L94300K43834
10216H52949R2111o56068L77191j99700L96860j32716j66439Q62197j05195n77331
10206G43859j32823Q38811L9507l66723P64473k54443l26563M96258K40353k04962
$$ plain form
10196 1837747 1431575 2108777 1709638 998937 1784147 1778428 1415214 1612668 1451498 1118403
10186 1118403 1005173 1875259 2035247 1483920 1767078 1878416 2105975 2264565 2604018
10177 2604018 2408538 2210407 2267376 2448548 2786579 2393539 2326501 2091496 1567755 1907366
10167 1907366 1887409 2210131 2271088 2164399 2132543 1848427 2334083 2922638 2414035 2206730
10157 2206730 2352101 2465767 2095904 2239113 2698231 2466841 2213188 2704758 2497311
10148 2497311 2655812 3231539 2836372 2691453 2660907 2820834 3389164 3239543 2419149 2493156
10138 2493156 3276104 3368788 2749630 3167400 2864575 2985464 3623858 3691160 3187949 2909131
10128 2909131 3220887 3447991 3382162 3758049 3635002 4346244 4731882 4109712 3315144 3647114
$$ packed form
10196A837747m06172O77202l99139p10701P85210n719l63214J97454j61170l33095
10186A118403j13230Q70086J59988n51327K83158J11338K27559J58590L39453
10177B604018j95480j98131N6969J81172L38031l93040o7038k35005n23741L39611
10167A907366j9957L22722O0957j06689l1856k84116M85656N88555n08603k07305
10157B206730J45371J13666l69863J43209M59118k31390k53653M91570k07447
10148B497311J58501N75727l95167j44919l0546J59927N68330j49621q20394P4007
10138B493156P82948R2684o19158M17770l02825J20889O38394O7302n03211k78818
10128B909131L11756K27104o5829L75887j23047P11242L85638o22170p94568L31970
$$ plain form
10118 3647114 3853359 3823178 3903620 4091981 3865470 4568622 4657645 3927912 4370006 5284931
10108 5284931 5229183 5141875 4875426 5380423 6212731 6016860 5680413 5553196 5721325 6226916
$$ packed form
10118C647114K06245l0181Q0442J88361k26511P03152Q9023p29733M42094R14925
10108E284931n5748q7308k66449N04997Q32308j95871l36447j27217J68129N05591
$$ [...]
##END NTUPLES=NMR SPECTRUM
##END=
