##TITLE=1H_CA-9029x
 DMSO
 8 sc, 
 1.07.2022
##JCAMPDX= 6.0         $$ Bruker NMR JCAMP-DX V2.0
##DATA TYPE= NMR SPECTRUM
##DATA CLASS= NTUPLES
##ORIGIN= UXNMR, Bruker Analytische Messtechnik GmbH
##OWNER= root
$$ XWIN-NMR		Version 3.5
$$ Fri Jul  1 14:41:33 2022 Russian Standard Time (UT+4h)  she@DPX200
##.OBSERVE FREQUENCY= 200.1313499994
##.OBSERVE NUCLEUS= ^1H
##.ACQUISITION MODE= SIMULTANEOUS
##.ACQUISITION SCHEME= undefined
##.AVERAGES= 8
##.DIGITISER RES= 18
##SPECTROMETER/DATA SYSTEM= spect
##.PULSE SEQUENCE= zg30
##.SOLVENT NAME= CDCl3
##.SHIFT REFERENCE= (INTERNAL, CDCl3, 0, 15.7535)
##AUDIT TRAIL= $$ (NUMBER, WHEN, WHO, WHERE, WHAT)
$$ ##TITLE= Audit trail, XWIN-NMR		Version 3.5
$$ ##JCAMPDX= 5.01
$$ ##ORIGIN= Bruker BioSpin GmbH
$$ ##OWNER= she
$$ F:/spectra/data/she/nmr/H-F/1/pdata/1/auditp.txt
$$ ##AUDIT TRAIL=  $$ (NUMBER, WHEN, WHO, WHERE, WHAT)
(   1,<2022-07-01 14:40:02.78 +0400>,<she>,<DPX200>,
      <created by zg, POWCHK disabled, PULCHK disabled
       configuration hash MD5:
       00 E9 B6 7A A2 85 ED C7 34 08 36 98 17 FE 4E 26
       data hash MD5: 16K
       5B DB 7D 52 1B CC 04 D5 A3 2E CD 93 77 7D 11 B0>)
(   2,<2022-07-01 14:40:09.15 +0400>,<she>,<DPX200>,
      <Start of raw data processing
       efp BC_mod = 2 LB = 0.24 FT_mod = 6 PKNL = 1 PHC0 = -18051.13 PHC1 = 24.00069 SI = 16K 
       data hash MD5: 16K
       F2 92 D4 EA 62 74 1F EB F8 A9 87 20 FC 9B 9F 6F>)
(   3,<2022-07-01 14:40:35.12 +0400>,<she>,<DPX200>,
      <pk PHC0 = 3.726349 PHC1 = -11 
       data hash MD5: 16K
       84 93 18 1A 84 1D 23 73 AF 7B F2 50 05 A0 C8 D9>)
(   4,<2022-07-01 14:40:38.75 +0400>,<she>,<DPX200>,
      <abs ABSG = 5 
       data hash MD5: 16K
       33 19 8E F9 B6 0A CB 7A 09 66 14 BE CD C7 BC 12>)
$$ ##END=
$$ 
$$ hash MD5
$$ BB E6 D4 C8 1B 70 75 C2 81 C7 E9 0E D2 0C C4 7A
##$RELAX= 
##$RELAX= 
##$RELAX= 
##$RELAX= 
##$RELAX= 
##$RELAX= 
$$ Bruker specific parameters
$$ --------------------------
##$DU= <F:/spectra>
##$EXPNO= 1
##$NAME= <H-F>
##$PROCNO= 1
##$TYPE= <nmr>
##$USER= <she>
##$AMP= (0..31)
100 100 100 100 100 100 100 100 100 100 100 100 100 100 100 100 100 100 
100 100 100 100 100 100 100 100 100 100 100 100 100 100 
##$AQSEQ= 0
##$AQ_mod= 1
##$AUNM= <au_zg>
##$AUTOPOS= <>
##$BF1= 200.13
##$BF2= 200.13
##$BF3= 200.13
##$BF4= 200.13
##$BF5= 200.13
##$BF6= 200.13
##$BF7= 200.13
##$BF8= 200.13
##$BYTORDA= 1
##$CFDGTYP= 0
##$CFRGTYP= 5
##$CHEMSTR= <none>
##$CNST= (0..31)
1 1 145 1 1 1 1 1 1 1 1 1 1 1 1 1 1 1 1 1 1 1 1 1 1 1 1 1 1 1 1 1 
##$CPDPRG= <>
##$CPDPRG1= <>
##$CPDPRG2= <>
##$CPDPRG3= <>
##$CPDPRG4= <mlev>
##$CPDPRG5= <mlev>
##$CPDPRG6= <mlev>
##$CPDPRG7= <mlev>
##$CPDPRG8= <mlev>
##$CPDPRGB= <>
##$CPDPRGT= <>
##$D= (0..31)
0 1.2 0 0 0 0 0 0 0 0.06 0 0.03 0 0 0 0 0.0002 0 0 0 0 0 0 0 0 0 0 0 0 
0 0 0 
##$DATE= 1656672002
##$DBL= (0..7)
120 120 120 120 120 120 120 120 
##$DBP= (0..7)
150 150 150 150 150 150 150 150 
##$DBP07= 0
##$DBPNAM0= <>
##$DBPNAM1= <>
##$DBPNAM2= <>
##$DBPNAM3= <>
##$DBPNAM4= <>
$$ [...]
##$SUBNAM2= <"">
##$SUBNAM3= <"">
##$SUBNAM4= <"">
##$SUBNAM5= <"">
##$SUBNAM6= <"">
##$SUBNAM7= <"">
##$SUBNAM8= <"">
##$SUBNAM9= <"">
##$SW= 18.0517283424941
##$SWIBOX= (0..15)
0 0 2 0 0 0 0 0 0 0 0 0 0 0 0 0 
##$SW_h= 3612.71676300578
##$TD= 16384
##$TD0= 1
##$TE= 0
##$TE2= 300
##$TE3= 300
##$TEG= 300
##$TL= (0..7)
0 120 120 120 120 120 120 120 
##$TP= (0..7)
150 150 150 150 150 150 150 150 
##$TP07= 0
##$TPNAME0= <>
##$TPNAME1= <>
##$TPNAME2= <>
##$TPNAME3= <>
##$TPNAME4= <>
##$TPNAME5= <>
##$TPNAME6= <>
##$TPNAME7= <>
##$TPOAL= (0..7)
0.5 0.5 0.5 0.5 0.5 0.5 0.5 0.5 
##$TPOFFS= (0..7)
0 0 0 0 0 0 0 0 
##$TUNHIN= 0
##$TUNHOUT= 0
##$TUNXOUT= 0
##$USERA1= <user>
##$USERA2= <user>
##$USERA3= <user>
##$USERA4= <user>
##$USERA5= <user>
##$V9= 5
##$VALIST= <valist>
##$VCLIST= <CCCCCCCCCCCCCCC>
##$VD= 0
##$VDLIST= <DDDDDDDDDDDDDDD>
##$VPLIST= <PPPPPPPPPPPPPPP>
##$VTLIST= <TTTTTTTTTTTTTTT>
##$WBST= 1024
##$WBSW= 4
##$XGAIN= (0..3)
0 0 0 0 
##$XL= 0
##$YL= 0
##$YMAX_a= 203756
##$YMIN_a= -249370
##$ZGOPTNS= <>
##$ZL1= 120
##$ZL2= 120
##$ZL3= 120
##$ZL4= 120
##$ABSF1= 15.73257
##$ABSF2= -2.31928
##$ABSG= 5
##$ABSL= 3
##$ALPHA= 0
##$AQORDER= 0
##$ASSFAC= 0
##$ASSFACI= 0
##$ASSFACX= 0
##$ASSWID= 0
##$AUNMP= <proc_1d>
##$AZFE= 0.1
##$AZFW= 0.1
##$BCFW= 0
##$BC_mod= 2
##$BYTORDP= 0
##$COROFFS= 0
##$CY= -3
##$DATMOD= 1
##$DC= 0
##$DFILT= <>
##$DTYPP= 0
##$F1P= 0
##$F2P= 0
##$FCOR= 1
##$FTSIZE= 16384
##$FT_mod= 6
##$GAMMA= 0
##$GB= 0
##$INTBC= 1
##$INTSCL= 0
##$ISEN= 128
##$LB= 0.24
##$LEV0= 0
##$LPBIN= 0
##$MAXI= 10000
##$MC2= 0
##$MEAN= 0
##$ME_mod= 0
##$MI= 1.114404
##$NCOEF= 0
##$NC_proc= -8
##$NLEV= 6
##$NOISF1= 3.799351
##$NOISF2= 2.8
##$NSP= 0
##$NTH_PI= 0
##$NZP= 0
##$OFFSET= 15.7535
##$PC= 1
##$PHC0= -18047.4
##$PHC1= 13.00069
##$PH_mod= 1
##$PKNL= yes
##$PPARMOD= 0
##$PSCAL= 0
##$PSIGN= 0
##$REVERSE= no
##$SF= 200.130003610497
##$SI= 16384
##$SIGF1= 3
##$SIGF2= 2
##$SINO= 5.538805
##$SIOLD= 16384
##$SREGLST= <1H.CDCl3>
##$SSB= 0
##$STSI= 16384
##$STSR= 0
##$SW_p= 3612.71676300578
##$SYMM= 0
##$S_DEV= 0
##$TDeff= 16384
##$TDoff= 0
##$TI= <>
##$TILT= no
##$TM1= 0
##$TM2= 0
##$TOPLEV= 0
##$USERP1= <user>
##$USERP2= <user>
##$USERP3= <user>
##$USERP4= <user>
##$USERP5= <user>
##$WDW= 1
##$XDIM= 16384
##$YMAX_p= 403847745
##$YMIN_p= -16838947
$$ End of Bruker specific parameters
$$ ---------------------------------
##NTUPLES= NMR SPECTRUM
##VAR_NAME=  FREQUENCY,     SPECTRUM/REAL,   SPECTRUM/IMAG
##SYMBOL=    X,             R,               I
##VAR_TYPE=  INDEPENDENT,   DEPENDENT,       DEPENDENT
##VAR_FORM=  AFFN,          ASDF,            ASDF
##VAR_DIM=   16384,         16384,           16384
##UNITS=     HZ,            ARBITRARY UNITS, ARBITRARY UNITS
##FACTOR=    0.220516191357247, 1,           1
##FIRST=     3152.74800882422, 0,            0
##LAST=      -459.968754181557, 0,           0
##MIN=       -459.968754181557, -16838947,   0
##MAX=       3152.74800882422, 403847745,    0
$$ Real data points
##PAGE= N=1
##DATA TABLE= (X++(R..R)), XYDATA
$$ [...]
6607A547979q58072j758583l80326J479273J179946K37961k512805K67642J265170
$$ 1547979 689907 -1068676 -1449002 30271 1210217 1448178 -1064627 -796985 468185
6598D68185m75398n65656P21539p18538k66437o21632J339461L00377q39301r49343
$$ 468185 -7213 -572869 148670 -569868 -836305 -1457937 -118476 181901 -657400 -1606743
6588a606743L89718J343088O58533q96075k171904N33472K144227m66984R59976
$$ -1606743 -1217025 126063 784596 -111479 -2283383 -1749911 394316 -72668 887308
6579H87308l91441q17164L9314L48197j584322R19243M02624q90662j15144k41100
$$ 887308 495867 -321297 -281983 66214 -1518108 -598865 -196241 -1086903 -1202047 -1443147
6569a443147J270026q71245K6531J050152Q29776q94889j10519M95683M65439
$$ -1443147 -173121 -1044366 -1017835 32317 862093 -32796 -143315 352368 817807
6560H17807o22961q0726r144j458763J779154Q19035j510447P50023p25744n42746
$$ 817807 194846 114120 104976 -1353787 425367 1244402 -266045 483978 -241766 -784512
6550g84512M64205L37215K40121j49571k50538j020246J098638J71111k034247
$$ -784512 -320307 16908 257029 107458 -143080 -1163326 -64688 106423 -1927824
6541a927824J825317J233348o17472j567958L06073R11642j200634N46726J40007
$$ -1927824 -102507 1130841 513369 -1054589 -748516 163126 -1037508 -490782 -350775
6532c50775K00752K63509m26259l86176o56939K07967P04338J069529j978163
$$ -350775 -150023 113486 -312773 -698949 -1355888 -1147921 -443583 625946 -1352217
6523a352217m60338J282865l06453L0576q54426l65392K534974j088961j324608
$$ -1352217 -1812555 -529690 -836143 -805567 -1659993 -2025385 509589 -579372 -1903980
6514a903980P62729M81036J204883M14549j978538m10151l54095n0268R85852
$$ -1903980 -1141251 -660215 544668 959217 -1019321 -1429472 -1783567 -1833835 -847983
6505h47983j01413M72619J00375N21600m91145N46881Q79661j020246l05486L91669
$$ -847983 -949396 -476777 -376402 145198 -345947 200934 1080595 60349 -245137 146532
6495A46532J02680j24j155978O6004J471998l11058j550316M97906J494615m42660
$$ 146532 249212 249088 -906890 -840886 631112 320054 -1230262 -732356 762259 319599
6485C19599m53355m25639J6702L90661M38263j140655K532Q16582L21589O542
$$ 319599 -133756 -559395 -542693 -152032 286231 -854424 -851892 -35310 286279 292821
6475B92821j070130m67370J352016j94001p27519P96428j407792O12531n44324
$$ 292821 -777309 -1244679 107337 -86664 -814183 -17755 -1425547 -813016 -1357340
6466a357340L22392R84716N98064M33351j319547q23954K92886M57816j137960
$$ -1357340 -1034948 -50232 547832 981183 -338364 -1162318 -869432 -411616 -1549576
6457a549576M40693L47638j356923K14740O40077R49743M37019q09029j64844
$$ -1549576 -1108883 -761245 -2118168 -1903428 -1263351 -313608 123411 -685618 -850462
6448h50462J055586p23499j226386J003010O87556J483606q01140j251199j42858
$$ -850462 205124 -518375 -1744761 -741751 -54195 1429411 628271 -622928 -765786
6439g65786R84392M57885j212476m82290j569008J229746J002294L03180o49584
$$ -765786 218606 676491 -535985 -1018275 -2587283 -1357537 -355243 -52063 -701647
6430g01647m80685J38333J411648J4954j151432p5655j327161R69508N37285r60999
$$ -701647 -1182332 -1043999 367649 382603 -768829 -844484 -2171645 -1202137 -664852 -1625851
6420a625851P29640M28788Q84431j063773m38821J26959j80414J170480p55156
$$ -1625851 -896211 -467423 417008 -646765 -1085586 -958627 -1139041 31439 -723717
6411g23717l55640L26103Q56613J3422P63520j47494j645174R1799R57899J95708
$$ -723717 -1079357 -753254 103359 116781 880301 732807 -912367 -820568 137331 333039
6401C33039j863179p64137J937571m1822r71415Q26860K09162J67875Q9318j817436
$$ 333039 -1530140 -2294277 -356706 -398528 -1369943 -543083 -333921 -166046 -76728 -1894164
6391a894164J396938J43657M46813R31618n98826r29197o38898L68543K195828
$$ -1894164 -497226 -353569 93244 1024862 426036 -503161 -1142059 -773516 1422312
6382A422312j309219j262410k339319Q91156K770789o86476j0591j588074M39609
$$ 1422312 113093 -1149317 -3488636 -2597480 173309 -513167 -523758 -2111832 -1672223
6373a672223L77698J80850k32560K70521O44399L74396j92769K31120j15021o53958
$$ -1672223 -1294525 -1113675 -1346235 -1075714 -431315 -56919 -249688 -18568 -133589 -787547
6363g87547o43713J558097P94556j314243j555990J222792M52936J23387n56665
$$ -787547 -1431260 126837 921393 -392850 -1948840 -726048 -273112 -149725 -706390
6354g06390m72982J013209q15007m73637R6452J029813p63038J32058l20954m56293
$$ -706390 -1179372 -166163 -981170 -1454807 -1358355 -328542 -1091580 -959522 -1280476 -1736769
6344a736769J082934j266299J298896J605607p61180j535883L74725J574758j039280
$$ -1736769 -653835 -1920134 -621238 984369 223189 -1312694 -937969 636789 -402491
6335d02491q84990p81757J67658M16518j52360M20943J17041n74123Q39238j042430
$$ -402491 -1287481 -2069238 -1901580 -1485062 -1637422 -1216479 -1099438 -1673561 -834323 -1876753
6325a876753P69890R21345j940337J025223P60014o86445o3967R68291n85280
$$ -1876753 -1106863 -185518 -2125855 -1100632 -340618 -1027063 -1091030 -122739 -708019
6316g08019k89420o31197l81513P78776M10967o59567P91700J32821m94688k82976
$$ -708019 -997439 -1628636 -2010149 -1231373 -820406 -1479973 -688273 -555452 -1050140 -1333116
6306a333116P37177k65725J10099j739831n7218N33238J846689J274234j526026
$$ -1333116 -595939 -861664 -751565 -2491396 -2548614 -2015376 -168687 1105547 -420479
6297d20479j13098j05300k77104P36350r26768K27306Q44718K93041l86157j099969
$$ -420479 -533577 -638877 -915981 -179631 -1106399 -879093 -34375 258666 -127491 -1227460
6287a227460J562984J06908l30238j661106K5512J49940M76210j347210O51302
$$ -1227460 335524 442432 112194 -1548912 -1523400 -1373460 -897250 -2244460 -1593158
6278a593158J36126j2362J801451K61825j900455R40194N66911k42008r50943
$$ -1593158 -1457032 -1469394 332057 593882 -1306573 -366379 200532 -41476 -992419
6269i92419Q81307R39563n08343j656046k68901J358879M07036q01848l70275
$$ -992419 -111112 828451 320108 -1335938 -1604839 -245960 161076 -640772 -1011047
6260a011047O24422j167172k41799n37547O59625N47343j097936j92271Q53663
$$ -1011047 -386625 -1553797 -1795596 -2333143 -1673518 -1126175 -2224111 -2416382 -1562719
6251a562719J91190r66355P32240j193572N97566K847168k522744k91060J307195
$$ -1562719 -1371529 -2337884 -1605644 -2799216 -2201650 645518 -1877226 -2168286 -861091
6242h61091N97344O92348n81282n92795K46013N59005L08029o36927N01905O63411
$$ -861091 -263747 428601 -152681 -745476 -499463 59542 367571 -269356 232549 895960
6232H95960k418334n17887K016996J315578k115424j145216O43930K18608J418155
$$ 895960 -1522374 -2040261 -23265 1292313 -823111 -1968327 -1324397 -1105789 312366
6223C12366j054877p33118N41987J152685j365625o94506J8465K355289j71997
$$ 312366 -742511 -1475629 -933642 219043 -1146582 -1841088 -1822623 532666 360669
6214C60669j852582Q83700R62695K32656j170142r95709J986368j344858p63918
$$ 360669 -1491913 -608213 354482 587138 -583004 -1578713 407655 -937203 -1701121
6205a701121O78854r54256K81714K15989M39365P91572K45533j000026J68750
$$ -1701121 -1022267 -1976523 -1694809 -1478820 -1039455 -247883 -2350 -1002376 -833626
6196h33626N70187P15838J01498P8248j539512m80293p64977N84498O65885J044962
$$ -833626 -263439 452399 553897 632145 -907367 -1387660 -2152637 -1568139 -902254 142708
6186A42708r48139r0806j11106j42798J090316l19093q40448R58589q57576O50153
$$ 142708 -805431 -896237 -1007343 -1150141 -59825 -378918 -1219366 -260777 -1118353 -468200
6176d68200M53921J95434R03969K57964j898880q97635J097641j012282k13482
$$ -468200 -14279 181155 1085124 1343088 -555792 -1453427 -355786 -1368068 -1581550
6167a581550J48344l53366M73940J94371j291382K055242m76133o4102q7628j187645
$$ -1581550 -1433206 -1786572 -1312632 -1118261 -2409643 -354401 -830534 -894636 -982264 -2169909
6157b169909M00380O99938j502180J123950N79739J00104J16022r87051Q20342
$$ -2169909 -1769529 -1069591 -2571771 -1447821 -868082 -767978 -651956 -1639007 -818665
6148h18665o21784Q89322R80536n86100n74919j849510J338983J481851j059520
$$ -818665 -1440449 -551127 429409 -156691 -731610 -2581120 -1242137 239714 -819806
6139h19806l55854p72693q0677J869211Q01026p63p80954j435377l7501Q34290
$$ -819806 -1175660 -1948353 -2029030 -159819 641207 640444 -140510 -1575887 -1613388 -779098
6129g79098N13450N11168j539263L04702R45884l04698m8533M43644j23886R8851
$$ -779098 -265648 245520 -1293743 -989041 -43157 -347855 -396388 47256 -76630 22221
6119B2221q47468k93151j526332J957743J836782k045871j036236J582562O28832
$$ 22221 -825247 -1118398 -2644730 -686987 1149795 -896076 -1932312 -349750 279082
6110B79082j059393j395681J635326R77447j730216r74316J427335j94710j56252
$$ 279082 -780311 -2175992 -540666 436781 -1293435 -2267751 -840416 -1035126 -1191378
6101a191378J112697r21625M36698K08405k62875l02545q14835m96827K549514
$$ -1191378 -78681 -1000306 -563608 -355203 -618078 -920623 -1735458 -2232285 317229
6092C17229j81356j731592K40934R38952L91892o96516j526297R68467o71902
$$ 317229 135873 -1595719 -1354785 -415833 -23941 -720457 -2246754 -1278287 -1950189
6083a950189L61633Q56470n40886j252570J342396L07661M37562Q17985l43913
$$ -1950189 -1588556 -732086 -1272972 -2525542 -1183146 -875485 -437923 380062 36149
6074C6149j044686K23481j097971J049474Q94687Q03990j709988m73322O71347
$$ 36149 -1008537 -785056 -1883027 -833553 61134 865124 -844864 -1318186 -646839
6065f46839k38527J031819o8432q58753l58615q39149M96447K234527j176331
$$ -646839 -885366 146453 78021 -780732 -1139347 -1978496 -1482049 752478 -423853
6056d23853o42447L02530L36165J1458N68990n09598j9495L05206l16738n77573
$$ -423853 -1066300 -763770 -427605 -416147 152843 -356755 -376250 -71044 -387782 -965355
6046i65355R59044q38546m62679m40818K72879K781073q39198p59727j12007J47137
$$ -965355 -6311 -844857 -1307536 -1748354 -1475475 1305598 466400 -293327 -405334 -258197
6036b58197J214878j012033j88409j88959L67669M21166j246404r09339J323637
$$ -258197 956681 -55352 -243761 -432720 -65051 356115 -890289 -1799628 -475991
6027d75991J571103L84707j123070k079784J024635j44949o46011k35355L3631
$$ -475991 1095112 1479819 356749 -1723035 -698400 -843349 -1489360 -1724715 -1691084
6018a691084Q68843l27783j21274J201304k57436m95492L25413J408930j757311
$$ -1691084 -822241 -1150024 -1271298 -69994 -327430 -822922 -497509 911421 -845890
6009h45890j92590O62625J058056K92333k128402n88377K39399M40704Q20334
$$ -845890 -1038480 -375855 682201 974534 -1153868 -1742245 -1502846 -1062142 -241808
6000b41808K17905r93600l58022j12568L66022K33090J308557n00153j223499
$$ -241808 -23903 -1017503 -1375525 -1488093 -1122071 -888981 419576 -80577 -1304076
5991a304076o19397j75192P92615J228102o64637n29599O26215P10242L04171
$$ -1304076 -1923473 -2098665 -1306050 -77948 -742585 -1272184 -645969 64273 368444
5982C68444K56961P0819N55256p72710J058922j471750k77039L85652o6885J75763
$$ 368444 625405 696224 1251480 478770 1537692 65942 -211097 174555 107670 283433
5972B83433j26844q4231j044849O48535J532056j187022l48009J44509r75323
$$ 283433 156589 72358 -972491 -323956 1208100 21078 -326931 -182422 -1157745
5963a157745j47768R08117M57076l63300J17733l46460L41206R30448N39781p68127
$$ -1157745 -1305513 -397396 59680 -303620 -185887 -532347 -191141 739307 1279088 510961
5953E10961j187223O2499J017491l59918m81628R86829j331580J391268M47663
$$ 510961 -676262 -613763 403728 43810 -437818 549011 -782569 608699 1056362
5944A056362k012802J268365r89145P51515P92556j586408J113510q50725J645807
$$ 1056362 -956440 311925 -677220 74295 866851 -719557 393953 -456772 1189035
5935A189035J204848j194775j497935o68035R76123j706455R76804Q99343j588219
$$ 1189035 2393883 1199108 -298827 -966862 9261 -1697194 -720390 178953 -1409266
5926a409266J494885M04930N42989L62545r71766L23353M51101n97455j296084
$$ -1409266 85619 490549 1033538 1396083 424317 747670 1198771 601316 -694768
5917f94768Q09115k68008N69532j5145M09688P8961n32322l93563N15056J476976
$$ -694768 114347 -153661 415871 400726 810414 889375 357053 -36510 478546 1955522
5907A955522L20751k499066r87915J053507J192409M53340N97837j24676j998482
$$ 1955522 2276273 -222793 -1210708 -157201 1035208 1488548 2086385 1961709 -36773
5898c6773L47208J278180J32086j206017j078345Q49971J567237p74303j680142
$$ -36773 310435 1588615 1720701 514684 -563661 286310 1853547 1079244 -600898
5889f00898K490766L55913K96494m3493k411384O43352r7765j84512k98913M87335
$$ -600898 1889868 2245781 2542275 2498782 87398 730750 632985 448473 149560 636895
5879F36895P19455p14201j020597n66360J129934n928O97320l69413j014840K009786
$$ 636895 1356350 642149 -378448 -944808 185126 179198 876518 507105 -507735 1502051
5869A502051J83259q69482P22986r29870P01057J134385j408148j826629J30311
$$ 1502051 1685310 815828 1538814 608944 1310001 2444386 1036238 -790391 -660080
5860f60080J048268J060449q97934o66780J66645J036792J54743o42085M65557
$$ -660080 388188 1448637 550703 -116077 50568 1087360 1242103 600018 1065575
5851A065575r96242L57477J254782m21503j524606j270720J497975K79194j047919
$$ 1065575 69333 426810 1681592 1260089 -264517 -1535237 -37262 241932 -805987
5842h05987J060176R43470j084282J91453M79607R20543M2080j187693K19027
$$ -805987 254189 1197659 113377 304830 784437 1704980 1747060 559367 778394
5833G78394P48033j9145R6626K32770J382265K96704j342777o27569p71595J490189
$$ 778394 1526427 1507282 1603908 1836678 3218943 3515647 2172870 1545301 773706 2263895
5823B263895l03321j629228Q55325L44815l79881L60135N82518j098465K83291
$$ 2263895 1960574 331346 1186671 1531486 1151605 1511740 2094258 995793 1279084
5814A279084J429709M90658l488950O13659L219595q14665o23129K26280N03331
$$ 1279084 2708793 3199451 -289499 324160 3543755 2729090 2105961 2332241 2835572
5805B835572k06868m66986J84622J673727q78382q12719L70911l30445L02784
$$ 2835572 2628704 2161718 2346340 4020067 3141685 2328966 2699877 2369432 2672216
5796B672216j97201l41016O74046j403483R55502q87115O82714r1806J57065n96310
$$ 2672216 2475015 2133999 2808045 1404562 2360064 1472949 2155663 2063857 2220922 1624612
5786A624612L89486k64675j96354J512224J71679k076003L38904J357283J997414
$$ 1624612 2014098 1749423 1553069 3065293 3236972 1160969 1499873 2857156 4854570
5777D854570j923117j129090J870343j674240m7372J079703K90962q58038j320370
$$ 4854570 2931453 1802363 3672706 1998466 1951094 3030797 3321759 2463721 1143351
5768A143351J997542Q51714p39651L26893q07635j919544Q12254J702169j48109
$$ 1143351 3140893 3992607 3252956 3579849 2772214 852670 1664924 3367093 3218984
5759C218984J44563p41159M05704k04560J577543M79674R98951q19866j765377
$$ 3218984 3363547 2622388 3028092 2823532 4401075 4880749 5879700 5059834 3294457
5750C294457J005074Q14482J75050J025211p78198j328832p3865J431877L82388
$$ 3294457 4299531 5114013 5289063 6314274 5536076 4207244 4133379 5565256 5947644
5741E947644l82528l64742q31354O62012O45850N18086k81459Q2718n86513M40605
$$ 5947644 5565116 5200374 4369020 5031032 5676882 6194968 5913509 5996227 5409714 5850319
5731E850319O06762p96624J012022r41861J782650J73880j187621L72024L79007
$$ 5850319 6457081 5660457 6672479 5730618 7513268 7687148 6499527 6871551 7250558
5722G250558Q98350j187338p24812J326276j062202Q99600k66983m79155K638434
$$ 7250558 8148908 6961570 6236758 7563034 6500832 7400432 7133449 6654294 9292728
5713I292728k12724P50473j427723n63218K439520N90812L46897j505175Q89162
$$ 9292728 9080004 9830477 8402754 7839536 10279056 10869868 11216765 9711590 10600752
5704A0600752J669947j298347R86266n08169k62370J417585l05662j65282L3891
$$ 10600752 12270699 10972352 11958618 11450449 11188079 12605664 12300002 12134720 12168611
5695A2168611J067717J684844j294227J421254P28182O0923P54076r1159P1775
$$ 12168611 13236328 14921172 13626945 15048199 15776381 15837304 16591380 16500221 16571996
5686A6571996L17786J44835L71760Q38431l99137J178731J085481K07247O17781
$$ 16571996 16889782 17034617 17406377 18244808 17845671 19024402 20109883 20317130 20934911
5677B0934911J272141j7670R25857K89355L7818P65036O48129J283685J054835
$$ 20934911 22207052 22189382 23115239 23404594 23442412 24207448 24855577 26139262 27194097
5668B7194097P11647K361871J961860M6544m4853K544925J174188M95621P99163
$$ 27194097 27905744 30267615 32229475 32276019 32231166 34776091 35950279 36445900 37245063
5659C7245063P60750J703374J385433J687575K236062J324130K178000J473972
$$ 37245063 38005813 39709187 41094620 42782195 45018257 46342387 48520387 49994359
5651D9994359K358189K354931O94575K37660L273063K421860K443458J534884
$$ 49994359 52352548 54707479 55402054 55639714 58912777 61334637 63778095 65312979
5643F5312979J166005K222586J373468K206788J130046L89309p29484J835181
$$ 65312979 66478984 68701570 70075038 72281826 73411872 73801181 73071697 74906878
5635G4906878J626995J004295P63465l12999J391723P59344O11752K94045j38125
$$ 74906878 76533873 77538168 78301633 77988634 79380357 80139701 80751453 81045498 80907373
5626H0907373J662679j577792R49972Q42190J426800N52670l26826n27475M99032
$$ 80907373 82570052 80992260 81942232 82784422 84211222 84763892 84437066 83909591 84408623
5617H4408623j157711O91689Q14887l44878N70898q52764m87348j524746Q08960
$$ 84408623 83250912 83942601 84757488 84412610 84983508 84130744 83643396 82118650 82927610
5608H2927610M98149k125853L99116j775269l04531J530489k62683j321130j938043
$$ 82927610 83425759 81299906 81699022 79923753 79619222 81149711 80887028 79565898 77627855
5599G7627855j018514j291705J615777k717100j687796q87104j590104R66883
$$ 77627855 76609341 75317636 76933413 74216313 72528517 71641413 70051309 71018192
5591G1018192r48230k159466o49953r16517j797955k685165j939128j316k350369
$$ 71018192 70069962 67910496 67260543 66344026 64546071 61860906 59921778 59920462 57570093
5582E7570093k613956n83952j660208k648842k342669j210866q09596l068459
$$ 57570093 54956137 54372185 52711977 50063135 47720466 46509600 45700004 42631545
5574D2631545j376579l925998r58211O8994l178852O46249j960844k986812k28690
$$ 42631545 41254966 37328968 36370757 36439751 33260899 33907148 31946304 28959492 28730802
5565B8730802j803452n16006j62651j717757J46214l47134k995784p85815J299305
$$ 28730802 26927350 26411344 26248693 24530936 24677150 24330016 21334232 20548417 21847722
5556B1847722j812495m67605J02205p03576l45566p96300j194693J017465k576812
$$ 21847722 20035227 19567622 19669827 18966251 18620685 17824385 16629692 17647157 15070345
5547A5070345N53750L27467l295741q6734l9300N52908J79192n83440q10005l04809
$$ 15070345 15624095 15951562 12655821 12569087 12529787 13082695 13261887 12678447 11868442 11563633
5537A1563633j109580p43838Q46317M41868r59901N56908j084007n85719J429421
$$ 11563633 10454053 9710215 10556532 10998400 10038499 10595407 9511400 8925681 10355102
5528A0355102j24080j314104n45947n39258l52930k21145J88622m26694j827639
$$ 10355102 10231022 8916918 8370971 7831713 7478783 7257638 7446260 7019566 5191927
5519E191927J39521J028043N39637j455789J87170p09620K13409J115834J75045
$$ 5191927 5331448 6359491 6899128 5443339 5630509 4920889 5134298 6250132 6425177
5510F425177L55131j160481n70199n29013K9823Q28064j093632J191167m16557
$$ 6425177 6780308 5619827 5049628 4520615 4550438 5378502 4284870 5476037 5059480
5501E059480N68150N20835j457513l38986Q4177K3869q90557K54181k41331q31554
$$ 5059480 5627630 6148465 4690952 4351966 4436143 4460012 3569455 3823636 3582305 2750751
5491B750751L77030J173269p47742j424273J183991L05586N73991j202267r37747
$$ 2750751 3127781 4301050 3553308 2129035 3313026 3618612 4192603 2990336 2052589
5482B052589J857733o44901J925023j057846j346201k47860j56228q83415N01240
$$ 2052589 3910322 3265421 5190444 4132598 2786397 2538537 2382309 1498894 2000134
5473B000134q16003o23916J028289N67804j267939J094045M63689j820119K75139
$$ 2000134 1184131 560215 1588504 2156308 888369 1982414 2446103 625984 901123
5464I01123O73978n54767R61533n63828M12536l48613N01956O97216O8095n96509
$$ 901123 1575101 1020334 1981867 1418039 1830575 1481962 1983918 2681134 2749229 2152720
5454B152720j242950J849130j122715j44936m37741J490291j84975k626244M54066
$$ 2152720 909770 2758900 1636185 1491249 1053508 2543799 2358824 -267420 186646
5445A86646N36596K111825o2387j637967m89250J11367k28414j11094J542476
$$ 186646 723242 2835067 2772680 1134713 645463 756830 528416 417322 1959798
5436A959798r36369j844518j0883J065258J403233J14973q19689p01567n63156
$$ 1959798 1023429 -821089 -831972 233286 1636519 1751492 931803 230236 -332920
5427c32920J696726n15385k08553P021l46937m54757K287472j028479M92248J275948
$$ -332920 1363806 848421 639868 646889 299952 -154805 2132667 1104188 1596436 2872384
5417B872384j947020j132871O39766M83300J236896j397517K59003k59437q43950
$$ 2872384 925364 -207507 432259 915559 2152455 754938 1013941 754504 -89446
5408h9446O62115J300273j684905q08662J228852q95966Q12326J183688k222608
$$ -89446 572669 1872942 188037 -620625 608227 -287739 524587 1708275 -514333
5399e14333k28781q0547m1224L305J73311n0483M9932K54445j35184J553285m77554
$$ -514333 -743114 -823661 -864885 -861580 -688269 -738752 -688820 -434375 -569559 983726 506172
5388E06172k41126N04459j22862L30684j95306j693047Q25437o21615J455871
$$ 506172 265046 769505 646643 977327 782021 -911026 -85589 -707204 748667
5379G48667p91291n5257J12991O73879r18915n42731N178Q13962J078625j962553
$$ 748667 -42624 -97881 15110 688989 -229926 -772657 -767479 46483 1125108 -837445
5369h37445l84963J989991p5057Q39272k356223M4188Q55244p69982j531294J531121
$$ -837445 -1222408 767583 692526 1531798 -824425 -780237 75007 -694975 -2226269 -695148
5359f95148J131702q12632J37493M10224N37489m72231r35741l8723J770695j228206
$$ -695148 436554 -376078 -238585 171639 709128 236897 -698844 -737567 1033128 -195078
5349a95078j427833n73071J014659R41513l97646k79975J819952o98897N41539
$$ -195078 -1622911 -2195982 -1181323 -239810 -637456 -917431 902521 203624 745163
5340G45163P46451j191186r67706L98902N2158l28001k39604o20713N48817J287928
$$ 745163 1491614 300428 -667278 -268376 -216218 -544219 -783823 -1404536 -855719 432209
5330D32209q69518Q01655l78511m32822Q0554N72164J57508n1028P65874K25075
$$ 432209 -437309 364346 -14165 -446987 -366433 205731 363239 312211 1078085 1303160
5320A303160r0809j466697N07582J481048n78461k116766L7512K52278J270780
$$ 1303160 1212351 -254346 253236 1734284 1155823 -960943 -923431 -671153 599627
5311E99627j64964N69956L27787r92348o61971N68518j01389m14674N3841Q81004
$$ 599627 434663 1004619 1332406 340058 -321913 246605 145216 -269458 -215617 665387
5301F65387j435279J652921p0132j831703J810272j100186P02771R51681k956602
$$ 665387 -769892 883029 812897 -1018806 791466 -308720 394051 1345732 -1610870
5292a610870m32572K358495R35275O86324j280652k97050L03935K76378j404556
$$ -1610870 -2043442 315053 1250328 1936652 656000 358950 662885 939263 -465293
5283d65293l25721L81639j89559L56501K0286j591385J174915J804409m17594
$$ -465293 -791014 -409375 -598934 -242433 -222147 -1813532 -638617 1165792 748198
5274G48198P83114j431712j571521J559874R3566j76054J11730k51848Q08850
$$ 748198 1531312 99600 -1471921 87953 181519 5465 117195 -134653 674197
5265F74197J060922q5055l67552r41987M26143k43817p64062J215845K82610J51418
$$ 674197 1735119 1650064 1282512 340525 766668 522851 -241211 974634 1257244 1408662
5255A408662n78421k55618J548181M4075j412060m14168K62571K46480j46533
$$ 1408662 830241 574623 2122804 2166879 754819 340651 603222 849702 703169
5246G03169n47162J207832L31053q13770o36240n58633J193379j228294k36646
$$ 703169 156007 1363839 1694892 881122 244882 -313751 879628 -348666 -585312
5237e85312P9232Q41875J183345j961514J9733R71947K50971O40529j041026q29174
$$ -585312 -506080 335795 1519140 -442374 -422641 549306 800277 1440806 399780 -429394
5227d29394N36485R03914N99781L10581j213394l15918R51495L5761j874378m72426
$$ -429394 107091 1011005 1610786 1921367 707973 392055 1343550 1379311 -495067 -967493
5217i67493J395884k85742P89607p44819k92848K415463p25864j569571J671950
$$ -967493 428391 142649 932256 187437 -105411 2310052 1584188 14617 1686567
5208A686567o77224r63188j72122j130144l37132K671852j019634K21329L67096
$$ 1686567 1009343 46155 -125967 -1256111 -1593243 1078609 58975 280304 647400
5199F47400p98183O02751J153045j444168p88410O68007k82060N54238J9832P5104
$$ 647400 -150783 451968 1605013 160845 -627565 40442 -241618 312620 332452 407556
5189D07556J71859L92529P12245l45821j290748O87617J349208k3051k222520
$$ 407556 579415 971944 1684189 1338368 47620 735237 2084445 2061394 -161126
5180a61126n63248Q78220R83406R1586P16902r71318Q16121O1654r40391J11117
$$ -161126 -724374 153846 1137252 1228838 1945740 974422 1790543 1852197 911806 1022923
5170A022923K49506l74373J229336K76443p56864J13379J435707k23798k77163
$$ 1022923 1272429 898056 2127392 2403835 1646971 1760350 3196057 2972259 2695096
5161B695096K68926M21646p32131K01667M89291j003144R40543k35865J177667
$$ 2695096 2964022 3385668 2653537 2855204 3344495 2341351 3281894 3046029 4223696
5152D223696J102055l59653J211051k03074j042555J489804j601168q39420Q21927
$$ 4223696 5325751 4966098 6177149 5974075 4931520 6421324 4820156 3980736 4802663
5143D802663N49232q14094j394596N513J285907Q82730j403249j691780P32616
$$ 4802663 5351895 4537801 3143205 3148718 4434625 5317355 3914106 2222326 2954942
5134B954942J589936k903165o02168J156628P7377M66869j86782j88678j98703
$$ 2954942 4544878 1641713 1039545 2196173 2273550 2740419 2553637 2364959 2166256
5125B166256P21036p97588J009830L56971l164726P7515J510844j64438r25352
$$ 2166256 2887292 2089704 3099534 3456505 291779 369294 1880138 1715700 790348
5116G90348m68111J0042K020958K55571j544197j073771P38164K03791N43862
$$ 790348 322237 332279 2353237 2608808 1064611 -9160 729004 932795 1476657
5107A476657j071706o01201J636868k388104R08990J604130R9506n7277n84065
$$ 1476657 404951 -196250 1440618 -947486 -38496 1565634 1665140 1607863 1023798
5098A023798j551494Q19118r56192j330599K434461n58347L6570j2958r82772
$$ 1023798 -527696 291422 -664770 -1995369 439092 -119255 -82685 -95643 -1078415
5089a078415J678589L61719q54187L42587Q34946m24484j266375K92215m46318
$$ -1078415 600174 961893 107706 450293 1285239 860755 -405620 -113405 -559723
5080e59723K170788N85577k48388l72844p49424m52416k22630J421799k413001
$$ -559723 1611065 2196642 1948254 1575410 825986 373570 150940 1572739 -840262
5071h40262M29197R26620K79300r73403k24411J988511r98437o91494J463814
$$ -840262 -411065 515555 794855 -178548 -402959 1585552 587115 -104379 1359435
5062A359435o16915j217629J003044j8334p39190k19954J32000J234436n60209
$$ 1359435 742520 -475109 527935 509601 -229589 -449543 -317543 916893 356684
5053C56684o37036o85492Q14582J33042J43899j97894q68524k85069J212584J62959
$$ 356684 -280352 -965844 -151262 -18220 125679 -72215 -940739 -1225808 -13224 149735
5043A49735K04732l55323K13928Q15371q89555j43967R34954K60600r87606o91769
$$ 149735 354467 -856 213072 1028443 138888 -5079 929875 1190475 202869 -488900
5033d88900n66187J009357P40280j491256K16060P2533m15151m8481p08894K11585
$$ -488900 -1055087 -45730 694550 -796706 -580646 -508113 -923264 -971745 -1680639 -1469054
5023a469054L53466Q42237K49002r42433j376271J728848J46896K147855j683095
$$ -1469054 -1115588 -273351 -24349 -966782 -2343053 -614205 -467309 1680546 -2549
5014b549k21725O78748j297313J429824O80395q85357r6569J018037O04611j708467
$$ -2549 -224274 454474 -842839 586985 1267380 382023 285454 1303491 1908102 199635
5004A99635j42898O29249L14855j523487k25085J175246l45640l84701P89666
$$ 199635 56737 685986 1000841 -522646 -747731 427515 81875 -302826 486840
4995D86840Q05741r31836k62947K22059M01805k61289j212835O75131J030133
$$ 486840 1292581 360745 97798 319857 721662 460373 -752462 -77331 952802
4986I52802l42258p15765j42626N43197J336617q52500k148549J467719L54732
$$ 952802 610544 -105221 -247847 295350 1631967 779467 -1369082 98637 453369
4977D53369n07357O93928P9775n7990R84965p45230L12967m701n96180n56733
$$ 453369 -53988 639940 719715 661725 1646690 901460 1214427 1209726 613546 56813
4967E6813Q86125j021175M91640J362185k024065N42404n15713o10310J206066
$$ 56813 942938 -78237 413403 1775588 -248477 293927 -221786 -832096 373970
4958C73970M0273Q7432j417863l72895J164147M75692p54254K437P51472j62711
$$ 373970 414243 501675 -916188 -1289083 -124936 350756 -403498 -401061 350411 187700
4948A87700P07780l8590m97252R53912m47509J46276k16597j081620J382335j73396
$$ 187700 895480 856890 359638 1313550 866041 1012317 795720 -285900 1096435 923039
4938I23039m21012N08715q5633K08579K47048q10337j173067J656829L79620j915665
$$ 923039 502027 1010742 925109 1133688 1380736 570399 -602668 1054161 1433781 -481884
4928d81884j466017J26454J249317J729839j614422j157784P74838N52381J443874
$$ -481884 -1947901 -1821447 -572130 1157709 -456713 -1614497 -839659 -287278 1156596
4919A156596l24148J24530k50723q46564J298689q75930n45580J024217K55494
$$ 1156596 832448 956978 706255 -140309 1158380 282450 -263130 761087 1016581
4910A016581J60419r70129o4834J151632q48536p84288J399576j054616j158663
$$ 1016581 1177000 206871 142037 1293669 445133 -339155 1060421 5805 -1152858
4901a152858M54113O76080k57152n57273M26699K15228N84996o52313J115864
$$ -1152858 -698745 -22665 -279817 -837090 -410391 -195163 389833 -262480 853384
4892H53384J043900m65247J0735j93937J10264q3553j006970l91912Q81900m78274
$$ 853384 1897284 1432037 1442772 1248835 1359099 1275546 268576 -123336 758564 280290
4882B80290K35174j551207L91673J023392K047978j13310j581658j02564m43483
$$ 280290 515464 -1035743 -644070 379322 2427300 2313990 732332 629768 186285
4873A86285P61563j213068J092727J518885m21515k229118j61753J404242J900397
$$ 186285 947848 -265220 827507 2346392 1924877 -304241 -465994 938248 2838645
4864B838645n10365j305075o81283j401994K84670J223273L86700L8888P8850
$$ 2838645 2328280 1023205 341922 -1060072 -775402 447871 834571 873459 952309
4855I52309K57937j175399l32960j26617Q65475J282642j395410m84610Q68141
$$ 952309 1210246 34847 -298113 -424730 440745 1723387 327977 -156633 711508
4846G11508J112228j808061P10093j119N74024j318018r35741m98739K477875
$$ 711508 1823736 15675 725768 724649 1298673 -19345 -955086 -1453825 1024050
4837A024050N99058j500468K76004M35861j10083J6677j12694J256076M83815
$$ 1024050 1623108 122640 398644 834505 724422 741099 628405 1884481 2368296
4828B368296j707765l37165N06062P36566J04598m87436k39398M51134M37361
$$ 2368296 660531 323366 829428 1565994 1670592 1183156 943758 1394892 1832253
4819A832253J59975j248675J23894n84099J347202l02888j558106M00064l2201
$$ 1832253 1992228 743553 867447 283348 1630550 1327662 -230444 169620 137419
4810A37419N61209J484698m00329j491072R14430R39949m17988j663581N33851
$$ 137419 698628 2183326 1782997 291925 1206355 2146304 1728316 64735 598586
4801E98586J549781M8833K12441m85141J061759j338515o12972R63453L11942
$$ 598586 2148367 2197200 2409641 1924500 2986259 1647744 1034772 1998225 2310167
4792B310167k160805l62732P65747O11880k18288L06333N58192J45414k95751
$$ 2310167 149362 -213370 552377 1164257 945969 1252302 1810494 1955908 1660157
4783A660157q66286P51632R89066k164122M47628J048088j65305q69930N80873
$$ 1660157 793871 1545503 2534569 370447 818075 1866163 1700858 830928 1411801
4774A411801J182212j304624j64730l46235P3918L33548r1057o07283J424527
$$ 1411801 2594013 1289389 1124659 778424 852342 1185890 1094833 487550 1912077
4765A912077r23602J030889q51326J094516p33653N82131L08310j113365P46881
$$ 1912077 988475 2019364 1168038 2262554 1528901 2111032 2419342 1305977 2052858
4756B052858l49776o68207J209370J17937j847284J59002O38551J446211j591512
$$ 2052858 1703082 1034875 2244245 2362182 514898 673900 1312451 2758662 1167150
4747A167150J398J055838R2718j539653o31818J057090M49323r68998M57943J607042
$$ 1167150 1168548 2224386 2317104 777451 145633 1202723 1652046 683048 1140991 2748033
4737B748033p32148j040862J169828L31111p70554j259414P75073l50349Q68043
$$ 2748033 2015885 975023 2144851 2475962 1705408 445994 1221067 870718 1738761
4728A738761L15671j93418J95228J007989j519573K67954P00897j040899n81170
$$ 1738761 2054432 1861014 2056242 3064231 1544658 1812612 2513509 1472610 891440
4719H91440K23055P13389J19160K64737j649739l18106J410959o67391J105830
$$ 891440 1114495 1827884 1947044 2211781 562042 243936 1654895 987504 2093334
4710B093334J207771l634340K19910J304900J634948o98528p74303j75000J99492
$$ 2093334 3301105 -333235 -113325 1191575 2826523 2127995 1353692 1178692 1378184
4701A378184q0435o06263R3447m70354J106864J779274j291841k2842j97272L20736
$$ 1378184 1297749 691486 784933 314579 1421443 3200717 1908876 1886034 1688762 2009498
4691B009498N82545p61974K62871J34584k095574J800121J855390p43603n88006
$$ 2009498 2592043 1830069 2092940 2227524 131950 1932071 3787461 3043858 2455852
4682B455852l22998O73024q77676j49157p23622J76024J69982J090698N25214
$$ 2455852 2132854 2805878 1928202 1779045 1055423 1231447 1401429 2492127 3017341
4673C017341j003138p50232J259508M23362p32937M58930j081437M21473P68919
$$ 3017341 2014203 1263971 2523479 2946841 2213904 2672834 1591397 2012870 2781789
4664B781789M05458p05657j662296J120802J454337m15530j305127P7838M01889
$$ 2781789 3187247 2481590 819294 1940096 3394433 2978903 1673776 1751614 2153503
4655B153503j199267n15820R01731Q14517l86520r15636o1427Q72304K13850N53102
$$ 2153503 954236 438416 1340147 2154664 1768144 852508 791081 1663385 1877235 2430337
4645B430337r6564m57352P92775o37582j18167Q39327L86654j702804M79283J630130
$$ 2430337 2333773 1876421 2669196 2031614 1913447 2752774 3139428 1436624 1915907 3546037
4635C546037p12443j671975J334037j673576J18753R88470m04749m99853j94646
$$ 3546037 2833594 1161619 2495656 822080 940833 1929303 1524554 1024701 830055
4626H30055L10977O99597Q02180r7761Q42345k088829r78247J140242J720796
$$ 830055 1141032 1840629 2642809 2545048 3387393 1298564 320317 1460559 3181355
4617C181355r48366l87987N19566L12498M8611j727211J859419M48856k103161
$$ 3181355 2232989 1845002 2364568 2677066 2725677 998466 2857885 3306741 1203580
4608A203580M76344o92428L74570R718P50662j66623O61050p21444L90841L52958
$$ 1203580 1679924 987496 1362066 1371784 2122446 1955823 2616873 1895429 2286270 2639228
4598B639228K74814N27674j477334q11120J359532K65933n92961j27958N35239
$$ 2639228 2914042 3441716 1964382 1153262 2512794 2778727 2185766 2057808 2593047
4589B593047P91324m57774j731334J225139l19763j377767J209143o08653K8495
$$ 2593047 3384371 2926597 1195263 2420402 2100639 722872 1932015 1323362 1351857
4580A351857p19462J523665J173868O30611j295631l74837M18034o51178J186473
$$ 1351857 632395 2156060 3329928 3960539 2664908 2290071 2708105 2056927 3243400
4571C243400k055204o55839J805454n49375J049095r82818k67548J296723j25200
$$ 3243400 1188196 532357 2337811 1788436 2837531 1854713 1587165 2883888 2758688
4562B758688j451942J071027J908021j693203M30779p11948L79036J791226k00394
$$ 2758688 1306746 2377773 4285794 2592591 3023370 2311422 2690458 4481684 4281290
4553D281290m02397O13992p45966j305956k58987O64804J362581p2100j333959
$$ 4281290 3878893 4492885 3746919 2440963 2181976 2846780 4209361 4137261 2803302
4544B803302m23373j150814P20647o85620k17801J987959m14593j78229j549777
$$ 2803302 2379929 1229115 1949762 1264142 1046341 3034300 2619707 2441478 891701
4535H91701J138228J014573J721476r47082j985581K50793Q47446P08077k19440
$$ 891701 2029929 3044502 4765978 3818896 1833315 2084108 2931554 3639631 3420191
4526C420191n44118J169281k22863r44155m9674q7106N89635P62062j261022J970582
$$ 3420191 2876073 4045354 3822491 2878336 2828662 2741556 3331191 4093253 2832231 4802813
4516D802813O01365p55976L12745q74599J183468n33624j403196O82830M99870
$$ 4802813 5404178 4648202 4960947 4086348 5269816 4736192 3332996 4015826 4515696
4507D515696q22445L15585J62386M59510P74629r45424o91066q54434m85378K478950
$$ 4515696 3693251 4008836 4171222 4630732 5405361 4459937 3768871 2914437 2429059 4908009
4497D908009q511j769821R44600R0105K55047J00685P94122k4264r36654j277211
$$ 4908009 4899498 3129677 4074277 4164382 4419429 4520114 5314236 5289972 4353318 3076107
4487C076107O34402M15357O30736O91210O55599P05420r74476L25961l16995J003836
$$ 3076107 3710509 4125866 4756602 5447812 6103411 6808831 5834355 6160316 5843321 6847157
4477F847157k11572n66716j473147K651154m57122l36307J826958j22917l10462
$$ 6847157 6635585 6068869 4595722 7246876 6789754 6453447 8280405 8157488 7847026
4468G847026k71790j397996L0682o9906J334125P43771j247281j103943J202563
$$ 7847026 7575236 6177240 6207922 6138016 7472141 8215912 6968631 5864688 7067251
4459G067251J162519l15957K1030j088814J564210j213548n99345O00106K52856
$$ 7067251 8229770 7913813 7934843 6846029 8410239 7196691 6597346 7197452 7450308
4450G450308J89028L18449J117683P39001M376M20848r27823J84495j67748J034332
$$ 7450308 7639336 7957785 9075468 9814469 9818845 10239693 9311870 9496365 9328617 10362949
4440A0362949q02613o21869J065175J049682J2207m87450J99373J0160N22859
$$ 10362949 9560336 8938467 10003642 11053324 11065531 10578081 10777454 10787614 11310473
4431A1310473L99783J178247m48680p49383j78755J447574J068783J61081n11306
$$ 11310473 11710256 12888503 12439823 11690440 11511685 12959259 14028042 14189123 13677817
4422A3677817K32875J642632O44595k06840k48288j007390K667298J784852q71461
$$ 13677817 13910692 15553324 16197919 15991079 15742791 14735401 17402699 19187551 18316090
4413A8316090P24712j733740M86666K008436p899K017071R25700j17216J0907
$$ 18316090 19040802 17307062 17793728 19802164 19794265 21811336 22737036 22619820 22630727
4404B2630727L11919J450727R07206j51324K417264M39251O64507j65803K98418
$$ 22630727 22942646 24393373 25300579 25149255 27566519 28005770 28670277 28504474 28802892
4395B8802892K764064K159562J641563P17778J847798R18370K043118J708672
$$ 28802892 31566956 33726518 35368081 36085859 37933657 38852027 40895145 42603817
4387D2603817L232656J930483J265303L336755K742622N346500J900133Q60747
$$ 42603817 45836473 47766956 49032259 52369014 55111636 60458136 62358269 63219016
4379F3219016K098867L611479M284522K923325J214129K741409M251794P69860
$$ 63219016 65317883 68929362 73213884 76137209 77351338 80092747 84344541 85114401
4371H5114401J288409L119231L27028J689756R65622J421092M71560p47779q94324
$$ 85114401 86402810 89522041 89849069 91538825 92504447 93925539 94397099 93649320 92754996
4362I2754996m4696n42517k329899j997515l765014k376098j802438k753513k998097
$$ 92754996 92710300 92167783 89837884 87840369 84075355 81699257 79896819 77143306 74145209
4353G4145209k989810l488491k570642l514887j439807k605675k912805l212350
$$ 74145209 71155399 67666908 65096266 61581379 60141572 57535897 54623092 51410742
4345E1410742l417417j400631l473364k857575j938259l029274k36871j156250
$$ 51410742 47993325 46592694 43119330 40261755 38323496 35294222 35057351 33901101
4337C3901101r09525j403611j658871p85596j894099j088831k47110k7452l98142
$$ 33901101 32991576 31587965 29929094 29143498 27249399 26160568 25913458 25886006 25487864
4328B5487864k220878j129922m81554J96772o57731k35918r06926j578408J81507
$$ 25487864 23266986 22137064 21655510 21852282 21194551 20958633 20051707 18473299 18654806
4319A8654806K117924m56649j048145j274130o9465K87227j712656R09287Q03387
$$ 18654806 20772730 20316081 19267936 17993806 17924341 18211568 16498912 17408199 18211586
4310A8211586p66234K28441p87739J15419J040042k51404p34672j249325k458924
$$ 18211586 17445352 17673793 16886054 17001473 18041515 17790111 17055439 15806114 13347190
4301A3347190J493764J176942j515028J7722J577294K95509j840374l32817Q83883
$$ 13347190 14840954 16017896 14502868 14520590 16097884 16393393 14553019 14220202 15104085
4292A5104085O36731j077886k237957J273735O07583K89397R47154q06256K14861
$$ 15104085 15740816 14662930 12424973 13698708 14306291 14595688 15542842 14736586 14951447
4283A4951447P58557o23634l51874m36273m63162m1486m42817J259774M58430
$$ 14951447 15710004 15086370 14734496 14298223 13835061 13793575 13350758 14610532 15068962
4274A5068962m83563p63273M30070M4994K58473q90081K76866k43206J082627
$$ 15068962 14585399 13822126 14252196 14297190 14555663 13665582 13942448 13699242 14781869
4265A4781869m28220R15469R14875L59689J151156q58906j300552J554866P04467
$$ 14781869 14353649 15269118 16183993 16543682 17694838 16835932 15535380 17090246 17794713
4256A7794713k69283p45445J41896J64685Q67495J43105o00621j92028N93070
$$ 17794713 17525430 16779985 16921881 17086566 17954061 18097166 17496545 17304517 17897587
4247A7897587J393483n86567j202310O68801J746525n82476j209533Q64517R07912
$$ 17897587 19291070 18704503 17502193 18170994 19917519 19335043 18125510 18990027 19897939
4238A9897939R57997K42917o7676L92244J602519R00471l85087R04960k23197
$$ 19897939 20855936 21098853 21031177 21423421 23025940 23926411 23541324 24446284 24223087
4229B4223087J82570l82103J42607L95893R29967J699976L15419j38861K011669
$$ 24223087 24405657 24023554 24166161 24562054 25492021 27191997 27507416 27368555 29380224
4220B9380224J980940j67475J251859J525218J229479r10523J173641K879975
$$ 29380224 31361164 31193689 32445548 33970766 35200245 34289722 35463363 38343338
4212C8343338p05029J247354J569666R20775R00872q23692r95124o54113k00772
$$ 38343338 37638309 38885663 40455329 41376104 42276976 41453284 40458160 39804047 39603275
4203C9603275Q02752j517416j422045J355016j044434j467999R01831J56230K91577
$$ 39603275 40406027 38888611 37466566 38821582 37777148 36309149 37210980 37367210 37658787
4194C7658787j421124j324581J314030k12735o59741K06102J09828P82705k65076
$$ 37658787 36237663 34913082 36227112 36014377 35354636 35560738 35670566 36453271 36188195
4185C6188195q21439J416743P20447j337993J559961J745852J50675Q01767P71173
$$ 36188195 35366756 36783499 37503946 36165953 37725914 39471766 39622441 40424208 41195381
4176D1195381j197175K448867J403787J95331J172565J256926j08437P81190L07203
$$ 41195381 39998206 42447073 43850860 44046191 45218756 46475682 46367245 47148435 47455638
4167D7455638J526835J150565o71914J641189J104067n05198J279686L299925
$$ 47455638 48982473 50133038 49461124 51102313 52206380 51701182 52980868 56280793
4159E6280793J115365Q80899j3297L74435K595079K442639J17177J800959K281329
$$ 56280793 57396158 58277057 58263760 58638195 61233274 63675913 63793090 65594049 67875378
4150F7875378K063796J935946K397115L317498K801997O66141J396479L389906
$$ 67875378 69939174 71875120 74272235 77589733 80391730 81057871 82454350 85844256
4142H5844256M378738K347878J131982L429769L452210L905972P037115M981156
$$ 85844256 90222994 92570872 93702854 97132623 100584833 104490805 111527920 116509076
4134A16509076K154944N700065P685486P313406O004976P643550Q601362Q258612
$$ 116509076 118664020 124364085 132049571 139362977 145367953 153011503 161612865 169871477
4126A69871477R304923R623865J0055661J2050827J3248513J3107154J4940185
$$ 169871477 179176400 188800265 198855926 210906753 224155266 237262420 252202605
4119B52202605J4887754J5669388J5824031J4394727J1875144P642063J965332
$$ 252202605 267090359 282759747 298583778 312978505 324853649 332495712 334461044
4112C34461044l802712o793935j3147308j7307816j8653452j8568500j6786025
$$ 334461044 330658332 323864397 310717089 293409273 274755821 256187321 239401296
4105B39401296j4596314j5161737j3335698j1308268j0921188r964078p709170
$$ 239401296 224804982 209643245 196307547 184999279 174078091 164114013 156404843
4098A56404843p824332o271140m288074m941363n803204n234436k358908k787560
$$ 156404843 148580511 142309371 138021297 133079934 127276730 122042294 119683386 116895826
4090A16895826l330836k043847j054330k930318k090907o02119K09343q70260
$$ 116895826 113564990 111521143 110466813 107536495 105445588 104843469 105052812 104182552
4082A04182552r65486o49837J209640M67535J056826l37171K13783Q75813P32558
$$ 104182552 103217066 102567229 103776869 104244404 105301230 104964059 105177842 106053655 106786213
4073A06786213K68972J302511J820361J58709J083914J813440L708214J299013
$$ 106786213 107055185 108357696 110178057 110336766 111420680 113234120 116942334 118241347
4065A18241347J129906K931027K975489J548814J895472L030857M652665L639678
$$ 118241347 119371253 122302280 125277769 126826583 128722055 131752912 136405577 140045255
4057A40045255J953532L011860M593800L419969K637450L154598K516036K829067
$$ 140045255 141998787 145010647 149604447 153024416 155661866 158816464 161332500 164161567
4049A64161567L551073L550307K043137L494338J332027L168546K987549J119221
$$ 164161567 167712640 171262947 173306084 176800422 178132449 181300995 184288544 185407765
4041A85407765J067097K444485L550556J344670J491444J404027K584936M65372
$$ 185407765 186474862 188919347 192469903 193814573 195306017 196710044 199294980 199760352
4033A99760352n52036l30349j270729O23388l44579j246763k63525k215039j447704
$$ 199760352 199208316 198877967 197607238 198230626 197886047 196639284 196375759 194160720 192713016
4024A92713016j321809k691420k831945k596820k238854l084916l301820k081569
$$ 192713016 191391207 188699787 185867842 183271022 181032168 177947252 174645432 172563863
4016A72563863m383492j313297l903419m338898k002787m275709l800159l021091
$$ 172563863 168180371 166867074 162963655 158624757 156621970 152346261 148546102 145525011
4008A45525011l460255k657700j878744m561842l629803j545268k208287l018489
$$ 145525011 142064756 139407056 137528312 132966470 129336667 127791399 125583112 122564623
4000A22564623k406530j314012j212065k386332l057739m48201k417669j439650
$$ 122564623 120158093 118844081 117632016 115245684 112187945 111739744 109322075 107882425
3992A07882425R24946q74485J44803k356410K658497J353403j8093K055817l53478
$$ 107882425 108807371 107932886 108077689 105721279 108379776 109733179 109715086 111770903 111417425
3983A11417425J434246J733090P70407j794575l452919j025576j415988m720722
$$ 111417425 112851671 114584761 115355168 113560593 110107674 109082098 107666110 102945388
3975A02945388k185069k553439k430183j853762j509077j629838j420392j039952
$$ 102945388 100760319 98206880 95776697 93922935 92413858 90784020 89363628 88323676
3967H8323676r45208J099834J20347j019536J19323P07613L95288l39118n1525
$$ 88323676 87378468 88478302 88598649 87579113 87698436 88406049 88801337 88462219 88410694
3958H8410694J641057J302165n24290L16897N62330K120210L159787n46766R19003
$$ 88410694 90051751 91353916 90829626 91146523 91708853 93829063 96988850 96442084 97361087
3949I7361087K009655K328017J520274Q17267K131341J678298K460485K534821
$$ 97361087 99370742 101698759 103219033 104036300 106167641 107845939 110306424 112841245
3941A12841245J374416K155872K605380K727303J937727K369093M464581L693627
$$ 112841245 114215661 116371533 118976913 121704216 123641943 126011036 130475617 134169244
3933A34169244K823374M417380M124581M471927L436060M132213O276782O306177
$$ 134169244 136992618 141409998 145534579 150006506 153442566 157574779 163851561 170157738
3925A70157738N688248N661509O596670P567704Q539557P603371Q380951P524029
$$ 170157738 175845986 181507495 188104165 195671869 204211426 211814797 220195748 227719777
3917B27719777R380262J1068461R353739J1208449J0847365J1558857J3093944
$$ 227719777 237100039 248168500 257522239 268730688 279578053 291136910 304230854
3910C04230854J2504017Q695268J1069144J3135690J0016856R679109R125690
$$ 304230854 316734871 325430139 336499283 349634973 359651829 369330938 378456628
3903C78456628O151447P005592N659959L237060L337059j35931j816301l37597
$$ 378456628 384608075 391613667 397273626 400510686 403847745 403711814 401895513 401557916
3895D01557916l267734l017835m819926n536205n014789r282580q424146j0063360
$$ 401557916 398290182 395272347 390452421 384916216 379901427 370618847 362194701 352131341
3887C52131341j0811832j0141822j2878248j1524091j1433761j2264124j1893874
$$ 352131341 341319509 331177687 318299439 306775348 295341587 283077463 271183589
3880B71183589j2419457j2092265j2089287j0221250j0710064j0846177r433054
$$ 271183589 258764132 246671867 234582580 224361330 213651266 202805089 193372035
3873A93372035q223702p406575p025388p790646o117388o999426o810776n687515
$$ 193372035 185148333 177741758 170716370 162925724 156808336 149808910 142998134 137310619
3865A37310619n611118l985351m524418m309450l993383l294722m496801l261287
$$ 137310619 131699501 127714150 123189732 118880282 114886899 111592177 107095376 103834089
3857A03834089k794620m052473j426135l308830l514136j911291l824294k818018
$$ 103834089 101039469 96986996 95560861 92252031 88737895 86826604 83002310 80184292
3849H0184292o27815j320998k489808k933706k855162r11803R71147k354160j913033
$$ 80184292 79556477 78235479 75745671 72811965 69956803 69045000 70016147 67661987 65748954
3840F5748954k878292q26574j713506j617052K80325j26874k484511k298579j851479
$$ 65748954 62870662 62044088 60330582 58713530 58993855 58866981 56382470 54083891 52232412
3831E2232412L99365j14492j503673j296111k167649j765584M66210p02572p1125
$$ 52232412 52631777 52517285 51013612 49717501 47549852 45784268 46250478 45547906 45476781
3822D5476781p17165l36748j172353l202702k19691q24675M4148q36861j962351
$$ 45476781 44759616 44422868 43250515 40047813 39828122 39003447 39047595 38210734 36248383
3813C6248383r26030J45691L82833O22803p08840j662927j655839O28509k242775
$$ 36248383 35322353 35468044 35850877 36473680 35764840 34101913 32446074 33074583 30831808
3804C0831808m86083Q00909m03515k278126M63082L78757q72360J81596j355270
$$ 30831808 30345725 31146634 30743119 28464993 28928075 29306832 28434472 28616068 27260798
3795B7260798m07258k68410j95096J18436P21660m29811k067957l75362N14589
$$ 27260798 26853540 26585130 26390034 26508470 27230130 26800319 24732362 24357000 24871589
3786B4871589K98374M10394r92672j45076q56646j21734J943693m88732j252184
$$ 24871589 25169963 25580357 24587685 24442609 23585963 23464229 25407922 24919190 23667006
3777B3667006o17397j301454K89182K06708j242103J571174j38306n43923R65690
$$ 23667006 23049609 21748155 22037337 22244045 21001942 22573116 22434810 21890887 22856577
3768B2856577j066428M73749P00678j282940K18732k06750J009519l45195k41139
$$ 22856577 21790149 22263898 22964576 21681636 21900368 21693618 22703137 22357942 22116803
3759B2116803O70896l27475l99977J482222L92587m70794m76472q19609J56552
$$ 22116803 22787699 22460224 22060247 23542469 23935056 23464262 22987790 22168181 22324733
3750B2324733L11370j356867k97313J428549N89484p73360R19382J342369p12139
$$ 22324733 22636103 21279236 20981923 22410472 22999956 22226596 23145978 24488347 23776208
3741B3776208Q21797L64665r0575L66398M89199O4056J133104k30961K8816J429941
$$ 23776208 24598005 24962670 24872095 25238493 25727692 25791748 26924852 26693891 26722707 28152648
3731B8152648P0415J028459J36906j460034N8020J877533J03988l85213J93683
$$ 28152648 28223063 29251522 29388428 27928394 27986414 29863947 29967935 29582722 29776405
3722B9776405M93540N26856m92957J311266n46052J11996M11653J283O11493O21881
$$ 29776405 30269945 30796801 30303844 31615110 31069058 31181054 31592707 31593990 32205483 32827364
3712C2827364n7473j192240n55526n45312k28538Q59851J028919k779175o97195
$$ 32827364 32769891 31577651 31022125 30476813 30248275 31108126 32137045 29357870 28660675
3703B8660675J458631N96841R69962M45663J59588J626155k028646n35186K325915
$$ 28660675 30119306 30716147 31686109 32131772 32291360 33917515 31888869 31353683 33679598
3694C3679598J188800l04547J061477O05487K69158K614893l35582P40697Q17814
$$ 33679598 34868398 34563851 35625328 36230815 36499973 39114866 38779284 39519981 40337795
3685D0337795J51617O72803J012753N12305M1478O92743J467135Q57195O49821
$$ 40337795 40489412 41162215 42174968 42687273 42728751 43421494 44888629 45745824 46395645
3676D6395645N54879J987073O93262J561565o68583L77602L530414O58237J169221
$$ 46395645 46950524 48937597 49630859 51192424 50523841 50901443 54431857 55090094 56259315
3667E6259315J048439J677766K880606J734453J238884p8181J450269o8058J640199
$$ 56259315 57307754 58985520 61866126 63600579 64839463 64761282 66211551 66143493 67783692
3658F7783692J381318P51602J628648J436995K537544r28532Q86190K986515J120489
$$ 67783692 69165010 69916612 71545260 72982255 75519799 74591267 75477457 78463972 79584461
3649G9584461J527937j487229J719543J268174R47905K272471R71803N27755K058924
$$ 79584461 81112398 79625169 81344712 82612886 83560791 85833262 86805065 87332820 89391744
3640H9391744O06811j68393K095188K265930Q28078O53680J487400K697786K492143
$$ 89391744 89998555 89830162 91925350 94191280 95019358 95673038 97160438 99858224 102350367
3631A02350367J838342J415083K158333K206718L067151M239636J549839N266859
$$ 102350367 104188709 105603792 107762125 109968843 113035994 117275630 118825469 124092328
3623A24092328L984583L082652M595542M273206M814995M249530N970472N739789
$$ 124092328 128076911 131159563 135755105 140028311 144843306 149092836 155063308 160803097
3615A60803097L501880Q049878N138087N039864N743977O260674P364242L787693
$$ 160803097 164304977 172354855 177492942 182532806 188276783 194537457 201901699 205689392
3607B05689392O265841O120762O028463O064047O363704N578456M835573M332051
$$ 205689392 211955233 218075995 224104458 230168505 236532209 242110665 246946238 251278289
3599B51278289L846546O600519M119458L934087M128294K116509J437770L724734
$$ 251278289 255124835 261725354 265844812 269778899 273907193 276023702 277461472 281186206
3591B81186206K164650L08251L221425J843065k76154p84579p78169n02550k100161
$$ 281186206 283350856 283659107 286880532 288723597 288447443 287662864 286884695 286382145 284281984
3582B84281984j066345j550083k353364m544430l440010k877214k159466l732579
$$ 284281984 283215639 281665556 279312192 274767762 271327752 268450538 266291072 262558493
3574B62558493n765100n630246m480176n469861n936643n640227n382476m847744
$$ 262558493 256793393 251163147 246682971 241213110 235276467 229636240 224253764 219406020
3566B19406020o709907n651682n650203o528378n027675n743275p577594n166914
$$ 219406020 212696113 207044431 201394228 194865850 189838175 184094900 176517306 171350392
3558A71350392n491523o010406m385059o667938m314491m419146p070903m454047
$$ 171350392 165858869 159848463 155463404 148795466 144480975 140061829 132990926 128536879
3550A28536879m230649l074422l641440m665994l336512k694457l011065l652953
$$ 128536879 124306230 121231808 117590368 112924374 109587862 106893405 103882340 100229387
3542A00229387k540436j876655k383834p88714j253882j442202k684808j489113
$$ 100229387 97688951 95812296 93428462 92639748 91385866 89943664 87258856 85769743
3534H5769743q01315q77701j49375k870569j976421n42793j474908N39875j671087
$$ 85769743 84968428 84090727 83941352 81070783 79094362 78551569 77076661 77616536 75945449
3525G5945449k524082j320497j480199j83301L28700j855496k687092R4017j163799
$$ 75945449 73421367 72100870 70620671 70437370 70766070 68910574 66223482 66317499 65153700
3516F5153700k135634r76240K0082k616392j770047p82991j627284k209430q88990
$$ 65153700 63018066 62041826 62061908 59445516 57675469 56892478 55265194 53055764 52166774
3507E2166774o15858k882089k413024J290189j847222j526684j875398j971182
$$ 52166774 51550916 48668827 46255803 47545992 45698770 44172086 42296688 40325506
3499D0325506j120119j690667K99238j263517j778947k99749l58182l79099k224656
$$ 40325506 39205387 37514720 37813958 36550441 34771494 34471745 34113563 33734464 31509808
3490C1509808j389847R70783k458462m90973j107202j104890j169639l41923M73420
$$ 31509808 30119961 31090744 28632282 28141309 27034107 25929217 24759578 24417655 24891075
3481B4891075j196739M78513o15806k264967l06382j674362J252773p06957k197645
$$ 24891075 23694336 24172849 23557043 21292076 20985694 19311332 20564105 19857148 17659503
3472A7659503k52353J154287p94241q50836J596400M4168j372535j471878j019214
$$ 17659503 17407150 18561437 17767196 16916360 18512760 18556928 17184393 15712515 14693301
3463A4693301R41817q33147l21559j778034J007638J207452p61589j337037P22827
$$ 14693301 15635118 14801971 14480412 12702378 13710016 14917468 14155879 12818842 13541669
3454A3541669p110k237538J90778n25724o9447J057994j123560q74122J875442
$$ 13541669 13534559 11297021 11487799 10962075 10892628 11950622 10827062 9952940 11828382
3445A1828382J63923j849894N37206k0680j624245M46790l448m43522P34723J1940
$$ 11828382 11992305 10142411 10679617 10658937 9034692 9481482 9478034 9034512 9769235 9781175
3435I781175l36695l04483k55688J3073r0114q02236p93131j04525J88694Q30896
$$ 9781175 9444480 9139997 8884309 8897382 8807268 8005032 7211901 7107376 7296070 8126966
3425H126966m27640L31739j007960j246330P58903p15845r17199K765475n02412
$$ 8126966 7699326 8031065 7023105 5776775 6535678 5819833 4902634 7668109 7165697
3416G165697j609868m80076j23316j86893J389082o16809k85212J89607n30659
$$ 7165697 5555829 5075753 4952437 4765544 6154626 5537817 5252605 5442212 4911553
3407D911553J78747J087850n48222J101851j302857j878094J725054Q43742j079724
$$ 4911553 5090300 6178150 5629928 6731779 5428922 3550828 5275882 6119624 5039900
3398E039900R37353m96015k7796q59094m20159J24777j725026k25030K195310
$$ 5039900 5977253 5481238 5453442 4594348 4174189 4298966 2573940 2348910 4544220
3389D544220k27013j114662P33264P04658R37359l85145O4506m74186q63028j141289
$$ 4544220 4317207 3202545 3935809 4640467 5577826 5192681 5257187 4783001 3919973 2778684
3379B778684M91085J563135L31974j418661P77470K93945j360594J03029J71229
$$ 2778684 3269769 4832904 5164878 3746217 4523687 4817632 3457038 3560067 3731296
3370C731296L76691m38463m82295O5238o23144R44693L81387k2665m47516n34871
$$ 3731296 4107987 3669524 3187229 3252467 2629323 3574016 3955403 3932738 3485222 2950351
3360B950351n69814r11858P17201N42855J636227n21288j158731J213324K74699
$$ 2950351 2380537 1468679 2185880 2728735 4364962 3843674 2684943 3898267 4172966
3351D172966K79428j554732n18028J287587j61186j618623L8434J529665P44904
$$ 4172966 4452394 2897662 2379634 3667221 3506035 1887412 1925846 3455511 4200415
3342D200415j073520j329036P41229j33393j145938K160572j362198P3340n22222
$$ 4200415 3126895 1797859 2539088 2405695 1259757 3420329 2058131 2131471 1609249
3333A609249n72994J750712J88760j427445J087230J47137o93108L86141L25565
$$ 1609249 1036255 2786967 2975727 1548282 2635512 2782649 2089541 2475682 2801247
3324B801247Q28389J74696m16602p09645q36978j27104J82788Q29048n57931l65973
$$ 2801247 3629636 3804332 3387730 2678085 1841107 1714003 1896791 2725839 2167908 1801935
3314A801935n22423Q48471J186814q4156M88805L26081k62873j717894N36685
$$ 1801935 1279512 2127983 3314797 3230641 3719446 4045527 3782654 2064760 2601445
3305B601445O26195N91041K63157l4287j30936K1993j870290o05193R65434J60952
$$ 2601445 3227640 3818681 4081838 4047551 3916615 3938608 2068318 1463125 2428559 2589511
3295B589511m71641Q61571q68112M12128J305273r08424j57907J670177j310251
$$ 2589511 2117870 2979441 2111329 2523457 3828730 2920306 2762399 4432576 3122325
3286C122325m43014m42855j073060L86163J141222L5763j801342L97987J661907
$$ 3122325 2679311 2236456 1163396 1549559 2690781 2726544 925202 1323189 2985096
3277B985096j092023p17224M6125N44055m91245j986111J900905J025382q06617
$$ 2985096 1893073 1175849 1221974 1766029 1274784 -711327 1189578 2214960 1408343
3268A408343q84634N9428O61484N9924N92052k00045K18323R46636o13634j59958
$$ 1408343 523709 583137 1244621 1304545 1896597 1696552 1914875 2861511 2247877 2087919
3258B087919N08104j118865r12783m6932J532159j524296r14220J557043j362835
$$ 2087919 2596023 1477158 564375 517443 2049602 525306 -388914 1168129 -194706
3249a94706P75596J389091n42594k731n45445R7806O15945j869814P84487N1151
$$ -194706 580890 1969981 1427387 1424656 879211 977017 1592962 -276852 507635 558786
3239E58786J054468r05798l25472J477582m00987K97774l41671j388430K58846
$$ 558786 1613254 707456 381984 1859566 1458579 1756353 1414682 26252 285098
3230B85098N72366m41215j39473m26414p5452J75135M12987L23505N97234j243735
$$ 285098 857464 416249 276776 -149638 -225090 -49955 363032 686537 1283771 40036
3220D0036L53091N90887J41872J05785P9339O14549J01653j282768P72757O80531
$$ 40036 393127 984014 1125886 1231671 1311010 1925559 2027212 744444 1517201 2197732
3210B197732P2606K13156o55881n44281j98429J224403r82006J55725p1238m24535
$$ 2197732 2270338 2483494 1827613 1283332 1084903 2309306 1327300 1483025 1411787 987252
3200I87252n96620M31650k3001J92380r44665j76183M21871r25428R16979M35016
$$ 987252 390632 822282 799281 991661 46996 -129187 292684 -632744 284235 719251
3190G19251M03061R88437j479871o49275J106512N7945j07710j204978J15315
$$ 719251 1122312 2110749 630878 -18397 1088115 1146060 1038350 -166628 -51313
3181e1313O77320p09431j382232Q06370P55308r54859R48331J889703r36453n88891
$$ -51313 626007 -83424 -1465656 -659286 96022 -858837 89494 1979197 1042744 453853
3171D53853l74514o26167J767525J27152n6025J1953j534216L66047J186829j192589
$$ 453853 79339 -546828 1220697 1347849 1291824 1303777 -230439 135608 1322437 129848
3161A29848P52087K15199o56610k65438n64382J057587j54233k17818N55174J258879
$$ 129848 881935 1097134 440524 175086 -389296 668291 514058 296240 851414 2110293
3151B110293j699195p08027J524715J252585j060428j472595n5994J580134J120202
$$ 2110293 411098 -296929 1227786 2480371 1419943 -52652 -108646 1471488 2591690
3142B591690j120374n32522j071067o20952J370703o02846R13615o5028j638979
$$ 2591690 1471316 938794 -132273 -753225 617478 14632 928247 863219 -775760
3133g75760j28517M97420J111031J10314J159392N0875q20790r34791L08720k31984
$$ -775760 -904277 -406857 704174 814488 1973880 2024755 1203965 269174 577894 345910
3123C45910R02949n65116j501530J73844r6281l35364J072256J84458l62406K10673
$$ 345910 1248859 683743 -817787 -643943 -740224 -1075588 -3332 181126 -181280 29393
3113B9393j895661m34802J249321P91980J057581J97906j680522J7876J435836
$$ 29393 -1866268 -2301070 -1051749 -259769 797812 995718 -684804 -666928 768908
3104G68908J102459l65683o44734j489185M90274J49748K9492O51879J006071
$$ 768908 1871367 1505684 860950 -628235 -137961 11787 41279 693158 1699229
3095A699229j475379j029072o6811l10923l68452M96574L40499p72796r71352
$$ 1699229 223850 -805222 -872033 -1182956 -1551408 -1054834 -714335 -1487131 -2458483
3086b458483O63858J707200j08036p83332j123909J777196j113184j33668k12828
$$ -2458483 -1794625 -87425 -195461 -978793 -2102702 -325506 -1438690 -1572358 -1785186
3077a785186Q55366J588431m62335j704409K97076J073412P61607Q2151j874545
$$ -1785186 -929820 658611 196276 -1508133 -1211057 -137645 623962 706113 -1168432
3068a168432k63072Q15952p83220J050108l4296m51660j87763Q20662J017999
$$ -1168432 -1431504 -615552 -1398772 -348664 -382960 -834620 -1022383 -201721 816278
3059H16278j19766j243323l58698J106868J44101m20943q60080R86619Q5580m19843
$$ 816278 696512 -546811 -905509 201359 345460 -75483 -935563 51056 136636 -283207
3049b83207n42830j331682N11122L004711r18558j227012o26730J131759O62108
$$ -283207 -826037 -2157719 -1646597 1358114 439556 -787456 -1414186 -282427 379681
3040C79681m4327j762062k1431J837263j038647j213501J434007R49419j261847
$$ 379681 335354 -1426708 -1448139 389124 -649523 -1863024 -429017 520402 -741445
3031g41445P16702M23150o4915J89987j384826n05277N99001j81385r4123K70835
$$ -741445 -24743 398407 333492 523479 -861347 -1366624 -767623 -949008 -1043131 -772296
3021g72296m3296M12473J703149o23097k207947m72986O36486K030498Q12958
$$ -772296 -815592 -403119 1300030 676933 -1531014 -2004000 -1367514 662984 1475942
3012A475942j445742j451042J085583N60780Q23172N20544q79020q57331o11272
$$ 1475942 30200 -1420842 -335259 225521 1048693 1569237 690217 -167114 -778386
3003g78386j30591j125481J014204J037770o80730k00084n48167p68393M83357
$$ -778386 -908977 -2034458 -1020254 17516 -663214 -863298 -1411465 -2179858 -1696501
2994a696501J822077L3641j435001q99981J004408l53629l91199J788988j819207
$$ -1696501 125576 159217 -1275784 -2175765 -1171357 -1524986 -1916185 -127197 -1946404
2985a946404P22468R76041j337505j060444J147019K73062J060587N66734j905425
$$ -1946404 -1223936 -247895 -1585400 -2645844 -1498825 -1225763 -165176 401558 -1503867
2976a503867L75069J102478j22394P91954j135519P41559L82203j930766j59591
$$ -1503867 -1128798 -26320 -148714 643240 -492279 249280 631483 -1299283 -1458874
2967a458874J159878N72614M85076j055222r32660j8692l23309J092810O58760
$$ -1458874 -298996 273618 758694 -296528 -1229188 -1247880 -1571189 -478379 180381
2958A80381l22140j011112q82831n73075J779398J569102j682655p22094N81651
$$ 180381 -141759 -1152871 -2035702 -2608777 -829379 739723 -942932 -1665026 -1083375
2949a083375N33612l4288J036434L47465r09494k222014m33887J532434J68661
$$ -1083375 -549763 -584051 452383 799848 -109646 -2331660 -2765547 -1233113 -1064452
2940a064452L7475K26372Q05204r64335J052479J05818j94734J80793j433697
$$ -1064452 -1026977 -800605 4599 -959736 92743 198561 3827 184620 -1249077
2931a249077M14553J199117j439524q02026Q16871J437403o58996j167630L7233
$$ -1249077 -834524 364593 -1074931 -1876957 -1060086 377317 -281679 -1449309 -1412076
2922a412076N85667J07569p8211j239480L42659J461049J77471n76621R900L74163
$$ -1412076 -826409 -718840 -797051 -2036531 -1693872 -232823 -55352 -631973 -622073 -247910
2912b47910k52109k93675N83999L09330L6809N632k59806M79452q09822j72364
$$ -247910 -500019 -793694 -209695 99635 136444 142076 -117730 361722 -448100 -620464
2902f20464j27051M44990j415671j92343J269325R7108J176689j082879m61815
$$ -620464 -747515 -302525 -1718196 -1910539 -641214 -544106 632583 -450296 -912111
2893i12111J277183k86493n14269K80158j119926p32899J186384L89568K11734
$$ -912111 365072 78579 -435690 -155532 -1275458 -2008357 -821973 -432405 -220671
2884b20671P1311n39500J186876Q85798j722790l47030N84815m21575J60899j777575
$$ -220671 -149360 -688860 498016 1383814 -338976 -686006 -101191 -522766 -361867 -2139442
2874b139442L76688J777935n75281k04850P20437j652355P28950J944807j707156
$$ -2139442 -1762754 15181 -560100 -764950 -44513 -1696868 -967918 976889 -730267
2865g30267N17117J584596j924701N70780J134274j803335L7087j055063j683
$$ -730267 -213150 1371446 -553255 17525 1151799 -651536 -614449 -1669512 -1671195
2856a671195J561106j482193M93368J494381J13309N02978k096288j07327K76623
$$ -1671195 -110089 -1592282 -1098914 395467 508776 1011754 -1084534 -1191861 -915238
2847i15238l96748K64572q66744J529472p45461j142213K127377N22163J41588
$$ -915238 -1311986 -1047414 -1914158 -384686 -1130147 -2272360 -144983 377180 518768
2838E18768q68304n30236O71339q0443m93969j467479O74617L31407L75381J375272
$$ 518768 -349536 -879772 -208433 -288876 -782845 -2250324 -1575707 -1244300 -868919 506353
2828E06353k70629r1607q9630n45573J037968j373746q62105J327734p89143J055045
$$ 506353 235724 144117 54487 -491086 546882 -826864 -1688969 -361235 -1150378 -95333
2818i5333m89808l91037J354635j121954O81430R69799j204380N21286r95006
$$ -95333 -585141 -976178 378457 -743497 -62067 907732 -296648 224638 -770368
2809g70368j07905P90228m52087k05687M56485M13053k5810o89580j136836k38599
$$ -770368 -878273 -88045 -540132 -745819 -289334 123719 97909 -591671 -1728507 -1967106
2799a967106M06556M59502R37175k19986j546892K15618Q94563K32202j49349
$$ -1967106 -1560550 -1101048 -163873 -383859 -1930751 -1715133 -820570 -588368 -737717
2790g37717j64164k29O21412q97306q77252J267983j48670O09482n81499J80031
$$ -737717 -901881 -902110 -280698 -1178004 -2055256 -787273 -935943 -326461 -907960 -727929
2780g27929o7204n6205J290051j70006l50279K76924j191418r74941R46154J301542
$$ -727929 -795133 -851338 438713 268707 -81572 195352 -996066 -1971007 -1024853 276689
2770B76689M68105k162455j054424K82177J408916J308673j235035M67656j501629
$$ 276689 744794 -1417661 -2472085 -2189908 -780992 527681 -707354 -239698 -1741327
2761a741327n42581N11271Q59749J532210o54495j369824j061423N69980P69498
$$ -1741327 -2283908 -1772637 -912888 619322 -35173 -1404997 -2466420 -1896440 -1126942
2752a126942L39306J66758m15344j067848k74004J683817L89261N704Q14130j047353
$$ -1126942 -787636 -620878 -1036222 -2104070 -2378074 -694257 -304996 -299292 514838 -532515
2742e32515m88028J77652J377167o09079j485373l11429J925631l3063p60774
$$ -532515 -1020543 -842891 534276 -74803 -1560176 -1871605 54026 20963 -739811
2733g39811k14765Q46527M59582j863988N6659Q29701p7986o19074q7172R460
$$ -739811 -954576 -108049 351533 -1512455 -1455796 -626095 -704081 -1323155 -1410327 -1400867
2723a400867J142181M11430k67053m12389n81870L50920O4819k084060L39925
$$ -1400867 -258686 152744 -114309 -526698 -1108568 -757648 -692829 -2776889 -2436964
2714b436964K039721n4537o51596J09719J419852p1802p40375Q29979o94870p56044
$$ -2436964 -397243 -451780 -1103376 -993657 426195 354393 -385982 443997 -250873 -1006917
2704a006917r84508J135489Q82654J70984k88543L05935O55535j405708j86615
$$ -1006917 -1991425 -855936 26718 197702 -90841 215094 870629 -535079 -721694
2695g21694J91334j065200p79140J68289Q90196R14555p71638K41277J095630
$$ -721694 -530360 -1595560 -2374700 -2206411 -1316215 -401660 -1173298 -932021 163609
2686A63609N1225j556823l26199R67488P41582j673048j491525M59210J593076
$$ 163609 214834 -1341989 -1668188 -700700 40882 -1632166 -3123691 -2664481 -1071405
2677a071405Q64637j043877q60042R66059P71232J69447j059681L79454K0971
$$ -1071405 -206768 -1250645 -2110687 -1144628 -373396 -203949 -1263630 -884176 -863205
2668h63205P97406p49392k09179q7538J274907J80861j871223O94377L84072k67360
$$ -863205 -65799 -815191 -1024370 -1111908 162999 343860 -1527363 -832986 -448914 -716274
2658g16274J341589n42619m43136n72811J038324O37036j405924j092164M99509
$$ -716274 625315 82696 -360440 -933251 105073 742109 -663815 -1755979 -1256470
2649a256470N71130j167402L52640j04970J46101K52601r8529K70823j8564l39015
$$ -1256470 -685340 -1852742 -1500102 -1605072 -1458971 -1206370 -1304899 -1034076 -1052640 -1391655
2639a391655J106665m57070N02241M77442o50150N1323q4822K75997P11701j095422
$$ -1391655 -284990 -742060 -239819 237623 -412527 -361204 -446026 -170029 541672 -553750
2629e53750m6152q63048n02206K50669J32596L7863p90699J385325J73126q05002
$$ -553750 -599902 -1462950 -1965156 -1714487 -1581891 -1544028 -2334727 -949402 -776276 -1581278
2619a581278J443391M18578p82695j312266J265133J524966j350840r79045M6148
$$ -1581278 -137887 280691 -502004 -1814270 -549137 975829 -375011 -1354056 -1307908
2610a307908L8703J762077Q85541j553948K98279l94889L1213j93654j882921
$$ -1307908 -1269205 492872 1378413 -175535 122744 -272145 -240932 -434586 -2317507
2601b317507J666479n65988m67044l67445n84078J021530K10958Q15039Q05188
$$ -2317507 -651028 -1217016 -1684060 -2051505 -2635583 -1614053 -1403095 -588056 217132
2592B17132r98119J47490R01052n93582J04187j57148p14276N76038O19729n94671
$$ 217132 -780987 -633497 267555 -326027 -221840 -378988 -1093264 -517226 102503 -492168
2582d92168M67433q50877o64841P11211l54490K18637O87567n47054R5962N37036
$$ -492168 -24735 -875612 -1540453 -829242 -1183732 -965095 -277528 -824582 -728620 -191584
2572a91584m25445m56025J97465L31982J84222j77838k34700L20108K98106R86930
$$ -191584 -617029 -1073054 -875589 -543607 -359385 -537223 -771923 -451815 -153709 833221
2562H33221j158715q38272J343835P8831j120654n41269p9727M05099k0061L95129
$$ 833221 -325494 -1163766 180069 258900 -861754 -1403023 -1482750 -1077651 -1097712 -702583
2552g02583R56381j128976m69868j06611J838N82276l64233J198355j649718o50129
$$ -702583 253798 -875178 -1345046 -1451657 -1449819 -867543 -1231776 -33421 -1683139 -2333268
2542b333268J242645Q8636L30405R30528p0105j268684m01155J557916j96592
$$ -2333268 -1090623 -1001987 -671582 258946 188841 -1079843 -1480998 76918 -119674
2533a19674P1294J08055j367241J600997k05492j221646R7613O6691M99820P54478
$$ -119674 -48380 59675 -1307566 293431 87939 -1133707 -1036094 -969403 -469583 284895
2523B84895j75906l98570M59586j221861K56861K407639j03905q68716j16017
$$ 284895 108989 -289581 170005 -1051856 -794995 1612644 1508739 640023 524006
2514E24006m55560l88940k12541O09324Q06976j885293R29958J531776l066140
$$ 524006 68446 -320494 -533035 76289 883265 -1002028 -72070 1459706 -1606434
2505a606434j94256K556015P00886j042303j829234p437Q20890p68057j389473
$$ -1606434 -1800690 755325 1456211 413908 -1415326 -1422763 -601873 -1369930 -2759403
2496b759403J238317R20148k115456Q75043J089519O06785q21384n99827J291307
$$ -2759403 -1521086 -600938 -2716394 -1841351 -751832 -145047 -966431 -1566258 -274951
2487b74951R64272r79156k65214M78601Q92401P23522k564465j39459q23485K437026
$$ -274951 689321 -289835 -555049 -76448 815953 1539475 -1024990 -1164449 -1987934 449092
2477D49092J206082k232611j530522J131088n75739m9903O29143J513725q32033
$$ 449092 1655174 -577437 -2107959 -976871 -1552610 -1602513 -973370 540355 -291678
2468b91678r85791L713K229372k46285j224663J247860p65605m60950j337338
$$ -291678 -1277469 -1273756 955616 709331 -515332 732528 -33077 -494027 -1831365
2459a831365L19491J587951j174514l45593L62895n61553R52138k02522p28186
$$ -1831365 -1511874 76077 -1098437 -1444030 -1081135 -1642688 -690550 -893072 -1621258
2450a621258N43698l96121j29053J89010O65622L14250p87957J205127p89419
$$ -1621258 -1077560 -1473681 -1602734 -1413724 -748102 -433852 -1221809 -16682 -806101
2441h06101N80797R27806o42496k74695p63536P38529J118101q04742p83724O47880
$$ -806101 -225304 702502 60006 -214689 -978225 -239696 878405 73663 -710061 -62181
2431f2181P17897j129499O86294l9251q12820J433169j943042K76851j424879
$$ -62181 655716 -473783 212511 173260 -639560 793609 -1149433 -872582 -2297461
2422b297461O18289J633357j254672M93036k55565o18260O28471J019832p94889
$$ -2297461 -1679172 -45815 -1300487 -807451 -1063016 -1681276 -1052805 -32973 -827862
2413h27862r22875P20350p65824M46138P59050L27652K001192Q67803k255154
$$ -827862 -1750737 -1030387 -1796211 -1350073 -591023 -263371 1737821 2605624 350470
2404C50470K8804J073686L2992K92113k731277l2500M47427p4047L47559k35460
$$ 350470 379274 1452960 1485952 1778065 -953212 -985712 -538285 -612332 -264773 -500233
2394e00233n97896J027562m44135N45939L53932j242679j295262J554553p19018
$$ -500233 -1098129 -70567 -514702 31237 385169 -857510 -2152772 -598219 -1317237
2385a317237J053502J165405o65257P78542m4223p62982Q80991q04108m45760
$$ -1317237 -263735 901670 236413 1014955 970732 207750 1088741 284633 -161127
2376a61127n82562O88586Q2873r99442j99783J668814Q1819j76927J66155o51671
$$ -161127 -743689 -55103 27770 -971672 -1171455 497359 579178 402251 568406 -83265
2366h3265J363805o41536N42343n45191p28074J562742j327230P22137j036380
$$ -83265 1280540 639004 1181347 636156 -91918 1470824 143594 865731 -170649
2357a70649P96635K17405j293250Q0142o56049P17683j309216J197163L06988
$$ -170649 625986 843391 -449859 -369717 -1025766 -308083 -1617299 -420136 -113148
2348a13148r46340Q26652K91604Q34635Q4769o01259k65077k87985n6952j251057
$$ -113148 -1059488 -232836 58768 893403 978172 376913 111836 -176149 -233101 -1484158
2338a484158J300402K34745P65872n77443k35430K40732k61065L42748j67522
$$ -1484158 -183756 50989 816861 239418 3988 244720 -16345 326403 158881
2329A58881P59639j251188n27060k67257K319110J574328j639232l82625q20157
$$ 158881 918520 -332668 -859728 -1126985 1192125 2766453 1127221 744596 -75561
2320g5561J155223N47237j465225m83621J76794k15011P12301Q3239l76200p20498
$$ -75561 1079662 1626899 161674 -321947 -145153 -360164 352137 435376 59176 -661322
2310f61322M18547J3761q75857n57514R91844j84714M58142R46048j153025l17943
$$ -661322 -242775 -229014 -1104871 -1662385 -670541 -855255 -397113 548935 -604090 -922033
2300i22033R20691O11974L04403r6616r44014l74558m2667K07644O27622j269617
$$ -922033 -1342 610632 915035 818419 -125595 -500153 -542820 -335176 292446 -977171
2290i77171p84892K19376P10898o31734L67356J288488O54447n61982J29257J04342
$$ -977171 -1762063 -1542687 -831789 -1463523 -1096167 192321 846768 284786 414043 518385
2280E18385m2389o24123J375232q04577q50804P50452m82954N39021m31442O23430
$$ 518385 475996 -148127 1227105 422528 -428276 322176 -160778 378243 -53199 570231
2270E70231j77608j950846p63813J873624o1779k05070k74774j062488m90847
$$ 570231 392623 -1558223 -2322036 -448412 -510191 -715261 -990035 -2052523 -2543370
2261b543370J324645Q71011L40988j02086L99293J106055j069138o13921J204846
$$ -2543370 -1218725 -347714 -6726 -108812 290481 1396536 327398 -286523 918323
2252I18323j004572J80685L81886j283898J336080k01645l91951Q4370N11680
$$ 918323 -86249 94436 476322 -807576 528504 326859 -65092 19278 530958
2243E30958j15686k530662R66896J422095o81598k71843j367621K913615O42786
$$ 530958 415272 -2115390 -1148494 273601 -407997 -679840 -2047461 866154 1508940
2234A508940j116940j043205o76572O95959L09880L15976N17506M17615o56273
$$ 1508940 392000 -651205 -1327777 -631818 -321938 -5962 511544 929159 272886
2225B72886k69248J329415Q75061r87876m44461o59525k30524J638514Q0519j363395
$$ 272886 3638 1333053 2208114 1220238 775777 116252 -114272 1524242 1604761 241366
2215B41366J726901o15540k17001j37065j19158R12772r78030j032129Q95608
$$ 241366 1968267 1352727 1135726 998661 879503 1792275 814245 -217884 677724
2206F77724j59269o33231P12266M9686o23583K42793N78416J404470p58245q83146
$$ 677724 518455 -114776 597490 647176 23593 266386 844802 2249272 1491027 607881
2196F07881Q67674J702929j840403j62356k11149j015510J441398j54243j82485
$$ 607881 1475555 3178484 1338081 1175725 964576 -50934 1390464 1236221 1053736
2187A053736J1442j94632J077216J91921k29648p43743K14709J377348j979222
$$ 1053736 1065178 870546 1947762 2139683 1910035 1166292 1381001 2758349 779127
2178G79127j459650J755644Q35668L37634O25021q406r49795j225201Q19602J106640
$$ 779127 -680523 1075121 1910789 2248423 2873444 2865038 1915243 690042 1509644 2616284
2168B616284L71581r03037j036225J551917m67700q57488J091568o43246p94923
$$ 2616284 2987865 2084828 1048603 2600520 2132820 1275332 2366900 1723654 928731
2159I28731J286233Q53488r61848M13549n68485k87696R05271K22804K8403j90138
$$ 928731 2214964 3068452 2106604 2520153 1951668 1663972 2569243 2792047 2820450 2630312
2149B630312P75041M14900l5902N70808r71059J992088l18732j673295M14300
$$ 2630312 3405353 3820253 3784351 4355159 3384100 5376188 5057456 3384161 3798461
2140C798461l99835M97931J080937o88645K06409K401757o21412r68029r93701
$$ 3798461 3398626 3896557 4977494 4288849 4495258 6897015 6275603 5307574 4313873
2131D313873K72502R72322j564996J463137J411502O36190n14876j291209M53937
$$ 4313873 4586375 5558697 3993701 5456838 6868340 7504530 6989654 5698445 6152382
2122F152382J402121R70224j414008r52533P60487M26287Q75906O58503K62405
$$ 6152382 7554503 8524727 7110719 6158186 6918673 7344960 8220866 8879369 9141774
2113I141774K456457J62001j413069Q87988J141853P86925p2851J5143J023909
$$ 9141774 11598231 11760232 10347163 11235151 12377004 13163929 13091078 13106221 14130130
2104A4130130J462900J923663J408011P21686J156159J38733K035306K141627
$$ 14130130 15593030 17516693 18924704 19646390 20802549 20941282 22976588 25118215
2096B5118215O71137J995305J887297K356691K898398M191965K790201L997638
$$ 25118215 25789352 27784657 29671954 32028645 34927043 39119008 41909209 45906847
2088D5906847M713325K597888J678607J267960n17370l016417m312116n313331
$$ 45906847 50620172 53218060 54896667 56164627 55647257 52630840 48318724 43005393
2080D3005393m624093l962941l436430j649605l508379k737230k189372l001820
$$ 43005393 38381300 34418359 30981929 29332324 25823945 23086715 20897343 17895523
2072A7895523l08713j552780p29416m87156j406209p77315j53681m01239l73822
$$ 17895523 17586810 16034030 15304614 14817458 13411249 12633934 12480253 12079014 11705192
2063A1705192j233278j627304O5074l34637q27114j44558Q58959k58877j487713
$$ 11705192 10471914 8844610 8909684 8575047 7747933 7603375 8462334 8203457 6715744
2054F715744l42263K92821M07134p28141k30956o05368j707203J242048P38528
$$ 6715744 6373481 6666302 7073436 6345295 6114339 5508971 3801768 5043816 5782344
2045E782344j03873N17432j150294r16673K20307j308501K41131O8770J61741
$$ 5782344 5678471 6195903 5045609 4128936 4349243 3040742 3281873 3350643 3512384
2036C512384j083432J394054N53904j130523N63087j02259Q5408M4949r09974
$$ 3512384 2428952 3823006 4376910 3246387 3809474 3707215 3792623 3837572 2927598
2027B927598J91535l17782r29118L37245J737861K52036k132333J151895j490704
$$ 2927598 3119133 2801351 1872233 2209478 3947339 4199375 2067042 3218937 1728233
2018A728233m50849J238257j682813L84660P27370L4535l61897o72156J554018
$$ 1728233 1277384 2515641 832828 1217488 1944858 1979393 1617496 945340 2499358
2009B499358m83638k94457k088665P01933J466534L07318j104979L69114j134484
$$ 2499358 2015720 1721263 -367402 334531 1801065 2108383 1003404 1372518 238034
2000B38034M23112N29982l07093q11432l46897N56647R45377j202287J011290
$$ 238034 661146 1191128 884035 72603 -274294 282353 1227730 25443 1036733
1991A036733P28621j02327r16132k33034N08362Q43898L74628j674594j51412
$$ 1036733 1765354 1663027 746895 513861 1022223 1866121 2240749 566155 414743
1982D14743Q4182n1874j55253J384116L118k353047M2935J488970P81670K73405
$$ 414743 498925 447051 291798 1675914 1679032 -674015 -631080 857890 1639560 1912965
1972A912965j96661o08098j383870M79217l49813J026782j196008k02543O64309
$$ 1912965 1716304 1108206 -275664 203553 -146260 880522 -315486 -518029 146280
1963A46280M01258n22769J639823j615111J007168q10922j85158j52885m01409
$$ 146280 547538 24769 1664592 49481 1056649 245727 60569 -92316 -493725
1954d93725m18587R1847J619441K71466j178409p06662M80625N62326L56872R3052
$$ -493725 -912312 -820465 798976 1070442 -107967 -814629 -334004 228322 585194 678246
1944F78246j100051j89054K65526Q493L99929J145325j593693j268957P52342
$$ 678246 -421805 -610859 -345333 -336840 63089 1208414 -385279 -1654236 -901894
1935i01894R90427k46335n97409O25557L9084l48705M55553o74720J105405P04371
$$ -901894 88533 -157802 -755211 -129654 -90570 -439275 16278 -658442 446963 1151334
1925A151334o30722k48469k98896L08518J1660Q45631k221105j013015J769368
$$ 1151334 520612 272143 -26753 281765 293425 1139056 -1082049 -2095064 -325696
1916c25696J44214j114193O15587J157389Q12998m13639j197619m07497k12291
$$ -325696 -181482 -1295675 -680088 477301 1290299 876660 -320959 -728456 -940747
1907i40747l26193Q69473p87656M97444J65086N24536j272619P58073O88665o17230
$$ -940747 -1266940 -397467 -1185123 -687679 -522593 1943 -1270676 -512603 176062 -441168
1897d41168Q17851k26604j28805J95778j19974J25488M07745J39894j442684L8509
$$ -441168 376683 150079 21274 217052 97078 222566 630311 770205 -672479 -633970
1887f33970j25397N61751j5097P20043R07311m86026N56781l40587l77472k8313
$$ -633970 -759367 -197616 -212713 507330 1414641 928615 1485396 1144809 767337 739024
1877G39024l72727J31376m83338P65073r74596L37811o45700O44099J033346j302948
$$ 739024 366297 497673 14335 779408 -195188 142623 -503077 141022 1174368 -128580
1867a28580M62790J06035p54635k96236M36791P59552m57562M09018j082680M36327
$$ -128580 334210 440245 -314390 -610626 -173835 585717 128155 537173 -545507 -109180
1857a09180M87683Q2352R22125l85392j198364j062056J856186M32730l25975
$$ -109180 378503 460855 1382980 997588 -200776 -1262832 593354 1026084 700109
1848G00109j194299J007816l24123P7873j003086j05258J376498o57767P72958
$$ 700109 -494190 513626 189503 267376 -735710 -840968 535530 -122237 650721
1839F50721J51814p96170J207483o38858q60854N75554J636969k077576j008640
$$ 650721 802535 6365 1213848 574990 -285864 289690 1926659 -150917 -1159557
1830a159557R82677L29453O26202j799601j84676J371867N9047j079493N57241
$$ -1159557 -176880 152573 778775 -1020826 -1205502 166365 225412 -854081 -296840
1821b96840Q78283k95474l09948r33663k7109J761595Q90151j313523Q80279K83612
$$ -296840 581443 285969 -23979 -957642 -984751 776844 1666995 353472 1233751 1517363
1811A517363j937586J805861O31930j426772n51973p00830N5186k33825J72255
$$ 1517363 -420223 1385638 2017568 590796 38823 -662007 -606821 -840646 -668391
1802f68391J048620L13590j119064K49298R37743L35068L08524m35918q48087
$$ -668391 380229 693819 -425245 -175947 761796 1096864 1405388 969470 121383
1793A21383j735830j38758K914375P94777k443164L97795L96751p13053L93999
$$ 121383 -1614447 -1753205 1161170 1955947 -487217 -89422 307329 -405724 -11725
1784a1725Q34794M0901j935492J30463J133671l86083j067060J056432R52341
$$ -11725 823069 863970 -1071522 -941059 192612 -193471 -1260531 -204099 748242
1775G48242j520672K17008P53676K57867p80401p20881K019464L65789m70459
$$ 748242 -772430 -555422 198254 456121 -324280 -1045161 974303 1340092 869633
1766H69633O71717j240036p70462J84597j933r90790P29520J135143j283804r490
$$ 869633 1541350 301314 -469148 -284551 -286484 -1277274 -547754 587389 -696415 -705905
1756g05905P5358J361739p5625j526071n14762L65201J254133j678822O01679
$$ -705905 -630547 731192 655567 -870504 -1385266 -1020065 234068 -1444754 -843075
1747h43075O21091r4636j533937R88941K881903j322739l28863q50605M1269p83259
$$ -843075 -221984 -316620 -1850557 -861616 2020287 697548 368685 -481920 -440651 -1223910
1737a223910J890998K04954j919052p58008m8631P74713J001871Q38621j184026
$$ -1223910 667088 872042 -1047010 -1805018 -1853649 -1078936 -77065 761556 -422470
1728d22470P9703J208061p67435j183560O17209M10734M41448o96183P80764j81731
$$ -422470 -342767 865294 97859 -1085701 -468492 -57758 383690 -312493 468271 286540
1718B86540K55450n05130M41727j39895p60441J079319m16999j334282N3975P46050
$$ 286540 541990 36860 478587 338692 -421749 657570 240571 -1093711 -1039736 -293686
1708b93686J133012j940890J389922J275810k619456j080528J603993J175335
$$ -293686 839326 -1101564 288358 1564168 -1055288 -2135816 -531823 643512
1700F43512m07709j229987O39791J503565j833689j63M48735m16570p3899j31527
$$ 643512 235803 -994184 -354393 1149172 -684517 -684680 -235945 -652515 -726414 -857941
1690h57941l79470J356637J83983o47568O10177k6529p76354O6579k02803P21554
$$ -857941 -1237411 119226 303209 -344359 265818 239289 -537065 -470486 -673289 48265
1680D8265n57157J261221p27990p66464M07220q89401O75952J292084l74400p28699
$$ 48265 -508892 752329 24339 -742125 -334905 -1224306 -548354 743730 369330 -359369
1670c59369r72073J81725N2656R20094R7363p13999j106943J950959k53217l03910
$$ -359369 -1331442 -1149717 -1097061 -176967 -79604 -793603 -1900546 50413 -202804 -506714
1660e06714L04067L77500q2088j420169J290298j9815m2587O51787k5624J118240
$$ -506714 -202647 174853 92765 -1327404 -37106 -56921 -99508 552279 526655 1644895
1650A644895N13746k243864M73483n83594j002372J179784K4267o9365j083446
$$ 1644895 2158641 -85223 388260 -195334 -1197706 -17922 6345 -63020 -1146466
1641a146466m59493P44137O59151R4537j086974K75351M06725j491779j64526
$$ -1146466 -1605959 -861822 -202671 -108134 -1195108 -919757 -513032 -2004811 -2169337
1632b169337J385805P47067J569938j406567j357279k02147J629244n27987o25981
$$ -2169337 -783532 -36465 1533473 126906 -1230373 -1432520 196724 -331263 -957244
1623i57244M71385j046898O30736n52528J131060J257369q95543L25196r09009
$$ -957244 -485859 -1532757 -902021 -1454549 -323489 933880 38337 363533 -545476
1614e45476J789131o34599j238389P85273l64536j02187p09506o4981K63437R0654
$$ -545476 1243655 609056 -629333 155940 -208596 -310783 -1020289 -1085270 -821833 -731179
1604g31179J308551R33486j26345k11640p02973K66836L49627j035803k42882
$$ -731179 577372 1510858 1384513 1172873 469900 736736 1086363 50560 -192322
1595a92322l59657K67344l89591M83922p8829O72076j36170J61258O92387j857322
$$ -192322 -551979 -284635 -674226 -190304 -269133 402943 266773 428031 1120418 -736904
1585g36904N54259R94348k094385K37194P36913o61280j32291N72714J043021
$$ -736904 -182645 811703 -1282682 -1045488 -308575 -969855 -1102146 -529432 513589
1576E13589L14039j063730m93756J418422L9582k343337J15071J085574M28711
$$ 513589 827628 -236102 -729858 688564 728146 -1615191 -1500120 -414546 14165
1567A4165J55056n69828J076105L81157R4045l25842m04295N96273k44494j475124
$$ 14165 169221 -400607 675498 1056655 1150700 824858 420563 1016836 772342 -702782
1557g02782k55653L53112q93284J093722N15845q82474o28225o07928J393941
$$ -702782 -958435 -605323 -1498607 -404885 110960 -771514 -1399739 -2007667 -613726
1548f13726N86968j81333o01171P22120R27869j268280o54203J125908O51646
$$ -613726 -26758 -208091 -809262 -87142 840727 -427553 -1081756 44152 695798
1539F95798m53195k72481J689778k178121k32198J949934j49467j107832n36525
$$ 695798 242603 -29878 1659900 -518221 -750419 1199515 1050048 -57784 -594309
1530e94309N69388r93558k25733K418157j165181p99194O2931l9806N35744J039565
$$ -594309 -24921 -1018479 -1244212 1173945 8764 -790430 -727499 -767305 -231561 808004
1520H08004l8723K32993K00180j78460k47101r16717O28153j65944j037116j29611
$$ 808004 769281 1002274 1202454 1023994 776893 -139824 488329 322385 -714731 -844342
1510h44342k57613R97911L18226j318387M78405J50557r12977K57203P66929r56668
$$ -844342 -1101955 -104044 214182 -1104205 -625800 -475243 -1388220 -1131017 -364088 -1320756
1500a320756J299906j029134J59167J216014J07757L36455r02492O01025P5109
$$ -1320756 -20850 -1049984 -890817 325197 432954 769409 -133083 467942 543051
1491E43051n65205P9577k004692J658797L64490n17817J150922j305968Q71477
$$ 543051 -22154 57423 -1947269 -288472 76018 -441799 709123 -596845 274632
1482B74632q56925m57928K057275M75445j402975k37877k22232k24340R85679
$$ 274632 -582293 -1040221 1017054 1492499 89524 -148353 -370585 -594925 390754
1473C90754l28694p7523N55904k11328m68189M75570Q3425r82057O95880Q88803
$$ 390754 62060 -15463 540441 329113 -139076 336494 419919 -562138 133742 1022545
1463A022545j116409o06320O35791p88578J21171j04528j28760M17901j119129
$$ 1022545 -93864 -700184 -64393 -852971 -731800 -836328 -965088 -547187 -1666316
1454a666316l03466J961314J66140o69144K46532P25587O199o82762j38492R15828
$$ -1666316 -1969782 -8468 157672 -511472 -264940 460647 466846 -215916 -354408 561420
1444E61420l15517p0855Q55240j223974r1862O67831l74264j174386J149203J40328
$$ 561420 245903 175048 1030288 -193686 -285548 382283 8019 -1166367 -17164 123164
1434A23164n82436R56059q34956P42776R5016j716619J62825R73014K57828m84785
$$ 123164 -459272 496787 -338169 404607 499623 -1216996 -1054171 -81157 176671 -308114
1424c08114j130309j19463K336074r77925k51805M24722K0646J128106j844888
$$ -308114 -1438423 -1557886 778188 -199737 -451542 -26820 -6174 1121932 -722956
1415g22956m46173J083725n18836N19436O07973M46351j463688j32878J010497
$$ -722956 -1169129 -85404 -604240 -84804 523169 969520 -494168 -627046 383451
1406C83451J51221J062j050428J465067j237047k60239J699373j195900J79391
$$ 383451 534672 535734 -514694 950373 -286674 -546913 1152460 -43440 135951
1397A35951j413249n1493J423911L93122m12605J7512k32939m88632J516738L37520
$$ 135951 -1277298 -1328791 95120 488242 75637 93149 -139790 -628422 888316 1225836
1387A225836j254820j09152O54085K98616m21683p47320R25362J065850k201502
$$ 1225836 -28984 -138136 515949 814565 392882 -354438 570924 1636774 -564728
1378e64728r03665J372998j592888N38909N45510J709069p77904j091978Q11716
$$ -564728 -1468393 -95395 -1688283 -1149374 -603864 1105205 327301 -764677 47039
1369D7039L39645O50264j275431p78791m39846R97335J8735M37677J514762j182729
$$ 47039 386684 1036948 -238483 -1017274 -1457120 -459785 -441050 -3373 1511389 328660
1359C28660l12153k66567N52567J86433q96100j14069J44691J010903j95992Q00688
$$ 328660 16507 -250060 302507 488940 -407160 -521229 -376538 634365 438373 1239061
1349A239061j394894J446863j658783j777297K079054P62854M45451j569025M20808
$$ 1239061 -155833 1291030 -367753 -2145050 -65996 696858 1142309 -426716 -5908
1340e908J879235j575141n3278j745682l94225J454827Q19962j374508j15362
$$ -5908 1873327 298186 244908 -1500774 -1894999 -440172 379790 -994718 -1110080
1331a110080R23679n72176J189137n97836j05880R41546q911p64779j1174P34931
$$ -1110080 -186401 -758577 430560 -167276 -273156 668390 659479 -105300 -116474 618457
1321F18457J89545k51428N71502j639726J149527K30924j528803j24215O80998
$$ 618457 808002 556574 1128076 -511650 637877 868801 -660002 -784217 -103219
1312a03219P72263j96918q10392L42298q04789j283686k13679J241458o26484
$$ -103219 669044 472126 -338266 4032 -800757 -2084443 -2298122 -1056664 -1683148
1303a683148k34766O41217J113995m87626k58713M97958n0332M79745q41972O74820
$$ -1683148 -1917914 -1276697 -162702 -650328 -909041 -411083 -461415 18330 -823642 -148822
1293a48822K80371R3741j44628J033509K8197j50614n86453j96290q27535n03097
$$ -148822 131549 225290 80662 1114171 1142368 991754 405301 209011 -618524 -1121621
1283a121621Q06304L17450n58123j420813J312565J197694R872j645034R32479
$$ -1121621 -315317 2133 -555990 -1976803 -664238 533456 543328 -1101706 -169227
1274a69227J279547k228072L46780K018045K42563k085092q3792J532203p25985
$$ -169227 1110320 -1117752 -770972 1247073 1489636 -595456 -679248 852955 126970
1265A26970J84273o59586J228624J073740j948918j143464L296K19397P46846
$$ 126970 311243 -348343 880281 1954021 5103 -1138361 -1135065 -915668 -168822
1256a68822J46972M2476L43064q27155J449782Q82255k280671j32129J252675
$$ -168822 -21850 20626 363690 -463465 986317 1868572 -412099 -544228 708447
1247G08447j18592p38493J59325K21765o22465q43739L30987J496306o89594o90221
$$ 708447 589855 -148638 10687 232452 -390013 -1233752 -902765 593541 -96053 -786274
1237g86274O54643o5012p31485M86061J786419j765286K89973J508408j86816
$$ -786274 -131631 -196643 -928128 -442067 1344352 -420934 -130961 1377447 1190631
1228A190631j142950k49510n19834P33351J820850p15961j115225J5490k85125
$$ 1190631 47681 -201829 -721663 11688 1832538 1116577 1352 16842 -268283
1219b68283L00872p49955N97080j06833l3080l83488K52222O40617r50594K748586
$$ -268283 32589 -717366 -120286 -227119 -260199 -643687 -391465 249152 -701442 2047144
1209B047144j393667q22656o58913n1220J619085j564008N43728J231702p68947
$$ 2047144 653477 -169179 -828092 -879312 739773 -824235 -280507 951195 182248
1200A82248P9191J093936n0257q72550J178449j245455r1421P18592q71643m39440
$$ 182248 261439 1355375 1305118 432568 1611017 365562 274141 992733 121090 -318350
1190c18350P29457r33880N16512R31694p7616o89338p43730O72636M04186M16860
$$ -318350 411107 -522773 -6261 925433 847817 158479 -585251 87385 491571 908431
1180I08431Q13892j396257l2032l80571M81753J021900j671050L48710j017167
$$ 908431 1722323 326066 294034 -86537 395216 1417116 -253934 94776 -922391
1171i22391l52404J721934L75718K10739k85769M59176l18732q35288j093482
$$ -922391 -1274795 447139 822857 1033596 747827 1207003 888271 52983 -1040499
1162a040499R95160J267542j010353j0362m37131q92335J824657L62336q36124
$$ -1040499 -45339 1222203 211850 201488 -235643 -1127978 696679 1059015 222891
1153B22891j020352k50642K11516O85402l17783j67811R27389Q2818j107623N5173
$$ 222891 -797461 -1048103 -836587 -151185 -468968 -636779 290610 373428 -734195 -679022
1143f79022r63968J38951J016243M06861J182595o14649l69371J202209n15387
$$ -679022 -1642990 -1504039 -487796 -80935 1101660 487011 117640 1319849 804462
1134H04462P96824j583142p09928J038374j092501R13847Q51259N89200k060773
$$ 804462 1601286 18144 -691784 346590 -745911 167936 1019195 1608395 -452378
$$ [...]
##END NTUPLES=NMR SPECTRUM
##END=
