##TITLE=1H_CA-9029
 CDCl3
 8 sc, 
 30.06.2022
##JCAMPDX= 6.0         $$ Bruker NMR JCAMP-DX V2.0
##DATA TYPE= NMR SPECTRUM
##DATA CLASS= NTUPLES
##ORIGIN= UXNMR, Bruker Analytische Messtechnik GmbH
##OWNER= root
$$ XWIN-NMR		Version 3.5
$$ Thu Jun 30 16:25:29 2022 Russian Standard Time (UT+4h)  she@DPX200
##.OBSERVE FREQUENCY= 200.1313499994
##.OBSERVE NUCLEUS= ^1H
##.ACQUISITION MODE= SIMULTANEOUS
##.ACQUISITION SCHEME= undefined
##.AVERAGES= 8
##.DIGITISER RES= 18
##SPECTROMETER/DATA SYSTEM= spect
##.PULSE SEQUENCE= zg30
##.SOLVENT NAME= CDCl3
##.SHIFT REFERENCE= (INTERNAL, CDCl3, 0, 15.7326)
##AUDIT TRAIL= $$ (NUMBER, WHEN, WHO, WHERE, WHAT)
$$ ##TITLE= Audit trail, XWIN-NMR		Version 3.5
$$ ##JCAMPDX= 5.01
$$ ##ORIGIN= Bruker BioSpin GmbH
$$ ##OWNER= she
$$ F:/spectra/data/she/nmr/H-F/1/pdata/1/auditp.txt
$$ ##AUDIT TRAIL=  $$ (NUMBER, WHEN, WHO, WHERE, WHAT)
(   1,<2022-06-30 16:24:16.93 +0400>,<she>,<DPX200>,
      <created by zg, POWCHK disabled, PULCHK disabled
       configuration hash MD5:
       00 E9 B6 7A A2 85 ED C7 34 08 36 98 17 FE 4E 26
       data hash MD5: 16K
       D9 FA FE 5B 8D F7 CF 0A D3 15 F3 AD 1F 6E 41 DF>)
(   2,<2022-06-30 16:24:19.71 +0400>,<she>,<DPX200>,
      <Start of raw data processing
       efp BC_mod = 2 LB = 0.24 FT_mod = 6 PKNL = 1 PHC0 = -18044.54 PHC1 = 18.00069 SI = 16K 
       data hash MD5: 16K
       49 10 CF 19 78 66 3A C8 C7 32 44 E6 BC 4B 0E C3>)
(   3,<2022-06-30 16:24:38.82 +0400>,<she>,<DPX200>,
      <pk PHC0 = -6.591147 PHC1 = 6 
       data hash MD5: 16K
       EE 06 F7 B7 3B F2 43 8B 67 E4 68 B7 BE C4 FC 08>)
(   4,<2022-06-30 16:24:42.18 +0400>,<she>,<DPX200>,
      <abs ABSG = 5 
       data hash MD5: 16K
       F3 11 41 57 00 B3 E8 21 DC D3 3E 20 04 EB 9C 64>)
$$ ##END=
$$ 
$$ hash MD5
$$ E0 23 9E E0 BA 00 41 0C 94 9D F4 46 28 F3 B1 D0
##$RELAX= 
##$RELAX= 
##$RELAX= 
##$RELAX= 
##$RELAX= 
##$RELAX= 
$$ Bruker specific parameters
$$ --------------------------
##$DU= <F:/spectra>
##$EXPNO= 1
##$NAME= <H-F>
##$PROCNO= 1
##$TYPE= <nmr>
##$USER= <she>
##$AMP= (0..31)
100 100 100 100 100 100 100 100 100 100 100 100 100 100 100 100 100 100 
100 100 100 100 100 100 100 100 100 100 100 100 100 100 
##$AQSEQ= 0
##$AQ_mod= 1
##$AUNM= <au_zg>
##$AUTOPOS= <>
##$BF1= 200.13
##$BF2= 200.13
##$BF3= 200.13
##$BF4= 200.13
##$BF5= 200.13
##$BF6= 200.13
##$BF7= 200.13
##$BF8= 200.13
##$BYTORDA= 1
##$CFDGTYP= 0
##$CFRGTYP= 5
##$CHEMSTR= <none>
##$CNST= (0..31)
1 1 145 1 1 1 1 1 1 1 1 1 1 1 1 1 1 1 1 1 1 1 1 1 1 1 1 1 1 1 1 1 
##$CPDPRG= <>
##$CPDPRG1= <>
##$CPDPRG2= <>
##$CPDPRG3= <>
##$CPDPRG4= <mlev>
##$CPDPRG5= <mlev>
##$CPDPRG6= <mlev>
##$CPDPRG7= <mlev>
##$CPDPRG8= <mlev>
##$CPDPRGB= <>
##$CPDPRGT= <>
##$D= (0..31)
0 1.2 0 0 0 0 0 0 0 0.06 0 0.03 0 0 0 0 0.0002 0 0 0 0 0 0 0 0 0 0 0 0 
0 0 0 
##$DATE= 1656591856
##$DBL= (0..7)
120 120 120 120 120 120 120 120 
##$DBP= (0..7)
150 150 150 150 150 150 150 150 
##$DBP07= 0
##$DBPNAM0= <>
##$DBPNAM1= <>
##$DBPNAM2= <>
##$DBPNAM3= <>
##$DBPNAM4= <>
$$ [...]
##$SUBNAM2= <"">
##$SUBNAM3= <"">
##$SUBNAM4= <"">
##$SUBNAM5= <"">
##$SUBNAM6= <"">
##$SUBNAM7= <"">
##$SUBNAM8= <"">
##$SUBNAM9= <"">
##$SW= 18.0517283424941
##$SWIBOX= (0..15)
0 0 2 0 0 0 0 0 0 0 0 0 0 0 0 0 
##$SW_h= 3612.71676300578
##$TD= 16384
##$TD0= 1
##$TE= 0
##$TE2= 300
##$TE3= 300
##$TEG= 300
##$TL= (0..7)
0 120 120 120 120 120 120 120 
##$TP= (0..7)
150 150 150 150 150 150 150 150 
##$TP07= 0
##$TPNAME0= <>
##$TPNAME1= <>
##$TPNAME2= <>
##$TPNAME3= <>
##$TPNAME4= <>
##$TPNAME5= <>
##$TPNAME6= <>
##$TPNAME7= <>
##$TPOAL= (0..7)
0.5 0.5 0.5 0.5 0.5 0.5 0.5 0.5 
##$TPOFFS= (0..7)
0 0 0 0 0 0 0 0 
##$TUNHIN= 0
##$TUNHOUT= 0
##$TUNXOUT= 0
##$USERA1= <user>
##$USERA2= <user>
##$USERA3= <user>
##$USERA4= <user>
##$USERA5= <user>
##$V9= 5
##$VALIST= <valist>
##$VCLIST= <CCCCCCCCCCCCCCC>
##$VD= 0
##$VDLIST= <DDDDDDDDDDDDDDD>
##$VPLIST= <PPPPPPPPPPPPPPP>
##$VTLIST= <TTTTTTTTTTTTTTT>
##$WBST= 1024
##$WBSW= 4
##$XGAIN= (0..3)
0 0 0 0 
##$XL= 0
##$YL= 0
##$YMAX_a= 90135
##$YMIN_a= -119117
##$ZGOPTNS= <>
##$ZL1= 120
##$ZL2= 120
##$ZL3= 120
##$ZL4= 120
##$ABSF1= 15.74138
##$ABSF2= -2.31047
##$ABSG= 5
##$ABSL= 3
##$ALPHA= 0
##$AQORDER= 0
##$ASSFAC= 0
##$ASSFACI= 0
##$ASSFACX= 0
##$ASSWID= 0
##$AUNMP= <proc_1d>
##$AZFE= 0.1
##$AZFW= 0.1
##$BCFW= 0
##$BC_mod= 2
##$BYTORDP= 0
##$COROFFS= 0
##$CY= -3
##$DATMOD= 1
##$DC= 0
##$DFILT= <>
##$DTYPP= 0
##$F1P= 0
##$F2P= 0
##$FCOR= 1
##$FTSIZE= 16384
##$FT_mod= 6
##$GAMMA= 0
##$GB= 0
##$INTBC= 1
##$INTSCL= 0
##$ISEN= 128
##$LB= 0.24
##$LEV0= 0
##$LPBIN= 0
##$MAXI= 10000
##$MC2= 0
##$MEAN= 0
##$ME_mod= 0
##$MI= 1.114404
##$NCOEF= 0
##$NC_proc= -9
##$NLEV= 6
##$NOISF1= 3.799351
##$NOISF2= 2.8
##$NSP= 0
##$NTH_PI= 0
##$NZP= 0
##$OFFSET= 15.73257
##$PC= 1
##$PHC0= -18051.13
##$PHC1= 24.00069
##$PH_mod= 1
##$PKNL= yes
##$PPARMOD= 0
##$PSCAL= 0
##$PSIGN= 0
##$REVERSE= no
##$SF= 200.130007799265
##$SI= 16384
##$SIGF1= 3
##$SIGF2= 2
##$SINO= 5.538805
##$SIOLD= 16384
##$SREGLST= <1H.CDCl3>
##$SSB= 0
##$STSI= 16384
##$STSR= 0
##$SW_p= 3612.71676300578
##$SYMM= 0
##$S_DEV= 0
##$TDeff= 16384
##$TDoff= 0
##$TI= <>
##$TILT= no
##$TM1= 0
##$TM2= 0
##$TOPLEV= 0
##$USERP1= <user>
##$USERP2= <user>
##$USERP3= <user>
##$USERP4= <user>
##$USERP5= <user>
##$WDW= 1
##$XDIM= 16384
##$YMAX_p= 318924085
##$YMIN_p= -6437986
$$ End of Bruker specific parameters
$$ ---------------------------------
##NTUPLES= NMR SPECTRUM
##VAR_NAME=  FREQUENCY,     SPECTRUM/REAL,   SPECTRUM/IMAG
##SYMBOL=    X,             R,               I
##VAR_TYPE=  INDEPENDENT,   DEPENDENT,       DEPENDENT
##VAR_FORM=  AFFN,          ASDF,            ASDF
##VAR_DIM=   16384,         16384,           16384
##UNITS=     HZ,            ARBITRARY UNITS, ARBITRARY UNITS
##FACTOR=    0.220516191357247, 1,           1
##FIRST=     3148.55929566658, 0,            0
##LAST=      -464.157467339204, 0,           0
##MIN=       -464.157467339204, -6437986,    0
##MAX=       3148.55929566658, 318924085,    0
$$ Real data points
##PAGE= N=1
##DATA TABLE= (X++(R..R)), XYDATA
$$ [...]
8421 4142444 2804924 3551648 4583117 4444602 2880705 2639067 2864380 4613107 3643797
8412 3643797 2820703 3983580 4207737 3590756 3616710 4977898 4180979 2826557 3359356
8403 3359356 3255310 3128869 4352614 2622718 1744326 3621152 3541406 2997027 3313940
8394 3313940 3533192 3970407 3341497 3772000 3671123 1589960 2924643 3664475 3033817
8385 3033817 1061253 1226786 2561913 2014486 973005 2340509 2695656 1819443 965379
8376 965379 1018716 3295265 3727284 1338239 237925 1070211 2966908 3178301 1652585
8367 1652585 1892572 823679 1177969 1596805 1724859 1428342 1535241 1684434 562661
8358 562661 2304166 1532132 -447916 703310 2563764 1106160 -398535 1035900 1672924
8349 1672924 1062052 1172303 1223871 1351832 787984 -352425 1062351 1648941 1342111
8340 1342111 1671361 534045 -344042 1059914 2098098 569931 170667 1225628 967835
8331 967835 1547685 1583718 742175 279243 1141532 807331 1133611 1509655 1958216 1688234
8321 1688234 980454 -705474 1081739 2457573 -142802 -78929 779819 328847 -170588
8312 -170588 -289802 352019 1036857 1505368 88306 167281 939862 1129247 1314598 -22382
8302 -22382 -24997 581975 -702188 -1237832 1657591 1901680 -926440 -789111 1350337 1167049
8292 1167049 752041 1828879 -736535 -414548 -679 -1324042 -18018 650579 1069297
8283 1069297 375206 -4757 -1148185 494966 699004 -406315 -227380 1540405 -133997
8274 -133997 -772067 1181371 -437877 532144 828763 885822 -105092 -16425 473288 1706591
8264 1706591 328400 -213596 1183351 -103486 674436 1645423 -21418 -1232008 258186
8255 258186 363910 354632 -924396 20611 -176367 64604 175060 -1140339 -465654 -864779
8245 -864779 -35527 -135484 -562575 1595868 1212683 -266965 568595 -100660 -239748 15457
8235 15457 421777 -421974 -2365259 -1421046 -946330 -200924 -1165544 1744140 1044527 -1151760
8225 -1151760 -268308 -263770 1335489 1853913 1550114 508945 1575304 629430 -506759
8216 -506759 59785 2218937 1388674 -27642 -140558 -473900 824352 -113596 1329762
8207 1329762 490049 -799197 -656482 -501260 370970 1032290 508714 -166963 212213
8198 212213 325461 -338272 -519485 93002 733627 92183 -6437986 -3838439 -1570681
8189 -1570681 -60973 1204089 -1788301 -992206 -621192 -2716121 -1030212 1114234 796781
8180 796781 1705309 1048530 -41133 -1303231 803964 108397 1299434 2361867 -1156826
8171 -1156826 -491941 -191471 -1118541 426065 847124 126160 205976 180710 -1869496 -1285893
8161 -1285893 364778 144537 -212692 -499636 -154284 -450965 996193 1690734 -377791
8152 -377791 -414936 -162093 -53450 59163 111184 254055 667104 -1063447 -1047971 -905048
8142 -905048 140306 287957 -1058893 -703506 -797604 374984 -550164 -154857 -432347
8133 -432347 -522893 1172085 1083942 -819506 928387 12566 -144278 621176 395941 511683
8123 511683 -603480 312753 -411096 363921 -1768946 -2006324 -1438691 -854259 -2029278
8114 -2029278 -2180524 341127 323124 -1089275 -1190728 949393 -521445 -154900 -458522
8105 -458522 -190436 15030 -1324137 -1563799 -1063649 271865 -295581 -277769 -650928 -1374291
8095 -1374291 -1237682 -187697 -148324 46338 700757 -1772122 -2115174 -2376846 -311384
8086 -311384 -464271 -369645 -125206 119194 334232 -783665 -420191 -251670 111932 -953734
8076 -953734 261527 61094 -895658 -701996 -1105099 432915 329015 -239648 -352631
8067 -352631 -721750 -855933 223291 601117 221230 -1677832 -1194901 320295 -312787
8058 -312787 -392025 -1337973 -1203519 -902206 -1047929 -571095 822488 -94667 -21645 752072
8048 752072 54369 -366823 -180771 337434 1078379 466923 421940 -206336 -674090 -355915
8038 -355915 -1243084 -157096 -347503 -2036129 -2431536 -2030545 -1423354 -289386 -683621
8029 -683621 -1428984 -1925217 -1585111 -454476 -754107 376637 -1602036 -526436 -1149996
8020 -1149996 -1027333 985445 745717 181252 -819932 -803766 -670302 450871 -204437
8011 -204437 -339231 -623400 -1410817 -1486094 -838454 -321364 -857743 -359354 -1316854 -1480583
8001 -1480583 -1922861 -1682547 -379850 -388916 -433069 -192554 537050 -872269 -485661 359856
7991 359856 -1118814 -1400077 -584066 -1297493 -1966016 -1128344 -1074102 -2608503 -891936
7982 -891936 1271429 -89880 -55744 -571398 -1029588 -582810 -697596 -617467 -496763 -660693
7972 -660693 -928680 -1454976 -2019128 195216 652241 465348 482332 598242 -151120 -690406
7962 -690406 -756211 -192483 212654 -2197274 -691951 -444209 -1306594 -1584504 -799883 -57847
7952 -57847 -1335341 -1377604 -668550 196268 -1140983 -1336062 -1758178 -1504973 -1321233 -448247
7942 -448247 -1009683 -1440228 291781 -933690 -565844 -339244 -1311353 -159324 -1429595
7933 -1429595 -1572836 -922052 -1194914 -402203 -1085197 -97411 1258219 637321 -870968
7924 -870968 -1262421 -1372155 625960 581319 -1853421 -1474360 -1440797 -1553292 -322260 678904
7914 678904 -1180405 -655295 -1008628 -1604074 492959 544970 -521795 -737889 -5079
7905 -5079 -1483823 -1375330 -1095723 -2505823 -108777 -247942 -1484146 -637422 -1284338
7896 -1284338 -968853 -1438697 -55847 1057317 243811 -809042 -2560796 -225405 288871
7887 288871 -562839 -137223 -1055155 -1776404 -282535 -340541 -1948806 -1303146 -496464 -236457
7877 -236457 -859730 -1317815 -1338840 733322 13079 -612770 -415564 -299257 -1804429 -471747
7867 -471747 1463346 -26426 -698538 -689814 -3037921 -580822 562640 -1869416 449845
7858 449845 -479580 -1621383 -1780069 231293 696196 153128 -554091 -1869645 103014
7849 103014 104635 -1383118 241320 135947 -969202 556370 -470257 -1528046 -887305
7840 -887305 466332 419313 -908535 -676240 -2367734 -1501378 -1866102 360063 355451 -792668
7830 -792668 -473341 -873746 -452008 -658479 361010 -190724 -971102 -1050601 -67345 -418786
7820 -418786 -972026 -1190587 -1378706 -697828 -1486072 -1170679 -1893635 -674267 -41091 1463444
7810 1463444 1503431 -2258426 -2133973 -918564 117336 -723299 -1532137 -1388118 -971261
7801 -971261 -794562 -1415073 -1931155 -966281 -1299133 -1106747 -671355 -553317 -921752 -2491566
7791 -2491566 -1954220 275994 -1380437 -1975252 -2035649 -2242190 -2060338 -1019107 -12986
7782 -12986 -1546625 -1168438 -841081 -1185973 549952 -192847 -1196816 -669692 -469408
7773 -469408 252876 223387 -576401 -548492 -715230 -1352108 -443319 -633378 -1397706 -1151696
7763 -1151696 -422614 -1276071 -898307 -1024258 -1343008 -895556 761421 190487 -2372378
7754 -2372378 -1173060 -1056675 -671900 -507735 -350353 -591354 -1461923 -2064837 -1458320
7745 -1458320 -400011 -786646 -1450117 -1853458 -1311713 -1330085 -1531813 -1920134 -1517381 -24174
7735 -24174 -870895 -799333 99206 -1465088 -1141747 573971 -640434 -1016892 -1433468 -1504552
7725 -1504552 -161825 -1342902 -1548429 -858452 -635782 -1081512 -956667 533528 263837
7716 263837 -607985 -1113635 -135699 1161877 188877 484214 -946610 -1523910 297250
7707 297250 665576 711108 -1849157 -2280705 -1621352 -1630288 -1088247 -1266382 -917140 -102615
7697 -102615 -1159266 -1336582 -1687425 -991604 233535 -1169484 -850581 -485190 413929
7688 413929 344180 -684760 172203 772288 -471866 -680188 -1446474 -954821 672779
7679 672779 -74308 -454253 -95849 -628147 -1820180 -1294305 -60993 749317 875440
7670 875440 -1039530 -363320 -568715 -407816 -1056582 -836289 -151954 -1071565 480879
7661 480879 -1081892 -1722795 -120450 -593964 -478183 -672143 -1844986 -632440 -150128
7652 -150128 -1390047 -52689 268069 -413000 -143183 658339 -521768 -461419 556993
7643 556993 -126306 446897 -928283 -989994 44136 -1109318 -910339 -459476 -997921
7634 -997921 -1647579 -1074428 -621455 -105941 -563141 -1426773 -1451063 -2497066 -900424 210583
7624 210583 -640881 15391 -522556 -905065 -369271 134489 -387025 -292728 -362794 -1308667
7614 -1308667 -2290587 -1353209 -76248 -1308575 -1941130 -1356143 414797 -245370 -294648
7605 -294648 -142871 656732 454693 -273591 -1619959 -1706095 -957367 -893321 529930 -1099731
7595 -1099731 -1475897 -1173836 -1136630 -1120043 -1002553 -520768 -1600071 -677987 -736917 -912625
7585 -912625 -644012 81580 -996711 -857828 805213 -370626 315424 36224 139160
7576 139160 74044 655519 -1572454 -733145 323588 -514777 268615 -1414502 34213
7567 34213 456118 -1079420 -1809271 853565 394272 -783123 -1405186 -400121 612062
7558 612062 -1081088 207893 -257324 -770724 -418365 -192321 -391679 -1260147 -223703
7549 -223703 -1445767 -1996501 -735093 40889 -493 -94096 -1324692 -934147 -666549 -2030075
7539 -2030075 -213322 342321 -1714008 213936 -508374 -1554299 76999 378109 -940312
7530 -940312 -2197813 -587534 -620240 -1331273 -430410 541718 -311635 -1603051 -1226446
7521 -1226446 -921212 -955799 -1438007 41214 917765 -180951 -1125895 -1271080 -20988
7512 -20988 -722072 -807765 -1661708 -1714440 -760986 537809 -3071495 -2758344 -632717 -485764
7502 -485764 -455395 -1511340 547839 1284165 527452 -697891 -65007 -246662 -942823
7493 -942823 408615 423112 -201047 161248 -425453 -256092 1093210 -335613 -1355117
7484 -1355117 -475527 97651 581603 -1091699 -641689 589998 -499851 -227116 252699
7475 252699 174348 -762925 -167208 -646119 125078 1163870 248026 -791418 -1072335 -662577
7465 -662577 -290637 -710605 -901485 296891 -402524 -774394 -1245694 149458 428312
7456 428312 -1491895 -455220 -366403 61811 -266092 -1027490 141581 1595416 499166
7447 499166 -727924 -185684 483429 -672775 -153594 655634 350462 -200154 -1514768
7438 -1514768 -1296743 283307 114992 -679991 -1535719 -2436778 -851137 -290720 746334
7429 746334 422063 291337 -1315545 -668129 841805 518840 172728 -1062615 -744674
7420 -744674 -609554 -903839 -422407 686480 628656 -782627 -2052440 -1450794 -1410541 237130
7410 237130 1050063 -219809 910314 -321870 -802831 -508431 -364818 1474994 -428956
7401 -428956 -1781804 -1489746 -1953337 264899 61595 -527443 -121990 -93281 -281906 -1039823
7391 -1039823 -239026 551335 -618578 -870683 -1457470 -1542919 -174951 -241943 432733 -112707
7381 -112707 -8653 -483109 -531946 -1180868 -1198150 553060 -1204783 -367718 -245963 -1356051
7371 -1356051 -1665877 -514520 5112 -1987527 -2046641 -852683 31495 -60520 158135
7362 158135 -867494 -244483 -373173 -822554 -704851 -941336 224517 -582768 506891
7353 506891 -451386 -527331 676269 -334249 -277243 -722410 -1304060 -707909 714984 1616196
7343 1616196 687007 -606554 -1566633 -1594541 908981 747608 -199088 -503929 -1457343
7334 -1457343 46092 -1631573 -1191351 282921 -141767 -460168 -2129869 -676162 415061
7325 415061 -592536 -425571 -187605 754626 -66175 -500674 966960 450768 569086
7316 569086 -459378 -1901739 -1879955 -411744 159154 -601750 883160 -644499 -1640565
7307 -1640565 -673135 -485995 208625 -151050 -168592 -1007014 -545296 -935631 -937462 1274414
7297 1274414 426373 -1015156 500969 -839111 70387 375553 -1989733 -1044725 -1005941
7288 -1005941 -919947 -1262929 -1002625 -543482 -1280350 -890422 -2180606 -1056669 -319229
7279 -319229 -398614 329361 -210883 -1140305 -411454 -506120 74726 739317 -736628 -1153203
7269 -1153203 -1764913 -1559467 -1675163 -170549 -22978 -401884 -1351397 -2492901 -1222965
7260 -1222965 -238344 647354 1118645 -178157 -430081 -457292 -893621 -535106 -569915 827989
7250 827989 -790554 -61863 -16059 -1221321 -182598 -532160 426648 -956172 -1689934
7241 -1689934 -897442 71757 -56966 317552 -735755 -674676 -124756 -634825 -493576 -1307730
7231 -1307730 356453 -45282 1443531 -979416 -881037 -752126 -1612729 389565 -364066
7222 -364066 -1234239 -1335862 -396703 -1120760 -1389677 -937956 358738 -1487880 -447150
7213 -447150 188478 -792802 416251 285439 242229 -339664 586527 -872065 -2368077
7204 -2368077 -1005004 -277093 205655 -853802 -961437 -1830776 -1958198 -1774949 -218761
7195 -218761 770182 -602793 55693 920227 -177271 -778608 -541512 -828796 1066954
7186 1066954 -63103 343520 1154206 337951 885263 -1591008 -717684 -591205 -1387592
7177 -1387592 -1347732 458779 860191 583939 -629622 -1893965 -1468094 -39111 437469
7168 437469 -1979740 348050 -572209 -1510038 181095 306279 -194919 48263 -190428
7159 -190428 -1738995 -521796 -2367 -660140 -377604 577521 -307876 -785961 -437244
7150 -437244 507652 -655413 -232003 -339170 -924859 -503853 50283 -3615 -382944 -327578
7140 -327578 -1360768 -488042 -107594 -1078804 -1348990 -343699 -1495438 596699 -100126
7131 -100126 -702612 537066 -905376 -470807 437882 833978 -527292 133358 -194624
7122 -194624 -718523 -586162 1341376 1384064 -159246 -1753686 -1102490 1251125 985346
7113 985346 353666 -1851161 51954 684262 -991760 -1900944 -293512 1087046 214821
7104 214821 245398 -328925 -157998 166301 -1048735 609903 608729 1387215 493319 -1662075
7094 -1662075 -296942 1400696 306325 1401787 1124072 458673 1225478 176888 -364908
7085 -364908 315544 16606 -1036524 -618194 1029598 500249 197476 984459 1169572
7076 1169572 1485706 898015 1108578 1198159 73669 1067392 3136349 1990394 423186
7067 423186 629336 1318459 494981 2025756 875979 1771997 459404 90808 671793
7058 671793 453675 1744906 1337681 -359640 -557886 -5444 -742250 265346 -138766
7049 -138766 187787 36988 -276963 76444 -1082544 -199044 -905946 -837031 -454321 -587041
7039 -587041 166450 1260567 93570 -999079 -1428735 -151868 1169010 -469471 753628
7030 753628 -51291 -968172 -615233 -1148472 -811722 1314629 803592 -562616 -678839
7021 -678839 -420790 -1015831 -266015 759691 340974 -114291 284966 39914 -1218522
7012 -1218522 -150395 224427 228044 -491026 -1487493 -880599 1513159 852326 172052 155004
7002 155004 -809354 -311053 -179465 -300091 -351554 1214625 -93324 -1162508 -536795
6993 -536795 332245 962395 -229135 -1111437 -609125 151609 -781563 -378596 511465 -44789
6983 -44789 -763139 -1897714 -1574580 -586867 121712 653248 153721 112785 872040 368007
6973 368007 754861 260319 -213698 474028 169302 498400 1591300 1256390 -516958
6964 -516958 184244 1025575 279053 275562 907621 139613 -809202 -410530 -119923 -6504
6954 -6504 -352315 -339016 -221896 -670327 -700507 -491617 610359 827622 415572 122153
6944 122153 -214899 -1312767 -119376 402190 -623726 511896 158379 786776 315198
6935 315198 23361 159274 -93891 -832491 -405478 361597 76821 855363 -5782 -1253328
6925 -1253328 -413964 13799 -716541 -907662 -415691 -698856 -1249401 -681373 -1278086 -585928
6915 -585928 440978 -963504 451369 -654985 156249 -211959 -2080653 78756 500124
6906 500124 737802 -617280 386907 964489 -277169 -1437277 -368739 -1753892 -1637879
6897 -1637879 290251 208629 -252003 127441 -61896 -2129532 -38115 1672082 1325996
6888 1325996 46537 -509071 874473 -384098 183486 647577 378735 881880 361232
6879 361232 -74689 -810606 201808 307048 -624005 241417 -652028 -1496621 -951280 -861988
6869 -861988 408747 602680 -872244 -659814 -183001 61396 562325 864658 -67269
6860 -67269 191430 499584 -313720 -129479 783403 -686745 -324942 -458971 -794324 192391
6850 192391 597307 195473 -484178 627215 -718047 -841770 -410728 352780 801440
6841 801440 104363 730024 -312562 -1389525 177046 434891 131284 221480 486433
6832 486433 -923192 -1076090 49003 605552 170941 -8587 -1657508 -1093838 -383834
6823 -383834 -555611 757165 -107994 -668726 -347236 -1133546 -1204777 939644 1485163 -307167
6813 -307167 -776187 -2643075 -1458272 -687923 824188 114509 -783781 167003 -938541
6804 -938541 308844 1041198 906499 -407202 1812142 633190 -899210 -470523 -177312
6795 -177312 -384003 320063 667458 -536121 1190113 -246639 380698 1057357 707505
6786 707505 734534 830211 -266946 -805755 1662897 -940716 108221 135122 -714102 1163224
6776 1163224 1057131 -910112 196385 1960432 -1478860 -28561 1619686 419967
6768 419967 867830 205276 -762440 827409 113727 -1582190 104252 485537 1039806
6759 1039806 2087377 725858 400227 349683 1318843 406136 767431 1356318 -371561
6750 -371561 454774 -887734 -154791 -1119732 248883 1257730 399593 88723 478571
6741 478571 956206 95583 319449 193895 1018468 -211495 -457248 4950 -109746 -150104
6731 -150104 808957 -1573789 -660840 919181 -970568 1186429 505934 456683 814966
6722 814966 1116046 211483 1036966 739114 -769417 381020 218466 681754 2445954
6713 2445954 165537 -1619157 -627652 -1526567 -1085824 -25382 1515902 805543 -267375
6704 -267375 -429699 163736 243587 -103213 1193995 307152 -1634783 -140836 682225
6695 682225 -701373 1474748 453935 415 482156 961253 1622676 894145 1399667
6686 1399667 169200 780168 -1040901 -1119722 486524 1032506 424123 122547 -362719
6677 -362719 -625508 372873 1932924 1073427 1044294 507184 -549082 1635215 1027750
6668 1027750 763395 957473 -70150 -41196 -9326 1292536 466003 1272290 1369615 -703696
6658 -703696 18524 980668 12707 690124 527733 -476374 1310408 1501519 1619821
6649 1619821 1193900 573989 291489 12478 -221769 130239 1522665 626718 422947
6640 422947 927077 -1704422 -1442634 139111 797675 601662 -431639 -516017 -561298 293070
6630 293070 1432071 562586 1227055 2020559 578695 -297420 1512455 1071673 337727
6621 337727 311634 -53626 166550 770600 118771 727928 294766 -362914 88225 301712
6611 301712 514379 132164 1187585 118147 -215431 -273724 -544295 1516664 720539
6602 720539 -77564 334189 145217 230141 1047608 1865311 1965350 -19345 334972 -310626
6592 -310626 140123 1825628 -11792 722101 466014 -225517 -380489 715035 860830
6583 860830 554430 484683 88505 438226 1521986 525872 516824 497805 -210293 -168534
6573 -168534 235585 822833 1388185 878298 -875706 -204153 -129904 -34609 325947 410796
6563 410796 -320667 312995 456811 937404 929033 -406230 966949 702357 1336548 1123979
6553 1123979 1579191 116669 -292315 -181810 -907800 638978 664557 597636 675418 935312
6543 935312 -1550268 -1063255 1780243 1755839 1001485 1438154 1019491 -812117 -392090
6534 -392090 1014855 2656567 1267363 796681 -792623 -519528 653052 277894 1307907
6525 1307907 1382863 -157035 -273343 620269 660158 2242847 1623570 1107687 2115409
6516 2115409 1749867 -360450 300602 1432646 541911 -5272 1059111 -180100 -215485
6507 -215485 2095602 1830044 1127548 486543 -1177473 108041 2030569 1927892 2615852
6498 2615852 1459215 -282037 -938763 144425 1389482 578168 1408057 363364 -636053
6489 -636053 730124 906229 400440 1431867 1393996 611776 1288395 724124 104299 1631693
6479 1631693 1662465 1121314 1371141 859521 708267 1567491 3461404 1730300 905102
6470 905102 421766 -850408 1097635 1539345 1086737 59654 153877 943198 236575
6461 236575 879378 955351 451753 1241861 1793927 655759 1484274 -203946 469836 940057
6451 940057 872972 1627121 177231 1362161 831409 1832702 1184193 1440812 900410
6442 900410 286944 1033141 1287376 856760 1669245 2281561 1065580 1963154 1114191 1019510
6432 1019510 425066 -182837 855260 1035109 793924 502197 1216304 -175124 632697
6423 632697 2428201 1666807 250090 819285 1812251 711404 974805 960485 1360018
6414 1360018 -125554 -338283 1624788 1745174 316567 1036524 1881983 1331645 1434249
6405 1434249 -287582 -528797 1796047 1889307 469537 2471640 3026956 1347357 1682755
6396 1682755 1159054 2056729 2502231 65934 322787 3099005 1369439 1659339 2366332
6387 2366332 720581 2140219 2276901 370200 830953 1699982 1741410 1436323 1208867
6378 1208867 641938 1016011 1668757 1142835 3178351 2302294 942777 -951494 -757557
6369 -757557 453507 1483797 2508912 1602979 1016807 1434003 1613806 1097839 2327426
6360 2327426 2227465 1395281 1598767 1679802 1088334 2642178 1341330 291937 2790535
6351 2790535 1663499 -465587 1215430 2663239 1109423 741229 279586 570940 1092302
6342 1092302 957976 1034097 1448606 985585 -519121 1090529 1640150 3267134 2270099
6333 2270099 2048158 1842406 1287018 1042025 1185812 2494531 2002282 642501 852407
6324 852407 1456472 1106700 2364124 2002985 1510846 1468538 547434 1409900 1594875 1194421
6314 1194421 1863419 2345950 1708585 349898 1330457 970997 1560096 925187 666679
6305 666679 1778467 2861126 1008077 1689582 2587969 1865528 2057609 659189 673586
6296 673586 2551632 2854266 2113142 2817419 2883625 2480572 1453318 1464841 2496541 1418384
6286 1418384 1729507 2420817 1011946 -985270 712646 1641998 570232 2477752 1625416
6277 1625416 2454981 1454160 1719082 2080141 2212373 2547120 2542866 3420724 2133363 3385250
6267 3385250 2314047 950752 1954381 1399934 1035575 1641364 2925211 2421163 1178287
6258 1178287 545828 1245282 2818247 1265186 1242937 2949440 2287357 2474376 2682086
6249 2682086 626034 2789382 3526720 1903966 1711108 1329075 1056553 1389010 2589178
6240 2589178 2579091 2309448 855783 967440 2244812 769019 1932833 2718083 2482006
6231 2482006 2418418 1785293 1260812 2195976 2445699 1873085 2672256 1336796 1505866 2042655
6221 2042655 2536469 1425889 2535696 3448481 2305205 1375841 1362439 2949508 2542328
6212 2542328 1835337 1659415 1227515 1584551 4374609 2839722 3289197 4156108 1773335
6203 1773335 1221563 2664334 3155500 3223971 3426301 2450457 2952370 3061087 1358798
6194 1358798 1663709 2810016 2004677 2509680 3220754 2996296 2394841 2741735 1888780
6185 1888780 2582016 3673203 2322633 1228997 2834834 4469029 3956051 3438514 2845180
6176 2845180 3122196 3760899 4209749 2871254 2467603 2925411 2544784 3440706 1635847
6167 1635847 3202880 3452162 1872457 1967844 2412489 2817404 3218526 3300190 1942640
6158 1942640 3208311 3473499 2753801 3575659 3204701 2482340 3732262 4143102 2854242
6149 2854242 2541397 3818306 3356867 3160166 3451765 3201827 3792737 3824704 3677935 3512222
6139 3512222 2553829 2648371 3282711 2696373 3552291 3520756 3102725 4603900 4129843 2966947
6129 2966947 2686782 4283436 3546011 3439247 3595058 2353335 2757590 2070591 2004203
6120 2004203 2580517 2781110 3203602 2872335 1942280 2243937 2349062 1678932 1557820 2848129
6110 2848129 2271592 2808885 3078968 2367036 2096778 2536184 2625566 2764762 2197894 2474162
6100 2474162 2864139 3184052 4167201 3917613 3457146 2858797 3248190 3348104 3770970 4251058
6090 4251058 2252382 2007773 3496447 4662943 2948740 3344318 4782173 2526060 1553998
6081 1553998 3417907 3971179 2931941 3724442 2458038 2518597 4249740 3490772 1557760
6072 1557760 3068961 3826852 3447902 2587008 2517867 3251260 4106780 2748842 3176209
6063 3176209 2434538 2628405 3310590 3856173 4105779 3662643 3533097 3085095 4170261
6054 4170261 3745764 4599304 3447103 1563451 2370999 2064499 2451875 4432915 3975900
6045 3975900 2764931 2857637 1978489 4443092 4893342 3891051 2574472 2888675 4208244
6036 4208244 4513500 4803466 1732731 2718390 3952313 4144076 4166080 4863850 5137468
6027 5137468 3342008 2978115 2137938 2318116 2794168 3381954 3188070 3982883 4805160
6018 4805160 3922971 3267376 4015726 4115890 4028622 4504012 2868784 4188996 3729190
6009 3729190 2617473 3675901 4327636 4036290 3581525 2782486 3978845 4863346 5111100
6000 5111100 3666189 2269630 3569021 3253959 4137116 4997283 4406407 4325324 3697780
5991 3697780 4327371 4857540 4111130 4284413 4582951 4937508 3049302 2925052 4466295
5982 4466295 3884389 4301106 3639129 3310060 2496958 3075512 4055806 4218567 3349204 4141202
5972 4141202 4392188 3527512 3856578 4984182 4967645 4712028 6716800 5431399 3554150
5963 3554150 3518071 3694621 4057749 4956633 5068992 3390568 3648076 3650776 4555360 4601901
5953 4601901 2919242 3328171 3109602 3143500 4288808 5846545 5324393 5059888 4570301
5944 4570301 3124856 3691835 5730826 6338630 5672937 6342169 5336082 5641834 3598042
5935 3598042 2699852 5081477 4158859 5856660 5671012 2836309 3028317 4721875 5792436
5926 5792436 5588270 6034408 4089911 4103235 6122311 4576069 4975794 6386258 5450258
5917 5450258 4955802 6575216 6936806 6637720 5581085 4726488 4985322 4857113 5312337
5908 5312337 5676348 5061171 5637551 5515382 4637706 5569952 5262282 5036284 5126222 5349613
5898 5349613 5001645 6139749 5622607 4230671 5894880 5700896 6394880 6921191 5597965
5889 5597965 3971959 6388865 6019684 6064075 5896496 5880035 5864083 5033879 6477755 7076704
5879 7076704 8052614 7533543 7883779 7978228 8374336 7914576 7784335 6603057 6855652 7863571
5869 7863571 6345407 8368499 7359829 6090839 6108147 6581755 6573496 7511707 6100787
5860 6100787 7224389 7334014 6218237 6323938 6900014 6747734 5830885 6483366 6192808
5851 6192808 7473775 7173233 6447451 5658814 8450905 7096003 7655747 7333677 7135056
5842 7135056 8695595 7215288 7514960 6976882 7292648 7498928 7688436 6622778 8277208
5833 8277208 8170420 7107404 8470304 6925454 8183185 7666511 7244654 6644017 8495270
5824 8495270 7858228 5893102 6637167 5658025 7424788 7967632 7273597 7607897 8576956
5815 8576956 5883537 5790060 7797650 7844817 9256051 8185839 6546689 6498164 7733469
5806 7733469 7861112 8006824 7628340 6897525 6013736 5486411 6303305 7700527 7783540 6482838
5796 6482838 7058722 6677337 5313429 7962826 7462591 6003049 6987235 5946479 7020153
5787 7020153 7695478 6717192 6666317 7479211 7535027 6211177 6434248 7277247 7488955 7959027
5777 7959027 5604918 5557018 5995462 5144835 7070032 8481353 8592592 8713827 6345356
5768 6345356 6778723 7520004 8130272 7222419 6585028 7382818 6412060 6448567 6954847 8202240
5758 8202240 6417130 7075183 7767901 6956321 8086544 8306510 7644308 6915422 5664309
5749 5664309 6539236 8461162 7166918 6971755 7796338 7101552 7090020 7947158 6826160
5740 6826160 6848828 7369522 6175650 7522156 9094558 8170797 8143831 9204284 7934255
5731 7934255 6261260 6357549 8592776 8066479 7449272 7960161 8569237 8976756 6225982
5722 6225982 7513320 8239181 7259342 8241504 7309713 7017898 8878076 9438910 6464755
5713 6464755 7048204 9188334 6411217 7501547 9523978 8175368 9486498 9196086 6764605
5704 6764605 7536340 9063228 7515349 7905864 8388420 8124720 8062664 7651181 8303299
5695 8303299 8840242 7636469 8003889 8527851 7691176 8058796 8542755 8139613 7425818
5686 7425818 8414014 9860768 8782065 7883063 8445389 8832931 8764102 7477238 8655784
5677 8655784 8961139 8115905 7785932 8213220 9277330 8225849 6725864 7450505 8486242
5668 8486242 8503511 8110185 8968813 10586223 9123645 8847579 8771765 9027119 8534311 8617714
5658 8617714 9201355 9241188 10200701 8575636 8784745 9636345 9772928 6993728 7230499
5649 7230499 8246583 8591981 8278065 8113702 9327163 8964066 9182938 7091199 9024385
5640 9024385 9803900 10048077 10414761 9528408 8070190 8306298 8963669 8041569 9740917
5631 9740917 8089756 7805151 7845862 8328987 7252852 8829527 9926670 8682678 8244055
5622 8244055 8123813 10024355 9541372 8981614 9543123 10927319 10470454 10066577 10171555
5613 10171555 9971604 10710701 9286666 9218755 9221176 9196641 8224694 8004763 9006835 9292672
5603 9292672 8796275 9822354 10451349 10067914 9746017 9376217 9110399 8956478 10079696
5594 10079696 10343854 10400972 10207736 9431860 8914987 8621956 7814551 9242874 10353342
5585 10353342 9641252 8308990 9123624 9971353 10419920 10542036 10868470 9249823 10100161
5576 10100161 10909391 10413879 11710145 11035054 10087254 9881045 10469105 10529646 10885815
5567 10885815 10704459 10801891 10063948 9230756 9590609 10614953 11384310 9928730 11031691
5558 11031691 11158790 11364848 10977850 9515599 9702645 9855785 12017322 10818021 10584902
5549 10584902 11686707 11555770 10869103 9333166 10914955 11860245 11889600 11674399 10433076
5540 10433076 10341973 10962690 10699595 11042056 10760890 10920669 12775777 9740037 9889175
5531 9889175 12094225 12732438 11940453 11007297 12175719 11022619 11611711 11798951 12427722
5522 12427722 12509853 13394797 12062076 11880611 12727199 11604322 10779106 12072864 12873182
5513 12873182 13015527 13120999 12047948 12326649 11754163 11640116 13769174 13573379 13742743
5504 13742743 12423187 14271277 14193033 11726349 13829775 13557725 12342306 11893309 12949554
5495 12949554 13900977 15206509 14249039 12614080 13212312 14430187 13059696 14426787 15709678
5486 15709678 13128644 14337451 12528707 11563741 13255968 13243900 12870443 12115446 12702300
5477 12702300 12253511 13754709 13139436 12425703 12823979 13160279 12251144 13257288 13995122
5468 13995122 13050316 14918405 14812247 13491124 12477493 14181453 14134096 14551307 15080956
5459 15080956 12866896 13345108 13892987 12881768 13216430 14289718 13377869 14251053 13674718
5450 13674718 12126781 13792747 15520601 13449666 12171937 12583236 12710249 13853106
5442 13853106 13156856 12295905 14159160 12644704 11794696 11921706 13648699 13314949 12989411
5433 12989411 12908078 12141165 13539787 12564834 11057785 12535806 13446526 12026544 12427900
5424 12427900 13062568 13509218 13740445 13929273 13070554 12385155 13197887 12919511 13655250
5415 13655250 13374419 12542883 14218990 12519429 11315902 12126894 12487544 12256674 11962543
5406 11962543 12889502 12416606 12606636 13086976 12817502 12651407 12486421 11414673 11135331
5397 11135331 12861296 13265190 12215272 12290766 11804205 12080405 13155844 11697942 11795630
5388 11795630 12306559 11763335 12080511 13130219 13042332 11655950 11678315 11332376 12949309
5379 12949309 13084159 12191468 12395474 12916295 13766522 12901927 12068135 12408599 14345338
5370 14345338 11866717 11204377 12735954 12284935 12261674 12892169 12674093 11649336 12825195
5361 12825195 12095115 12469120 11842273 12643248 12498268 11713453 12765358 12305533 13684901
5352 13684901 11595506 11473361 11462382 11849657 11573378 12608150 11329410 12135632 12023500
5343 12023500 10506909 11730491 12364077 12146597 11669879 11813326 11396098 11046515 10899662
5334 10899662 12147317 13176222 11861463 10725531 10969357 11734346 11174606 11369560 12090618
5325 12090618 11424798 12144220 10984828 10814233 11940469 10625202 11257665 11144127 10314522
5316 10314522 11557828 11855456 11430686 12121334 12893405 12259751 12025451 11823567 11918615
5307 11918615 12712333 13124915 11925045 12950578 12187769 12372947 12459582 12298186 11562551
5298 11562551 11672210 11564329 10897750 12082650 12012560 12503251 11329471 12080818 11145727
5289 11145727 11547081 12393910 12711582 12013574 11877515 11592808 11551862 13286929 11078052
5280 11078052 10515257 11460485 11723731 11625605 11736259 13170773 13240380 12505299 12387547 12029482
5270 12029482 12681006 12530335 11522278 10952922 12424783 11476630 11675179 11555803 11784824
5261 11784824 12711396 10828237 11451341 12229254 11608324 11565846 10937936 9756213 11185221
5252 11185221 12680540 10954404 11500139 11371261 11528963 11406719 11188318 11976373 12715042
5243 12715042 11659069 9907645 10771541 11209289 10365534 11894717 12405671 10096496 11096091
5234 11096091 9579794 11135032 12707084 10674102 11199467 11426872 11675494 10047248 10269574
5225 10269574 11555480 11837898 11703844 9538511 9152074 10413878 11264035 10304274 11139826
5216 11139826 11138868 9958196 9760742 10868732 12090914 12820949 11626581 10543057 11333507
5207 11333507 10189223 10417903 10468908 10981881 11154648 11795876 11292534 10198432 11307897
5198 11307897 11615491 10230335 11390205 10516254 10674866 9858566 10268847 10553996 9703398
5189 9703398 11555251 11606862 11876003 12093882 11593009 11353689 10877517 10820444 11142981 11281641
5179 11281641 10795284 10594134 10582242 11148430 10306656 11260328 11346102 10964119 9279320 9146502
5169 9146502 11526601 10833117 9603457 9382301 11091331 9532500 10895615 10386209 10015664
5160 10015664 10560732 9006436 7918684 10717413 11374918 11178743 10697674 9970973 10374515
5151 10374515 9477812 9537817 10440100 11353712 10425022 9130873 10818897 9009214 9149784
5142 9149784 10563200 10828657 11255519 10003947 9786879 10004814 10091545 9598119 11181752
5133 11181752 11138646 8507853 9458317 9801519 9595627 11997039 10706392 10081436 10087218
5124 10087218 8153232 10210372 10823788 10902419 11142699 10476511 10575962 10651087 10493502 10623403
5114 10623403 11072172 10916226 9368661 9355533 9973201 9725317 10546991 10822377 10953483
5105 10953483 9725183 8911424 11123710 11450980 11351260 10177404 9859212 10273047 11164061
5096 11164061 10539122 10061272 11483148 11153725 11411192 10364336 8165367 9949419 10956615
5087 10956615 8746994 10831592 9908195 9104785 9109237 8925177 10140332 10352437 9493773
5078 9493773 10485929 10131516 8060092 8966306 10252988 9130556 8937463 9352498 8844199
5069 8844199 9650289 9911122 9067693 11130909 10886950 9115705 8732810 9489227 9736357
5060 9736357 9801903 10990868 10657702 10005862 9855013 9142440 10880802 10641751 10821046
5051 10821046 11322856 10148298 10200527 9578020 10764990 11197205 11051868 10795571 9515951
5042 9515951 10162708 9673390 10122695 12249171 12054009 10758043 10212052 10544421 9405919
5033 9405919 10422383 11226798 10435309 10471092 9975805 9149660 10374165 12169794 12243961
5024 12243961 11260792 11007899 11333171 10134707 11800180 12594074 12890014 11364437 11922979
5015 11922979 12574115 10951527 12156588 12820732 12273375 11185128 12526120 11723472 12022155
5006 12022155 13117228 14920972 13949192 13097461 14336378 12620339 12177405 13405811 15069932
4997 15069932 13565651 14896246 15722745 14670533 15906586 17551004 16990326 15178366
4989 15178366 17372158 16616352 17126408 19586773 19709938 19812156 20354281 21327782 21472503
4980 21472503 22382694 24888277 26157785 25817320 27654385 27510287 27991440 30609880 31753690
4971 31753690 31963190 31125888 30295295 28813781 28332850 27874859 28160943 27370889 24561257
4962 24561257 23191871 22833553 22097081 22408700 21375697 20315631 19524276 19227516 18401858
4953 18401858 17304580 19217658 18906339 17593188 17698560 17512676 17399699 16567577 16451861
4944 16451861 16818685 15652184 15651897 15288384 16242993 17025884 15928903 16500288 15742100 15478565
4934 15478565 15974234 16870662 17032950 16891732 17259021 16958359 18786069 19053697 19424106
4925 19424106 19104495 19538641 19728656 19534830 21099216 20312530 19132269 20153838 21165650
4916 21165650 21897177 23835061 24533854 25674701 26509851 25360857 26697140 29009051 29886863
4907 29886863 30465368 33776420 35069005 33727585 35013469 35503017 36426610 37358864 35520076
4898 35520076 33415164 35035016 33923146 33389950 32117894 29656738 28755468 26221717
4890 26221717 23961258 24247642 24948375 23934017 21180428 20096514 20726919 20945639 19816586
4881 19816586 18514472 17307733 15815294 15752221 17035500 16378478 15964822 16394446 15635946
4872 15635946 14218072 13063918 14815737 15805970 14903203 15081304 13622963 11736716 12561341
4863 12561341 14195309 14575740 14622900 14371326 11914328 13216424 14289590 13195656 13277664
4854 13277664 14283668 13641256 12943297 13112120 12410765 13236172 14155582 13387137 12348362
4845 12348362 12210499 12112356 12891067 14186277 13592912 15641042 13047888 12017812 14194371
4836 14194371 14858532 15859990 15220378 14975271 13962437 14611825 15543598 16740234 16222536
4827 16222536 15224214 14735099 15911883 16775144 17776511 17607013 15647105 18275585 18108058
4818 18108058 18530125 18761551 19868806 20125511 21032327 22949401 23179229 23170209 23257911 24493846
4808 24493846 23837989 25446137 26109397 27021491 26576796 27621964 27695153 26020454 25595446
4799 25595446 25208167 27885689 25680374 25601293 24932519 22127431 22544875 23842534 23750893
4790 23750893 23197985 23072223 22290493 21541269 19799915 20510417 20162393 20616466 19688484
4781 19688484 19723959 19483602 19939850 19951495 19896226 21576300 20606773 19668143 19748736 21171945
4771 21171945 22195113 21951243 20540802 21966876 23407200 22545002 24598607 25985944
4763 25985944 26727944 26105370 26699495 28333070 31218425 32499707 32119581 32809245 33267174
4754 33267174 34528387 35298159 36149192 36769206 37487350 36483065 36148375 35037240 33152921
4745 33152921 32727625 32409504 31089129 30566675 28541106 25905404 25033560 24772692 22938118
4736 22938118 22629099 21919231 20573444 19585926 20319886 19294959 18147761 19152437 17762525
4727 17762525 17509690 17539439 18577408 18093958 17218285 17103398 15788461 16006192 16249291
4718 16249291 15993979 15030257 16249113 14877247 14025535 14307885 13792503 14854842 15327364
4709 15327364 13088082 13739074 15161662 13078799 13216842 14544403 15149529 13810691 15128188
4700 15128188 14381105 13930186 13381456 12995670 14473956 14413069 13941051 14804937 14898863 13921263
4690 13921263 15663259 15396621 15474346 15499589 14117817 15214189 15008712 15406764 16894345
4681 16894345 16658552 16143052 17625951 16680826 17764711 20271097 19129953 19139786 21200081
4672 21200081 21084392 21563650 23016288 21977270 22912542 24357411 23950074 25882582 27535148
4663 27535148 28271140 30967708 31957385 31750611 32211928 33346225 34176075 35765395 37470149
4654 37470149 38125668 36476240 34778458 35278140 34056990 32899026 32059475 30228276 29671750
4645 29671750 29083482 26700317 26312053 25280404 22158048 21951836 22322046 21090788 21533204
4636 21533204 20643811 17932213 17786605 20284499 19644418 18076505 18553103 20134212 18244420
4627 18244420 16638713 17573668 17426276 17221962 18002845 18369956 18459287 18332194 18669203
4618 18669203 18566015 18871317 19734603 18280116 18039643 19438312 21139395 21058026 20764574
4609 20764574 22593401 22385931 22802393 24129223 24130058 25418669 23465763 22432145 23177967
4600 23177967 23242720 23587341 23407283 22026669 19429402 19626639 19445854 17739490 17272857
4591 17272857 16291820 15825499 15943330 14400924 12977385 14789332 13681433 13667365 12994963
4582 12994963 12893174 12723560 12125272 11379071 12065285 12799552 10053654 10319325 11152193
4573 11152193 11500081 11118654 10069201 9262720 8067993 8605833 8962289 9900153 10580762
4564 10580762 9385419 8182755 8910244 8929398 8760865 8314766 8639612 9351840 8792414
4555 8792414 9427777 9656160 7598113 9572783 9770415 8431707 8515140 8767698 9153601
4546 9153601 8798986 8869926 8891932 9871678 9295706 9414778 9877640 9824438 9410782 8971616
4536 8971616 9718589 10888047 11466806 10386964 8337403 9547422 9770352 8695316 8603164
4527 8603164 9095316 9382857 7368732 6213643 8105567 7756270 7595042 8615111 9020318
4518 9020318 9202404 8285378 7071958 8592461 9050577 9999978 8017607 8133370 10268634
4509 10268634 7997558 8043567 8248558 8906302 7832604 8109203 9000071 8804440 10377220
4500 10377220 9956549 9347212 8871458 8934787 8411647 10542559 11979201 11928771 11319361
4491 11319361 11168785 11759831 11295730 12289437 12486916 13438371 12082871 12210093 12692370
4482 12692370 11912814 12511757 14033647 13210569 13316076 14920925 14454718 14811346 16114649
4473 16114649 16557944 15105059 17188397 17415238 17834083 19519141 20409724 21620604 22756523
4464 22756523 22858878 24398791 26530926 27159894 29125527 31519493 30075412 30490173 32421647
4455 32421647 31878985 32809712 31912658 30653299 29544043 28914834 26292426 25152571 23970355
4446 23970355 23446480 21820071 20480192 19363850 18804655 18070275 18030938 18458674 16728525
4437 16728525 16451375 15936688 14277486 13367534 14572405 14975796 14956338 14096336 13249223
4428 13249223 12761234 12557386 13369760 12400197 13166192 13271682 11991031 11695109 10668291
4419 10668291 13163187 12641659 12293652 12331318 11789153 11731040 12815634 12121784 11772943
4410 11772943 13067190 13257394 13124284 13630629 13055674 13663586 15446669 15033731 14043239
4401 14043239 14615610 16148853 15776517 17602918 18621001 18556753 20168890 19307011 19196443
4392 19196443 22636006 23453996 23134510 25655284 25551562 25513150 26957105 27125349 27271023
4383 27271023 26879298 26653908 24368209 24120207 23314945 21773239 21531900 19106479 18814435
4374 18814435 18840585 16379666 16807500 16855086 14991689 15621886 16334396 14179928 13897759
4365 13897759 14736993 13980514 11713545 11656121 12779589 12071110 11900502 12106137 11575703
4356 11575703 11002275 11933516 11140545 10728365 11194670 11740107 11792205 10675680 9893136
4347 9893136 11172724 10589306 10424822 13124696 13174470 13089134 12387314 12474627 11830266 14577916
4337 14577916 14563809 13575301 15158503 14215833 14611415 15365228 14126033 13515973 14297578
4328 14297578 12949042 14512356 14378224 11914221 11910640 13224067 11729267 12193191 13317903
4319 13317903 11285528 12713643 12724450 12279679 12467028 14129339 12123760 12026369 13709585
4310 13709585 14501610 14277662 13258476 13001351 13039835 14335792 14052788 12905667 12354142
4301 12354142 13236012 12206813 10782570 11283747 11163165 11420443 9949476 9198750 9489356
4292 9489356 9143936 9108638 9558945 9422949 9745859 9793201 8300334 10021754 10510982 10102954
4282 10102954 10958012 9773502 9140420 9835328 8898052 10124459 11333577 11742787 10073270
4273 10073270 11416887 10538488 10905417 13055538 10405414 11367254 12929956 11718906 11840827
4264 11840827 13516094 13177907 13607116 13209894 12081048 11505714 10484047 11384718 11643441
4255 11643441 11316388 11428443 11880628 9519033 9737634 11679701 10765770 9974132 10609042
4246 10609042 11793706 10640232 9772962 11094163 10923117 10216946 11164292 11295442 10250168
4237 10250168 10139663 10300399 9505439 9068916 10855502 10087298 10472484 9680820 9770234
4228 9770234 10150808 8403919 9873551 10342179 9883914 9999077 10415880 8690830 8611153
4219 8611153 10170220 8464896 10815838 10979860 8205210 9106839 10145394 9642098 11491528
4210 11491528 11011698 9597089 11000594 10079492 9726730 9914455 10921501 8094074 8686572
4201 8686572 10040964 10208404 10837928 10079316 10665097 10436862 11428919 10540497 12013232
4192 12013232 13105287 11909422 11841994 11579412 10763766 10745490 12142751 12687912 14032705
4183 14032705 13103693 13750676 13675572 14373616 14933234 14556073 15528444 14593881 15430226 14533977
4173 14533977 14941179 15873741 15973918 17171896 17664899 18028929 18262778 18314927 18940927
4164 18940927 19287800 18268776 19255933 19864522 21387005 22135252 21730733 21354323 20559283
4155 20559283 21893425 22333464 22868954 23989161 22311420 23448586 22265008 21871708 21374777
4146 21374777 21589718 22733681 23020149 22717455 21311958 23045488 23610043 22261275 23213233
4137 23213233 23812101 24394966 23886705 23013856 23926569 25766000 26326431 26115806 26333629
4128 26333629 27535228 28053334 28900038 29681107 29533147 31093370 31000163 32323880 32830702
4119 32830702 32167502 34371181 34052883 34802981 36591739 37773359 39691069 38379299 40079269
4110 40079269 42083259 43355001 43256027 44353061 46238663 48267607 50444014 51127982 51267437
4101 51267437 54262184 55876138 55979945 60561394 62334203 64872126 66600221 67063379
4093 67063379 70000675 72121006 75498860 77654878 81066637 83261822 86954521 88685194
4085 88685194 90023151 94261228 97807405 101537393 105027784 108838191 111721635 115813747
4077 115813747 119274205 123160299 128078163 131925561 135684702 139501663 144504234 149756199
4069 149756199 155114524 160140074 165837136 172889141 179854671 188826476 196863935 205314627
4061 205314627 214209487 222532492 232326969 239223578 245320701 247973312 249937021 250014865
4053 250014865 246063921 240966415 234105018 225525477 213818622 203596536 191846152 183531794
4045 183531794 175227166 168691689 160311091 153739451 149524639 142993640 139303942 133215997
4037 133215997 129604453 125050844 121986077 118443056 115358252 113351645 110529318 107652952
4029 107652952 104306903 102803078 100122662 98046055 95588822 94449324 92760151 90590457
4021 90590457 88137087 86947837 85871103 84588549 85826082 83981209 85833260 84084180
4013 84084180 82191562 82266630 83227190 84751308 83131986 84531188 84789497 85357252 86265442
4004 86265442 87282821 87864840 88817316 89233430 90627932 92094910 93466095 95397230 96970908
3995 96970908 98829950 99178427 101536902 103704608 105596414 107176937 109291593 112954287
3987 112954287 113663911 115794232 118077738 119890784 123308077 124698310 125600291 126775180
3979 126775180 129741586 133137655 135960777 138248953 140048338 143627231 146630857 148458412
3971 148458412 151040812 153378057 155576682 158773322 161765835 164452877 166850779 172186778
3963 172186778 174665555 178320739 184210216 188036341 193696718 199909466 206280262 213516854
3955 213516854 221551239 228739265 233916876 237650734 242384110 243951962 244216123 241111039
3947 241111039 234009566 225650006 215680681 205423048 194960695 183835485 173074706
3940 173074706 163590521 153536592 145504845 139088859 132245249 126271853 121202084 114957633
3932 114957633 109643891 107196562 103428625 98910566 97543590 93488785 87347481 85506842
3924 85506842 84446300 81959543 79869935 78082589 76841035 75092072 72058748 69130952
3916 69130952 68256100 68187869 66248903 65933696 64036234 62154202 63071731 59732161 57375502
3907 57375502 58348020 57118269 54231764 53273867 52975860 51692537 51610725 49843755 47145631
3898 47145631 47695379 48039221 45644762 45482713 45445756 43555035 44408724 44013018 43281949
3889 43281949 43205075 41276724 40151451 42004388 41105544 39410787 40060208 39771023 38773377
3880 38773377 37641220 38454588 39358729 39405729 38959777 37305690 38381482 39184514 38198166
3871 38198166 38490819 38267631 38325630 39674505 38716620 38976948 39055010 40359704 39934243
3862 39934243 39284480 41303308 39876638 39945422 40981786 42995543 42933853 42075936 41774087
3853 41774087 43135040 44996308 46486598 47179763 47472499 49041749 49393352 50200917 50096185
3844 50096185 52028805 53996570 53932011 54842089 56166039 57069302 58232516 59984518 57801357
3835 57801357 58619988 59947355 60459513 61050742 61609193 62065749 62566249 62512790 61398468
3826 61398468 61591970 62195499 62471235 62043767 62838837 61918629 61412414 61683542 58925503
3817 58925503 58908169 58861450 60991530 61020419 59271078 59425343 58519614 58929515 58270448 58459278
3807 58459278 59087325 59840233 60106553 61392765 61711491 63845229 65740903 66126129 66004857
3798 66004857 67438463 69848639 71644520 73888309 75247342 77061340 78878439 78564511
3790 78564511 80198458 81876339 83763296 85735922 86397259 86995472 88434947 89591699
3782 89591699 89244448 91443179 91825876 91460643 92991552 93173860 94270631 94781386 93425963
3773 93425963 91403360 91519218 90680777 88219850 88495144 87707100 86579476 85723468 83801352
3764 83801352 80997944 79783937 78188771 77451325 74939022 73347784 73642359 70456822
3756 70456822 69231782 67270235 66047680 65187369 63933027 63383205 62268207 62623925 61243348
3747 61243348 59416648 59032376 58584952 58325269 60211808 59531797 58275077 58758550 59871718
3738 59871718 60620798 59885625 60545329 61539572 61174968 61784189 62369661 62991337 65196960
3729 65196960 66797827 66474199 67074168 66159693 69052183 72253242 71574918 73109335 73893627
3720 73893627 75660326 75907033 77328881 79177730 81865983 83694430 83130753 85109690
3712 85109690 88808904 90634957 92463833 95324982 95692589 98004041 99556141 102179001
3704 102179001 105541819 107606034 109179817 111548497 114754533 115822737 119137280 121512131
3696 121512131 123435187 125713313 127675599 128695606 131704409 134798245 136200277 139248756
3688 139248756 141717453 142909744 143926519 146246548 147410889 149380566 151820397 153206276
3680 153206276 153485795 155427209 158037634 157897753 160647644 162352854 162787315 164405605
3672 164405605 165961835 168179898 169681297 171678882 174897221 176600962 178003275 180064825
3664 180064825 182864820 185855013 187585009 190974600 193077211 195415719 199727703 201900460
3656 201900460 203694149 207749713 210333675 213415214 216409228 219026893 219926840 223482624
3648 223482624 228263757 228761233 230055899 234239837 237498459 237114504 238959043 240035057
3640 240035057 240562401 242578229 242996220 242952947 243477575 244271886 244649876 245669136 244981044
3631 244981044 244303932 242637865 241288813 242044135 240855706 239744941 238861064 237988910 234454175
3622 234454175 232027110 230795187 229237620 226595173 225065875 222760002 220514061 218988606
3614 218988606 217158865 214999975 213098946 212009541 212199861 211113995 209992924 209945320
3606 209945320 208801382 209251892 209771609 209550897 210468522 210849048 211468133 212094723 211989697
3597 211989697 214609084 217023213 218550899 220777870 222313085 224896704 226512811 229116256
3589 229116256 232396451 234235830 236519752 238672768 242007938 244803627 247300107 250128014
3581 250128014 252336190 253517218 257309440 260010544 261919408 265108250 266088170 267013695
3573 267013695 269706655 273086153 275226749 277809394 279866985 282927276 284257104 284452479
3565 284452479 288054656 291688610 294485633 296157733 298066745 299681280 300295550 304118074
3557 304118074 306694674 308275300 311943687 313534058 313792859 314032865 316405552 317074306
3549 317074306 318924085 318281825 315314547 315340094 314351712 311184429 308737319 305995162 303079750
3540 303079750 299340883 294699636 290260156 284511688 278094723 273027758 266778527 260091634
3532 260091634 253247865 246397201 240336522 233269798 226108865 217894549 211072579 205307290
3524 205307290 196870144 191787851 185898936 180998812 174887965 168885413 163219798 158004906
3516 158004906 154234039 148908284 145032478 140867780 138161371 133968388 129786883 127634209
3508 127634209 124036857 121195963 118386877 116410768 113891646 109949988 107535229 106251268
3500 106251268 104425092 103198262 101220768 96725009 95462310 93458886 91454319 89153740
3492 89153740 88721862 86217828 82617055 81057409 79244013 77119776 76746312 76411941 72818390
3483 72818390 71539256 70628694 68628368 66766458 66564669 65248325 61963781 59199923
3475 59199923 58268883 57935007 57527734 57014552 54042864 52555308 51661482 51884333 50414621
3466 50414621 49957783 48305947 47954638 47117925 45725411 45216343 44189401 43482528 42841763
3457 42841763 43496831 40876908 39649503 39949738 39263956 39661220 39642501 37186421 36128284
3448 36128284 36634480 36720866 36755521 35577770 35618230 35171968 34400723 33898761 32782167 33059913
3438 33059913 32805352 31400447 31636316 33531513 32213615 29601482 30074887 30544674 29664958
3429 29664958 29531762 28430800 27807530 29581145 28980828 27673923 27951657 27288552 25128356
3420 25128356 24996954 26252375 26768081 27034411 25551993 25448271 25518066 25809519 26326179
3411 26326179 25718383 26251501 24797568 24491137 26556087 25602308 24551708 24012360 24312777
3402 24312777 24396912 24375322 22211128 20264146 21041024 22219392 23020248 22369947 21074362
3393 21074362 18661798 20483941 19659653 20121000 20072468 19384348 19782601 19532560 19143792
3384 19143792 18591298 20298528 18888804 18882024 18958019 19505758 18409950 17802688 19749104
3375 19749104 19200588 18740792 18005606 17276087 17121470 17557582 17253698 18047497 16781064
3366 16781064 14258248 15924583 17035348 17719685 18531927 17380584 14662260 15488625 16062899
3357 16062899 14898783 15618959 15509668 13492685 13819236 13930263 14072964 14099237 14688570
3348 14688570 14456088 14258014 14096476 15025675 15209502 15214604 15106905 13602733 12773336 14000775
3338 14000775 15493497 14796366 14835760 14448893 12149510 10767154 12238795 13902972 14227243
3329 14227243 13881416 12811789 13281014 13443303 13931190 14746316 13769085 13236471 12581172
3320 12581172 13585477 13146256 13609054 14835921 14669814 13741024 13405563 13152695 12840485
3311 12840485 15313869 15516981 14079344 13568077 13968275 13714002 13896179 15551624 14706543
3302 14706543 14945839 14260967 12009325 14692508 16613034 15711051 14721549 14232851 12920328
3293 12920328 14938766 16017794 14918516 16036051 16355875 14856608 14628153 16371323
3285 16371323 15954420 16224750 16684106 17116329 16981148 16731458 17195954 17692944 17762309 18001125
3275 18001125 18619243 18338643 17759716 19338044 19478824 20407136 20156531 19824738 20384499
3266 20384499 20563067 21712032 23217085 22531761 22050518 23459082 23857292 24774225 25681473
3257 25681473 27155682 26202773 26119194 26949891 28330401 28976187 27945955 27548237 28578470
3248 28578470 30384215 28938543 28786588 28711887 29270589 29731598 28712078 28845078 29376713
3239 29376713 28512886 27865007 26899822 26128730 26281085 25817385 24803387 25679186 24809822
3230 24809822 23697260 23273485 23134523 22648678 22535501 20746065 19555778 20308123 18965636
3221 18965636 19220392 18958001 18050855 17905378 18515921 19080099 17478691 15712087 16117545
3212 16117545 15504616 14385473 15852938 16263632 15221996 14524068 14551137 13069358 13146278
3203 13146278 14659670 13897413 12899339 13543314 14317866 12633537 12131076 13191977 13844765
3194 13844765 11866237 13361640 15146341 12024642 11021326 12444137 10250965 10751922
3186 10751922 10762714 10649461 12378076 12185823 9853027 8283536 9251629 9800731 10121734
3177 10121734 9998104 9352394 10048331 8739025 7664110 9750835 10184619 8435115 8681544
3168 8681544 8657689 7581302 6682921 7604958 7976319 6955871 7998770 6802440 5530790
3159 5530790 6348457 7447460 7436087 7268017 7778960 7520178 7489607 6937526 6808671 6700704
3149 6700704 6595113 6359693 6225825 6617846 6895343 6894757 6716540 5959273 4517987 6499573
3139 6499573 6077894 5440731 6798288 6250827 5640393 4891874 5533559 6308698 6762754
3130 6762754 6428158 6494606 6231627 6414503 5376037 3385092 5587483 6169305 5470176
3121 5470176 5855792 6113422 5854441 4937832 5553089 5425295 5869160 5952926 4960742 4682454
3111 4682454 6137416 5320314 4607825 5722420 4720024 5377002 5062924 5918095 4737920
3102 4737920 4724249 5928772 4925065 3508533 4563325 5837562 5070250 3758926 4737536
3093 4737536 4727789 4200211 4775144 5829022 6089456 4525955 4319664 4030140 4529128 3840809
3083 3840809 4402931 4647464 4152886 3766994 4050537 3649044 4340171 5611656 3678189
3074 3678189 3449517 5148408 5012621 4128429 4999561 4480757 3936067 4278418 3790546
3065 3790546 3753679 4223183 4673543 2857258 2566559 2927421 3500357 4151832 4513178 3982576
3055 3982576 4114647 3399315 2670684 2780404 3324605 5340385 3431871 2104693 3494205
3046 3494205 3619470 3646669 4658088 4198929 3436641 3875835 3441601 2181371 4009042
3037 4009042 5031356 4502708 3392182 3195522 1711765 1777914 3884768 4213803 3554103
3028 3554103 1988941 2289120 2988503 1848371 2280841 4338708 3947660 2453502 3093591
3019 3093591 3844110 4409651 4069725 4917514 4066738 2615945 3638792 1779131 1359447
3010 1359447 4358248 4971070 2677291 1777215 1762535 3033202 2901679 3292341 4810774
3001 4810774 3862637 1815325 2378203 3387015 3066206 3685584 4388827 2483481 2555702
2992 2555702 4305332 3468692 2820717 3355340 2749664 2884779 2578577 2585487 2543615 2123312
2982 2123312 3246221 3618872 2328878 2284932 2949884 3501325 3674370 2949273 3537763
2973 3537763 3022322 1747075 2789098 3742306 3412467 4612937 3807814 2184248 1592290
2964 1592290 4026531 3699475 2575422 3647749 3172904 3405129 3490325 3639744 4468629
2955 4468629 5212354 3531928 3715233 3572949 3065256 3891839 3976431 4170846 3605542 5222917
2945 5222917 3740642 1946188 3438777 4828445 4006766 3426867 4176835 3719306 3756037
2936 3756037 4219664 5305671 4622483 5421201 6049337 5227971 4808515 4829142 5531080 5486142
2926 5486142 4333465 2642081 4557418 5408587 4406281 4886153 4161414 5349733 4674537
2917 4674537 3929682 5093055 5900758 6208258 6432385 7153418 5349735 6010206 5955463
2908 5955463 5309472 6036779 6751486 5940013 5189607 6703973 5853304 6891217 7463113
2899 7463113 6422982 4951399 6118068 6151497 5765013 6922078 6042334 6448803 5784846
2890 5784846 6608997 6642387 6743986 6479378 5223036 6742623 6257037 5655611 6851330
2881 6851330 6415556 5488899 6034007 5524856 6025197 6855789 6382774 5364649 6675819
2872 6675819 6862792 5266207 6409851 6561854 5938556 7604617 5974369 4795410 6458703
2863 6458703 6224939 5138117 4270050 6944726 5888032 4174949 3878497 4496698 3908354
2854 3908354 4061302 4379915 4171650 4425008 4599451 5360204 3313023 4295256 4016071
2845 4016071 4298784 4129761 4586017 4628657 2066746 2971694 3559631 3805153 2611686
2836 2611686 3186902 781708 2003247 3760330 2153812 1611364 2116193 3102111 2656743
2827 2656743 2344440 2035477 3092811 2147544 2923964 3429231 2609069 1847295 1991660
2818 1991660 2666454 2678715 1204619 878741 2308763 2664233 2909466 244079 761574
2809 761574 2624104 2857302 1676403 1383825 2534878 1972303 1229808 1240091 1689284
2800 1689284 2462543 3019708 1384740 1674194 2923606 1792934 816200 2512901 1204800
2791 1204800 2146661 2448102 -296896 631721 1971216 2232660 2479734 3770459 2072983
2782 2072983 263018 256686 1119771 2466446 3275486 1341687 358527 1381560 1007275
2773 1007275 2345548 2179243 2167723 1334734 665336 1395864 899480 179071 762756 590747
2763 590747 2033794 2239778 860250 552963 708578 928510 2478985 2057924 46058
2754 46058 415086 -178709 -466793 2059411 2017790 740927 157687 -49676 -458528 632497
2744 632497 689941 -615569 696611 1305945 447758 -39836 -86687 32353 114203 309968
2734 309968 1310369 1397921 -152898 -16906 1695251 1445360 435182 671998 -439968
2725 -439968 -937435 1999629 1976571 889960 -230292 703878 879841 1128854 684650
2716 684650 1837558 932150 1193732 1500563 -601161 -621754 8209 650808 1395357 1061718
2706 1061718 -663236 -670042 -314023 433472 21581 926552 1316038 -489350 -9028 -34400
2696 -34400 770579 729845 3979 606111 376513 379398 571956 -212094 -51521 1637027
2686 1637027 -169739 51603 -169554 -544914 656155 1354627 1317590 460403 511919 -3907
2676 -3907 1068673 1655113 1027404 977451 112919 -438534 968651 797050 504591 1074735
2666 1074735 -21362 281876 -648550 -348542 847247 535701 1124253 591180 -454206
2657 -454206 47471 32506 -497836 828819 1759249 995786 -1376802 -1874999 -1488527 550861
2647 550861 836627 50099 1028145 990081 491753 422669 899571 752349 135653 -543459
2637 -543459 -307067 529492 -266982 -447125 1139211 588430 445971 941387 407961 -162124
2627 -162124 570994 248444 933931 1127236 -433949 -1360697 358933 1810315 1351985
2618 1351985 1139679 -363889 550704 49693 475580 1422061 1663035 1209502 929964
2609 929964 1365099 40636 -403533 971388 1493519 1519222 406103 -1641790 -40282
2600 -40282 36380 644560 642666 -1095253 -1014488 -1559923 -365567 772796 1011226 1010997 -93217
2589 -93217 -120245 1072721 1465744 1246398 1983627 106530 -1136924 -367478 389698 40013
2579 40013 1046073 816687 -866351 -746801 -99420 -882146 -124732 1046447 798519
2570 798519 -453097 -1725650 -484488 901690 1273612 2086435 470347 -958991 -36508
2561 -36508 281609 816418 1282793 -179521 -423882 -209721 -274736 235973 401653 495545
2551 495545 -258100 189366 -160000 167535 708574 40301 -282621 343483 -81966 -1054353
2541 -1054353 15243 26429 443173 -83554 -370471 -346659 -756430 656855 -647998
2532 -647998 -289977 -1138367 -1111978 -901300 13636 1140189 423072 -435202 -1217950 266089
2522 266089 -574887 -170691 -1048163 -1121239 -1152053 -262069 -352996 327206 1162256 -963183
2512 -963183 109940 741840 491883 39424 -758061 -1015490 -409512 -936530 -1113349 1138960
2502 1138960 1778435 -79595 204505 -884104 -1246243 615163 -500159 1124383 1345483
2493 1345483 -503956 183294 -39305 660845 474420 -277031 -1298685 -563678 641160
2484 641160 502135 -166567 997860 697739 -235461 326752 -483391 821775 1456925
2475 1456925 -268757 -819858 -714832 -383272 -695350 1545738 951688 -1003246 -374756
2466 -374756 -278157 -1194283 189919 1180185 -147259 -210653 -601900 -1028081 -144096 12504
2456 12504 -96606 556791 872790 -157158 -490427 754550 399891 -1486464 42394
2447 42394 779486 -550409 -481519 777934 1463816 521285 -265253 -282192 -993258 690354
2437 690354 124985 -643491 116733 454589 441946 -905306 -744811 -429304 1109297 619395
2427 619395 478105 -1039382 -620160 237753 932910 1066459 1410269 1200773 397426 1092277
2417 1092277 -1127393 354898 603102 514118 255122 131697 421852 -1309754 -31123
2408 -31123 -109067 1039788 1019658 286926 -931582 1059793 1194993 1112829 1436514 536583
2398 536583 820842 -566399 -241161 -482909 1335363 221926 -606095 469789 -1089369
2389 -1089369 -337554 1093937 1298069 -889082 -19628 -1358603 -1200583 425898 1421155
2380 1421155 2091496 1302499 419093 827040 967526 854365 3129360 2848314 1671444
2371 1671444 1323130 1485507 673194 -289318 562857 -331763 610917 659914 122668 620176
2361 620176 44255 375080 243742 -540166 107970 1284113 1460537 1868275 1225862 -63581
2351 -63581 -358935 -1443652 -725730 1521088 1768549 372485 155014 -333730 -442611
2342 -442611 43373 -245030 -616055 189891 353416 -764666 -1018880 -454803 2200076
2333 2200076 557544 -15424 582240 292486 -584034 1209313 968504 1769232 2509222
2324 2509222 -951599 -429040 134016 1004682 612719 800687 1116254 685127 296842
2315 296842 -1023003 1412453 573912 -1519123 -406447 1210336 473499 459071 -413214
2306 -413214 1669606 1034767 -161870 780444 145294 728429 1433743 434819 -529129
2297 -529129 1035089 258580 404832 1367425 385753 1437682 1419689 690360 890356 1814597
2287 1814597 348539 -1136058 506870 1181865 1086529 1874138 1131217 158708 681446
2278 681446 846026 -235670 114353 856410 657111 663361 869471 608375 466216 2146209
2268 2146209 388887 1065019 533781 -1135805 180876 473486 1342312 2803665 1665780
2259 1665780 529592 1564584 1302739 465429 2608925 3024663 549038 2179 1699236
2250 1699236 1496829 842175 137322 318320 3252372 3600081 1093620 2263756 2620207
2241 2620207 1470061 2493335 2693083 1796005 3248001 2527495 1861876 2917207 3065058
2232 3065058 2458820 1822174 2070044 2773411 3121739 1724540 1111613 1397865 2066516
2223 2066516 2191925 2816142 3326768 2555784 3177684 4000779 2785252 2397143 3039138
2214 3039138 3343459 3156963 3642889 4260137 4326972 4159945 4258532 4989529 5352309 3663403
2204 3663403 3573103 3731745 3295097 5394742 6432525 3501075 4177294 4406568 3298438
2195 3298438 5250898 5050835 4806945 5682925 5686075 6304897 6587454 6054787 5942413 6814323
2185 6814323 6413314 6035500 7068946 6320815 6435264 7726924 7391462 7108874 7795442
2176 7795442 6858606 8020187 7890930 9072209 9470672 7727517 9286954 10118624 9649606
2167 9649606 9306748 10306579 11203668 12180772 12084685 9895807 11475732 12416077 12911206
2158 12911206 13339151 14319496 14846586 14822062 14924323 13972742 15271331 17017592 17407377
2149 17407377 17711218 18331284 18564916 20109938 20519696 21606534 23211276 23471655 25876524
2140 25876524 26086056 27150095 29023190 29480911 30591267 31470190 32715287 33664727 36949266
2131 36949266 38104037 39888968 41966200 43932820 46621452 50164668 54150052 56677959
2123 56677959 60271234 62902583 66541260 71762525 76442712 82679136 88687080 94684463
2115 94684463 104044073 115151588 126349418 139448418 152233803 162692624 171073792
2108 171073792 177649950 184127029 186956814 186673084 182206863 174589006 162701993 149945735
2100 149945735 137413821 123737555 113435962 105850457 96045303 87184393 81642011 76851887
2092 76851887 72816926 68134958 63081998 58875200 55414234 51707972 49189017 47584877
2084 47584877 46814587 42522467 39142017 38651587 37499057 36799845 34306590 34104541 33150015
2075 33150015 29636198 28854971 28339317 27710206 27061839 26192538 26228458 25484256 23516726
2066 23516726 22829920 21032987 21427086 21486746 19362199 18325847 17879418 17833352 19222511
2057 19222511 17733332 17411990 16929227 16364761 15787310 14957851 16158266 15713947 13974441
2048 13974441 13310311 15277167 14660924 14031295 13420686 13898721 13239973 11631770 12929476
2039 12929476 10965675 10825692 11289838 10578012 10175851 9389933 8933011 9555584 9921555
2030 9921555 9879467 9641767 8753242 8548929 8367548 7987042 8577442 9129650 8656601 7516360
2020 7516360 6505470 6166487 5987450 6090150 6243390 7049631 6859820 7345544 7249615 7228008
2010 7228008 4374213 4898249 7630932 4688192 5254392 5768295 5392406 5657362 6050463
2001 6050463 6008400 5112277 5086737 5375222 5340050 3667395 4534642 5086125 6181987 5002829
1991 5002829 4240311 3507442 3843004 4105742 4202073 5041562 3162508 3887205 3412065 4887986
1981 4887986 3828236 3625652 4502068 2165168 2080623 3009587 3694799 3699312 3841762 3343020
1971 3343020 3120810 2829945 3544477 2595235 2936290 4215369 3394172 3207713 2095861
1962 2095861 2901414 3107330 3021086 4386561 4113766 2096260 1046096 2373204 2661936
1953 2661936 3375406 4336966 2492844 401505 1475990 2677529 2194078 1510906 3753703
1944 3753703 2535792 2051352 2960437 4109003 2440108 936448 2245325 2659098 3245702
1935 3245702 3252738 2893683 2430308 3147754 1401885 541421 789828 1976236 1646548 1572619
1925 1572619 2298497 363310 -278401 459608 2097605 1220722 2268681 3041723 1575483
1916 1575483 1189724 2553722 1597314 1456062 3224960 1803213 1644386 1353083 1082627
1907 1082627 449854 1017653 925074 1367130 1631025 981761 643515 603018 682357 1423664
1897 1423664 2719617 1509489 631634 571417 1064997 1597771 2511066 2273543 854023
1888 854023 1616932 2192989 1640321 991318 1601901 1642799 1138125 206515 2029627 2608790
1878 2608790 1019257 2359661 2430862 315212 275052 -148236 351095 2873425 3321906
1869 3321906 1053547 991594 593711 552496 2212737 2509946 1674963 1175504 136732
1860 136732 135401 1366542 273812 1082854 1562054 1333309 1921336 1027450 660624 1097070
1850 1097070 1422513 92694 547751 507612 1292358 2017792 1679926 2232831 1606293 -444623
1840 -444623 796029 2427838 2107217 2097897 1419098 903165 480793 1946079 -445064
1831 -445064 879009 1540136 -154355 -779938 409932 1581471 -580241 565925 1389726
1822 1389726 82261 -545755 1630974 1279571 1348821 875065 764664 -372400 57791
1813 57791 1195114 -762148 1711670 679360 335237 959610 -217275 1316866 1580355
1804 1580355 108184 392836 832 -645070 36244 1481722 -216144 -590313 240948
1795 240948 -1858602 -568816 1465827 192493 893622 674761 -803334 -506759 -319503
1786 -319503 743389 552848 519484 76284 476400 -323331 -990908 -203266 -270969 860256
1776 860256 832296 692401 -229100 -901855 -239286 264082 42079 71182 -293120 95583
1766 95583 1219485 139069 -206831 719619 1136019 -96582 147403 1380983 269636
1757 269636 442515 142290 -344199 638975 -969504 -25578 867482 614470 1017949 405769
1747 405769 -65228 329229 903482 -691755 -22864 1364996 699253 -1797250 -480724
1738 -480724 -605140 34069 617324 -214593 836327 1209539 529772 -429553 -206571 -237953
1728 -237953 -121002 -312068 -737392 -146081 714120 -181259 130330 1059506 -123843 467807
1718 467807 1260697 851895 -782686 489133 1291063 -114767 694455 -212544 -1411077
1709 -1411077 -765951 -94509 -181184 269553 375906 142448 -69203 640100 578946 1340845
1699 1340845 852800 -217385 -630817 966348 784023 806129 -46388 -508948 556470
1690 556470 -136285 -398319 -328699 1275059 551589 1061220 90037 1072602 1270677 457854
1680 457854 1380262 358858 1326514 364750 358743 278997 824687 137601 -322825 -556793
1670 -556793 1211352 1129634 -373593 896944 -598463 839785 2955 -707983 -876367
1661 -876367 457111 653976 -421815 822357 269073 -316024 152265 765175 -110476
1652 -110476 760603 538155 144316 -1014376 -822640 121372 -224201 429050 297953 1272076
1642 1272076 158428 -236406 -528693 -432557 597221 1666579 2438778 -83926 37174
1633 37174 855028 100655 -242727 -209150 -896482 -101994 344439 1055382 -218446 -435916
1623 -435916 -157601 -1911416 -1009848 38022 -157307 -759 -436522 -870786 113359
1614 113359 873267 -14349 -355897 12023 -496336 859643 264599 -371524 1517185
1605 1517185 -864640 -1692439 -199660 -1094659 -442979 535114 -950698 -1169341 923354
1596 923354 -540955 -2596699 170413 -35959 75401 980068 -613805 672593 248036
1587 248036 1158675 1821829 634570 -999842 -166410 304498 -60818 893612 517031
1578 517031 -583602 -793508 -1285118 -1646912 -1743995 251209 1754957 -267814 -151124
1569 -151124 327243 -56391 -695956 -620881 1642482 648166 -430134 -1467252 -1351847
1560 -1351847 -311030 -1186615 -1090819 -219171 -258484 431118 -523441 -1323215 469812 -1219143
1550 -1219143 -1398620 -495285 -880975 -65250 381404 1172893 -108987 279796 -458592
1541 -458592 -1141882 367069 118012 -155359 564739 -18545 -2634390 -771168 93737
1532 93737 27052 -443189 -637696 -1484823 -1345429 -1378402 -1455188 514815 791606 587909
1522 587909 -1224152 -620470 240577 317510 1490170 1508365 591726 -1027594 -808214 -314786
1512 -314786 575832 808330 656528 -232574 -1383809 -2507457 -1614404 -1339138 -134663
1503 -134663 -567017 -2540622 -814803 559324 651120 314095 359871 449001 -852455 -1013694
1493 -1013694 519618 1418717 1845390 -1225925 -1205192 21101 -951146 -404389 -96677
1484 -96677 693953 392127 -427184 -258974 -1163352 390562 327987 650256 1265636 -66991
1474 -66991 -191146 660684 926040 183035 -93702 -758376 21293 -530137 -1959513 166513
1464 166513 377481 -2456218 -1570888 -330854 -743060 1852874 559867 -488790 -172509
1455 -172509 -321456 -242710 261717 908550 645945 2075394 1470054 144994 942749 446165
1445 446165 -557164 -260718 -560097 -1116154 -264860 322576 -474148 -749052 -2244 -184310
1435 -184310 -1545144 821230 63147 -302284 -1206772 -1245305 -1077484 -661058 978033
1426 978033 -295048 -92337 -909534 -1244444 -1691058 569307 445293 182005 -707951
1417 -707951 -2137395 -1252087 -829872 829680 -682032 -704465 -424924 -417922 339784 847222
1407 847222 230626 -880923 -1746925 -791907 1345072 1292203 192100 -588117 -420523
1398 -420523 -1299071 -1609403 -270190 -109267 -633963 -231537 -622902 -278645 -190872 -477508
1388 -477508 -1558591 -340518 977178 -1306100 -306272 -363696 618198 -1241697 -1563794
1379 -1563794 991184 1114851 352922 -881289 -260719 662672 -743322 -1872555 -1532120
1370 -1532120 -316181 1219225 99621 -1002426 -781489 205527 -374293 -1877924 47147
1361 47147 -69542 -619744 786566 591164 -203186 -112390 -572913 -1217957 370685 -66879
1351 -66879 465085 617148 -114503 -526798 547755 -2113524 -1769962 -538223 -1035206
1342 -1035206 -1937490 -1919298 219699 -1498455 -1617104 -62665 679024 3899 192931
1333 192931 -169937 1139171 1203725 624170 1025845 783741 -290265 -2096726 -55515
1324 -55515 -268432 -747940 -1101664 -809000 -703273 -757760 -2916627 -2440751 -551374 -58048
1314 -58048 437621 -515175 -397630 -1024885 -523439 -670222 -1250343 -769222 621781 409847
1304 409847 -196722 -209392 28141 704840 -212827 -222718 -742135 -1396538 74790 38018
1294 38018 -711696 -1255179 -361390 98472 84770 -213236 641491 334936 -1558089 -1737727
1284 -1737727 -272093 -438874 -913953 -4768 158268 -947841 -2304903 -931488 725238
1275 725238 799276 -996561 -1367079 -997227 -1086246 -430362 -118483 568143 -1035505 -1529288
1265 -1529288 -116921 -835029 -263827 -543123 -1896670 -130523 1185587 845577 -1160999
1256 -1160999 108775 894658 -611090 -1732288 -740228 332911 -275268 -145525 -771331
1247 -771331 -348101 -1703829 -663671 -107975 512893 -105146 -1684972 -611337 -1318806
1238 -1318806 -1403481 -1113010 1434178 -203513 -111909 -2259995 -2345136 558753 218967
1229 218967 -1075917 -1284757 -1116003 -2215656 -551449 284276 1161091 -465280 -1230206
1220 -1230206 -2123430 53192 415661 -740323 686044 -493808 -1036735 -1302638 -1741014
1211 -1741014 -1569536 153079 -306548 -1813996 -888364 306655 -21030 -2310940 -933860
1202 -933860 -309604 -912255 -26831 -522185 -293245 -329749 -502394 37584 113855 -350084
1192 -350084 38046 124125 -696806 788706 137561 75650 -1631209 -74200 -575073 -2668764
1182 -2668764 105139 -1227873 -1640016 -532361 -1710040 -2354749 525885 845896 251288
1173 251288 -191962 357027 -54314 -566053 259221 -970517 336206 -499734 -1286298
1164 -1286298 -919943 -345130 330372 791299 408134 -916127 -1239696 -2645139 -1815994
1155 -1815994 -530811 550885 -886888 -1786958 -675440 181404 -402131 -186260 1826743
1146 1826743 1013025 -227070 -728385 -414654 -524942 447914 -180550 -1070409 -910376
1137 -910376 -915841 -654189 -554378 -646133 271284 -732804 -1394100 -457658 -833661 159719
1127 159719 -262143 -1014029 -192114 374323 -2451617 -1489271 2184580 1867669 -902551
1118 -902551 -732641 -1400340 -1527347 709870 -310398 -568517 -673655 -463264 -992880
1109 -992880 -1158970 -664516 354788 98768 -1482012 -1331367 -354207 1247426 -177670
1100 -177670 788091 968704 -975600 -1022393 68212 -463791 623319 614161 -165747 615211
1090 615211 -398482 -1351740 -1911197 1054555 743692 -212654 -2405396 -1834317 725406
1081 725406 -739487 -527522 462402 -1005661 -1971679 166474 -57774 503904 774264
1072 774264 776188 -2159791 -436067 1102904 -875342 135222 -247770 944281 -427140
1063 -427140 -1628753 -1393670 1239817 597613 -586043 912057 -173373 -1021017 -410413
1054 -410413 721135 -405663 292386 392105 -942604 -920854 440779 233061 203578 -479763
1044 -479763 -1203050 234082 -1189673 18958 672275 -442564 -222520 -499522 -96277
1035 -96277 -26866 528564 -41528 -1664890 -52338 1092735 -797787 -54912 687825
1026 687825 378095 785131 37349 72658 1033698 478022 -388823 16344 -1039918 668732
1016 668732 2048908 115269 -411858 -769250 -671084 -98682 480613 -405962 -1079820 -341203
1006 -341203 -812393 -854732 -1594918 -719379 1399666 1333394 -503587 -764407 -859567 -1314156
996 -1314156 626434 503306 -464141 676418 -44833 -491305 338103 157775 307784
987 307784 97223 -247318 -133840 -344448 -269975 311635 457909 -275326 -631351 -534398
977 -534398 -218887 -666812 -946253 -1641961 -2551749 -288692 148268 -956104 206520
968 206520 352414 -850681 -265968 598688 -190538 -1009786 -219309 1314921 511339 1117039
958 1117039 826954 180958 -910909 -1021397 818727 1563036 1171285 518780 -210386
949 -210386 -714494 620940 958285 75053 -1734990 -683946 75994 -721988 491612
940 491612 893097 426663 51710 412197 137484 -507699 -780288 415014 841502 -987731
930 -987731 -1036979 -1679369 -2014865 -901978 -1317531 -171084 16288 -1812440 -2087006 -661425
920 -661425 52117 -1153204 -1257212 -1236869 -1049511 -1046123 121484 -113022 357360 -391659
910 -391659 -1318381 -378674 -354924 -1047427 -381719 843185 -490945 -228210 381371 158672
900 158672 -591946 -18274 1194998 -639762 -834200 489438 -532718 468999 866913
891 866913 166651 -218697 -922640 -1192495 -1006065 1780064 1229313 -421820 617495
882 617495 -344714 -943875 797493 8734 -436292 274167 -271983 -316933 -514001 -576093
872 -576093 98069 146670 -100946 30306 322020 -1916872 -293596 1064541 1163637 594370
862 594370 -291913 72707 -1441131 73882 159077 -1035341 -1204530 -1100264 -1259334 -95958
852 -95958 746014 -66670 380188 304632 -776985 -1135992 -508319 -1155995 702823 1845513
842 1845513 -219791 365997 -488288 -31 1245599 1978113 988839 826022 636973
833 636973 -391380 -1047333 -169754 1047206 4895 -462281 -1187859 252503 -85378
824 -85378 -382133 -299426 -269042 -824020 -550752 1111273 -1564420 -1282449 813381 499679
814 499679 -111810 12307 -368123 466650 972907 -808784 -808816 -1038999 -716313 25302
804 25302 63443 -610498 220597 -474658 -1886134 284880 1169125 247407 1124214 27544
794 27544 -499089 51847 327810 585426 878782 645295 -7013 -348741 9277 210008
784 210008 -1137359 -158028 438227 1005171 238493 612262 307559 -37071 63920 -524762
774 -524762 -159559 -357407 -216931 188088 484218 266194 123134 -919070 -634535 -190655
764 -190655 -839433 -854143 -412636 744440 -1376318 -1196286 -440321 -1271267 -742616 169777
754 169777 242637 412025 271828 -525592 -1293209 324230 1591747 827525 -242642 -1572336
744 -1572336 -831660 -335677 -259673 476319 589959 695126 185455 -1100949 -580818 192533
734 192533 -9959 -13544 -2264394 -780522 299980 -678194 148613 -81403 -605404 -441357
724 -441357 368988 -1269485 -1016487 -193338 -1044426 -837009 -621464 -1417994 -605971 1074832
714 1074832 267997 309390 910450 831636 -474990 1113153 1079812 -26683 -102536 -763782
704 -763782 -790971 26772 624882 1059429 862872 -423443 152944 -682954 -283340 -224860
694 -224860 809898 163368 250294 539556 112972 78896 520568 392031 627891 -406533
684 -406533 -250454 -858992 714839 844824 -122359 -301140 -365508 -236238 -515243 -299537
674 -299537 -541351 -6856 166119 764873 -429139 -161970 234954 1056365 376669 -1084475
664 -1084475 -415998 -1163051 590424 1300314 -834497 31762 -20528 -839804 -20497 -416351
654 -416351 887758 538224 -1059338 -1066231 -261781 -460714 -136317 -1135558 -268794 334068
644 334068 951382 1018482 -90058 -186857 -810655 812051 96212 707456 -437398 -916142
634 -916142 -13507 590970 -288153 -7498 786866 -169157 -341586 898866 1690761 932278
624 932278 10429 201606 1914714 1656716 -696158 464461 -149278 984321 -116706
615 -116706 -281482 266763 -506344 290801 -1335201 127689 609680 278680 850516 836292
605 836292 1414098 852458 315975 860670 1038209 956873 1296630 -852519 1027779 1286576
595 1286576 308909 -300848 -1571905 317254 317177 -53371 -374803 457527 123843 -476114
585 -476114 -374319 -237894 829244 762463 -847461 383996 -311798 -11573 -31348 557658
575 557658 832679 -703797 222514 -89332 291331 241643 -529261 268103 863299 1018730
565 1018730 -812421 -1034580 1420746 1434720 12280 -116390 461359 1217594 -350094
556 -350094 -727541 129195 336253 -395973 -1033504 -423194 -133449 336259 -1392185 -1101275
546 -1101275 -192291 -298118 817423 644580 -107786 558688 407599 -423058 543794 641934
536 641934 600554 66295 -84333 256300 186659 640028 -379791 -388854 604190 462408
526 462408 235405 -137376 127579 -640553 -956268 158292 173348 105245 -339616 -412845
516 -412845 130252 1472993 -18503 -392931 -293778 653755 349512 -33226 755029 1372426
506 1372426 850577 -2585959 -1033399 -353459 -861334 778057 1105850 789474 693088
497 693088 1012819 182297 1298962 168548 780632 677046 -698730 -301357 115279
488 115279 1464563 1371939 1307005 116726 -152372 338389 709836 958413 236634 1800448
478 1800448 932369 -917300 -1874493 -824305 -514813 -335473 934085 -445123 -642322
469 -642322 -836762 -20623 -234717 737466 -79617 -136764 101218 -297327 142783 287753
459 287753 130107 1077214 1019940 -1185295 -568306 557473 1312116 762670 1230334 783370
449 783370 -1532573 -498158 -258270 -1662502 -288329 1061538 200677 -474489 -727011
440 -727011 995869 84039 267666 609166 310018 -125852 1219708 2399209 1308932
431 1308932 345724 1376656 1054000 82720 628320 1005149 1485174 1025004 572341 244529
421 244529 35595 365985 1403836 1278899 795732 1117466 -1116267 -1448663 -636122 1800669
411 1800669 590983 -824777 -226245 463370 866448 867076 1253438 -1124339 -268421 -610693
401 -610693 -468948 -727574 254299 1190833 632841 -316392 -1027555 -703199 -877971 548113
391 548113 855424 -111137 297960 669029 -884392 -1159646 1481586 967194 -70795
382 -70795 -134735 -435499 26025 178856 220414 402371 -1034339 -1389215 49376 2539746
372 2539746 685679 147274 421957 1537796 823067 753790 -312174 -77087 1421825
363 1421825 -898675 -267443 -1009299 -1015316 -1520636 -625378 346931 228147 -239569 -194255
353 -194255 1412767 516739 330670 260641 1198040 -215761 437544 427524 -295424 1460989
343 1460989 272871 350946 829813 967073 -394519 -432634 -746289 283162 44750 -2045240
333 -2045240 -910701 -250026 259959 -34647 1308352 458613 -1936853 143629 1995317
324 1995317 859268 -178385 520224 -592570 -72155 -178778 759819 -262132 -759735
315 -759735 472310 -1537460 450596 1081962 471590 708516 923682 1393266 54184
306 54184 -906085 667088 1939280 2297342 2395322 5021 -591269 -893574 771198 102753
296 102753 -874998 1310957 12164 -905155 156140 1566855 721482 634044 -355743
287 -355743 -77181 1047710 -628982 -716303 828811 -486933 -277018 572189 -40479
278 -40479 166712 579180 596599 -122701 875256 -63169 -1384724 -883465 417015 1503860
268 1503860 261742 -1712935 -567293 180934 -299154 -1070743 -646534 758038 361434
259 361434 832648 1494758 137444 -96433 887000 1677206 722024 927225 -610849 -1517674
249 -1517674 377370 -480738 554593 1284326 -791037 -1268998 -1013258 -634509 691819
240 691819 544793 -447186 -1051269 -262091 247611 512036 1303245 444378 794761 831996
230 831996 -41012 -267755 307626 1249667 1230359 -365155 -1617404 -496774 -188966 980510
220 980510 1788035 351043 -299686 -1351388 -789555 1296396 2553669 2813625 937105
211 937105 -1015406 -572057 -7663 1400632 1202750 759419 508161 -534298 -165991
202 -165991 -332901 634783 859915 481677 874252 -390933 -674650 1423191 1334871 860673
192 860673 1494433 -67895 -682990 -283738 326514 1407509 1684144 1251991 -222464
183 -222464 -1450552 -383077 1434471 694592 -1035280 -79539 -81240 -877831 -234671 1400905
173 1400905 1595381 577272 -61144 -1055878 489563 1143955 1347421 1484198 1160960
164 1160960 819549 -350411 -501355 16521 1619705 877262 -23844 583512 263342
155 263342 534896 460803 501348 1306158 1818155 253352 894643 345555 -134398 184933
145 184933 -162969 680062 406570 26386 -528429 26585 592946 560980 -602069 97626
135 97626 556619 -552795 812061 868891 566713 -216000 574983 383906 88939 367990
125 367990 623684 1780476 619024 -504145 258568 414701 -751583 576936 1047885
116 1047885 31064 -788446 -949208 -753775 -504193 112411 -164819 651303 23421 569354
106 569354 360822 633128 752998 110107 280116 957246 812694 775386 1245409 -676158
96 -676158 984301 858441 -180593 51590 123968 -489514 -434600 102868 -489252 891816
86 891816 715475 55824 -540601 735272 1138666 -160861 -164949 504242 1265046 1613462
76 1613462 1131151 1338186 1119583 705873 1417717 1342358 1079013 -563847 -686836 -385411
66 -385411 -802859 469077 1419223 80482 580414 1282191 225393 16544 709585 231476
56 231476 239918 991786 1025293 827975 47607 -8768 467578 153367 -420265 -83224 121231
45 121231 753873 1872938 349035 -84040 715750 698333 199240 469801 540567 743189
35 743189 -57134 138057 1738300 2158945 814007 -55918 311000 -69910 1388476 1443308
25 1443308 -257994 -193960 567678 547826 1111320 839889 674780 1026424 688071 -2388
15 -2388 72893 692334 534834 290715 276791 838513 32452 -90958 -443038 756511 1181364
4 1181364 195459 281906 -49166 1018046
0 1018046
$$ Imaginary data points
##PAGE= N=2
##DATA TABLE= (X++(I..I)), XYDATA
16383 -3780573 -4511099 -4532974 -2927939 -2322738 -2826407 -2843366 -2948952 -3584084 -3201208 -3798044
16373 -3798044 -3017964 -2381039 -2971809 -2304560 -1786253 -2668899 -3633053 -2933048 -2714632
16364 -2714632 -2587133 -2741583 -3482201 -2671242 -1491979 -1523360 -1893510 -1717105 -2507704
16355 -2507704 -2614533 -1399768 -1493804 -1458884 -2587779 -2938179 -2524951 -2126102 -1634645
16346 -1634645 -976488 -1493319 -1928462 -1009792 -1216914 -1641229 -1093204 -792503 -2747092
16337 -2747092 -1343838 474399 -1197429 -1028663 -670235 -1021850 -1568890 -1136995 -1710793
16328 -1710793 -1670486 336461 -383871 -650579 99689 -678355 -238232 658530 -376936
16319 -376936 -387089 142194 358991 -463583 -637 401090 -683639 80892 -253325 -412344
16309 -412344 1657562 1949479 -369576 -463416 981320 -27912 672195 1440724 -80858
16300 -80858 665521 518096 -531988 297208 1794292 964660 617264 267213 1138125
16291 1138125 1829789 1455672 1689373 1977759 2054908 976909 1484538 1080663 2435731
16282 2435731 2287915 1598226 2444462 1190238 230711 1246824 2429923 2294875 2079212
16273 2079212 1549044 2294330 1725736 1589334 1292574 1433425 1256257 1837590 2037203
16264 2037203 991331 2115057 2166609 1330253 2383879 2862918 1934695 2036433 2831320
16255 2831320 2801159 3109008 2807280 3142207 2435469 2206125 1957388 1634179 3281624
16246 3281624 3048066 2442595 946538 2170092 3332643 3681827 2950198 2828556 2312586
16237 2312586 1998506 2321932 3501085 3979706 2367231 3056716 2180849 2697054 3084963
16228 3084963 2536432 3794186 4629843 3891527 1984747 3482424 4349171 4375938 3496369
16219 3496369 3620189 3606254 2927886 2333594 2514373 4252527 3626942 3843906 3758754 3922384
16209 3922384 4203485 3712116 3564077 3501932 5107942 3573200 3247921 3212795 4235965
16200 4235965 4779065 3959519 3008270 2500306 4110431 3113866 4124288 5330076 4220868
16191 4220868 2812625 3710034 3305749 3432432 4962116 5170091 3905438 3665549 3189083
16182 3189083 1087111 3902157 4679260 2179198 4222943 5082993 4369013 5131922 4330698
16173 4330698 3806958 4335419 5070224 4985550 6127323 4781916 3745385 4738177 4107133
16164 4107133 3548102 4841024 4799645 4079484 5083209 4296582 4250206 4873727 4210522
16155 4210522 5154566 6205382 3949689 3239168 4314949 4790375 4476542 4579614 5146851
16146 5146851 4898164 4276315 4495393 4466292 4007976 3302264 4737934 4967453 3523307
16137 3523307 4320236 5480884 3816126 2880480 4838401 4895376 5614384 5867929 4227587
16128 4227587 4162413 6007783 4725726 2555145 5565635 6593454 4539061 4570877 4881801
16119 4881801 4769632 5009939 4571985 3631857 4224846 4820219 4965631 5440517 4900812
16110 4900812 4852857 5217417 5096162 4516020 5200876 6549513 6138884 4870106 4088198
16101 4088198 4521072 4679483 4462706 4685880 5876913 5698916 4859309 5156205 4337585
16092 4337585 5139733 6061276 5245593 4971908 5222175 4686699 4932182 3959689 4079901
16083 4079901 4985800 3946466 3655981 4858543 5089463 3782711 3866950 4940008 6216909
16074 6216909 4954072 4902638 5536354 5656781 5672039 4328975 5558948 5438221 5637591
16065 5637591 4890758 4423178 4914500 5121079 4621106 4948636 6587899 6241165 6228205
16056 6228205 5241754 5030556 4772353 5093822 5833036 5481457 5711314 4717509 4155986
16047 4155986 4788010 4719537 5537798 6703693 4836923 4650816 5765535 4526141 4003872
16038 4003872 4285535 6110399 5188036 3703599 4396319 4449212 5437091 5202802 5366942
16029 5366942 4237081 4946228 4436985 4619828 6511063 6132948 6927593 4878174 4043480
16020 4043480 3988779 4420482 5564808 6205334 5176125 4864276 4989135 5014639 5577818
16011 5577818 4635200 5769177 5890315 5129982 3802239 3828160 5785105 4903386 5074650
16002 5074650 4407033 3825945 4905195 4801922 5201690 5856354 6635509 4984216 2710206
15993 2710206 3933983 5027289 6106159 5522547 5475877 5752245 4852741 3917617 4327265
15984 4327265 4718365 5744662 6910800 6430136 4675831 3346287 4850664 4739911 5687614
15975 5687614 4756693 4590652 5738321 5673350 5978122 4807084 6240175 4798971 4611871
15966 4611871 4241986 3756363 5419204 5098990 3748831 5526438 4597924 3498509 6082030
15957 6082030 5668494 5525673 5145407 6110079 4454491 4684447 5274544 5498751 6529269
15948 6529269 4739294 4990037 4234467 5201924 5081922 4944933 5349886 5450330 5552047
15939 5552047 4833243 4634266 5314982 5025097 4357473 4895951 5086257 6760470 4897086
15930 4897086 3684770 5239774 4914111 7309878 4813857 3140160 3933369 5039305
15922 5039305 5024396 3933557 5200092 4058341 4497072 3357838 4372168 5209611 6176227
15913 6176227 5264423 3961137 5510810 6083988 6322838 6424731 5692684 4128449 5783789
15904 5783789 6329133 4441972 4972966 5606968 6827228 6002680 5482902 4340807 5240405
15895 5240405 6025175 5265241 6425628 5719610 5213115 4518766 3777759 4098914 4280007
15886 4280007 4691965 5463788 4828080 5026894 6038303 4365117 4293586 4550965 5013530
15877 5013530 4760213 5213911 4749060 5164384 5632133 5534741 6489552 4915280 4743120
15868 4743120 5141019 5935588 5086858 4214753 5646547 5641500 4365425 4304042 5418302
15859 5418302 5656008 5659948 5188999 4864676 4882722 5158677 4565523 4466482 5504734 4716590
15849 4716590 5235346 4560849 4116438 5468100 4843687 4054113 3788553 4310238 4869526
15840 4869526 5692234 5274185 4758185 4970189 5228835 5266426 4011675 5058885 5540845
15831 5540845 4355049 3220241 4182955 5816814 5676027 4119891 4922627 5987700 4723821
15822 4723821 5214296 4385668 5326580 6068609 4966221 4635053 4052703 5887610 5998667
15813 5998667 5411570 6189309 5879320 4510888 5965152 5705268 6028789 6311048 5087861
15804 5087861 4251104 4869703 5631892 6342621 6909722 6446285 4921459 4378532 5982684
15795 5982684 6661883 6947305 4861422 5433781 4915327 5214333 5814164 5463645 4557034
15786 4557034 4288389 5442890 3412090 4957763 5916066 6412410 6112467 5474074 4571575
15777 4571575 3757811 4297174 5286800 6858451 5742427 5019193 3752582 3664776 4003411
15768 4003411 6331205 7009239 5323385 5014740 4946989 5775005 4912418 6337187 6866920
15759 6866920 5854154 5129550 5145031 5144263 5762962 4404618 4559667 5427802 5040460 4596052
15749 4596052 5248898 5005854 4449234 6226329 5747649 4457449 3722974 5106247 5183227
15740 5183227 5594507 4647484 5878524 6545789 4938506 5205454 4515697 4053375 4932391
15731 4932391 5933979 3993278 5382724 5291937 3634156 4554967 4908171 4415600 5042657
15722 5042657 7810264 5310367 4726949 5193210 5269357 5273421 5649131 4513046 5507173
15713 5507173 5783668 3553438 4903704 5787854 5300199 5199085 5606149 4306081 4639138
15704 4639138 5512687 5848714 6123969 4827767 4973979 5082687 5029667 6164648 6403703
15695 6403703 5849838 5483685 5713622 5176882 4532983 5244203 5360173 5316517 4350990 5004088
15685 5004088 6328105 5918695 5189408 4910844 6189179 5535652 4782078 3906425 5426061
15676 5426061 4867224 5561254 6273869 6090822 5952095 5023361 5423864 5469899 7167754
15667 7167754 5557639 4573807 4608813 5656371 5418080 5202972 5074542 5829114 4661173
15658 4661173 3719371 5449428 5576964 7357077 5717689 3104235 4009217 6031552 5401966
15649 5401966 5382897 4975953 5274476 6501541 5543608 3217143 5159136 6821977 5199908
15640 5199908 5134419 6317843 4732678 3767831 6358230 6448971 5637450 5183547 5286736
15631 5286736 5308441 5852493 5246382 4882837 6327613 6587646 4415954 3887036 5130314
15622 5130314 5491597 5619958 4107043 4376118 5490331 5103336 4802608 6522644 6200487
15613 6200487 5659445 7018553 4601036 5827402 5661291 5281591 4811023 5066779 5455139
15604 5455139 4456049 5554439 5016255 4654245 6056091 5245374 4323959 5453140 4675237
15595 4675237 6177268 5671141 5551150 5522865 4801941 4802927 4700480 4638495 4287818 5768210
15585 5768210 5278906 4823190 4851877 5256432 5508191 4321108 4660622 5425332 5248051
15576 5248051 6125937 7073730 4226576 3284145 3859417 5531507 6219222 5172562 5274604
15567 5274604 4349067 4283768 4174378 5673910 6110129 4899059 4810905 5192816 4464647
15558 4464647 5903241 5890017 6212908 6206104 4573621 4573695 2918380 5310510 5409835 6166712
15548 6166712 5719873 6044448 5379872 5029871 7316525 5895380 6903087 6060834 5462152
15539 5462152 4861276 5426532 5802834 6607710 6200458 4771644 5472671 6408990 6962290
15530 6962290 5360900 5664402 5332520 5022918 4688583 3815146 5077008 5227408 5576710
15521 5576710 6207999 4971649 4851621 4312582 5253369 5620480 5129833 5739565 6009273
15512 6009273 5734095 5164624 4820806 5447753 6434037 6240952 4965630 5024992 5266064
15503 5266064 4837580 5883580 4960960 5678396 6692482 6188144 4954927 5881624 6874884
15494 6874884 5294559 4962897 5154635 5399236 6013486 4793454 5112060 7111019 6616375
15485 6616375 5345057 6063154 5357203 4749956 5989204 7060020 5443156 5614122 5459466
15476 5459466 5545580 6117683 5991863 5904557 6347286 5368398 4331083 5913249 5724561
15467 5724561 6713507 6327925 5789081 4076669 5872599 5766661 5991455 6893945 5822628
15458 5822628 5944176 6848291 6783143 4861622 5927846 6535030 6397975 5069073 5079653
15449 5079653 6402696 6615181 4966733 5398203 5728955 4302397 5967174 4733578 4754680
15440 4754680 4437923 5076304 4691055 3172584 4502584 4786312 3946313 5806371 5380099
15431 5380099 3856727 4608689 3998621 4562929 5006783 5814341 5152307 4622518 6643911
15422 6643911 6686549 5979265 5015374 4486524 6211130 6195812 5645198 5555842 5573012 6278841
15412 6278841 6324505 5271325 5197872 6403411 4777284 3856816 5411671 4528298 5561369
15403 5561369 5555977 4498032 5346146 5437865 4517033 4180953 5543897 5371215 4946776 6881964
15393 6881964 5487612 4116533 4769265 6360734 6085745 4806338 5315625 5979702 5687651
15384 5687651 4631935 3860816 4840911 6545334 5621716 5064812 4251656 4951257 6365150
15375 6365150 5434780 3644661 4736581 6054616 2890767 4747696 5699456 4600471
15367 4600471 5379635 5532807 4571394 4285504 4395655 5566227 5370017 4386662 4787086
15358 4787086 5457855 3863150 4395864 5943031 5023399 5504449 6582894 3848460 2361789
15349 2361789 4875397 4834437 5862423 5695993 5879821 4104244 4609428 5608808 5971104
15340 5971104 5555648 4909592 4745274 4329374 5876849 5221544 6188238 5447816 4750628
15331 4750628 5114089 4004840 3838549 5099396 6836791 4477844 3753806 5317259 5883835
15322 5883835 4311682 5801873 6260906 5479726 5216984 4983934 5873371 4868325 5998463
15313 5998463 6350349 5305327 3384762 4946366 5798794 5174773 6413627 4155790 3581921
15304 3581921 5316838 5289483 4659282 6309786 6206594 4864474 3873924 5421013 6138870
15295 6138870 5373435 4516555 4292714 5655122 4342546 5319902 5487987 4325014 6142544
15286 6142544 5536639 5153827 6015972 5131899 5533670 6277953 5877022 4989694 5040744 4887278
15276 4887278 5103026 6458462 4469190 4381649 5251024 4756119 5212495 5996337 5652834
15267 5652834 5087245 4066224 3875331 6346165 6809189 4710958 5168154 5455600 5385886
15258 5385886 5078149 4666162 5660731 6496445 4550778 5519163 5766259 4681721 6462036
15249 6462036 3894695 5376282 5217236 5628768 5175360 5674757 5764598 5157103 5042954
15240 5042954 5130587 5647116 5230930 6213579 6126259 5838748 5236815 3923409 5280092
15231 5280092 5694049 6644794 5193831 4775852 6536828 5037961 5544794 6212444 5409044
15222 5409044 4874332 6005218 5221506 6425657 5833388 5170031 5859200 4781380 6197793
15213 6197793 6633303 6387753 5333560 5619475 6669919 4831306 4911965 5975470 5959213
15204 5959213 6861977 5829369 3307381 4993001 5442900 5668359 5075643 4213111 3952024
15195 3952024 4176614 5555050 5780947 5726285 6429097 4855446 3773673 4622259 5043017
15186 5043017 5114932 5382509 5360176 4879598 5946540 5601538 5454851 6165980 5273894 5072133
15176 5072133 5269082 5582444 4697937 6439618 6502468 5056054 6207222 4959784 4445160
15167 4445160 5044830 5602798 6106338 6225992 4038944 4889711 5638774 6199723 7376696
15158 7376696 7237241 6678077 5616443 6372570 4723567 4936667 6206148 5108036 5380581
15149 5380581 5426014 5358273 5171605 5277458 6223099 5845950 4531834 4618922 5641582 5551178
15139 5551178 5403293 6490337 6405608 4533278 4229963 4247557 6127282 5972019 5666755
15130 5666755 7208088 5480912 5155879 6914642 6616582 5637224 6565376 6855973 6145580
15121 6145580 5181242 5666704 5658992 4697375 5644747 6150712 5653335 5771174 5732164 4776371
15111 4776371 4300755 6338222 6072178 5082037 6712412 5875636 5899274 6644468 5220977
15102 5220977 6130771 5909378 4816598 6135360 6124960 3610570 5612851 6456216 4817307
15093 4817307 5316957 5922992 5269316 5819027 5306148 6192025 7379813 6484840 5099022
15084 5099022 5378727 6497640 6518901 6734200 4855806 4485477 5794877 5357210 5507851
15075 5507851 7016114 6571799 6673681 4030472 5283399 7289434 5585394 4909038 5364055
15066 5364055 5613050 3910920 3644190 5617542 6844230 5806614 5469079 6431774 4638372
15057 4638372 3885311 6870100 5407413 4508959 4872589 3426724 4115830 5726308 5503037
15048 5503037 4615815 5869796 5987814 6467943 5637546 6490108 7819717 6478033 4733072
15039 4733072 6247417 6283877 4246101 5733525 5145784 6104428 6811076 5374477 4664313
15030 4664313 5108428 6121017 6055866 6563741 5381881 5836326 5081332 6892213 8527335
15021 8527335 6880665 4381896 5946473 6039145 5038212 6589601 6010134 6590531 6417308
15012 6417308 6062909 4887142 5772216 5288301 5719154 6399355 4366680 5185392 6042018
15003 6042018 5738478 5706442 5453879 5956258 5305371 5256764 6213377 5305922 5410161 6002020
$$ [...]
##END NTUPLES=NMR SPECTRUM
##END=
