##TITLE=1H_CA-9027-2
 DMSO
 8 sc, 
 30.06.2022
##JCAMPDX= 6.0         $$ Bruker NMR JCAMP-DX V2.0
##DATA TYPE= NMR SPECTRUM
##DATA CLASS= NTUPLES
##ORIGIN= UXNMR, Bruker Analytische Messtechnik GmbH
##OWNER= root
$$ XWIN-NMR		Version 3.5
$$ Thu Jun 30 14:40:53 2022 Russian Standard Time (UT+4h)  she@DPX200
##.OBSERVE FREQUENCY= 200.1313499994
##.OBSERVE NUCLEUS= ^1H
##.ACQUISITION MODE= SIMULTANEOUS
##.ACQUISITION SCHEME= undefined
##.AVERAGES= 8
##.DIGITISER RES= 18
##SPECTROMETER/DATA SYSTEM= spect
##.PULSE SEQUENCE= zg30
##.SOLVENT NAME= D2O
##.SHIFT REFERENCE= (INTERNAL, D2O, 0, 15.7579)
##AUDIT TRAIL= $$ (NUMBER, WHEN, WHO, WHERE, WHAT)
$$ ##TITLE= Audit trail, XWIN-NMR		Version 3.5
$$ ##JCAMPDX= 5.01
$$ ##ORIGIN= Bruker BioSpin GmbH
$$ ##OWNER= she
$$ F:/spectra/data/she/nmr/H-F/1/pdata/1/auditp.txt
$$ ##AUDIT TRAIL=  $$ (NUMBER, WHEN, WHO, WHERE, WHAT)
(   1,<2022-06-30 14:39:31.09 +0400>,<she>,<DPX200>,
      <created by zg, POWCHK disabled, PULCHK disabled
       configuration hash MD5:
       00 E9 B6 7A A2 85 ED C7 34 08 36 98 17 FE 4E 26
       data hash MD5: 16K
       5C 06 2D 80 C3 E6 EC F8 B6 78 3D 63 8C FF 8E C1>)
(   2,<2022-06-30 14:39:33.53 +0400>,<she>,<DPX200>,
      <Start of raw data processing
       efp BC_mod = 2 LB = 0.24 FT_mod = 6 PKNL = 1 PHC0 = -18198.21 PHC1 = 7.800686 SI = 16K 
       data hash MD5: 16K
       32 69 1C 0F 0F FE 9E E7 2C 70 88 55 C3 33 79 41>)
(   3,<2022-06-30 14:39:49.57 +0400>,<she>,<DPX200>,
      <pk PHC0 = 154.6566 PHC1 = 1.399999 
       data hash MD5: 16K
       C4 8F CD 78 07 7D A9 F9 11 76 B0 69 4B 1D 4C DD>)
(   4,<2022-06-30 14:39:52.93 +0400>,<she>,<DPX200>,
      <abs ABSG = 5 
       data hash MD5: 16K
       C8 C2 3D 78 4F 41 69 A8 F1 79 64 72 45 01 22 3F>)
(   5,<2022-06-30 14:40:24.75 +0400>,<she>,<DPX200>,
      <abs ABSG = 5 
       data hash MD5: 16K
       6A BC 95 B1 6F 97 6A D5 2D 8C 07 EC 73 2F A4 AF>)
$$ ##END=
$$ 
$$ hash MD5
$$ 44 BE 89 46 53 FE EC 65 21 23 28 6C 63 0C 96 E5
##$RELAX= 
##$RELAX= 
##$RELAX= 
##$RELAX= 
##$RELAX= 
##$RELAX= 
$$ Bruker specific parameters
$$ --------------------------
##$DU= <F:/spectra>
##$EXPNO= 1
##$NAME= <H-F>
##$PROCNO= 1
##$TYPE= <nmr>
##$USER= <she>
##$AMP= (0..31)
100 100 100 100 100 100 100 100 100 100 100 100 100 100 100 100 100 100 
100 100 100 100 100 100 100 100 100 100 100 100 100 100 
##$AQSEQ= 0
##$AQ_mod= 1
##$AUNM= <au_zg>
##$AUTOPOS= <>
##$BF1= 200.13
##$BF2= 200.13
##$BF3= 200.13
##$BF4= 200.13
##$BF5= 200.13
##$BF6= 200.13
##$BF7= 200.13
##$BF8= 200.13
##$BYTORDA= 1
##$CFDGTYP= 0
##$CFRGTYP= 5
##$CHEMSTR= <none>
##$CNST= (0..31)
1 1 145 1 1 1 1 1 1 1 1 1 1 1 1 1 1 1 1 1 1 1 1 1 1 1 1 1 1 1 1 1 
##$CPDPRG= <>
##$CPDPRG1= <>
##$CPDPRG2= <>
##$CPDPRG3= <>
##$CPDPRG4= <mlev>
##$CPDPRG5= <mlev>
##$CPDPRG6= <mlev>
##$CPDPRG7= <mlev>
##$CPDPRG8= <mlev>
##$CPDPRGB= <>
##$CPDPRGT= <>
##$D= (0..31)
0 1.2 0 0 0 0 0 0 0 0.06 0 0.03 0 0 0 0 0.0002 0 0 0 0 0 0 0 0 0 0 0 0 
0 0 0 
##$DATE= 1656585570
##$DBL= (0..7)
$$ [...]
##$SUBNAM2= <"">
##$SUBNAM3= <"">
##$SUBNAM4= <"">
##$SUBNAM5= <"">
##$SUBNAM6= <"">
##$SUBNAM7= <"">
##$SUBNAM8= <"">
##$SUBNAM9= <"">
##$SW= 18.0517283424941
##$SWIBOX= (0..15)
0 0 2 0 0 0 0 0 0 0 0 0 0 0 0 0 
##$SW_h= 3612.71676300578
##$TD= 16384
##$TD0= 1
##$TE= 0
##$TE2= 300
##$TE3= 300
##$TEG= 300
##$TL= (0..7)
0 120 120 120 120 120 120 120 
##$TP= (0..7)
150 150 150 150 150 150 150 150 
##$TP07= 0
##$TPNAME0= <>
##$TPNAME1= <>
##$TPNAME2= <>
##$TPNAME3= <>
##$TPNAME4= <>
##$TPNAME5= <>
##$TPNAME6= <>
##$TPNAME7= <>
##$TPOAL= (0..7)
0.5 0.5 0.5 0.5 0.5 0.5 0.5 0.5 
##$TPOFFS= (0..7)
0 0 0 0 0 0 0 0 
##$TUNHIN= 0
##$TUNHOUT= 0
##$TUNXOUT= 0
##$USERA1= <user>
##$USERA2= <user>
##$USERA3= <user>
##$USERA4= <user>
##$USERA5= <user>
##$V9= 5
##$VALIST= <valist>
##$VCLIST= <CCCCCCCCCCCCCCC>
##$VD= 0
##$VDLIST= <DDDDDDDDDDDDDDD>
##$VPLIST= <PPPPPPPPPPPPPPP>
##$VTLIST= <TTTTTTTTTTTTTTT>
##$WBST= 1024
##$WBSW= 4
##$XGAIN= (0..3)
0 0 0 0 
##$XL= 0
##$YL= 0
##$YMAX_a= 168028
##$YMIN_a= -281697
##$ZGOPTNS= <>
##$ZL1= 120
##$ZL2= 120
##$ZL3= 120
##$ZL4= 120
##$ABSF1= 15.75791
##$ABSF2= -2.29394
##$ABSG= 5
##$ABSL= 3
##$ALPHA= 0
##$AQORDER= 0
##$ASSFAC= 0
##$ASSFACI= 0
##$ASSFACX= 0
##$ASSWID= 0
##$AUNMP= <proc_1d>
##$AZFE= 0.1
##$AZFW= 0.1
##$BCFW= 0
##$BC_mod= 2
##$BYTORDP= 0
##$COROFFS= 0
##$CY= -3
##$DATMOD= 1
##$DC= 0
##$DFILT= <>
##$DTYPP= 0
##$F1P= 0
##$F2P= 0
##$FCOR= 1
##$FTSIZE= 16384
##$FT_mod= 6
##$GAMMA= 0
##$GB= 0
##$INTBC= 1
##$INTSCL= 0
##$ISEN= 128
##$LB= 0.24
##$LEV0= 0
##$LPBIN= 0
##$MAXI= 10000
##$MC2= 0
##$MEAN= 0
##$ME_mod= 0
##$MI= 1.114404
##$NCOEF= 0
##$NC_proc= -7
##$NLEV= 6
##$NOISF1= 3.799351
##$NOISF2= 2.8
##$NSP= 0
##$NTH_PI= 0
##$NZP= 0
##$OFFSET= 15.75791
##$PC= 1
##$PHC0= -18043.55
##$PHC1= 9.200685
##$PH_mod= 1
##$PKNL= yes
##$PPARMOD= 0
##$PSCAL= 0
##$PSIGN= 0
##$REVERSE= no
##$SF= 200.130002727924
##$SI= 16384
##$SIGF1= 3
##$SIGF2= 2
##$SINO= 5.538805
##$SIOLD= 16384
##$SREGLST= <1H.CDCl3>
##$SSB= 0
##$STSI= 16384
##$STSR= 0
##$SW_p= 3612.71676300578
##$SYMM= 0
##$S_DEV= 0
##$TDeff= 16384
##$TDoff= 0
##$TI= <>
##$TILT= no
##$TM1= 0
##$TM2= 0
##$TOPLEV= 0
##$USERP1= <user>
##$USERP2= <user>
##$USERP3= <user>
##$USERP4= <user>
##$USERP5= <user>
##$WDW= 1
##$XDIM= 16384
##$YMAX_p= 309592006
##$YMIN_p= -3383428
$$ End of Bruker specific parameters
$$ ---------------------------------
##NTUPLES= NMR SPECTRUM
##VAR_NAME=  FREQUENCY,     SPECTRUM/REAL,   SPECTRUM/IMAG
##SYMBOL=    X,             R,               I
##VAR_TYPE=  INDEPENDENT,   DEPENDENT,       DEPENDENT
##VAR_FORM=  AFFN,          ASDF,            ASDF
##VAR_DIM=   16384,         16384,           16384
##UNITS=     HZ,            ARBITRARY UNITS, ARBITRARY UNITS
##FACTOR=    0.220516191357247, 1,           1
##FIRST=     3153.63052621316, 0,            0
##LAST=      -459.086236792624, 0,           0
##MIN=       -459.086236792624, -3383428,    0
##MAX=       3153.63052621316, 309592006,    0
$$ Real data points
##PAGE= N=1
##DATA TABLE= (X++(R..R)), XYDATA
$$ [...]
9103 41055324 42506683 44117872 45544037 46935642 47588161 47262704 46347170 45643452 45008380
9094 45008380 44438273 44369840 44724357 45403610 45543156 45760534 46005398 46200300 46195686 46406537
9084 46406537 46854247 47685882 48456726 48801584 48270131 47141242 44801109 42083002 40140947
9075 40140947 38518705 37650015 36857556 36497857 36208700 36350993 36492512 36760306 37354999
9066 37354999 37816515 38022100 38177849 38879792 39438712 39857184 40222370 40467191 40140122
9057 40140122 39024618 36735483 34151309 31396801 28952946 26790176 24810842 23245316
9049 23245316 21875004 20702147 19813577 19325730 18592032 17743203 16971388 16113123 15420265
9040 15420265 15009171 14231733 13907678 13494101 12977610 12384285 11976533 11738664 11248207
9031 11248207 11018899 10630447 10394161 10082226 9813888 9655519 9249797 8892929 8470466
9022 8470466 8103742 7831967 7755311 7614102 7546274 7228297 7066468 6587890 6288149 5993212
9012 5993212 5996503 5981192 5726509 5466081 5851409 5809844 5427618 5241460 5121947 5068872
9002 5068872 4742711 5037188 5079108 5149292 4961553 4843483 4688141 4544176 4435839 4442997
8992 4442997 4425583 4542097 4390263 4353956 4470889 4582953 4573510 4250493 4403673 4410007 4357823
8981 4357823 4413128 4573363 4912445 4710502 4666641 4540619 4549113 4589456 4622400 4556387 4485647
8970 4485647 4077805 4101617 4231870 4072244 3883143 4029295 3899633 3894829 4140735 3937780
8960 3937780 3997509 4035257 4268518 4210522 4040493 4212395 4266638 4346159 4187406 3856248
8950 3856248 3789327 4027674 4171655 4047402 3984347 3983311 3909895 4085460 4252853 3935936
8940 3935936 4074025 4144513 4236472 4293649 4278867 4269779 4136678 3986432 3762494 3478301 3560689
8929 3560689 3355623 3189933 3220821 3229634 3259125 3307086 3321297 3275483 3015440 3186258 3295859
8918 3295859 3334587 3373658 3537551 3872624 3902189 3881607 3642165 3436623 3274798 3053638
8908 3053638 2817567 2816273 2793246 2756722 2836895 2587031 2415203 2302297 2295265 2380886 2617104
8897 2617104 2620863 2315904 2376986 2348950 2186638 2296968 2336095 2273694 2181411 2389410 2369667
8886 2369667 2450916 2581062 2278421 2385954 2435889 2124153 2014966 2033017 2267584 2282780
8876 2282780 1860873 1951088 1921618 2173561 2126357 1945471 2067845 2106417 2116595 2006182
8866 2006182 2154013 2009319 1884185 2051001 2280843 2249151 2078421 1928988 2031317 2150714
8856 2150714 2436635 2366008 2357614 2327403 2266502 2135401 2260420 2599292 2711598 2535885
8846 2535885 2280457 2228053 2418060 2402497 2366014 2684420 2750461 2758554 2793335 2636343 2512661
8835 2512661 2781672 2872409 3116861 3041348 2890543 3083118 3279086 3438012 3324346 3116646
8825 3116646 2894242 2880655 2929043 2857905 3222203 3427492 3443103 3582026 3377147 3125446
8815 3125446 3219874 3245318 3459764 3385480 3684233 3688453 3638981 3744027 3920128 3875161 3861251
8804 3861251 3831886 3799490 3925492 3958412 3974730 4345459 4423647 4160625 3962183 4066926
8794 4066926 4204909 4301706 4338634 4599191 4690286 4640076 4340778 4518576 4840494 5010559
8784 5010559 5091831 5377701 5557503 5426165 5575470 5758691 5740198 5598822 5608580 5809882
8774 5809882 6014391 6165842 6179765 6360982 6814767 7080336 7252014 7352157 7416560 7413403
8764 7413403 7670302 7530191 7869696 8393164 8537717 8565273 8938720 9304436 9449033 9888864
8754 9888864 10274776 10625487 10734686 10916654 11342204 11826720 12093876 12222381 12508729 13236752
8744 13236752 13778963 14016527 14789456 15281634 15974374 16532355 17176217 17905950 18838229
8735 18838229 19815957 20649246 21478561 22622412 23596871 24227749 25039154 25827293 26513326
8726 26513326 27432973 28289131 29428634 30137530 30776499 31777751 33532819 35021065 36688227
8717 36688227 38971370 41458676 44029591 46735109 49485376 52102608 54936294 57500832
8709 57500832 59363967 60211798 59144654 56672758 53805706 51258702 49177510 47439687
8701 47439687 46551744 46667773 46398198 46535293 46238695 45797586 45367864 45084870 44913329
8692 44913329 45238809 45897476 46013162 46315587 46748962 47791239 48622167 49738451 50555283
8683 50555283 51744723 53373370 55204990 57423878 60172826 63296410 66649986 69756275
8675 69756275 73029646 76296353 79646327 83260682 86791297 89780484 91124988 90236202
8667 90236202 87383213 83138585 77409144 71275960 66140900 62034643 58259831 55341176
8659 55341176 52824278 50766721 48452820 45980958 43815975 42138245 41104972 40314878
8651 40314878 39715541 38955601 38412966 37496114 36964134 36652235 36703450 36528711 37033806 37723409
8641 37723409 38274807 38965442 39770948 40687573 41610011 42406677 42764776 43504384 44497835
8632 44497835 45602406 46300435 47065396 47793394 47624982 46688690 44045275 40435190 36835895
8623 36835895 33722714 31084333 28835100 26762886 25383286 23877814 22820169 21979275
8615 21979275 21416897 20950018 20226215 19386558 18655219 18037611 17178542 16969775 16348173
8606 16348173 15810669 15377943 15198071 14972021 14693050 14482382 14353050 14628041 14530510 14812282
8596 14812282 14825579 14916673 14851082 14644103 14338431 14269209 14068806 13636202 13851202 13872207
8586 13872207 13461447 13202091 12796362 12118642 11577983 11228352 10803274 10521781 10451557 10249865
8576 10249865 9845117 9645318 9465052 9344814 9753474 9731576 9671973 9656856 9882903 9772489
8566 9772489 10112493 10568866 10672633 10792268 11010972 11348091 11683987 11948612 11783956 11250556
8556 11250556 10803752 9736371 8917888 8371785 7919877 7420255 7160727 6716310 6276212
8547 6276212 6072344 5954681 5487724 5101836 5022313 4773844 4633178 4627610 4738927 4645517
8537 4645517 4452122 4196038 4166845 3792965 3560021 3324215 3506037 3821816 3611712 3313931
8527 3313931 3235830 3146683 2792687 2774061 2792770 2801481 2606846 2505781 2330907 2382248 2290469
8516 2290469 2320098 2445498 2376446 2267099 2106094 2084631 1975964 1773614 1577317 1800625
8506 1800625 1918812 1887115 1507479 1416498 1771234 1769405 1583877 1366497 1249709 1240131 1197351
8495 1197351 1488339 1461432 1399110 1480321 1546546 1330088 1285795 983262 852916 889672 783142
8484 783142 579421 847696 861429 917792 1133156 960822 859521 725031 730977 411828
8474 411828 644802 761543 938865 804158 776199 548495 459408 378923 722168 794375
8464 794375 580571 727057 830128 694836 432250 210292 220270 388320 657136 709019
8454 709019 525768 399880 537769 452478 331110 105237 164947 369706 404842 378820
8444 378820 392165 228261 277949 122187 105533 29585 -169190 -127912 -2098 79362 -44116
8433 -44116 -80802 28967 302213 90150 -136091 -151155 -11439 -50324 -158962 -185509 47554
8422 47554 168236 281578 319724 397572 338101 277753 -15922 47101 -30376 163507 159573
8411 159573 74773 155754 215541 553886 922477 621789 249435 -141610 85822 -59793
8401 -59793 73110 223928 255112 221179 480687 205981 19461 -202 164887 48993
8391 48993 132846 62606 -171896 55256 -22494 -102613 -96335 -118005 -264708 -197064 -69185
8380 -69185 -284796 -161075 -163889 -238508 -218420 -293788 -395407 -321210 -49105 -44393 -150192
8369 -150192 -122637 -256930 -508677 -213328 -210914 -57479 -160631 89712 -261326 -77242
8359 -77242 -119578 -46504 126736 29422 -129766 -468957 -312265 -416298 -466477 -190666 42774
8348 42774 82521 -144037 -258621 -346583 -420694 -492646 -546714 -466293 -282622 -173874 9364
8337 9364 -30186 205372 -127950 -348415 -168955 40124 -176914 -284102 -5469 143205
8327 143205 344425 121095 -40275 23876 319776 97235 -41321 98655 -149149 -143572
8317 -143572 -92915 -129183 -60283 17886 24133 152893 366383 176638 -321775 -46360 71025
8306 71025 -94803 -29021 229838 166635 69497 17733 15736 -55604 -73344 -385388 -325487
8295 -325487 116756 -160767 -285022 -92983 -117437 -192567 -167591 -330956 -248320 -305868 -455216
8284 -455216 -188763 -152801 -404276 -568972 -477418 -137050 -82464 -281707 -49314 -79867
8274 -79867 -261877 -374532 -532846 -627594 -414946 -434685 -357671 -317514 -362522 -180437 -262719
8263 -262719 -119702 -90970 -35301 -265102 -173693 -340894 -415838 -446115 -273240 -224488 -126675
8252 -126675 -163938 -135962 -184418 -103690 -25233 -197198 -91872 62705 -87676 -213785 -183557
8241 -183557 -193540 -59497 -433854 -525640 -382741 -354573 -268531 -375779 -282629 -115487 -66982
8230 -66982 -372965 -558970 -599346 -427811 -642713 -451012 -138642 -386229 -527123 -680303
8220 -680303 -355238 -600045 -561031 -553908 -626534 -631362 -459094 -533008 -720511 -479068 -565535
8209 -565535 -857540 -853943 -878451 -837272 -721193 -345829 -377058 -397026 -195193 -544872 -993272
8198 -993272 -1048655 -926474 -914684 -716791 -395159 -1462823 -3383428 -2064205 -1069320 -945626
8188 -945626 -926201 -947322 -652770 -755699 -625353 -208337 113767 -409723 -754705 -664975
8178 -664975 -523433 -634451 -577928 -343573 -339404 -365875 -667997 -757575 -553637 -472109 -952710
8167 -952710 -731415 -432897 -594390 -636561 -498932 -564737 -547007 -551561 -861373 -956322 -602432
8156 -602432 -586076 -690293 -441847 -482421 -698576 -839568 -542951 -306923 -517915 -806863
8146 -806863 -839343 -515441 -617344 -784466 -810324 -576793 -499845 -599938 -576583 -497196 -561491
8135 -561491 -768779 -961094 -740950 -597462 -651892 -560618 -753492 -487137 -798316 -751781
8125 -751781 -641148 -477026 -674742 -829438 -618105 -473645 -595061 -617067 -502375 -443328
8115 -443328 -514581 -668329 -778527 -700738 -369101 -403142 -549613 -346725 -522409 -673337
8105 -673337 -431171 -397958 -342298 -415204 -722815 -404513 -551318 -498331 -663265 -424990
8095 -424990 -484346 -710614 -942349 -727060 -327324 -333113 -579639 -513037 -433939 -630265 -638647
8084 -638647 -719848 -560669 -466163 -721906 -669192 -409772 -440317 -371890 -578406 -334231 -553931
8073 -553931 -473505 -655733 -655619 -309253 -311621 -525249 -480969 -501845 -668419 -519869 -363717
8062 -363717 -359489 -464416 -550585 -682501 -686937 -686113 -737637 -559588 -413665 -400753 -524036
8051 -524036 -713877 -554938 -482832 -598530 -632859 -572255 -533740 -518099 -523819 -353578 -158904
8040 -158904 -364455 -410680 -469622 -612558 -480079 -667538 -587821 -440846 -375204 -417676 -354104
8029 -354104 -343115 -329271 -473923 -621293 -325699 -383731 -544106 -476211 -187241 -297294
8019 -297294 -305222 -386530 -222950 -255785 -244021 -296600 -367457 -360976 -152302 -142168 -296922
8008 -296922 -336600 -248125 -382709 -524581 -523812 -364779 -559852 -439908 -485214 -334550 -474324
7997 -474324 -566178 -401770 -240864 -301429 -559526 -464249 -363550 -488045 -479403 -387303 -686315
7986 -686315 -536361 -535567 -537225 -524186 -483940 -568708 -745128 -797339 -884304 -712631 -552621
7975 -552621 -402777 -393991 -410627 -535029 -366085 -366707 -545208 -505559 -542800 -471740 -685152
7964 -685152 -527593 -534603 -419576 -385190 -405108 -416474 -498320 -583856 -316294 -185025 -174136
7953 -174136 -385290 -362091 -225248 -225491 -302829 -170334 -129067 -976 -187338 -174314 -98773
7942 -98773 -109266 -201312 -243521 -73818 -64229 -118844 -198832 -171658 -169599 -157669 -430567 -300053
7930 -300053 -182292 -474472 -383302 -360379 41190 58104 -69232 -214561 -121079 -48951 -202059
7919 -202059 -283833 -219952 11977 -90643 -171466 -429230 -324620 -509294 -296442 96461
7909 96461 137871 -110880 -104787 -185379 -428750 -271939 -398920 -258520 -70433 34061 -178159
7898 -178159 -200571 -54614 -298783 -520308 -336134 -473369 -272577 13045 -26425 -249665
7888 -249665 -388272 -144475 -251844 -256783 -541398 -452718 -231494 163624 38489 -306558
7878 -306558 -246576 -128103 -251192 -176633 -150852 -176742 87471 83741 131988 -46282 -308117
7867 -308117 -234553 54556 277265 202573 -44712 138775 374372 90493 85895 96646 271826
7856 271826 126161 -51220 -244491 52799 143724 437561 255751 240722 153961 40869
7846 40869 207371 138807 241158 161482 488054 104878 305209 194329 118386 482592
7836 482592 578110 259224 14083 214797 318585 140163 270448 572159 410523 370410
7826 370410 259128 346992 395814 517631 330806 230298 373236 104449 -40935 224046
7816 224046 366375 190061 196193 220718 -55350 -243538 103365 209500 315199 215745
7806 215745 64814 4966 367021 351386 364733 273645 410120 134303 -68287 129871
7796 129871 310794 456376 326670 257039 315286 501689 533840 437732 563519 718978
7786 718978 419402 483054 655555 841915 726904 358373 338359 341047 472994 431948 713189
7775 713189 723492 867535 678106 617378 855166 629892 704374 764236 894489 618141
7765 618141 938764 1098435 1094637 897824 1065018 940620 946730 863896 827575 1175446 1146575
7754 1146575 1367298 1462401 1393250 1106947 1191041 1207264 1112011 1022555 873033 1012833 1375839
7743 1375839 1650200 1386195 1395475 1235496 1060166 815624 997429 963359 1084550 1154751
7733 1154751 1280483 1223948 1149325 1291860 1155835 1253407 1115526 1062940 1036649 1011298 1293508
7722 1293508 1248558 1489884 1462753 1479793 1277866 1138354 1454738 1586937 1529761 1391977
7712 1391977 1595779 1580874 1528284 1335296 1727071 1758623 1547357 1579770 1672875 1633772 1692015
7701 1692015 1613920 1571594 1696637 1626584 1454846 1681812 1992619 2107888 2022552 2001248
7691 2001248 1943651 1987097 1868147 1957566 1894038 2299536 2248044 2410768 2365618 2455207 2335325
7680 2335325 2178806 2325237 2223273 2341760 2184787 2293900 2427555 2552676 2379057 2596301
7670 2596301 2761133 2632732 2455891 2559539 2615076 2634948 2764514 2564341 2943106 2856569
7660 2856569 2779490 2623482 2748307 2895005 2749849 2727526 2623628 2736172 2705360 2683736
7650 2683736 2737267 2938526 2910251 3016441 3156110 3083979 2755224 2756853 2923128 3143740
7640 3143740 3070977 3103415 3189903 3631234 3367494 3106735 3269278 3305950 3436689 3528846
7630 3528846 3463213 3599558 3519235 3509988 3452600 3896185 3963733 3792896 3841738 4171540 4109276
7619 4109276 4108354 4114180 4261361 4309886 4231687 4006939 4156543 4643977 4641896 4591279 4657075
7608 4657075 4885952 4645142 4612663 4907331 4561095 4514921 4454023 4431297 4566593 4772285
7598 4772285 4908675 4868200 5099889 4835592 4862049 4637140 5152983 5180356 5030984 4919083
7588 4919083 4896196 4906251 4937373 4958760 5310768 5336669 5199645 5020779 4776965 5033023
7578 5033023 5183303 5213837 5434490 5310322 5149868 5057372 5193083 5161485 5468741 5238352
7568 5238352 5206596 5197302 5037672 5186403 5338483 5408623 5470488 5469321 5217143 5211108 5324597
7557 5324597 5154538 5015316 5087856 5462753 5285389 5284371 5472881 5273366 5157580 5361155
7547 5361155 5416930 5303182 5102695 5089687 5216278 5165736 5107883 5020728 5373204 5245457
7537 5245457 5197884 5045420 5245056 5532389 5470966 5230159 5210331 5000587 4964192 4871840
7527 4871840 4867146 5091729 5500779 5379304 4988859 4921427 4950206 4800084 4575122 4675209
7517 4675209 4766468 4617029 4731875 4666568 4739986 4408642 4081765 4011857 4425060 4251335
7507 4251335 4186694 4280044 4334856 4240557 4156014 4338304 4146791 4137464 3968724 3834864 3741984
7496 3741984 3642609 3773155 3360984 3314902 3332033 3272625 3342389 3474941 3571919 3446469 3392254
7485 3392254 3467006 3317160 2902019 2923792 2933103 3161276 3102208 3001177 3122804 3221103 2911613
7474 2911613 2806908 2813726 2530380 2422632 2600055 2689676 3041891 3176372 2903672 3219019
7464 3219019 3059456 2705451 2433415 2511750 2721309 2847323 2675455 2460588 2533855 2489549
7454 2489549 2353801 2233655 2521246 2476768 2361199 2204780 2281119 2197165 2034708 2105513
7444 2105513 2273364 2210622 2039227 1946439 2079485 2274779 2215167 1924104 1762661 1791607
7434 1791607 1746939 1715657 1889172 2027478 1947624 1832467 1638629 1574575 1747799 1674047
7424 1674047 1812947 1426416 1793645 1524847 1559892 1549409 1349484 1197702 1501284 1423899
7414 1423899 1284364 1067038 1071862 1083934 1197352 1273933 1073644 1053879 951182 878856 1007893
7403 1007893 1126827 1060662 725354 693048 1020456 890785 998947 755501 950700 925895
7393 925895 849019 813434 1148874 1181716 840810 614027 607674 861980 832948 925689 1016933
7382 1016933 959354 1125277 976323 931080 792795 846693 687592 846695 592912 730540
7372 730540 649549 955621 903235 897495 675522 844341 916999 762210 633687 466777 349499
7361 349499 523896 781899 713892 671729 740471 736344 651357 670447 525844 445170 526690
7350 526690 394934 378417 382059 625539 899189 992933 720410 536856 537876 552691 289767
7339 289767 27813 303939 582306 752124 536545 589675 582237 411502 199034 81543
7329 81543 -8877 68608 186320 474695 545169 586982 136754 59954 -104788 272145 183967
7318 183967 334670 440686 573940 377887 89103 -236336 17821 117742 185934 550677
7308 550677 656051 568831 228133 200012 83795 146718 91137 456524 257102 197188 171719
7297 171719 118712 197095 84393 -78979 -268712 96 248559 484833 345776 321461
7287 321461 323907 229924 1554 -141567 60268 272837 287755 425932 362657 276264 7530
7276 7530 -113960 86310 305476 141665 361943 416434 410950 209246 -212205 138514 40554
7265 40554 15655 -72535 355034 579228 543535 351886 228290 188616 -98891 -452558 -479151
7254 -479151 -88199 -16988 -75202 -61421 222159 76011 -86640 -221926 -219106 -336734 -572226
7243 -572226 -428065 24488 375005 -52219 -99982 -180069 -101626 -340278 -168146 -140863
7233 -140863 12010 -153016 -409341 -150629 17780 88299 -277106 -37507 248026 75521
7223 75521 13252 -92931 48814 -82838 -124008 -235002 57485 232278 180515 -47937
7213 -47937 78574 -63286 -343134 -289091 -166463 -140468 -184326 -62473 -67961 -10685 -29260
7202 -29260 65280 -68616 -164137 -150002 -121240 -88369 62934 -44703 -407928 -144544 -2344
7191 -2344 -161254 -340778 -10647 100475 -56049 -80660 -206510 -231400 -386323 -605169
7181 -605169 -257646 20862 -159785 -136127 -41559 13172 -179185 -163253 -303199 -49534
7171 -49534 -222562 -202353 92011 508123 486303 349101 39336 163617 -49864 -249290
7161 -249290 -402888 -229673 40348 147147 -23759 -17133 -45982 -80029 -136810 -297869 -217662
7150 -217662 28778 6476 79258 -28777 -149544 -265227 -208228 -334500 -129365 -41434
7140 -41434 152814 24877 -15541 -89740 -122520 56020 -113752 18591 96993 178158 -35738
7129 -35738 65859 -82505 110951 55279 -153871 -428709 -167439 -289315 -111080 155150
7119 155150 180176 116819 -105244 -111450 -125593 -80856 -102890 216056 223819 175928 114098 -132504
7107 -132504 165522 -51560 -168004 -262728 113860 217966 227199 -276929 -33299 -19205
7097 -19205 -66225 4023 156403 133151 244145 266831 304058 492255 289341 290977 331485
7086 331485 284578 361057 391772 606790 605704 614907 578395 473234 472389 282840 305458 567644
7074 567644 700688 620091 496633 737621 780714 764566 721490 705836 667252 489967 403205
7063 403205 444938 726541 678101 539924 452351 628971 286530 334048 424468 639133 628093
7052 628093 545175 394389 800183 978463 898695 598548 845958 821927 532733 410106
7042 410106 1066449 1339297 1075066 724636 960972 1064763 817493 704321 872640 1241376
7032 1241376 1514930 1390205 1429170 1596449 1585881 1343804 1539815 1522018 1623215 1556636
7022 1556636 1746497 2069354 2216124 2163683 1940520 2254635 2264132 2260362 2243260 2720371 2743228
7011 2743228 2830132 2869327 3160444 3170019 3187684 3367159 3476958 3503128 3535485 3745548 3899233
7000 3899233 3953295 4111425 4169479 4493269 4716903 4716376 4873311 5270849 5335963 5420988 5482112
6989 5482112 5774598 5815932 6046673 5921381 6309728 6826365 7071576 7163221 7528184 7926779
6979 7926779 7932926 7960992 8403171 9111049 9520836 10066220 10609427 11364949 11831604 12190643
6969 12190643 12579169 13627466 14468662 14972130 16172108 17367174 18404317 19538200 20865503
6960 20865503 22295355 23793487 25239546 26926301 28797200 30920617 32954264 34691600
6952 34691600 36462383 37914424 39078609 40142932 40531801 40246153 39638564 38451360 36832614
6943 36832614 34961889 32765833 30263020 28213532 26263040 24305685 22416634 21191459
6935 21191459 19841456 18516815 17103675 16087904 14757071 13795649 13135444 12306733 11851659
6926 11851659 11240780 10638270 10044041 9918059 9306141 8616859 8080011 7735834 7585501
6917 7585501 7225395 6990210 6744755 6647526 6204145 5827731 5678145 5548623 5166866 5032551
6907 5032551 5116734 4853922 4359302 4284942 4328963 4117971 3898678 3670406 3656894 3720047
6897 3720047 3534154 3365292 3089980 2840189 2787317 2843163 2919310 2793622 2829922 2468333
6887 2468333 2555940 2330936 2427010 2303080 2068822 1925593 1773762 1774603 1891747 2208547
6877 2208547 2135216 1803923 1618661 1474886 1254437 1329218 1228034 1313880 1470594 1268307
6867 1268307 1056634 1081341 1203809 991216 1037042 1110268 1045116 819561 519636 723442
6857 723442 944250 804250 681171 1015817 1068522 1064267 860284 897109 904035 739116 725767
6846 725767 482579 396857 620361 626611 695078 891799 647032 504514 361610 382113 296354
6835 296354 473830 505601 469204 513455 358691 378861 360658 310815 344371 258146 344864
6824 344864 286845 272325 232701 306399 347202 219397 -38177 -63352 29225 -63361 153371
6813 153371 77124 113990 -91482 -188370 -97462 -114616 -16431 150526 416814 151110 114394
6802 114394 153976 127763 104441 41812 -128535 -30902 -43371 -89753 163347 306334 86350
6791 86350 -193803 -195308 -220667 2564 -278078 -125143 -151985 -40708 -98647 -154790 -51255
6780 -51255 -153252 -443369 -400152 -99322 -84180 -90074 -296894 -365393 -135172 -201866 -324681
6769 -324681 -259148 -64528 -61453 180564 -16524 -143 -244028 -154489 -168001 -115061 -257800
6758 -257800 -371087 -306678 -513 -49326 -226851 -508530 -706721 -651974 -506332 -425463
6748 -425463 -348441 -202545 -194682 -138974 -275249 -182336 -374214 -322294 -467258 -451091 -525278
6737 -525278 -80577 -212317 -171050 -271688 -408691 -512472 -319719 -440198 -520752 -63312
6727 -63312 -67445 -172004 -220254 -307023 -235927 -251981 -137851 -433763 -289844 -170734 -6486
6716 -6486 -63502 -103259 -254606 -286597 -626181 -487232 -342644 -303886 -450968 -457868 -405005
6705 -405005 -452952 -724235 -457734 -285508 -436124 -337413 -600376 -406538 -357615 -333770
6695 -333770 -471668 -576004 -513314 -458466 -501396 -274932 -374257 -206826 -317425 -448991
6685 -448991 -579285 -415325 -479486 -414013 -189064 -268948 -341304 -201449 -59462 112187
6675 112187 -273184 -573367 -563978 -593398 -567025 -538364 -431413 -286447 -386678 -534797 -574680
6664 -574680 -530494 -635989 -523609 -611182 -502983 -657746 -402828 -370640 -753994 -728629
6654 -728629 -580430 -367476 -338157 -343146 -574121 -594538 -347490 -250608 -434839 -530589 -484257
6643 -484257 -241614 -106790 -307163 -473870 -622390 -319400 -407155 -389369 -88251 -301187
6633 -301187 -265233 -129033 121094 -138543 -105003 -279790 -282880 -327202 -275693 -358164 -83713
6622 -83713 37580 -264338 -351039 -210702 -96244 -119025 -73231 -501898 -437908 -347646 -359079
6611 -359079 -486314 -355955 -315061 -556721 -404669 -507819 -289835 -307099 -413945 -519608
6601 -519608 -561459 -583678 -562079 -505498 -362706 -185603 -510040 -243482 -256601 -271502 -547890
6590 -547890 -690905 -557970 -295135 -289055 -506815 -505690 -379384 -390882 -714168 -586821 -500695
6579 -500695 -447302 -308798 -290990 -279910 -346940 -227912 -163333 -125472 -205058 -315962 -402649
6568 -402649 -83538 -37918 -190761 -347211 -351042 -276999 -381454 -197124 -208224 -30114 -166751
6557 -166751 -95850 -241205 -266344 -305979 -387812 -106597 -77402 -37680 -334689 -137170 -161710
6546 -161710 -319706 -271655 -161099 -202446 -410020 -128218 32790 176795 106046 -34700
6536 -34700 -539378 -404533 -250641 -139917 -61888 -106478 -267943 -81063 -10162 -346778
6526 -346778 -483795 -592578 -528398 -215527 -17320 -563537 -479450 -224179 -216826 -321797
6516 -321797 -407739 -407518 -349770 -231172 -371198 -343040 -35867 93745 -115281 -151619 -119765
6505 -119765 -387851 -13852 -64252 39095 122587 88191 -126165 -376667 -304317 -214176 -124389
6494 -124389 -1315 33960 -43150 -47707 77047 193560 -25931 -142256 -237231 -306916 -128214
6483 -128214 -62161 4973 -28813 -17321 -122977 -476387 -514514 -500551 -396236 -239112 -95446
6472 -95446 -423528 -128523 -194547 -114946 -182526 -209114 -494961 -235746 -63158 -341809 -455918
6461 -455918 -517701 -414168 -260695 -22793 -377840 -492066 -222309 -286524 -298614 -76372
6451 -76372 -132508 -402495 -189529 -195588 -334200 -277021 82292 -277187 -331010 -143827 -142758
6440 -142758 -126054 40246 153028 -232179 -178593 -169119 -89308 -63239 287845 38146 180782
6429 180782 80354 -236283 -414081 -172227 110804 64045 82055 11055 -223207 -152509
6419 -152509 -365056 -70880 235665 275788 14273 75778 -174482 -253012 -77842 366253
6409 366253 280150 -52218 -84905 156950 279812 410968 416824 -19278 79105 75364 35347
6398 35347 -6788 106579 260089 267794 37678 -78109 -327834 -275925 -8199 -109105 154504
6387 154504 120738 -245482 -214471 -105100 28793 -308464 -320884 -259449 -8328 2151 127177
6376 127177 89835 -55253 -283338 -236245 -158335 -130738 271299 163997 -28218 -2491 35512
6365 35512 -361010 -465483 -431420 -124010 307085 327615 674846 453895 282022 110703
6355 110703 358895 247515 73367 324572 682343 727828 657429 539343 142047 334477
6345 334477 619972 425921 343555 767406 887711 941868 894499 526369 726693 911625
6335 911625 842977 889882 851858 915393 1134260 1252708 1369428 1087444 851567 955662
6325 955662 1036272 1221188 1317926 1483146 1603550 1645634 1750800 1898329 2320500 2339880
6315 2339880 2252558 2279298 2334961 2765908 2825185 2767213 2655243 2649385 2442956 2612346 2413599
6304 2413599 2339481 2123116 2018057 1810291 1876289 1297787 1072831 1505277 1487132 1229112
6294 1229112 705754 833060 765817 1021931 802818 846564 604593 863452 937242 763217
6284 763217 745991 780315 697826 650067 1037217 612243 722391 906244 996387 877791 661320
6273 661320 549374 570895 715710 755676 718448 877142 993748 812021 590262 736565
6263 736565 699017 456764 511108 710835 769496 869863 918958 1083916 916003 713527
6253 713527 623025 589276 772218 718517 940989 1155977 1236148 1039961 913520 820136 870894
6242 870894 1018450 856319 866852 1131701 1287872 1129919 946211 1063904 895672 879292
6232 879292 901157 782085 662048 622908 714952 907280 714692 780610 619226 694389 819969
6221 819969 840768 761908 824979 1034696 704578 773725 929544 1051832 883367 1126238
6211 1126238 1183273 1017486 1043997 1266609 1064071 1007670 1028162 866317 930582 1088340
6201 1088340 1159390 1173833 1399006 1341827 1429687 1303471 1334129 1464697 1530049 1304161 1331723
6190 1331723 1363010 1372298 1515244 1511281 1422215 1528802 1515229 1539451 1478057 1453820 1645161
6179 1645161 1484869 1454536 1558017 1494772 1377157 1741627 1858953 1474247 1439740 1618936
6169 1618936 1603449 1608361 1606715 1591138 1658158 1759261 1980619 2128369 2161747 2091311 1820474
6158 1820474 2092290 2194385 2267201 2205629 2423248 2112049 2242078 2398607 2241433 2422691
6148 2422691 2537067 2353138 2462891 2593612 2615677 2712904 2728271 2729192 2927886 3140698 2892157
6137 2892157 2930100 3196289 3187982 3171691 3292912 3103878 2881857 2841041 3290734 3256311 3139218
6126 3139218 3208288 3151209 3136398 3145045 2833632 2895150 2956156 3122915 3176818 3106930 3232074
6115 3232074 3296167 3408606 3381476 3537263 3470223 3638432 3664525 3598886 3673910 3561748 3892741
6104 3892741 3836211 3699670 3822421 4155126 4298366 4109918 3961015 3873298 3675490 3747400
6094 3747400 3745802 3482996 3567177 3634043 3752099 3593986 3736759 3618508 3658183 3728037 3659094
6083 3659094 3781006 3775192 4000262 3976692 4071294 4168780 4179955 3844600 3857000 3929703 4033332
6072 4033332 3776952 3764616 4212255 3990105 3685711 3781319 3739181 3666423 3721864 3715858 3780500
6061 3780500 3774134 3719894 3622668 3606408 3812096 3710433 3629354 3794024 3641293 3526335 3600921
6050 3600921 3599992 3572863 3428512 3448566 3426478 3663071 3676743 3445485 3395196 3380311 3420375
6039 3420375 3503059 3571577 3300573 3351781 3197453 2851450 2643109 2820508 2713291 2732622
6029 2732622 2770829 2713279 2614540 2755444 2859798 2592253 2268146 2325375 2529711 2712281
6019 2712281 2713635 2571430 2632787 2760156 2653249 2458662 2319182 2407238 2536436 2667148
6009 2667148 2581404 2553327 2691493 2926299 2786733 2663192 2478908 2545754 2506771 2749487
5999 2749487 2859372 2793313 2960528 2893944 2855737 2636991 2587827 2610934 2855617 2706435
5989 2706435 2548297 2171942 2457775 2557010 2591206 2476312 2536801 2505075 2705866 2744774
5979 2744774 2675830 2829253 2640326 2347079 2315835 2604925 2619219 2587281 2688258 2761555
5969 2761555 2544474 2232294 2540702 2679773 2799486 2612113 2270566 2511131 2813543 2526333
5959 2526333 2523249 2692214 2689785 2672264 2658630 2528807 2500278 2715641 2672305 2673961 2553704
5948 2553704 2720499 2504180 2538665 2507926 2427153 2321169 2426011 2400300 2507991 2725358
5938 2725358 2422157 2470840 2527766 2316720 2239111 2361487 2262705 2332910 2582947 2602669 2530207
5927 2530207 2455825 2339916 2219213 2399485 2724375 2751812 2593389 2647550 2584907 2889251
5917 2889251 2784929 2644916 2632420 2935169 2922477 2933129 3340977 3258074 2926069 3019397
5907 3019397 3198600 3177492 3095086 3105570 3183752 3147320 3223655 3199456 3250175 3370372 3372713
5896 3372713 3484107 3301980 3178091 3122237 3205906 3444232 3279469 3259905 3334297 3129487
5886 3129487 3404991 3489153 3229548 3349320 3455994 3462954 3449414 3852186 3657430 3497863
5876 3497863 3379462 3740293 3558123 3730946 3837341 3883334 3936588 3965887 3972453 3986813 4073236
5865 4073236 3904139 4116989 4191574 4329588 4227316 4505432 4514130 4759909 4941493 4761853
5855 4761853 4579098 4926143 5108626 4865323 5150728 5488055 5809526 5912458 5882376 5794296
5845 5794296 5982207 6015724 6278773 6703228 7001612 7010436 7287302 7771332 7729234 7903865
5835 7903865 8371159 8560582 8948271 9292340 9209951 9365424 9473857 9829099 10024080 10309207
5825 10309207 10519766 10990382 11165572 11401631 11954159 12237445 12531162 12796329 13122419
5816 13122419 13318603 13511174 13939243 14313966 14489113 15002715 15490205 15681167 15833614
5807 15833614 16070242 16246782 16682659 17068385 17336957 17479304 17769867 17887313 18004486
5798 18004486 18398950 18321652 18569989 18970465 19263496 19404457 19580671 19633433 19750794 19845093
5788 19845093 19645794 19437977 19372516 19568755 19421920 19517212 19439015 19378670 19383181 19327157 19478014
5777 19478014 19588204 19892926 19864278 19877741 20066143 20022019 20055399 20107509 20293427 20373422
5767 20373422 20516503 20368411 20078253 19754958 19459932 19104635 18739042 18745653 18328902 17777332
5757 17777332 17595231 17756133 17747913 17402478 17110480 16963890 16784953 16440827 16169700 15951819
5747 15951819 15783585 15460107 14988501 14750710 14450535 13967289 13735522 13566167 13490745 12889766
5737 12889766 12135535 12121673 12172304 11736697 11264639 11158715 11152332 11117406 10679042 10276058
5727 10276058 9804595 9568001 9440288 9009104 8655433 8272316 7815089 7738281 8025080 7660023
5717 7660023 7194447 7127676 7003940 6669220 6585902 6274995 6299394 6331593 5953276 5905141
5707 5905141 5908026 5774766 5641430 5546565 5532721 5430402 5303484 5324197 5132910 5301540
5697 5301540 5283591 5245257 5492237 5481030 5193365 5030404 5160836 5025850 4675374 4519135
5687 4519135 4654526 4804578 4707704 4593536 4493950 4878610 5063719 4861985 4559919 4437711
5677 4437711 4384591 4334032 4417143 4580183 4572062 4551231 4548913 4573433 4486968 4442636 4373632 4486138
5665 4486138 4632807 4807821 4578985 4431606 4984316 4972395 4481765 4500899 4528753 4498946
5655 4498946 4526627 4503119 4469975 4544007 4318833 4226989 4286822 4400524 4480107 4520404 4471583
5644 4471583 4286382 4362863 4393194 4273268 4395297 4382759 4242786 4383945 4519772 4429140
5634 4429140 4432550 4569356 4495141 4351115 4286224 4220562 4325782 4768146 4934654 4788526
5624 4788526 4589097 4744716 4575300 4691414 5047003 4987482 4929706 5067294 5009915 5140598
5614 5140598 5093221 4901927 4940357 5091224 5172197 5194536 5192853 5345972 5021493 5018896 5330623
5603 5330623 5270659 5202407 5198822 5304208 5974011 5882383 5527676 5507861 5589749 5314900 5376154
5592 5376154 5522860 5418373 5350147 5573662 5710783 5540332 5498056 5530630 5507402 5617560
5582 5617560 5740627 5717148 5576421 5680247 5728495 5665125 5853667 6114243 6172408 6257173
5572 6257173 6129418 6105199 6034965 5941324 6096937 6117107 6239906 6305138 6482833 6472806 6515477
5561 6515477 6400899 6550464 6378367 6426375 6647848 6735071 6755959 6636004 6828652 7048514
5551 7048514 7185362 6938887 6552999 6710186 6892459 7052878 7284457 7431956 7321485 7344357
5541 7344357 7390574 7334239 7386123 7392624 7482710 7629884 7815015 7948797 8010599 7970591 7916203
5530 7916203 8245358 8324475 8342228 8608408 8951985 8862064 9127257 9397297 9515681 9470907
5520 9470907 9842141 9928770 10197554 10487440 10758690 10946640 11321491 11730023 11727362 12096252
5510 12096252 12659563 13049036 13494510 13726303 13676042 13838810 14008835 13993259 14051532 13918387
5500 13918387 13877843 14122527 14440808 14761826 14930870 14871543 15027581 15337530 15376177 15690492
5490 15690492 16057397 16602545 17149584 17555569 17817921 18263203 18786096 19289878 19890922
5481 19890922 20269932 20516120 20696946 20939654 21383297 21872066 22446857 22929005 23609659
5472 23609659 24703181 25493389 26198910 27207932 28518101 29707949 31108936 32841218
5464 32841218 34714201 36875645 39167549 41902327 44331224 47313158 50193764 52908878
5456 52908878 55727111 58669487 61187582 62771461 63882721 64175454 64528915 65067267 65379388
5447 65379388 66051995 66246637 66250877 65903674 65178176 63596039 61890186 60619119 59929796
5438 59929796 58877062 58351092 58154902 58117683 58425035 58530285 58339458 57942344 57119996
5429 57119996 55822009 54718291 53597692 52727547 51904603 51125646 50561541 49891764 48956735
5420 48956735 47377243 45530495 43329351 40958429 38213256 35878608 33725351 31629238
5412 31629238 29842546 28159885 26986796 25872252 24805995 23790797 23223474 22510507
5404 22510507 21930071 21266016 20871139 20550183 20253652 19916816 19829232 19796484 19400873 19015660
5394 19015660 19133781 18783376 18378307 17776003 17662736 17342647 17002195 16459541 16137434
5385 16137434 15868292 15633735 15169330 15029008 15302478 15103959 14921294 14850676 14872316 14778472
5375 14778472 14848966 14565367 14634859 14833923 14656463 14606935 14862118 14674104 14307776 13989205
5365 13989205 13592732 13249649 13041693 12689096 12488067 12576513 12578167 12231420 12167635 12149070
5355 12149070 12098916 11887390 11939700 12087129 11939541 11842302 11799193 11900086 11803009 11469932
5345 11469932 11492731 11713642 11764054 11733908 11777888 12043101 12133765 11721620 11539408 11739242
5335 11739242 11819742 11713666 11855884 12075840 12007274 12380538 12283960 12165592 12167293 12215842
5325 12215842 12254126 12545523 12751032 12522206 12502634 12657873 12833146 12651731 12539007 12627832
5315 12627832 13003498 12954715 12828435 12644280 12877440 12811560 12699241 12712470 12680241 12703708
5305 12703708 13100902 13480406 13159888 13345059 13224614 13130801 13309666 13439694 13499130 13605639
5295 13605639 13853026 13950606 13992144 13945927 13996757 13991626 14272684 14393616 14460772 14545497 14678448
5284 14678448 14642643 14927277 15327846 15421068 15557124 15619373 16058045 16214183 16537058 16683373
5274 16683373 17143630 17359452 17715280 18198480 18750433 19495658 20014010 20564750 21119983
5265 21119983 21703103 22095235 22731979 23272042 23489987 23297099 23079210 22454790 21766857
5256 21766857 21490801 21085497 20978148 21016658 20870374 20867198 21157585 21384476 21452612 21621380
5246 21621380 21889840 22347623 22928202 23522617 24038047 24543630 25545192 26776292 27937585
5237 27937585 29153978 30571929 32408794 34468744 35890039 37236732 38575802 39629781
5229 39629781 39459861 38067381 36092686 33923647 32091486 30535421 29414872 28219918
5221 28219918 27448312 26450751 26035949 25710239 25361150 25238842 25263861 25523418 25598501 25973588
5211 25973588 26195660 26853393 27519211 28093848 28882248 30196616 31769078 33004585 34658165
5202 34658165 36040948 37425622 38924107 40001994 40302458 40193655 38589815 36220539
5194 36220539 33520204 31137882 29327638 27813172 26984159 25935561 25149074 24336367 23881460
5185 23881460 23553968 23101172 22260497 22103940 22209746 22020971 21827362 22025347 21923154
5176 21923154 22062616 22433886 22658759 23007658 23207559 23439346 23731418 24329637 24661634
5167 24661634 24782190 24710920 24352293 23359564 22305754 21569405 20929712 20448133 19923041
5158 19923041 19447282 18968745 18441391 17792201 17315461 17424779 17326741 17162736 17022885 16833767
5148 16833767 16669806 16306681 15933292 15696722 15606454 15247751 15301345 15402340 15516508 15472990
5138 15472990 15448340 15280296 14910053 14542107 14378357 14173577 14143030 14489552 14641573 14583012
5128 14583012 14307449 14510611 14193790 13953521 14015140 14118688 13885285 13555891 13647237 13531907
5118 13531907 13433098 13234550 13269995 13403656 13266787 12971447 12732388 12877940 13090482 13063745
5108 13063745 12681159 12548235 12333557 12519038 12337750 12291026 12474572 12599536 12352816 11982823
5098 11982823 11855905 11758284 11721456 11672054 11572891 11492510 11320614 11155541 11493722 11622571
5088 11622571 11424518 11222726 11112900 11120505 10857861 11003336 10968036 10939310 10970804 10596126
5078 10596126 10420189 10407569 10563243 10276456 10309088 10320360 10333698 10080206 9870860 10029229
5068 10029229 10257145 10157151 10093888 10158094 9830380 9697962 9620916 9753139 9497616 9385999
5058 9385999 9372118 9316904 9611012 9638302 9553802 9331907 9629975 9492329 9327093 9077613
5048 9077613 9348834 9318199 9304211 9303698 9166158 9084786 8993439 8967200 8755424 9040577 8747977
5037 8747977 8615131 8737032 8902416 8750447 8630890 8636717 8719844 8671295 8723133 8781780 8848837
5026 8848837 8968488 8803454 8807800 8905387 8880343 8556592 8593893 8692529 8802182 8874418 8957733
5015 8957733 8848136 8762693 8559126 8552455 8811699 9071084 8901208 8809214 8778467 8625844
5005 8625844 8656328 8888658 8992583 8964044 9092178 8821258 8645064 8701046 8723558 8771877
4995 8771877 8951952 9267649 9062517 8872584 9148719 9374637 9315498 9317707 9269064 9146663
4985 9146663 9223446 9732585 9912893 10061459 10189461 10149462 10292434 9960719 10289621 10403654
4975 10403654 10730304 10733548 11030619 11305176 11169303 11508452 11923310 12272086 12482257 12643924
4965 12643924 12743752 12998134 13264598 13621546 13955251 14494491 14933376 15159439 15548519 16310135
4955 16310135 16586887 17001873 17184815 17190644 17520809 17545507 17814437 18383229 18873063 18923249
4945 18923249 19261186 19255693 19335695 18937930 18856493 18851043 18877118 18797967 18667772 18547381 18665591
4934 18665591 18284070 17787046 17667500 17388470 17106745 16838822 16653922 16275114 16051266
4925 16051266 16022568 15857717 15654907 15556935 15331320 14930036 15117909 15305337 15137129 15168983
4915 15168983 15298002 15415643 15485452 15778267 16168812 16388464 16535369 16765108 16955457 17225620
4905 17225620 17496916 18159172 18462019 18845993 19217934 19708661 20381024 20853342 21187644
4896 21187644 21401787 21890511 22021602 22182525 22528011 22560188 23082065 22780757 22566123 22803584
4886 22803584 22774646 22416999 22189376 22075629 21765078 21356326 20921954 20386265 19872838 19160935
4876 19160935 18693759 18295187 17847151 16856679 15877526 15489900 15126607 14417885 13803213
4867 13803213 13414777 13035247 12390565 12016119 11565765 11282538 11071217 10686194 10360395
4858 10360395 10099296 9958353 9503768 9299355 8987023 8636104 8238300 8163539 8270492 8028907
4848 8028907 7890626 7536914 7513492 7775098 7443684 7248966 7024029 6827674 6774266 7059916
4838 7059916 6925772 6546275 6460401 6509621 6186167 6134364 6076587 5805693 5726469 5833028
4828 5833028 5701210 5669319 5915195 5847734 5642387 5284715 5280818 5335758 5249772 4997623 4509266
4817 4509266 4856040 5015757 4808485 4710303 4566161 4601977 4780150 4865796 4613114 4321824
4807 4321824 4323831 4215028 4176446 4133850 4046658 4187140 4191276 4282969 4021437 4248731 4255961
4796 4255961 4211425 4344057 4270577 4156759 4434339 4578833 4479101 4702359 4391986 4251133
4786 4251133 4526138 4675677 4763146 4653168 4428383 4480587 4689501 4599672 4621457 4562668
4776 4562668 4762926 4632395 4539925 4832094 4683860 4643860 4913609 4903400 4694515 5015310
4766 5015310 4955683 5001024 4745277 4829614 4659675 4880964 4794195 4849980 5041098 5192229
4756 5192229 5351922 5141915 5125356 5243717 5359748 5465491 5406931 5169464 5218176 5345723
4746 5345723 5567285 5757492 5885711 5914055 6112506 6139895 6001481 5938620 6155421 6444429
4736 6444429 6992602 6752213 6493995 6646487 6839580 6965230 7159548 7471963 7400677 7756233
4726 7756233 8108390 8251388 8461666 8598802 9087120 9396765 9803460 10196031 10421389 11061919
4716 11061919 11521689 11613025 12021727 12403665 13155275 13744206 14074007 14429966 14895815 15210666
4706 15210666 15293510 15413851 15327632 15615509 15490978 15490695 15132909 14934250 14746607 14514314
4696 14514314 14267725 14048970 13878237 13732743 13676878 13254456 13195150 12781958 12835297 12621570
4686 12621570 12734377 12710409 12595170 12688110 12959809 13022365 13070945 13452027 13527844 13722452
4676 13722452 14004592 14569732 14567181 14842231 15609565 15916142 16222603 16517991 17019129 17237259
4666 17237259 17417917 17897561 18186494 18214575 18442987 18492968 18470125 18390483 18122388 18004908
4656 18004908 17991841 17896409 17885852 17828396 17428898 17220182 16870782 16538659 16283086 16189669
4646 16189669 15763537 15017728 14700863 14373728 13787310 13316375 12904532 12552318 12299293
4637 12299293 12188503 11685836 11269144 10993897 10752200 10226692 10048398 10123398 9995900 9794980
4627 9794980 9632458 9558872 9430785 9742438 9737790 9585318 9693831 9796451 9526096 9720284
4617 9720284 10105004 10033666 10191507 10264455 10266652 10253487 10602471 10623283 10580319 10809185 11003160
4606 11003160 10822676 10718470 10467344 10093207 9933338 9681141 9390402 8948626 8562055
4597 8562055 8234099 7966514 7809803 7405698 6955945 6808232 6474029 6226743 5922145 5753012
4587 5753012 5657514 5593831 5535167 5237989 5141462 5148253 4888304 4835426 4924331 4483741 4208037
4576 4208037 4253196 4254850 4277482 4225482 3938599 3878225 4018980 3977268 3560809 3625581 3623192
4565 3623192 3488855 3565045 3677365 3571601 3685912 3587018 3240221 3297789 3214265 3123385
4555 3123385 3176945 3284511 2938580 3211733 3160743 2958049 2732186 2655712 2802095 3060893
4545 3060893 2963792 2716398 2481586 2690808 2739280 2556322 2573497 2511838 2477930 2390771 2560950
4534 2560950 2546599 2486578 2505151 2567091 2440031 2374208 2416086 2214142 2412197 2647808 2236637
4523 2236637 2063583 2199968 2494020 2162201 2095576 2132064 2203113 2354342 2173787 2213967
4513 2213967 1988269 1924688 1957887 1918294 1935601 2035115 1917803 1933407 2135245 1964838 1822737
4502 1822737 2001834 2204557 2211934 2333308 2281643 2238717 2171099 2105189 2148407 2135880 2212239
4491 2212239 2270999 2818566 2826865 2702522 2532572 2609791 2692184 2606474 2722930 2725063 2713565
4480 2713565 2792233 2746581 2537136 2767186 2833048 2680641 2494336 2684530 2747630 2895901
4470 2895901 2915774 2592882 2489273 2652871 2851775 2837575 2677816 2739292 2784382 2860359
4460 2860359 2880456 2781590 2745334 2936148 2827212 2740882 2986696 3249967 3173931 3220064 3123611
4449 3123611 3049794 2899988 3037760 3329910 3258161 3364209 3661641 3873925 3889709 3873889
4439 3873889 3631060 3620474 3961723 3872608 3921361 4042311 4188718 4392636 4436555 4388476
4429 4388476 4561667 4799010 4734236 4898099 5156984 5373152 5155874 5386497 5530049 5583583
4419 5583583 5504044 5828568 6026763 6219462 6247602 6112543 6280605 6784203 7008819 6845438
4409 6845438 7085475 7642646 7940032 8042003 8214897 8241440 8530449 8933876 9050479 9324219
4399 9324219 9776671 10294597 10602594 11049479 11658703 12248326 12715450 13569234 14081676 14547573
4389 14547573 15560140 16683456 17834546 18989159 20392365 21845813 23616651 25296084
4381 25296084 26986468 28533348 30166421 31738121 33051311 34159891 35719883 38009105
4373 38009105 39724884 41532004 43049793 43745410 44107688 44447035 45216078 45979137 46861971
4364 46861971 47640119 47984865 47148943 45575571 43712933 42217106 41112217 40318145 39379478
4355 39379478 38175615 36881107 35104362 32803085 30847532 28973816 27418887 25974197
4347 25974197 24794784 23406502 22004694 20416333 19004483 17605578 16129010 14899030
4339 14899030 13819469 13410154 12994725 12368930 11527027 11367531 11429625 11073768 10453038
4330 10453038 10055386 9814965 9548501 9134933 8691763 8912686 8863657 8539057 8397104 8377873
4320 8377873 8069632 7574236 7306378 7215239 7196773 7369824 7216904 7006441 7201710 6911757
4310 6911757 6746349 6839198 6847521 6346805 6246373 6162848 6129790 6248948 6253190 6220724 6361501
4299 6361501 6527339 6389997 6001902 6034242 5946722 5834718 6032251 6203987 6354975 6357808
4289 6357808 6514626 6464061 6416548 6338049 6168370 6399574 6303688 5965476 5801235 6098518
4279 6098518 6066613 5870334 5785390 5566072 5697417 5796262 5915117 5981212 6259783 6334479
4269 6334479 6157237 6272173 6190875 6160983 6230524 6476445 6857718 7258393 7345064 7209219
4259 7209219 7389752 7714635 7830984 7755939 8250169 8699075 8920248 9196764 9681283 10428024
4249 10428024 10794832 10825355 10742312 10813389 11038633 11286028 11346013 11371475 11466746 10815063
4239 10815063 9960347 9692658 9504320 8956040 8746634 8662798 8187407 7577343 7598037 7593624
4229 7593624 7376220 7271379 6918131 6694291 6706925 6571492 6453257 6346283 6323219 6216181
4219 6216181 6321652 6175469 6030804 6120694 6390927 6373712 6235128 6131224 5689511 5806327
4209 5806327 6019345 6303036 6411213 6618285 6490358 6275330 6227650 6360289 6226767 6193195
4199 6193195 6299878 6324618 6345523 6357104 6495547 6586530 6431765 6305636 6083971 6417404
4189 6417404 6299348 6291571 6648645 6756013 6703722 6765052 6682849 6548684 6921897 7015072 7203503
4178 7203503 7081321 7007388 6882942 7090817 7113055 7336373 7503466 7725575 7891565 8103368
4168 8103368 8300419 8286236 8580454 8752969 8762027 8819834 9354194 9902132 10327879 10760214
4158 10760214 11082879 11438687 12079298 12499242 12844784 13774746 14397274 15137321 15866800
4149 15866800 16925919 17359153 17553847 17584567 17440352 16644914 15850272 15117949 14552887
4140 14552887 14272561 13573380 13044617 12890407 12911084 12683028 12500098 12306198 12406779 12521362
4130 12521362 12279636 11778161 11792069 11935026 11997945 12132570 12419382 12319014 12273211 12636759
4120 12636759 12847030 12918403 12811946 13014829 13266698 13431326 13376681 13241718 13497824 13976161
4110 13976161 14150392 14037653 14149267 14545445 14874688 15306611 15655553 15489081 16003186
4101 16003186 16145628 16522364 16925148 17355385 17760112 18214897 18502237 18993950 19230300
4092 19230300 19701924 19936379 20249532 20343732 20417931 20807481 20833891 20844523 20774453 21022544
4082 21022544 21490205 21905332 21844738 22415130 22737010 23407307 23931716 24303639 24550679 24927729
4072 24927729 25610887 26078074 26863169 27692129 28454682 29218337 29829983 30196775 30883728
4063 30883728 31951881 32940178 33972526 34710015 35450252 36530464 37724281 38637639 39349827
4054 39349827 40672320 42058935 42931490 44152606 45193565 46343351 47577502 49069434
4046 49069434 50517954 51772719 53377209 55112364 57249420 59262825 61139498 62966824
4038 62966824 65284677 67548367 69772174 71936340 74518141 77434519 80236839 82910415
4030 82910415 85373763 87989321 91290091 94553825 97748153 101205862 104821269 108334453
4022 108334453 112241652 116331936 120491539 125244426 130226405 135019950 139956130 145096597
4014 145096597 150754677 157094861 164152080 171634242 179809034 189550482 200817132 212870673
4006 212870673 226122929 240222453 254684976 268988660 282457007 294916934 304750353
3999 304750353 309592006 306698400 295599907 277791245 257320304 237424172 219835833
3992 219835833 204648099 191913062 180612942 171435719 163310058 155707986 148320441 141397311
3984 141397311 134842508 128568350 122422380 116549981 111232998 106383113 102157461 98061668
3976 98061668 94069867 90290715 87064284 83887513 80631060 77737123 75164862 72822228
3968 72822228 70608006 68803735 66412717 64300710 62359867 60732052 58996018 57356168
3960 57356168 55898495 54596535 53758130 52541121 51296130 50260754 49551652 48529980
3952 48529980 47626065 46802777 46161618 45646972 45442991 45025117 44615946 44375449 44286172 44039405
3942 44039405 43918390 43813782 43867522 43948183 44292268 44358213 43786514 43193504 42968804 42007130
3932 42007130 40894939 39975251 39078874 38171079 37267252 36478428 35815950 35469723 35112696
3923 35112696 34844629 34039165 33332894 32990686 32587264 32320187 31779537 31564422 31233446
3914 31233446 31064330 30507025 30229656 29868959 29608247 29501160 28769979 28040474 27828950
3905 27828950 28203811 27745962 27464573 27287201 27015345 26917904 26933351 26570280 26537492 26588198
3895 26588198 26391573 26405028 26287044 26272959 26179804 26287231 26519160 26567300 26489224 26448235
3885 26448235 26590201 26717987 26796140 26817026 27116020 27402553 28030981 27964721 28025110 28557410
3875 28557410 29306512 29783083 30087997 30315614 30876090 31926683 32711068 33846623 34870464
3866 34870464 35662486 36639187 37694518 38272064 39228370 40180460 40735147 41135039 41477228
3857 41477228 41319067 41136225 41217914 41364627 41267255 41345019 41404378 41594807 41860535 42092642
3847 42092642 42232569 42581990 43013752 43412934 43700951 44281595 44912941 45210268 45770355
3838 45770355 46228832 46860676 47538268 48240904 48863106 49379054 50199114 51281223 52566355
3829 52566355 53498191 54304615 55513094 56926897 58543982 60034539 61525468 63182471
3821 63182471 64836520 67170548 69393064 71422042 74270419 77168821 79821117 82747669
3813 82747669 86158320 89461460 93568105 97680355 101880758 106364088 111208604 116416398
3805 116416398 121543634 126830759 132212220 137740886 143322717 148449227 153637911 158757278
3797 158757278 163476563 167873354 171656329 174728710 177466466 179390824 180763363 181518075
3789 181518075 181560301 181287509 180453750 178740461 176422271 173582601 170317443 167170914 163374000
3780 163374000 158990189 154470189 149427254 144265897 139269997 133980314 128718345 123401372
3772 123401372 117755610 112573534 107542312 102683476 97664994 93021487 89032175 84797387
3764 84797387 80735632 77067757 74032729 70887366 67729809 65058367 62812196 60837193
3756 60837193 58733934 56922568 55228854 53414542 52107804 50835689 49534794 48592593
3748 48592593 47596349 46608556 45941764 45337926 44467150 43605739 43368178 43003139 42412524
3739 42412524 42053230 41729789 41378076 40881322 40438270 39989644 39381646 39036641 38424738
3730 38424738 37945591 37807387 37733233 37244703 36813553 36655436 36288052 35902942 35590306 35920300
3720 35920300 36018933 35955440 36027793 36242991 36205866 36094608 36154114 36235983 36458523 36445504 36203712
3709 36203712 36065758 36027425 35909694 35874483 35258059 34807204 34270330 33987220 33832191 34047522
3699 34047522 34197481 33693865 33249253 33089871 32785838 32527452 32274916 32203763 32598015 32574352
3689 32574352 32287936 32218279 32483396 32605386 32754371 32926081 33589925 34047605 34197215 34556506
3679 34556506 34771761 34994692 34880852 34723513 34528697 34496839 34262401 34170374 34089771 34078305
3669 34078305 33767990 33518262 33459614 33270134 32738723 32379305 31916432 31404461 30864196 29990457
3659 29990457 29273946 29024172 28685618 28091671 27773998 27580478 27528325 27387263 27383262 27238856
3649 27238856 27727542 27949605 28116433 28386520 28779513 28942581 29220471 29832936 30456460
3640 30456460 31019203 31467663 31998470 32532971 33107607 33912757 34370550 35105208 35776023
3631 35776023 36155469 36370079 37089676 37732830 38393675 38921721 39266573 39718247 40278544
3622 40278544 40569398 40481630 40821438 40992942 41120421 41287084 41580108 41636992 41894210 42216657
3612 42216657 42548224 42908339 43080130 43182004 43594653 44116713 44344185 44646915 45418509
3603 45418509 46168040 46727992 47570313 48372678 49446753 50639146 51828717 53164212 54632966
3594 54632966 56402548 58225109 60180512 62558554 64737661 67033720 69683334 72431944
3586 72431944 75254633 78320494 81207535 84450593 87568643 90805046 94294432 97564694
3578 97564694 101148008 104225826 107359691 110666507 113940687 116964511 119982315 122913748
3570 122913748 125742890 128599172 131066279 133617529 135897876 137895036 139703769 141513166
3562 141513166 142807264 144224899 145403657 146138103 147067052 147508868 147923907 147932471 147920460
3553 147920460 147732053 147521629 146712583 145885566 145015470 144107869 142807955 141331571 139865659
3544 139865659 138205430 136392110 134375934 132126827 129903624 127258595 124125540 120934261
3536 120934261 117945084 114689943 111232869 107979941 105044064 101595935 98204455 94853140
3528 94853140 91333653 87956623 84935202 81669319 78418254 75509726 72090956 68817006
3520 68817006 65903383 63378058 60545752 57915592 55645058 53603520 51773652 49879011
3512 49879011 48215721 46917254 45888671 44729008 43514668 42486623 41627253 40798623
3504 40798623 40249750 39790115 39099830 38842027 38353694 38036452 37666126 37347373 36978593
3495 36978593 36923519 36659976 36369397 35664999 35480465 35443697 35141137 34915209 34449072 34272483
3485 34272483 33721875 33076446 32332014 31844605 31247468 30739726 29960954 29190751 28453241
3476 28453241 27561075 27091190 26383873 25680259 24946682 24251007 23659480 23075747 22232684
3467 22232684 21308103 20901691 20339526 19536739 18683755 18099775 17599685 17000933 16227791
3458 16227791 15482432 15032722 14375295 13874087 13652284 13267513 13000836 12513061 12223189
3449 12223189 11945880 11621315 11328477 10937129 11032541 10837318 10325619 9992358 10051318 9927246
3439 9927246 9698018 9081744 8887600 9246149 9186224 8740839 8506645 8508506 8375883 8090751
3429 8090751 7740398 7751556 7715458 7708051 7391459 7408159 7319334 7073669 6910511 7058793 6981537
3418 6981537 6530346 6073245 5951920 6159897 6019780 5986190 5845418 5874192 5624707 5498469
3408 5498469 5356609 5451109 5478524 5471215 5327443 5373649 5468359 5151350 5174570 4808127 4690400
3397 4690400 4647614 4771778 4782401 4577154 4492365 4244525 4326837 4443177 4399196 3830831
3387 3830831 4107936 4122161 4100124 3877949 4054872 4001067 3769457 3676025 3451598 3531583
3377 3531583 3236660 3311699 3397662 3622934 3575180 3203020 2944124 3017164 3114564 3053400 2953220
3366 2953220 3150302 3230934 3127611 3156037 3130059 3173842 2924343 2697614 2651190 2685150 2589663
3355 2589663 2453856 2731848 2724384 2557853 2424007 2483484 2484480 2694202 2486767 2781616 2874987
3344 2874987 2850424 2550697 2734198 2824803 2656409 2649500 2637431 2631884 2762765 2800671 2631711
3333 2631711 2742977 3076887 2897878 2623586 2691548 3064786 2983067 2985134 2836563 2407239
3323 2407239 2473131 2457473 2329865 2281735 2410709 2293575 2513778 2534325 2479661 2274250
3313 2274250 2320515 2098075 2120629 2022858 1798916 1928579 2312852 2356758 1765535 2080589
3303 2080589 2017046 1880554 1937284 2072065 2017672 1853772 2071350 2017529 2140426 2095551
3293 2095551 2063589 2085218 1891689 1712672 1721530 1796408 2110214 2118152 2105925 1951659 1840065
3282 1840065 1966317 1978807 1999156 2057567 2160072 2241778 2038316 2085747 2146688 2144266 1980911
3271 1980911 2067069 1884683 1819538 2293315 2417761 2233928 2051933 2079639 2138385 2418140
3261 2418140 2314265 2124116 2135894 2181417 1946303 1966401 2047151 2081132 2215790 2259791 2365315
3250 2365315 2056688 2132516 2094708 2287421 2375973 2456427 2340168 2216876 2083831 2135530
3240 2135530 2438002 2269341 2371514 2017274 2206455 2196528 2383368 2389819 2110372 1919993
3230 1919993 1887495 2000245 1738521 1944360 1978585 1973672 1731183 1955008 1764075 1796639
3220 1796639 1760474 1789500 1835571 1722202 1628995 1684650 1988059 1980237 2000498 1874515 1892167
3209 1892167 1919012 1889530 1957264 2022187 2593937 2592076 2521309 2633838 2622497 2465635 2261840
3198 2261840 2543454 2625376 2445278 2327355 2470689 2208229 2137660 2061833 2278988 2351480
3188 2351480 2522916 2423609 2200314 2360300 2353055 2323323 2479436 2419258 2302489 2288980 2149397
3177 2149397 2134415 2296376 2202136 2283439 2352478 2434271 2531593 2473672 2519200 2506339 2445907
3166 2445907 2533786 2351332 2453844 2597491 2696525 2715463 2686007 2586738 2335643 2169967
3156 2169967 2216610 2328277 2606491 2676291 2661114 2661017 2644230 2494213 2411426 2587957 2482218
3145 2482218 2541646 2850775 2911913 3127027 3254258 3392734 3201888 3016003 2962088 3129849
3135 3129849 3586117 3817288 3902164 3877767 4069311 3989031 3966003 3664324 3826023 4010657
3125 4010657 3945464 3816852 4029047 4209573 4395834 4307606 4355935 4367322 4354853 4613434
3115 4613434 4703601 4906914 4886827 4758218 4930030 5563922 5404381 5528868 5774425 6220991
3105 6220991 6625472 6573809 6733066 6954059 7281305 7486021 7713981 7974588 8377719 8986662
3095 8986662 9513255 9787000 10497753 11249195 12016722 12901700 14249890 15532213 16852550
3086 16852550 18659362 20686595 22487545 24499944 26581541 28761354 30959709 32403665
3078 32403665 31283999 27965006 24553051 21542725 19400492 17737099 17008359 16345257
3070 16345257 15727603 15302894 15141967 15230865 15404682 15426398 15692810 16189716 16893364 17968985
3060 17968985 19001383 20181946 21724920 23772392 26191545 29222166 32167749 35871584
3052 35871584 39617953 43075013 46924186 50987643 55206366 56624981 51611711 43850033
3044 43850033 37379654 31814098 27812568 24792488 22409232 20579174 19160348 17953062
3036 17953062 16791214 15935245 15294806 14906961 14650481 14459719 14421130 14591882 14966327
3027 14966327 15271550 15473033 16247626 17396386 18721988 20276589 21669083 22965212 24485297
3018 24485297 26229640 28023739 29491493 29081960 26097994 22755625 19362571 16524619
3010 16524619 14483815 12894415 11889282 10952783 10310710 9237330 8625493 8157176 7507811
3001 7507811 7224234 6974605 6434815 6027353 5836100 5332886 4953032 4763011 4779957 4535825
2991 4535825 4424459 4458197 4243386 4140149 4068615 3948502 3357089 3391729 3229140 3023794
2981 3023794 2968674 3039110 3073162 3080911 2964628 2777821 2820706 2762420 2545914 2445732 2454911
2970 2454911 2362529 2458673 2340709 2348623 2053771 2160765 2163954 1941144 1949438 2014604 1798962
2959 1798962 1806141 1999956 1837128 1786849 1750254 1913508 1729745 1535610 1651102 1448883
2949 1448883 1848727 2078658 1613517 1490861 1635822 1273818 1354634 1624994 1496567 1400323
2939 1400323 1350967 1096114 965859 1005314 1054365 1055602 1196981 961271 725950 707530 707206
2928 707206 818264 818418 902221 957262 811740 891595 728510 689212 839381 639241 886586
2917 886586 905128 812968 585157 736174 788688 661188 557055 569606 620637 709709 879060
2906 879060 762098 559002 696238 800612 678832 380509 555226 642448 648456 356135
2896 356135 419770 429139 567888 370841 479310 579557 561105 285392 467703 761232
2886 761232 552667 274744 138209 386339 357043 459875 422818 564410 439764 326957
2876 326957 358296 604266 697052 540333 383396 536050 918422 923955 694954 383774
2866 383774 482735 428174 354539 533788 686315 563577 299368 634641 718304 590650
2856 590650 583621 543101 281646 295812 368394 429666 423220 550723 413241 461956 366265
2845 366265 558902 497244 528073 373203 280564 68031 30593 172757 183801 116171 49708
2834 49708 332722 200576 372983 263233 -44815 -84591 -13280 227057 287617 236520 52957
2823 52957 297892 262367 317188 164239 140384 -48718 20174 -65355 -105427 73500 191724
2812 191724 411017 209173 -98545 -324569 -156882 -125127 -134001 17697 365240 101441
2802 101441 28689 -124378 48051 9692 292210 319316 245397 294904 205664 105130 -52640
2791 -52640 98410 147974 -15309 -74403 246880 435450 237101 426002 671187 307812
2781 307812 150868 -32129 55424 407060 226711 65224 102167 409422 307759 246649
2771 246649 309234 528045 560049 198940 45449 44550 192239 194310 20178 34794 282223
2760 282223 230154 -13698 -78302 19860 -100312 -367069 -185086 289453 56813 -342002
2750 -342002 6541 397526 164756 -164352 -185663 -140610 -170136 -310970 -399328 -104976
2740 -104976 280058 257916 -300958 28166 290107 -42106 -210280 -161804 -120178 51812
2730 51812 -205675 -132341 -16857 -44097 -159649 -185772 174886 41598 -36740 -106153 -32233
2719 -32233 -21510 2435 -39149 -8756 -115371 -83952 -165388 139245 -39559 -350580 -347747
2708 -347747 -216139 -512467 -481174 -337230 -334653 -9351 89763 24207 -22282 158608 -186025
2697 -186025 -376531 -245160 319700 -37734 -246663 -215226 38388 115313 -175619 -125325
2687 -125325 65676 114541 -102136 -179194 -354200 -1342 -93867 -46213 -30519 -25905 124894
2676 124894 -255989 -276495 -218197 -242379 -268199 -274014 -200726 -254339 -491770 -290673 -177411
2665 -177411 -62494 -307035 -558385 -546808 -559825 -354980 -572495 -365392 -381697 -274795
2655 -274795 -414761 -355806 -362118 -500668 -404655 -260340 -636287 -820968 -668942 -559007
2645 -559007 -210650 -198267 -216640 -29742 -85765 -38028 -168075 -207462 -198013 -198905 -28502
2634 -28502 -1949 -176600 -136263 -128959 59234 -36347 -52571 -75588 43279 6367 -163714
2623 -163714 43676 151144 -49490 -150141 58069 -124916 -63179 -106382 -44272 -47361 58245
2612 58245 -160599 -237568 -374853 -188947 -322135 -17225 148447 -194496 -374013 -199914
2602 -199914 -173316 -126225 -432266 -554640 -372191 -322257 -37469 -242330 -201460 -300252 -437340
2591 -437340 -370496 -369102 -281469 -598449 -399895 -234236 -2449 -165872 -407529 -519382
2581 -519382 -182357 -502998 -548063 -362193 118040 -98224 -13058 -18748 -333299 -90250
2571 -90250 -272834 -371401 -364700 -264666 -433805 -272233 -95183 -69833 -534468 -485536 -181297
2560 -181297 -42172 43306 -49373 256878 115542 -254281 -229326 -299133 -213430 -111831 -18559
2549 -18559 -29903 142621 54164 40765 -56690 43561 -13174 -33519 -277634 -177225 -240001
2538 -240001 -131269 64492 194165 -121636 -341572 -450770 -379369 -406746 -354160 -323716
2528 -323716 -152774 -167511 -238700 -183656 -194112 -311133 -578867 -535350 -412459 -342129 -307911
2517 -307911 -413015 -184711 -294428 -655090 -575592 -520361 -484628 -399556 -266014 -368621
2507 -368621 -444234 -539021 -700189 -399353 -290104 -415365 -318877 135319 -117739 -254847
2497 -254847 -175500 -239225 -152779 -328907 -414262 -462220 -154116 -334149 -294904 -222302 -153049
2486 -153049 -325105 -256819 -164857 -316071 -335537 -216933 -280136 -407463 -158729 -177072 -155006
2475 -155006 36258 413 -33690 -82603 -243771 -457574 -472128 -286431 -204408 35534 1369
2464 1369 -124923 51042 77094 -94018 -240986 -424803 -487555 -339348 -279029 -142481 -226244
2453 -226244 -304819 -160491 -228972 -351678 -393089 -578867 -288294 -188035 -196792 -468380 -419805
2442 -419805 -285431 -359549 -312854 -387389 -429430 -546353 -384902 -197222 -98215 -488356 -704573
2431 -704573 -593552 -251681 -141420 -283465 -202527 -278582 -314837 -377675 -171681 -239037 -167944
2420 -167944 -434482 -361539 -427615 -290435 -229074 -166541 181630 66381 -16747 -190007 -86952
2409 -86952 -321909 -135760 -87755 -273 -77254 -135563 -225961 -347285 -173124 -151500 -59501
2398 -59501 -137909 -95993 -402954 -490232 -167141 -75324 -128260 -218369 -353863 -467853 -455015
2387 -455015 -457586 62162 -176819 -373321 -241396 -99331 -69590 -422973 -290541 -187726
2377 -187726 -17736 -16309 -319488 -411327 -85800 -77695 -271348 -184680 -22341 -197629 -266449
2366 -266449 22815 -434 -8883 -248502 -564542 -430271 -99110 -64756 -125111 46734 -113274
2355 -113274 -218294 -218994 64333 16392 -124278 -26460 -154553 -76219 -77700 -159297 -54713
2344 -54713 137309 -57866 -335696 -74108 -83145 166614 168066 -6147 -191713 -152302 -293936
2333 -293936 -401792 -259294 -190867 -240560 -257174 234212 26580 -186910 -315082 -138395
2323 -138395 -283794 -199057 -262825 -236023 -74584 -82850 -159904 -179059 -11127 -103820 -39732
2312 -39732 -74400 31589 -317483 -357582 -138271 -74280 54482 -106892 -121992 7392 -143942
2301 -143942 -347064 1914 54564 167392 50944 -84172 58587 -54155 -44304 -321622
2291 -321622 -96807 -21375 -86404 -142076 -388667 -8583 -16466 65923 -71516 17442 200001
2280 200001 300587 82730 180324 128186 17769 153323 44497 160524 63402 -21408
2270 -21408 -19556 130386 25034 83475 154274 293508 112235 28903 177661 138824 61397
2259 61397 -187663 -323098 -312502 -24166 -50751 103444 210506 68582 178796 77811
2249 77811 -19296 -270327 -90972 41030 383377 410847 400856 260826 134122 13115 -198492
2238 -198492 -211939 -224295 312735 105616 -32601 -28013 211738 135121 -178478 -128782 -57628
2227 -57628 -200324 -11655 460236 428297 418862 70319 -142342 -16854 77078 -55332 56618
2216 56618 451410 448794 223373 3778 -27857 -51006 3601 -77525 79278 481326 452984
2205 452984 391823 445772 466779 201242 82635 176429 232914 233844 455433 771102 786864
2194 786864 609280 274155 134190 307544 247173 134027 242231 461582 612103 787272
2184 787272 491914 398209 353426 383367 120679 261907 369923 450744 643858 799133
2174 799133 543085 224893 581542 609434 657881 703958 750361 877683 988963 660368
2164 660368 717523 754027 941497 893325 1069143 962394 1009373 1018329 757151 915862 992219
2153 992219 982628 1075764 1371460 1287738 1166059 1084480 1433767 1582233 1476198 1460187 1582513
2142 1582513 1633926 1652762 1659099 1956833 1963137 1781077 1882877 1881563 1949161 2058763 2294406
2131 2294406 2502466 2664285 2286603 2566444 2702870 2726625 2670567 2912753 2947683 3134440
2121 3134440 3304680 3454452 3504815 3586731 3709884 3675979 4161163 4141631 4308479 4241655
2111 4241655 4651642 4619401 4757722 4957937 5405864 5724694 6272218 6705946 7162588 8062433
2101 8062433 8539697 9001637 9584348 10445892 10842082 11768989 12896827 14251219 15943560
2092 15943560 17999403 20372601 23039974 26445532 29181096 31965508 35187047 38580327
2084 38580327 41649847 41816855 36729869 30379945 25502337 21439618 18134504 16038232
2076 16038232 14153687 12165820 11343494 10607949 9744064 8850348 8107645 7669401 7237037
2067 7237037 6710301 6334925 5909331 5466341 5097971 4605765 4462166 4419246 4166786 3949424
2057 3949424 3885291 3543872 3331303 2990269 2818678 3147608 2879326 2694706 2534594 2518274
2047 2518274 2499048 2263244 2100954 2133947 1756290 1849601 1874158 2025610 1931596 1936930 1716326
2036 1716326 1817968 1372221 1018229 1047542 1278472 1565738 1552767 1346648 1276957 1370556
2026 1370556 1129186 1097713 1108353 1180655 860629 1079058 1042879 1137685 1141009 952140 950420
2015 950420 1034252 1349741 1027614 1004805 694678 677303 573277 453471 494509 689241
2005 689241 497096 643157 970422 732568 475021 652052 775216 338130 376506 292687
1995 292687 459040 344216 520504 409191 678639 460577 205891 94994 230503 432121
1985 432121 264059 304114 187854 250783 408675 344458 327137 554329 446205 309310
1975 309310 357835 389917 349017 303602 396433 211037 166131 222052 399727 693715 466297
1964 466297 -12938 51005 103818 45742 -107433 -67770 181942 94583 108078 359059 219493
1953 219493 158031 -44831 -120235 49687 168074 -27285 -2870 171059 12129 -164481
1943 -164481 9750 -109057 -267514 -91083 78168 -15075 136547 -172252 -286843 -251473
1933 -251473 84773 29213 259755 551795 248474 36921 48296 78199 79918 304966 251053
1922 251053 113889 67909 212933 17280 249636 156676 -154753 -307057 138196 140747
1912 140747 3026 -114348 -124382 -88779 36386 -62459 -294445 1278 -149612 -336864
1902 -336864 -192013 -66436 -238959 -158170 -67243 -195726 2052 -216148 -236348 -261311
1892 -261311 36242 -120509 -326135 -195900 -268672 -588691 -392599 -72544 -2205 29622
1882 29622 2027 -183629 73806 27994 -325875 -595022 -189805 -82801 -353368 -146053
1872 -146053 59207 59551 21733 110465 44275 -33350 -200799 -272790 -19867 193073 214306
1861 214306 142478 456786 246618 81644 -258422 -280052 36320 36992 -298925 -486761 -220822
1850 -220822 16918 99281 79450 181579 -54033 -46217 -46579 -42038 -332414 -226804 -49005
1839 -49005 87037 -57235 -82705 127242 302955 317377 417435 94842 26245 -249782
1829 -249782 -356478 16016 292665 252274 98461 144249 139648 -62330 84279 140937 149363
1818 149363 79149 -71831 -12069 138929 34556 -65852 -229400 -83617 -177179 -278720
1808 -278720 -347657 -389912 -306787 -74593 -199276 -275354 -162295 -251529 -378602 -250030 -136170
1797 -136170 -249887 -217392 -370791 -257499 -272235 -121757 -184054 117904 234530 -63465
1787 -63465 -141145 58122 24342 -36718 -17251 -116784 -123450 -134776 -143246 -9543 176424 269287
1775 269287 -167305 -247525 -193204 -279080 -273581 15358 -129206 10838 117403 23889 -137343
1764 -137343 -217750 -69253 -14330 -21286 -79753 -62458 -350921 -371661 50456 45558 -404270
1753 -404270 -23050 -7698 -41286 -26358 -288596 -215086 -149386 -277310 -307042 -190207 -34405
1742 -34405 39352 203295 269406 -22616 -70314 13024 -219409 -191038 56318 -192387 -242070
1731 -242070 -49242 -98464 1010 248286 177332 -34598 113629 -110863 -105770 -78353 -66734
1720 -66734 -198167 -124154 -95772 -199825 -222072 -201415 -302419 -359546 -166589 11543 -261053
1709 -261053 -325323 -155327 -242524 18833 -62753 -243970 -313476 9816 -66346 -424870 -522596
1698 -522596 -237272 88867 3221 -39905 130330 72367 196337 170079 84816 -80724 -231745
1687 -231745 -182052 71649 87804 -96815 -54652 -11113 226177 274025 113379 -24659 -114344
1676 -114344 -41850 1161 -282017 -189520 108090 77008 -4739 -244269 -184094 -291668 -439386
1665 -439386 -383706 -349752 -214051 84917 89379 -78239 -157709 -337130 -333759 -317184 -305716
1654 -305716 -267792 -132786 -34460 -246219 -140437 -107288 -58685 -79937 -188876 -323750 -264627
1643 -264627 -147699 -123095 -28461 -284709 -263562 -174472 -27172 91401 -9431 65071 34804
1632 34804 12148 97925 57061 -303742 -245502 -8735 -218927 -337701 -26785 -49609 -44248
1621 -44248 520 -323429 -320741 -246683 -218793 -285603 63674 106279 16342 -78005 -221623
1610 -221623 -209778 -254091 -207470 -349875 -447503 -385801 -599346 -560819 -161225 -156576 -302074
1599 -302074 -156637 17497 152806 -96939 -29802 -94114 4520 23563 -134790 -271922
1589 -271922 -195021 -186182 -22473 298834 66271 -375791 -160912 65113 -402134 -177879
1579 -177879 88156 100185 112694 -107517 -232497 -93498 211183 83409 -275642 -159453
1569 -159453 -237757 -176484 34035 -215773 -158716 -193812 -310897 -426999 -189354 -53503
1559 -53503 -107980 -157467 -18338 -270656 -571618 -437209 -271942 -287961 -55153 -22953 -143215
1548 -143215 -215691 -42487 -163456 -168387 -115296 -241938 -235351 -52688 -197159 -478300 -261715
1537 -261715 -281279 -276145 -216111 72398 -211962 -202732 25739 116328 -322488 -329771 -302217
1526 -302217 -344162 -164118 -80437 -258700 -193285 124672 92182 -139593 -222726 -198861 92890
1515 92890 -6526 45779 -93853 -159398 -423195 -343020 -56423 110286 -27949 -79083 -147008
1504 -147008 -154143 -38342 158627 15412 65532 20736 -39169 -47831 126181 104596 -82280
1493 -82280 -162508 14126 1169 -49560 17232 -23362 40481 -24673 -121272 -44995 8233 -162823
1481 -162823 -7096 284481 212521 -307584 -368324 -277873 -31685 73119 -63893 -259849
1471 -259849 34563 -120380 -217681 -244587 -378099 -382613 -191527 -111524 97172 176193 -120668
1460 -120668 -132667 -287397 -245948 -69811 -330408 -120570 -94454 165303 66364 -122454
1450 -122454 -229755 -71618 -225701 -217508 -237170 64589 63596 130946 -5987 53525 -129726
1439 -129726 -100025 1103 142929 283169 309823 282385 113271 9707 -191085 -51383
1429 -51383 -235425 -151527 114558 -149845 -285833 -324050 -232685 -73181 -57773 -306235 -333352
1418 -333352 -28571 36848 148227 164536 -16375 -41807 232388 122755 -105932 -366671
1408 -366671 -276162 -133729 -204791 91522 113747 -240403 -40633 6524 187125 87358 -69153
1397 -69153 -229548 -144789 -109182 78807 30535 -50397 -288431 -167833 -57697 -161884 -255544
1386 -255544 -110436 43757 -130297 -64406 -189504 -413387 -208200 56038 15756 -89538
1376 -89538 -171197 -204127 -91780 19011 -160586 -538940 -266600 -157856 -64658 18652 -44438
1365 -44438 -316752 -280326 -266688 -239099 -161564 -200101 -222595 -17074 113045 121931 218567
1354 218567 255914 124323 78884 -86222 -65414 -24741 128051 90695 264867 362684 291653
1343 291653 159159 82745 311969 361468 225507 -15849 -58354 -126968 205481 -21279
1333 -21279 -25082 -15866 -71661 -62551 1627 -60099 -192049 -435726 -350500 -89249 -36168 -342178
1321 -342178 -128007 201957 -107343 -193362 -119342 -207457 -202139 81648 10427 -196464 99140
1310 99140 -67736 -220874 25265 47829 -209613 -198538 -53039 3119 -66585 -210201 -214160
1299 -214160 -178645 -282742 -369468 -225012 7119 8474 -112899 55317 104931 -224694 -429478
1288 -429478 -394098 60894 66219 -18873 -122086 94683 3171 -267939 -181993 -211112 -73115
1277 -73115 24983 89432 96575 33899 116452 58798 135711 346689 8809 -240350 46684
1266 46684 152395 134079 179427 -47179 -108781 -158685 -237331 -261017 4297 -140531 -269008
1255 -269008 -147321 44056 -34350 -194584 -224936 -322234 -69812 176168 -36813 -166374
1245 -166374 -176409 -209789 35168 3043 -79480 -303466 -208500 -105509 -187322 -77931 33475
1234 33475 -110089 958 63218 -255758 -362152 -131267 -42860 -401642 -190990 14126
1224 14126 -57629 -62563 -7100 -144597 -222938 -92715 -215707 -341090 -137972 -246585 149547
1213 149547 244440 72561 -73593 125317 40773 47046 48025 -155691 37754 -38762 -81420
1202 -81420 -229817 -89316 59555 13742 -267865 -181426 47255 93755 165940 -146405 -270439
1191 -270439 -147185 -40161 111635 25669 -171836 -405890 -48710 123379 -105908 -271005
1181 -271005 -174428 -210652 -184585 107051 101105 31928 115750 -49707 55419 171446 -65529
1170 -65529 -177406 -290794 -186055 39049 -28775 -3181 93141 239123 90798 -242313
1160 -242313 -288589 -407579 -379615 -252513 -201897 -94280 19402 -157121 -35836 121305
1150 121305 58875 -177746 -259112 -104980 -109163 -302172 -228845 -327392 -117491 -30211 -99769
1139 -99769 -21893 -206619 -133119 43991 189018 -129339 -450341 -368560 -152656 29364
1129 29364 -87901 -493551 -364367 18568 43197 -39467 112864 175661 -68716 -83291 -357751
1118 -357751 -189698 33429 210883 139201 93548 67018 -71496 -49673 43599 71319 118278
1107 118278 197045 -46216 142398 93515 -68801 166524 204540 102791 -91239 -131447
1097 -131447 -74665 -226269 -132863 49452 165122 297949 328312 99929 55142 -116018
1087 -116018 -184185 -224834 11529 -138805 47285 323666 305542 98126 -160955 -374867
1077 -374867 -279471 143687 -8136 -291606 -214107 -12593 -273880 -418696 -107427 -58555
1067 -58555 17674 -77999 -253215 -189920 -89676 -123159 -271385 -141518 -412210 -498242 -92032
1056 -92032 90454 31811 31007 -82403 -214538 -205925 -120353 -219051 -58642 103848 -16158
1045 -16158 59768 291781 220407 54598 -39103 -81505 -117664 60772 213775 42200 -106686
1034 -106686 -115882 -107950 158954 31521 -239358 47130 258593 -11493 -185453 -422229
1024 -422229 -400067 -14519 157406 147983 -145961 170876 112753 -92550 -87512 -272501 -312153
1013 -312153 -47950 131498 133683 169804 124714 214551 174396 147055 -165646 -118735 -101174
1002 -101174 -104355 -44166 46736 288341 122140 241612 8685 115575 -58255 -238979
992 -238979 9548 -101342 66890 -53714 -299090 -391357 -331609 -197492 -114998 -22908 -18242
981 -18242 -214314 -226987 -56994 -61657 -100250 -214734 -89942 312741 211330 -93177 -104850
970 -104850 -50056 -184566 -180157 22505 120018 -263001 -44597 167726 135473 244535 -180950
959 -180950 -268127 -75420 58847 -278156 -138677 51183 235739 57499 213780 235400
949 235400 185659 130672 31456 42845 -154430 -137769 -250324 263216 309188 115732 -115342
938 -115342 98994 40000 -64313 -159577 -314363 -221871 -398221 -207798 -370373 47604
928 47604 88660 -155585 -335562 -255970 -108820 -227655 -311040 -208151 -22990 -112466 -253718
917 -253718 -160794 -32801 -326141 -321376 -261327 -51342 -85521 221507 221584 73969 -195539
906 -195539 -200431 -175966 52899 260557 27693 -82824 -35399 72944 -10836 -95654 -256749
895 -256749 -104480 115881 58964 110903 429520 360688 155228 92553 -69604 11879 -223878
884 -223878 85870 175656 181828 177912 231529 328886 232068 69855 62660 -98045 -217076 -120475
872 -120475 122490 193569 133499 168728 115358 190390 202730 224789 -51385 220448 328241
861 328241 157400 -36579 -68907 -172335 -39608 155651 375805 403881 418260 103487
851 103487 75799 216923 68306 -96011 -289077 -196459 -19175 192221 156865 220761 97957
840 97957 -264425 -327038 -371741 -225542 -246725 59117 152984 189545 99217 -270016 -553890
829 -553890 -172448 149854 51409 47632 62496 130409 -120233 -56789 -215291 -115714 26876
818 26876 3310 290419 439957 308430 -40674 -21136 -101988 -210988 -189950 -42471 68532
807 68532 496775 416290 181145 166690 85473 11422 134493 373778 573804 749449 632498
796 632498 526976 193851 54455 -124115 -118941 288972 349642 491775 471175 411938 316324
785 316324 127031 26880 -157978 -169726 -152459 415052 476782 465043 247765 -64982 -84683
774 -84683 -139477 -111997 -3540 328406 380254 261587 104783 54000 -302618 -288254 -229094
763 -229094 -60563 231464 231566 329053 120859 54994 -105889 -234249 -296969 20006 -73748
752 -73748 -74467 -130464 -9914 140291 -53240 -346008 -70770 -207919 -258183 -24873 -13544
741 -13544 115851 -197042 -31997 44114 43151 -103631 -19588 49833 -168691 9736 85609
730 85609 -42911 -311775 -171699 -84411 248038 326355 385983 170990 -26783 103034 208134
719 208134 202285 275409 235621 180057 132225 99114 396169 394512 139440 63293 126489 12412
707 12412 -76985 98469 215006 110842 181198 115302 250139 411300 411566 389561 460985
696 460985 176258 -42509 -24815 -108954 39670 357241 320932 402031 343423 377865 116159
685 116159 -7426 122162 103738 4178 227992 140837 79145 -97497 -74395 -149299 -68815
674 -68815 -318974 -163429 27336 310663 253892 206969 144571 140944 97192 -257676 -212713
663 -212713 62670 339931 291132 427635 190639 -160948 -186765 -177739 24517 332183 157579
652 157579 132021 377080 489708 170771 -277696 -266067 -116264 -74724 -82444 -145715 328482
641 328482 184411 107360 94256 25691 -252106 -153605 -220030 49532 184581 155038 -175953
630 -175953 -18636 12331 -21330 -31767 187786 231592 142530 410963 365007 136762 265768
619 265768 239929 78322 132307 825 -124713 212733 439318 319398 268630 182361 91691
608 91691 -46003 72891 57399 -33902 93620 103722 184591 253195 163660 191472 220493
597 220493 162926 92666 100523 -37279 57087 259887 249392 141395 109401 -93265 35634
586 35634 -39058 72381 -141485 40379 -44860 27254 -242557 -241527 -36978 -68153 81153
575 81153 188729 225648 35650 -203096 -76800 92912 96072 28578 133540 205742 332059
564 332059 264214 243737 60247 63464 -91485 -141044 1559 -68677 -110714 -218287 -379076
553 -379076 -101487 -57957 -220694 37525 66522 282443 331214 282549 171424 -21942 -186463
542 -186463 -1274 95940 108340 198709 250467 273987 51695 -183072 -223667 -226308 -58343
531 -58343 126697 189688 282962 457425 256482 244027 58422 151446 40481 11810 -4943
520 -4943 288011 411559 256313 89178 133666 -36956 -78951 161026 305553 272410 369742
509 369742 483564 408107 139558 -161625 -115555 107897 203669 162211 -75962 151288 161966
498 161966 193185 199308 192338 338182 225929 128545 80198 135370 106292 88456 270861 242777
486 242777 183254 159598 94152 24127 145040 110928 174244 134980 -4017 -75810 45212
475 45212 -75485 -67502 100497 157327 15158 -145464 127983 82654 282742 140243 -59809
464 -59809 -149172 -44324 15988 7724 -35876 172130 427815 67228 -146945 198255 170548
453 170548 94616 18563 242619 189771 38490 151514 259077 162073 325062 116199 -6876
442 -6876 108174 31373 15911 186980 415076 246493 68407 -145464 -4950 290547 310264
431 310264 149891 -33578 203151 58469 127790 -132139 23724 43220 135496 36214 242583
420 242583 92284 7787 87178 229903 86978 -140631 -14771 167810 82927 105518 196428
409 196428 -45999 -127539 30189 202035 333566 195758 163411 -26505 -31513 66574 33792
398 33792 239899 151930 172384 1081 57964 -163001 -26607 13222 237382 223526 179863
387 179863 -142675 59756 108528 32778 -75149 -67213 -118256 34206 228602 105146 30237
376 30237 127539 264355 277026 223641 155289 202686 188426 270120 379163 171883 354363
365 354363 207849 244373 76578 110840 100156 236460 57968 -8041 -119904 195838 113395
354 113395 -94715 -90744 64797 215241 70839 117495 -8076 191808 188960 34397 20571
343 20571 16413 -107983 147487 365339 283340 27454 -73640 196111 325601 23565 -309617
332 -309617 -139176 -118414 -181830 117535 124878 74683 129535 199519 -27749 25891 -213087
321 -213087 -147723 40418 15621 -249804 -94948 126348 252182 330046 287817 -103384 24637
310 24637 203432 156843 280341 333168 75376 89008 -35627 -90596 -98104 120717 1458
299 1458 18899 117531 333417 202838 22768 43114 99944 70660 133793 -2181 -33766
288 -33766 48998 277672 206818 200244 188094 -25997 98411 140311 219799 103243 340492
277 340492 331193 184762 -60947 -217929 -269892 87196 489382 414806 142398 410623 502610
266 502610 309514 98656 105919 -72990 50667 182617 168786 34486 -31677 155837 -38781
255 -38781 -43263 -130052 -345494 48842 115228 -79144 -219277 -225524 -316190 -13789 -201891
244 -201891 -292309 -263162 -47740 -28362 161045 113297 104919 99991 207155 196152 92995
233 92995 208357 170586 193403 169229 79257 107291 174349 120621 85949 66928 242930 332970
221 332970 334840 150729 265198 301186 270856 430359 286650 198270 275509 451767 266418
210 266418 99505 91681 -34375 42078 190970 396386 112450 208884 299722 318345 226650
199 226650 70636 169287 235624 -68074 -207133 86642 236906 19230 233333 42238
189 42238 -78134 -112876 15930 -178885 156365 -63883 -36463 18417 208885 51197 -52269
178 -52269 16598 -152589 -93020 -38114 57041 -153226 -399 55742 51126 127549 51455 -110560
166 -110560 -89600 -138624 -66361 -85188 62410 196028 180480 41160 -858 -76184 -19889
155 -19889 90861 63681 312860 335154 -76995 -123406 -109444 -118814 105659 338956 146424
144 146424 56004 242302 190387 -10209 91716 360742 246499 -52921 206650 208274 269074
133 269074 272953 283563 114013 180438 97026 -2093 116422 309301 286384 172834 199966
122 199966 117567 93727 312622 303555 172596 93249 17486 141377 265889 76871 -57841
111 -57841 35904 228423 28954 47405 4933 168543 241126 168529 19025 -10219 -22054
100 -22054 -139999 -9248 44274 37338 34842 254031 74252 -43414 -152935 -249492 -177633
89 -177633 -104524 56383 35870 143751 254822 128448 49376 118348 72491 -220841 -197018
78 -197018 35411 242277 232140 358568 393062 386373 135865 -37051 -188105 9699 -3468
67 -3468 -13669 30437 189507 165059 -59382 27198 87295 101844 56056 120088 105673 131999
55 131999 158732 53956 174234 293791 170855 113956 192462 198341 311905 247785 193470
44 193470 155388 213554 54964 26871 278988 338266 166760 61549 15950 98230 100567
33 100567 -82075 -45616 67247 -56349 -87107 21179 97341 153655 103985 75067 156957
22 156957 233 -2599 -94484 -99530 113024 103324 86237 137520 119076 23983 -88370 28920
10 28920 94111 233314 262558 85473 81103 259056 220948 63811 60932 42224
0 42224
$$ Imaginary data points
##PAGE= N=2
##DATA TABLE= (X++(I..I)), XYDATA
16383 -1798237 -1549373 -1678192 -1617012 -1673726 -1638066 -1555377 -1462706 -1459422 -1459170 -1321494 -1347444
16372 -1347444 -1439571 -1575109 -1370071 -1248085 -1122212 -1009512 -949361 -985267 -1081184 -940521
16362 -940521 -745446 -653609 -806507 -875836 -640074 -616804 -795249 -602748 -473848 -594826
16352 -594826 -537189 -677240 -731483 -471171 -300174 -315906 -46319 -288746 -337648 -396596
16342 -396596 -234281 -261883 -85349 -152632 -197184 -272698 -64549 -84223 -79102 83474 -127729
16331 -127729 -138716 -13955 58161 30633 92213 -144010 -137831 56681 142963 25411 124484
16320 124484 240215 209323 223080 338239 477464 302529 246133 290189 514905 461290
16310 461290 529055 630532 687898 730398 674272 666253 709100 749236 560050 600052 713501
16299 713501 919527 950753 1020545 1016474 957227 916947 913920 1077800 1299128 1225839 1149508
16288 1149508 882680 919901 1102422 1098102 1222150 1429635 1440039 1448330 1465821 1208440 1223227
16277 1223227 1100633 1194175 1254510 1517798 1660278 1645097 1620177 1671713 1691809 1682230 1686045
16266 1686045 1353470 1407639 1479477 1938544 1998685 2073260 1973210 1977853 1739315 1625917
16256 1625917 1840912 2081832 2118952 2231912 2280201 2106722 1928777 1918684 1985095 1950752
16246 1950752 2009086 2047603 1965739 2214345 2402691 2223753 2172194 2221946 2080710 1817910
16236 1817910 2064952 2283207 2325291 2586318 2549683 2446172 2439022 2167382 2140551 2106748
16226 2106748 2159743 2134960 2230054 2574438 2492504 2361876 2538527 2601369 2518074 2413947
16216 2413947 2117620 2244033 2571734 2433807 2746058 2899391 2910420 2583911 2663702 2684422
16206 2684422 2656629 2884058 2665084 2488052 2584902 2650591 2571549 2646442 3109968 2922163
16196 2922163 2524731 2646956 2721471 2891147 2875719 2850994 3162512 3476730 3216751 2714535
16186 2714535 2719570 3047183 3061095 2608640 2810106 3112421 3027691 2714040 2750082 3105795
16176 3105795 3216561 2956410 2724417 2871088 2994279 3067820 3120708 3289366 3467449 3196561
16166 3196561 2814686 2859895 3089336 3142876 3146439 3303289 3314884 3249923 3069784 2977905 3200425
16155 3200425 3339483 3137051 3205798 3290789 3195065 3340467 3389651 3308805 3225577 3356021
16145 3356021 2961880 2950939 3148779 3093984 3247248 3386831 3287920 3090275 3009384 2939694
16135 2939694 2985657 2996287 3051683 2949394 3219569 3116669 2911089 2875499 3204612 3272006
16125 3272006 3403513 3400150 3480602 3614932 3469736 3542025 3189263 3358694 3204086 3402153
16115 3402153 3610565 3724834 3504991 3651734 3812617 3707650 3661586 3488241 3687868 3550081
16105 3550081 3724890 3412595 3596081 3543951 3561202 3315494 3293170 3457191 3368477 3486741
16095 3486741 3476387 3693678 3647481 3684710 3501736 3431863 3387237 3337181 3158964 3299772
16085 3299772 3543507 3489874 3369688 3155621 3407417 3327147 3230781 3033149 3390512 3596730
16075 3596730 3588627 3323170 3373182 3362662 3185953 3203047 3422995 3447428 3389147 3353141 3423511
16064 3423511 3509799 3641988 3431132 3372154 3428078 3364798 3453773 3060882 3289091 3552355
16054 3552355 3573814 2951785 3353807 3526805 3465906 3401746 3249864 3282089 3552816 3561484
16044 3561484 3270033 3309591 3416751 3723775 3417341 3481668 3473935 3594287 3640691 3424041
16034 3424041 3433116 3282298 3401064 3352949 3732155 3474745 3551468 3581480 3723021 3543260
16024 3543260 3460834 3703713 3572218 3649232 3669017 3664494 3432041 3534774 3696783 3765493
16014 3765493 3613565 3694711 3534089 3582172 3566336 3476646 3565840 3649904 3714484 3307644 3171730
16003 3171730 3299921 3549260 3791901 3750921 3530103 3430189 3288706 2963789 2788628 3054271
15993 3054271 3389525 3199664 3455795 3538369 3626009 3474393 3426978 3288298 3199380 3307187
15983 3307187 3264937 3245855 3434637 3412656 3256585 3420871 3516176 3535412 3208156 3281338
15973 3281338 3335730 3532613 3519400 3627209 3639362 3668245 3476229 3686153 3820740 3903754
15963 3903754 3861477 3743684 3749349 3498032 3645410 3661338 3667832 3716880 3762779 3738256 3842205
15952 3842205 3879235 3680233 3455960 3451599 3428444 3419080 3715665 3775254 3693999 3609631 3819548
15941 3819548 3774459 3741355 3334375 3360775 3716472 3857804 3625577 3430581 3542481 3698450
15931 3698450 3528745 3070617 3691817 3839264 3663825 3351727 3623358 3815837 3741329 3513200
15921 3513200 3286758 3648965 3723302 3612878 3717911 3843105 3732830 3703008 3544496 3479916
15911 3479916 3698878 3644834 3590002 3823141 3813298 3586715 3390397 3696637 3726633 3177563
15901 3177563 3203597 3171005 3429983 3703424 3661572 3359134 3601694 3519949 3601525 3592233 3282627
15890 3282627 3307916 3503103 3452520 3424894 3522310 3519271 3641574 3959338 3845495 3474599
15880 3474599 3497209 3697987 3506351 3376566 3336270 3525190 3647103 3547814 3702878 3833646
15870 3833646 3879880 3478500 3366645 3809620 3698356 3495562 3701761 3887945 4121101 3724884
15860 3724884 3770512 3861817 3994774 3644546 3257080 3400098 3675893 3591477 3426807 3430594
15850 3430594 3607141 3543894 3615094 3703570 3768620 3588585 3409121 3280591 3575467 3442974
15840 3442974 3446431 3486111 3388406 3652929 3692165 3573510 3809380 3802616 3375989 3361016 3291405
15829 3291405 3641106 3504948 3468837 3506726 3740260 3666359 3678339 3542698 3656734 3791181
15819 3791181 3625304 3487211 3362757 3479356 3699399 3464289 3458376 3733627 3767181 3708477
15809 3708477 3646820 3506827 3331677 3345164 3470027 3482827 3583576 3911727 4064224 4000521
15799 4000521 4121864 3843374 3611069 3818054 3537298 3461026 3684522 3562197 3630463 3907712
15789 3907712 3800098 3942184 4066196 3907811 3948106 3731628 3516817 3353674 3487707 3726469
15779 3726469 3537639 3350049 3581104 4064913 3915812 3931791 3660362 3650022 3881424 3761486
15769 3761486 3625367 3729173 3584695 3453729 3556379 3539994 3545375 3811076 3828444 3673247
15759 3673247 3464460 3509861 3457342 3515553 3457373 3645718 3568696 3602500 3405678 3509571
15749 3509571 3548292 3398087 3347665 3393333 3475305 3399956 3714199 3544420 3733634 3786350
15739 3786350 3789730 3490337 3608197 3558056 3350177 3261710 3455333 3859165 3586619 3517032
15729 3517032 3625273 3837541 3638522 3676459 3609799 3731744 3742105 3387030 3498717 3665070
15719 3665070 3949435 3688559 3831655 3909748 3982158 3680086 3504406 3468061 3940857 4048616
15709 4048616 3489026 3485531 3682308 3628028 3543404 3724144 3892338 3711321 3320823 3490815
15699 3490815 3689516 3729283 3821017 3683244 4103918 3927730 3643672 3433486 3430907 3522050
15689 3522050 3638478 3948635 3850613 3693049 3517793 3636357 3719761 3876235 3764862 3672567
15679 3672567 3549752 3795529 3527881 3482270 3689662 3749131 3484711 3568171 3938815 3964271
15669 3964271 3680998 3711989 3963749 3970877 3811970 3712887 3740675 3887777 4000285 3741372
15659 3741372 3677170 3889701 3763732 3554143 3705504 3763197 3837119 3442869 3270466 3471203
15649 3471203 3702001 3575652 3527362 3828486 4032977 3689932 3622824 3773577 3728740 3736591
15639 3736591 3825612 3734104 3844881 3939560 3666873 3656921 3825893 3794133 3655236 3924513
15629 3924513 4050368 3761201 3657045 3504145 3538846 3453784 3568990 3427294 3570174 3868576
15619 3868576 3965268 3790565 3762979 3843955 3737220 3804502 3603922 3768400 3660684 3806863
15609 3806863 3953610 3697078 3542657 3549205 3708060 3508315 3656041 3644548 3864227 3762104
15599 3762104 3658879 3779188 3975225 4064053 3648823 3605864 3509394 3687142 3552761 3741057
15589 3741057 3924025 4030359 3811627 3700465 3648393 3749983 3413936 3422647 3725158 3874125
15579 3874125 3825801 3602525 3652890 4088294 4142696 3658858 3720522 3932836 4149231 3748628
15569 3748628 3665736 3807471 3810135 3736523 3594025 3881167 3627712 3438632 3583336 3828570
15559 3828570 4002404 3951645 3814506 3948883 4010842 3661166 3320755 3519592 3868657 3876512
15549 3876512 3829363 3535249 3370528 3412299 3361429 3432476 3582830 3535523 3517229 3560640 3567531
15538 3567531 3408223 3403545 3743481 3877745 3536918 3563966 3633971 3584199 3693719 3668362
15528 3668362 3886794 3868773 3549933 3461187 3656096 3736496 3847883 3746460 3951279 3947266
15518 3947266 3726215 3849771 3702133 3783317 3875012 3847682 3723206 4011159 3918148 3679137
15508 3679137 3729357 3886402 3864100 3673809 3583513 3747267 3957368 3647692 3672134 3607086
15498 3607086 3611470 3697545 3868469 3671756 3567626 3767262 3730460 3865101 3819930 4074169
15488 4074169 3892061 3799966 3611490 3823474 3862991 4017873 3945852 3872607 3729322 3490430
15478 3490430 3617122 3658875 3753368 3593960 3924892 4030740 4034105 4091993 3749641 3465544
15468 3465544 3783280 3844884 3746018 3800994 3780114 3923067 4129265 3736358 3464791 3770060
15458 3770060 4001298 3836265 3572916 3591660 3478239 3451347 3533137 3558411 3590898 3815989
15448 3815989 3545917 3414645 3687116 3825822 3730946 3726448 3989179 3783797 3599689 3433592
15438 3433592 3789234 3876669 3860998 3895939 3799138 3776632 3664875 3568680 3507986 3624652 3723945
15427 3723945 3862278 3776720 3829932 3873187 3684894 3485720 3540866 3702391 3999322 3893581
15417 3893581 3512833 3861847 4065229 4065727 4154504 4130418 3804443 3864558 3788860 3817277 3675149
15406 3675149 3640673 3549154 3550023 3488667 3532251 3630958 3607595 3756509 3580389 3921055 3848740
15395 3848740 3830343 3782894 3776464 3812353 3933678 3936147 3872345 4079989 4008062 3841758 3710426
15384 3710426 4004965 4097636 4081329 3976675 3970337 4073288 4003133 3870319 4082983 4243479
15374 4243479 3939867 3631785 3705908 4040891 3827874 3744968 3601383 3727307 3868002 4050062
15364 4050062 3785464 3807522 3959414 4075806 3641516 3593555 3705249 3712639 3763773 3752494
15354 3752494 3985788 4017433 3820017 3529046 3569669 3695097 3779709 3676209 3928967 3987104
15344 3987104 3936427 3806137 3787608 3805761 3702601 3845260 3695880 3775876 4156631 3884585
15334 3884585 3675002 3914716 4045150 3844088 3690483 3830903 3809480 3928729 3931955 3916786
15324 3916786 3888816 4154947 4338831 4368089 3898636 3681701 3910733 3875735 3887898 3985989
15314 3985989 4091360 3769515 3877698 3738275 3773893 3757436 3667314 3751424 3963493 3993283
15304 3993283 4078992 4181342 4136048 4107676 4114529 3785301 3757412 3797544 3792368 3780741 3899490
15293 3899490 3931191 4046084 3874624 4217142 4195407 4049474 3783033 3676738 3786341 4125331
15283 4125331 4100739 4002210 4188726 3862744 3957293 4069435 3950374 3798577 3854581 3717410
15273 3717410 3895577 4017594 4147164 4019435 3732871 3778086 3679415 3587360 3493669 3653382
15263 3653382 3831184 3788679 3525899 3578509 3857498 3816707 3739833 3893023 3936257 4035564
15253 4035564 4146433 4022231 3626246 3567155 3752384 3560414 3755135 4068712 4185451 4251852
15243 4251852 4300176 4091460 3916966 3691008 3732968 3684895 3926194 4023459 4072289 3935346
15233 3935346 3929097 3931193 4008525 3675951 3593524 3821280 3831143 3689538 3894146 4093315 4209271
15222 4209271 3833999 3577297 3653214 3748784 3676867 3590451 3930793 3842394 3862283 3817157 3537335
$$ [...]
##END NTUPLES=NMR SPECTRUM
##END=
