##TITLE=1H_CA-9027-1
 DMSO
 8 sc, 
 30.06.2022
##JCAMPDX= 6.0         $$ Bruker NMR JCAMP-DX V2.0
##DATA TYPE= NMR SPECTRUM
##DATA CLASS= NTUPLES
##ORIGIN= UXNMR, Bruker Analytische Messtechnik GmbH
##OWNER= root
$$ XWIN-NMR		Version 3.5
$$ Thu Jun 30 14:44:19 2022 Russian Standard Time (UT+4h)  she@DPX200
##.OBSERVE FREQUENCY= 200.1313499994
##.OBSERVE NUCLEUS= ^1H
##.ACQUISITION MODE= SIMULTANEOUS
##.ACQUISITION SCHEME= undefined
##.AVERAGES= 8
##.DIGITISER RES= 18
##SPECTROMETER/DATA SYSTEM= spect
##.PULSE SEQUENCE= zg30
##.SOLVENT NAME= D2O
##.SHIFT REFERENCE= (INTERNAL, D2O, 0, 15.7491)
##AUDIT TRAIL= $$ (NUMBER, WHEN, WHO, WHERE, WHAT)
$$ ##TITLE= Audit trail, XWIN-NMR		Version 3.5
$$ ##JCAMPDX= 5.01
$$ ##ORIGIN= Bruker BioSpin GmbH
$$ ##OWNER= she
$$ F:/spectra/data/she/nmr/H-F/1/pdata/1/auditp.txt
$$ ##AUDIT TRAIL=  $$ (NUMBER, WHEN, WHO, WHERE, WHAT)
(   1,<2022-06-30 14:43:11.39 +0400>,<she>,<DPX200>,
      <created by zg, POWCHK disabled, PULCHK disabled
       configuration hash MD5:
       00 E9 B6 7A A2 85 ED C7 34 08 36 98 17 FE 4E 26
       data hash MD5: 16K
       77 A1 F4 58 B6 EE AA 12 36 93 34 82 1A C0 91 1C>)
(   2,<2022-06-30 14:43:13.67 +0400>,<she>,<DPX200>,
      <Start of raw data processing
       efp BC_mod = 2 LB = 0.24 FT_mod = 6 PKNL = 1 PHC0 = -18043.55 PHC1 = 9.200686 SI = 16K 
       data hash MD5: 16K
       D2 C3 62 10 E7 A5 EA 91 A0 A0 5F DC 43 01 1A 35>)
(   3,<2022-06-30 14:43:30.53 +0400>,<she>,<DPX200>,
      <pk PHC0 = -8.735602 PHC1 = 12 
       data hash MD5: 16K
       0A F7 9D 42 5E A9 FE B6 E1 56 A8 DA AC E1 84 61>)
(   4,<2022-06-30 14:43:33.84 +0400>,<she>,<DPX200>,
      <abs ABSG = 5 
       data hash MD5: 16K
       A2 A8 FF 6D CE 6E 74 B9 7F 7B AC 1C 61 0A 69 30>)
$$ ##END=
$$ 
$$ hash MD5
$$ 76 2C AE C2 08 91 40 BB D7 8C B4 D0 6C 2F CD 45
##$RELAX= 
##$RELAX= 
##$RELAX= 
##$RELAX= 
##$RELAX= 
##$RELAX= 
$$ Bruker specific parameters
$$ --------------------------
##$DU= <F:/spectra>
##$EXPNO= 1
##$NAME= <H-F>
##$PROCNO= 1
##$TYPE= <nmr>
##$USER= <she>
##$AMP= (0..31)
100 100 100 100 100 100 100 100 100 100 100 100 100 100 100 100 100 100 
100 100 100 100 100 100 100 100 100 100 100 100 100 100 
##$AQSEQ= 0
##$AQ_mod= 1
##$AUNM= <au_zg>
##$AUTOPOS= <>
##$BF1= 200.13
##$BF2= 200.13
##$BF3= 200.13
##$BF4= 200.13
##$BF5= 200.13
##$BF6= 200.13
##$BF7= 200.13
##$BF8= 200.13
##$BYTORDA= 1
##$CFDGTYP= 0
##$CFRGTYP= 5
##$CHEMSTR= <none>
##$CNST= (0..31)
1 1 145 1 1 1 1 1 1 1 1 1 1 1 1 1 1 1 1 1 1 1 1 1 1 1 1 1 1 1 1 1 
##$CPDPRG= <>
##$CPDPRG1= <>
##$CPDPRG2= <>
##$CPDPRG3= <>
##$CPDPRG4= <mlev>
##$CPDPRG5= <mlev>
##$CPDPRG6= <mlev>
##$CPDPRG7= <mlev>
##$CPDPRG8= <mlev>
##$CPDPRGB= <>
##$CPDPRGT= <>
##$D= (0..31)
0 1.2 0 0 0 0 0 0 0 0.06 0 0.03 0 0 0 0 0.0002 0 0 0 0 0 0 0 0 0 0 0 0 
0 0 0 
##$DATE= 1656585790
##$DBL= (0..7)
120 120 120 120 120 120 120 120 
##$DBP= (0..7)
150 150 150 150 150 150 150 150 
##$DBP07= 0
##$DBPNAM0= <>
##$DBPNAM1= <>
##$DBPNAM2= <>
##$DBPNAM3= <>
##$DBPNAM4= <>
$$ [...]
##$SUBNAM2= <"">
##$SUBNAM3= <"">
##$SUBNAM4= <"">
##$SUBNAM5= <"">
##$SUBNAM6= <"">
##$SUBNAM7= <"">
##$SUBNAM8= <"">
##$SUBNAM9= <"">
##$SW= 18.0517283424941
##$SWIBOX= (0..15)
0 0 2 0 0 0 0 0 0 0 0 0 0 0 0 0 
##$SW_h= 3612.71676300578
##$TD= 16384
##$TD0= 1
##$TE= 0
##$TE2= 300
##$TE3= 300
##$TEG= 300
##$TL= (0..7)
0 120 120 120 120 120 120 120 
##$TP= (0..7)
150 150 150 150 150 150 150 150 
##$TP07= 0
##$TPNAME0= <>
##$TPNAME1= <>
##$TPNAME2= <>
##$TPNAME3= <>
##$TPNAME4= <>
##$TPNAME5= <>
##$TPNAME6= <>
##$TPNAME7= <>
##$TPOAL= (0..7)
0.5 0.5 0.5 0.5 0.5 0.5 0.5 0.5 
##$TPOFFS= (0..7)
0 0 0 0 0 0 0 0 
##$TUNHIN= 0
##$TUNHOUT= 0
##$TUNXOUT= 0
##$USERA1= <user>
##$USERA2= <user>
##$USERA3= <user>
##$USERA4= <user>
##$USERA5= <user>
##$V9= 5
##$VALIST= <valist>
##$VCLIST= <CCCCCCCCCCCCCCC>
##$VD= 0
##$VDLIST= <DDDDDDDDDDDDDDD>
##$VPLIST= <PPPPPPPPPPPPPPP>
##$VTLIST= <TTTTTTTTTTTTTTT>
##$WBST= 1024
##$WBSW= 4
##$XGAIN= (0..3)
0 0 0 0 
##$XL= 0
##$YL= 0
##$YMAX_a= 113182
##$YMIN_a= -179391
##$ZGOPTNS= <>
##$ZL1= 120
##$ZL2= 120
##$ZL3= 120
##$ZL4= 120
##$ABSF1= 15.75791
##$ABSF2= -2.29394
##$ABSG= 5
##$ABSL= 3
##$ALPHA= 0
##$AQORDER= 0
##$ASSFAC= 0
##$ASSFACI= 0
##$ASSFACX= 0
##$ASSWID= 0
##$AUNMP= <proc_1d>
##$AZFE= 0.1
##$AZFW= 0.1
##$BCFW= 0
##$BC_mod= 2
##$BYTORDP= 0
##$COROFFS= 0
##$CY= -3
##$DATMOD= 1
##$DC= 0
##$DFILT= <>
##$DTYPP= 0
##$F1P= 0
##$F2P= 0
##$FCOR= 1
##$FTSIZE= 16384
##$FT_mod= 6
##$GAMMA= 0
##$GB= 0
##$INTBC= 1
##$INTSCL= 0
##$ISEN= 128
##$LB= 0.24
##$LEV0= 0
##$LPBIN= 0
##$MAXI= 10000
##$MC2= 0
##$MEAN= 0
##$ME_mod= 0
##$MI= 1.114404
##$NCOEF= 0
##$NC_proc= -8
##$NLEV= 6
##$NOISF1= 3.799351
##$NOISF2= 2.8
##$NSP= 0
##$NTH_PI= 0
##$NZP= 0
##$OFFSET= 15.74909
##$PC= 1
##$PHC0= -18052.29
##$PHC1= 21.20069
##$PH_mod= 1
##$PKNL= yes
##$PPARMOD= 0
##$PSCAL= 0
##$PSIGN= 0
##$REVERSE= no
##$SF= 200.130004492397
##$SI= 16384
##$SIGF1= 3
##$SIGF2= 2
##$SINO= 5.538805
##$SIOLD= 16384
##$SREGLST= <1H.CDCl3>
##$SSB= 0
##$STSI= 16384
##$STSR= 0
##$SW_p= 3612.71676300578
##$SYMM= 0
##$S_DEV= 0
##$TDeff= 16384
##$TDoff= 0
##$TI= <>
##$TILT= no
##$TM1= 0
##$TM2= 0
##$TOPLEV= 0
##$USERP1= <user>
##$USERP2= <user>
##$USERP3= <user>
##$USERP4= <user>
##$USERP5= <user>
##$WDW= 1
##$XDIM= 16384
##$YMAX_p= 360987183
##$YMIN_p= -1329844
$$ End of Bruker specific parameters
$$ ---------------------------------
##NTUPLES= NMR SPECTRUM
##VAR_NAME=  FREQUENCY,     SPECTRUM/REAL,   SPECTRUM/IMAG
##SYMBOL=    X,             R,               I
##VAR_TYPE=  INDEPENDENT,   DEPENDENT,       DEPENDENT
##VAR_FORM=  AFFN,          ASDF,            ASDF
##VAR_DIM=   16384,         16384,           16384
##UNITS=     HZ,            ARBITRARY UNITS, ARBITRARY UNITS
##FACTOR=    0.220516191357247, 1,           1
##FIRST=     3151.86549141691, 0,            0
##LAST=      -460.851271588874, 0,           0
##MIN=       -460.851271588874, -1329844,    0
##MAX=       3151.86549141691, 360987183,    0
$$ Real data points
##PAGE= N=1
##DATA TABLE= (X++(R..R)), XYDATA
$$ [...]
$$ plain form
6619 -306907 -166351 -168015 -64469 -104683 -437097 -483544 -597038 -514006 -736201 -647882 -678040
6608 -678040 -858891 -557273 -385171 -314213 -440811 -615894 -406041 -492318 -778253 -548373
6598 -548373 -674470 -816725 -854903 -758837 -661078 -860591 -773823 -581826 -191321 -377850
6588 -377850 -343397 -233292 3673 -264972 -655406 -751327 -446087 -322852 -510713 -735886
6578 -735886 -698181 -597254 -421380 -505897 -456261 -253055 -396279 -383806 124062 300136
6568 300136 -160131 -231335 -231201 -709116 -213681 -345401 -481135 -680285 -693362 -622238 -263718
6557 -263718 -570506 -711541 -640028 -468238 -580217 -579448 -955602 -469359 -273301 -860610
6547 -860610 -508029 -393011 -476464 -130619 -1954 182981 285613 -382367 -14273 -210742
$$ packed form
6619c06907J40556j664J03546m0214l32414m6447j13494Q3032k22195Q8319l0158
6608f78040j80851L01618J72102P0958j26598j75083K09853q6277k85935K29880
6598e48373j26097j42255l8178R6066R7759j99513Q6768J91997L90505j86529
6588c77850L4453J10105K36965k68645l90434r5921L05240J23235j87861k25173
6578g35886L7705J00927J75874q4517M9636K03206j43224J2473N07868J76074
6568C00136m60267p1204J34m77915M95435j31720j35734j99150j3077P1124L58520
6557b63718l06788j41035P1513J71790j11979P69l76154M86243J96058n87309
6547h60610L52581J15018q3453L45845J28665J84935J02632o67980L68094j96469
$$ plain form
6537 -210742 -293521 -559532 -449845 -644145 -229350 -115643 -381980 -734081 -621096 -864899
6527 -864899 -459702 -337848 -553384 -639081 -928995 -757224 -612640 -1042429 -850483 -829327
6517 -829327 -735229 -265388 -342180 -433606 -409022 -429771 -680668 -327900 -285656 -645460 -675048
6506 -675048 -597299 -375181 -226533 -752697 -732313 -566472 -352468 -639872 -895106 -541686
6496 -541686 -224240 -374830 -362995 -456431 -308244 -588048 -504191 -315736 -431563 -937662
6486 -937662 -636369 53439 -93031 -138734 -302794 -641639 -703125 -385825 -479890 -474322 -303757
6475 -303757 -478961 -859922 -540022 -191431 -576451 -1007942 -710052 -777509 -792681 -912950
6465 -912950 -270410 -316009 -81993 255855 376511 112227 -582372 -535524 -588789 -419035
$$ packed form
6537b10742q2779k66011J09687j94300M14795J13707k66337l52101J12985k43803
6527h64899M05197J21854k15536q5697k89914J71771J44584m29789J91946K1156
6517h29327R4098M69841p6792r1426K4584k0749k50897L52768M2244l59804k9588
6506f75048P7749K22118J48648n26164K0384J65841K14004k87404k55234L53420
6496e41686L17446j50590J1835r3436J48187k79804Q3857J88455j15827n06099
6486i37662L01293O89808j46470m5703j64060l38845o1486L17300r4065N568J70565
6475c03757j75204l80961L19900L48591l85020m31491K97890o7457j5172j20269
6465i12950O42540m5599K34016L37848J20656k64284o94599M6848n3265J69754
$$ plain form
6455 -419035 -300900 -533324 -778254 -885817 -1036049 -622429 -323742 -405899 -694863 -816038
6445 -816038 -685375 -645930 -398087 -200374 -125723 180913 -59983 -586663 -613212 -403933
6435 -403933 -254738 -148966 -294926 -43397 -134677 -216078 -339168 -459032 -558284 -686138
6425 -686138 -565616 -514238 -272273 -516192 -695709 -376982 -261643 -320871 -450808 -310763
6415 -310763 -151532 -414551 -559317 -294557 -275552 -295881 -504859 -674897 -89294 -491078
6405 -491078 -657151 -436940 -578211 -429761 -494218 -779080 -642320 -507672 -639040 -120252
6395 -120252 -126618 -497124 -475105 -376994 -644932 -636324 -439029 -138278 -265274 -242152 -326975
6384 -326975 -635569 -377211 -103673 176139 202374 -76934 -230671 155506 46065 234076
$$ packed form
6455d19035J18135k32424k44930j07563j50232M13620K98687q2157k88964j21175
6445h16038J30663L9445K47843J97713P4651L06636k40896n26680k6549K09279
6435d03933J49195J05772j45960K51529r1280q1401j23090j19864r9252j27854
6425f86138J20522N1378K41965k43919j79517L18727J15339n9228j29937J40045
6415c10763J59231k63019j44766K64760J9005k0329k08978j70038N85603m01784
6405d91078j66073K20211j41271J48450o4457k84862J36760J34648j31368N18788
6395a20252o366l70506K2019R8111k67938Q608J97295L00751j26996K3122q4823
6384c26975l08594K58358K73538K79812K6235k79308j53737L86177j09441J88011
$$ plain form
6374 234076 -75538 -180549 -159954 -294035 -588275 -747778 -416305 -248300 -146460 -287396
6364 -287396 -479298 -570200 -614298 -815082 -153486 -27286 -146688 -278411 -469918 -67867
6354 -67867 -198333 -294504 307586 17844 -51292 -237482 -476783 -234191 182911 180063 -241891
6343 -241891 -208105 150938 -69446 175480 171390 202068 -107397 -129035 -167996 -197540 152220
6332 152220 78048 -89410 -148196 -487079 -778299 -534098 -142471 35686 -486012 -93055
6322 -93055 232045 69276 -62846 -58172 -172901 47959 -179871 123083 178527 82786 -40872
6311 -40872 -268056 -425154 -107489 -309720 -219913 -233059 122711 175537 -432686 -318509
6301 -318509 -132625 76049 29705 -245117 -138831 -53796 -407056 -232553 -14201 -483290
$$ packed form
6374B34076l09614j05011K0595j34081k94240j59503L31473J68005J01840j40936
6364b87396j91902r0902m4098k00784O61596J26200j19402j31723j91507M02051
6354f7867j30466r6171O02090k89742o9136j86190k39301K42592M17102k848m21954
6343b41891L3786L59043k20384K44926m090L0678l09465k1638l8961k9544L49760
6332A52220p4172j67458n8786l38883k91220K44201L91627J78157n21698L92957
6322i3055L25100j62769j32122M674j14729K20860k27830L02954N5444r5741j23658
6311d0872k27184j57098L17665k02231Q9807j3146L55770N2826o08223J14177
6301c18509J85884K08674m6344k74822J06286Q5035l53260J74503K18352m69089
$$ plain form
6291 -483290 -551653 -446777 -247898 193331 389473 452044 193582 -70026 -245137 -457024
6281 -457024 -287420 -152670 -171950 -70592 -308894 -477077 -230211 -121743 -57670 242157
6271 242157 119339 118716 161572 -151687 -292554 -63611 5316 331330 490746 502693 704135
6260 704135 524006 264873 326331 81558 244787 65575 291306 450295 498755 568026
6250 568026 586395 280538 384114 734426 789765 566357 585984 672922 555585 625728 679115
6239 679115 675587 442305 574677 393683 313267 139690 384266 303846 383659 387501 631799
6228 631799 354254 -64395 68956 -247441 231437 399238 176200 437010 230482 423652
6218 423652 482511 663684 454277 99479 -123151 -122701 -241747 -44060 176238 504286
$$ packed form
6291d83290o8363J04876J98879M41229J96142O2571k58462k63608j75111k11887
6281d57024J69604J34750j9280J01358k38302j68183K46866J08468O4073K99827
6271B42157j22818o23M2856l13259j40867K28943O8927L26014J59416J1947K01442
6260G04135j80129k59133O1458k44773J63229j79212K25731J58989M8460O9271
6250E68026J8369l05857J03576L50312N5339k23408J9627Q6938j17337P0143N3387
6239F79115l528k33282J32372j80994q0416j73577K44576q0420P9813L842K44298
6228F31799k77545m18649J33351l16397M78878J67801k23038K60810k06528J93170
6218D23652N8859J81173k09407l54798k22630M50j19046J97687K20298L28048
$$ plain form
6208 504286 404678 138402 301190 1002267 854376 113251 549938 734748 721259 527024
6198 527024 467110 433422 319189 377681 691595 678970 619483 688245 686396 426735 608631
6187 608631 509212 660400 680740 542045 540953 436889 424003 467834 435371 863253 992899
6176 992899 996671 646665 1064290 917395 1097119 895765 672072 990534 634919 559155
6166 559155 1032359 764207 781820 1179813 472314 167386 756533 666796 629981 925419
6156 925419 753130 892098 949479 985543 860098 967539 754072 587499 1144989 1279214
6146 1279214 1136150 1211282 997848 1132834 1187277 1080949 951509 805977 1004650 1261194
6136 1261194 1429907 1762715 1628854 1289126 1359940 1170065 1462681 1789125 1316759 1300358
$$ packed form
6208E04286r9608k66276J62788P01077j47891p41125M36687J84810j3489j94235
6198E27024n9914l3688j14233N8492L13914j2625n9487O8762j849k59661J81896
6187F08631r9419J51188K0340j38695j092j04064j2886M3831l2463M27882J29646
6176I92899L772l50006M17625j46895J79724k01354k23693L18462l55615p5764
6166E59155M73204k68152J7613L97993p07499l04928N89147q9737l6815K95438
6156I25419j72289J38968N7381L6064j25445J07441k13467j66573N57490J34225
6146A279214j43064P5132k13434J34986N4443j06328j29440j45532J98673K56544
6136A261194J68713L32808j33861l39728P0814j89875K92616L26444m72366j6401
$$ plain form
6126 1300358 1822773 1523737 1596693 1709319 1603933 2126583 2081131 1823673 1848442 1872073
6116 1872073 2277260 2625848 2494520 2530961 2772397 2450148 2144296 2600265 2352933 2921224
6106 2921224 2824380 2214821 2269196 2482488 2194279 2451681 2516566 2674494 3031594 3203410
6096 3203410 3317078 2996658 2626828 2883821 3121131 3106391 3051894 3290119 3337238 3177795
6086 3177795 3690111 3580622 3769929 3927939 3560156 3367907 3297669 3321957 3708314 3773165
6076 3773165 3735187 3791207 3507083 3520083 3632103 3272418 3504791 3845861 3604210 3733562
6066 3733562 3536353 3418215 3629007 3090057 3072861 3759451 3520913 3449776 3386406 3159955
6056 3159955 3544316 3865950 3249891 3482188 3385358 3813600 3862832 3500022 3548322 3880850
$$ packed form
6126A300358N22415k99036P2956J12626j05386N22650m5452k57458K4769K3631
6116A872073M05187L48588j31328L6441K41436l22249l05852M55969k47332N68291
6106B921224r6844o09559N4375K13292k88209K57402O4885J57928L57100J71816
6096C203410J13668l20420l69830K56993K37310j4740n4497K38225M7119j59443
6086C177795N12316j09489J89307J58010l67783j92249p0238K4288L86357O4851
6076C773165l7978N6020k84124J3000J12020l59685K32373L41070k41651J29352
6066C733562j97209j18138K10792n38950j7196O86590k38538p1137o3370k26451
6056C159955L84361L21634o16059K32297r6830M28242M9232l62810M8300L32528
$$ plain form
6046 3880850 3270817 2841343 3011413 3291926 3230368 2997424 3031173 2923517 3108686 2932341
6036 2932341 2736433 2732873 2483686 2831957 3020026 2250412 2220224 2027753 2035811 2386281
6026 2386281 2696844 2592054 2737069 2336162 2172054 2218420 2121267 2111689 2181802 1831659
6016 1831659 2149598 2146128 2476038 2252821 1939091 1743866 2143275 1983482 1789365 1940710
6006 1940710 2006637 2052760 2084883 2143178 2028312 1592322 1317765 1875695 1964842 1844297
5996 1844297 1939072 1617048 1793023 1611885 1781445 1715585 1782590 2194837 2026808 2003417
5986 2003417 1775942 1760242 1852037 2141188 2208887 2166995 2155423 1932188 1632892 1619575 1601198
5975 1601198 2041641 1900951 1597104 1791929 2226121 2456526 1920331 1977818 2070278 1877901
$$ packed form
6046C880850o10033m29474J70070K80513o1558k32944L3749j07656J85169j76345
6036B932341j95908l560k49187L48271J88069p69614l0188j92471Q058L50470
6026B386281L10563j04790J45015m00907j64108M6366r7153r578P0113l50143
6016A831659L17939l470L29910k23217l13730j95225L99409j59793j94117J51345
6006A940710O5927M6123L2123N8295j14866m35990k74557N57930Q9147j20545
5996A844297R4775l22024J75975j81138J69560o5860O7005M12247j68029k3391
5986B003417k27475j5700R1795K89151O7699m1892j1572k23235k99296j3317j8377
5975A601198M40443j40690l03847J94825M34192K30405n36195N7487R2460j92377
$$ plain form
5965 1877901 1718371 1685973 1838969 2218094 2329148 2068286 2215979 2169656 2194589 2107263
5955 2107263 2143166 2524766 2356734 1610456 2047703 2314179 2268035 2834001 2784339 2687173
5945 2687173 2899672 2533910 2669125 3047986 3199107 2743784 2728069 3030008 2914136 2639597
5935 2639597 2906998 3218616 3100957 2775612 2652479 3281919 3297745 3092073 3492091 3677198
5925 3677198 3236705 3560642 3466342 3596663 3596435 3059619 3425002 3861321 3990518 3728862
5915 3728862 3638419 3874299 4060523 4265557 3984878 3989018 4234341 4155921 4041962 4716927
5905 4716927 4807144 4381195 4617530 4634149 5227001 5211138 4998886 4960606 5090390 5596456
5895 5596456 5775606 5440668 5594688 5518732 5852464 5937633 6227697 6476176 6676776 7013147
$$ packed form
5965A877901j59530l2398J52996L79125J11054k60862J47693m6323K4933q7326
5955B107263L5903L81600j68032p46278M37247K66476m6144N65966m9662r7166
5945B687173K12499l65762J35215L78861J51121m55323j5715L01939j15872k74539
5935B639597K67401L11618j17659l25345j23133O29440J5826k05672M00018J85107
5925C677198m40493L23937r4300J30321k28n36816L65383M36319J29197k61656
5915C728862r0443K35880J86224K05034k80679M140K45323p8420j13959O74965
5905D716927R0217m25949K36335J6619N92852j5863k12252l8280J29784N06066
5895E596456J79150l34938J54020p5956L33732Q5169K90064K48479K00600L36371
$$ plain form
5885 7013147 7134521 6798219 6722877 7377925 7521175 7123738 7319590 7878154 8524918 9076375
5875 9076375 9611540 9942198 9954898 10535197 10839535 10774047 11324131 12068812 12304357 12724446
5865 12724446 13631109 14139727 14676829 15492524 15674047 15757545 16412208 16731280 17610110 17867228
5855 17867228 18219396 18983569 19029058 19078790 20010280 21023815 21689686 22344667 22686112 23602428
5845 23602428 24243808 24726932 25623907 26329159 26888532 27896850 28569220 29015871 29875033
5836 29875033 30405223 30702581 31269407 31652308 32170170 32702184 33272609 33863216 34431442
5827 34431442 34395173 34691486 35007554 35582168 36545247 37259047 37166900 37423040 37631089 37066207
5817 37066207 37114534 37205714 36762589 36966789 37190963 36984738 36677893 36895538 36888755 36595023
$$ packed form
5885G013147J21374l36302p5342O55048J43250l97437J95852N58564O46764N51457
5875I076375N35165L30658J2700N80299L04338o5488N50084P44681K35545M20089
5865A2724446R06663N08618N37102Q15695J81523Q3498O54663L19072Q78830K57118
5855A7867228L52168P64173M5489M9732R31490J013535O65871O54981L41445R16316
5845B3602428O41380M83124Q96975P05252N59373J008318O72370M46651Q59162
5836B9875033N30190K97358N66826L82901N17862N32014N70425N90607N68226
5827C4431442l6269K96313L16068N74614R63079P13800r2147K56140K08049n64882
5817C7066207M8327R1180m43125K04200K24174k06225l06845K17645o783k93732
$$ plain form
5807 36595023 36206274 36801937 37540033 38082950 38449027 38534241 38502942 38888808 38543938 38513676
5797 38513676 38504950 38245794 37791151 37388515 37051308 36930869 36119374 34873801 34536309 34176116
5787 34176116 33578670 33285051 32832556 32030671 31954665 31523455 30816326 30400439 29695816 29335607
5777 29335607 28801649 27924238 27172351 26528500 26170144 25230393 24152755 23343219 22732805
5768 22732805 22031489 21379844 20565334 20378082 19841260 19680641 19190947 18681710 18096581
5759 18096581 17513241 17125449 16377472 15801690 14733368 14420130 13995089 13559176 12804916
5750 12804916 12073936 11872630 11145147 11130755 10605967 9977555 9850821 9435610 8952077 8868584
5740 8868584 8632185 8660691 8647690 8304877 7836318 7094454 6937163 7097872 6906206 7001207
$$ packed form
5807C6595023l88749N95663P38096N42917L66077Q5214l1299L85866l44870l0262
5797C8513676q726k59156m54643m02636l37207j20439q11495j245573l37492l60193
5787C4176116n97446k93619m52495q01885p6006m31210p07129m15887p04623l60209
5777B9335607n33958q77411p51887o43851l58356r39751j077638q09536o10414
5768B2732805p01316o51645q14510j87252n36822j60619m89694n09237n85129
5759A8096581n83340l87792p47977n75782j068322l13238m25041m35913p54260
5750A2804916p30980k01306p27483j4392n24788o28412j26734m15211m83533q3493
5740H868584k36399K8506j3001l42813m68559p41864j57291J60709j91666R5001
$$ plain form
5730 7001207 7395111 7222305 6860032 6806220 6505846 6451765 6307667 6339679 5823850 6015577
5720 6015577 6506282 6436695 6553535 6485346 6345998 6365979 6210415 6291668 6222336 6297467 6157935
5709 6157935 6220427 6316070 6463782 6141371 6212714 6341307 6107508 6015397 6252259 5910557
5699 5910557 5639612 5822303 5662929 5689839 5693276 5911163 5903321 6174529 6238134 6135508 5621354
5688 5621354 5384162 5588220 5887336 5468170 5864774 6169462 6310120 6202274 6321736 6535079
5678 6535079 6038446 5564050 5622661 6080049 6194652 5647475 5823129 5945133 5838752 6061860
5668 6061860 6018515 6103040 5951197 5657874 5931248 6045049 6019896 5706358 5779641 5745637
5658 5745637 5773791 6013298 5795887 6281224 6320878 5974084 5585840 5784169 6026862 6074393
$$ packed form
5730G001207L93904j72806l62273n3812l00374n4081j44098L2012n15829J91727
5720F015577M90705o9587J16840o8189j39348J9981j55564Q1253o9332P5131j39532
5709F157935O2492R5643J47712l22411P1343J28593k33799r2111K36862l41702
5699E910557k70945J82691j59374K6910L437K17887p842K71208O3605j02626n14154
5688E621354k37192K04058K99116m19166L96604L04688J40658j07846J19462K13343
5678F535079m96633m74396N8611M57388J14603n47177J75654J22004j06381K23108
5668F061860m3345Q4525j51843k93323K73374J13801k5153l13538P3283l4004
5658E745637K8154K39507k17411M85337L9654l46794l88244J98329K42693M7531
$$ plain form
5648 6074393 5721432 5913012 6019375 5878471 5502292 5221542 5304481 5704308 5871749 5812865
5638 5812865 5832139 6061547 5811636 5977937 5775768 5788097 5872519 5433451 5330051 5470904
5628 5470904 5873333 5750985 5617503 5307914 5215604 5591425 5943947 5755423 5956742 5839254
5618 5839254 5929811 5655032 5566794 5948727 6047079 6077451 6270777 6441985 6021619 5914094
5608 5914094 5976222 6029758 6112213 5505173 5418777 5896225 6053129 5976956 6095958 5942815
5598 5942815 5886220 5764136 5720432 5773449 5973321 6340551 6221289 6156775 6470928 6472788 6593826
5587 6593826 6373610 6496099 6097678 6431242 6650773 6674216 6794101 6732691 6735435 6878071
5577 6878071 7012078 6603501 6639601 7019826 6995331 7318754 7224797 7151348 7291338 7040286
$$ packed form
5648F074393l52961J91580J06363j40904l76179k80750Q2939L99827J67441n8884
5638E812865J9274K29408k49911J66301k02169J2329Q4422m39068j03400J40853
5628E470904M02429j22348j33482l09589r2310L75821L52522j88524K01319j17488
5618E839254R0557k74779q8238L81933R8352L0372J93326J71208m20366j07525
5608E914094O2128N3536Q2455o07040q6396M77448J56904p6173J19002j53143
5598E942815n6595j22084m3704N3017J99872L67230j19262o4514L14153J860J21038
5587F593826k20216J22489l98421L33564K19531K3443J19885o1410K744J42636
5577F878071J34007m08577L6100L80225k4495L23423r3957p3449J39990k51052
$$ plain form
5567 7040286 7214893 7364934 7706410 7695816 7669879 7856231 7704095 7714085 7793678 8402319
5557 8402319 8532693 8041529 8156797 8656773 9003283 8821243 8832456 8698691 9160489 9525673
5547 9525673 9507091 9963341 10451613 10400698 10182828 10551731 10835897 10755375 11447811 11916189
5537 11916189 12289600 12523477 13069067 13067623 13371934 13537977 13791960 14009209 14573602 14681095
5527 14681095 14803170 15240695 15781252 15624318 16078844 16873464 16793241 17528139 18448773 18536205
5517 18536205 19225733 19645323 20053819 21287025 21921160 22247889 23272243 24008584 23716123
5508 23716123 24158271 24055482 24075638 24817725 24584885 24293301 24597523 24415400 24687769 25297498
5498 25297498 25564137 26002708 26449779 26966143 27615251 28306507 28832570 29672904 30201945
$$ packed form
5567G040286J74607J50041L41476j0594k5937J86352j52136R990P9593O08641
5557H402319J30374m91164J15268M99976L46510j82040J1213j33765M61798L65184
5547I525673j8582M56250M88272n0915k17870L68903K84166q0522O92436M68378
5537A1916189L73411K33877N45590j444L04311J66043K53983K17249N64393J07493
5527A4681095J22075M37525N40557j56934M54526P94620q0223P34898R20634Q7432
5517A8536205O89528M19590M08496J233206O34135L26729J024354P36341k92461
5508B3716123M42148j02789K0156P42087k32840k91584L04222j82123K72369O09729
5498B5297498K66639M38571M47071N16364O49108O91256N26063Q40334N29041
$$ plain form
5489 30201945 30741350 32104191 32748368 33076369 33173472 33867241 34440256 34781501 35411575
5480 35411575 35848983 36805226 37166072 37853900 39004460 40438118 41734022 43286447 45157983
5471 45157983 46963753 49671555 52163482 55011540 58299934 61756040 65754505 70282377
5463 70282377 74651522 79148373 83825399 88896778 92778751 95891303 97951658 99588446
5455 99588446 100637716 101266529 102512884 103267892 104305971 105699951 107436964 109143627
5447 109143627 110212079 110437605 110280685 109738295 108946745 108000691 106868396 106069870 105643401
5438 105643401 104949239 103858382 102593712 100075121 97101031 94798614 92202911 89859686
5430 89859686 87482762 85929563 84464382 82946743 81823178 81470490 80806117 79420327
$$ packed form
5489C0201945N39405J362841O44177L28001R7103O93769N73015L41245O30074
5480C5411575M37408R56243L60846O87828J150560J433658J295904J552425J871536
5471D5157983J805770K707802K491927K848058L288394L456106L998465M527872
5463G0282377M369145M496851M677026N071379L881973L112552K060355J636788
5455I9588446J049270O28813J246355P55008J038079J393980J737013J706663
5447A09143627J068452K25526j56920n42390p91550r46054j132295p98526m26469
5438A05643401o94162j090857j264670k518591k974090k302417k595703k343225
5430H9859686k376924j553199j465181j517639j123565l52688o64373j385790
$$ plain form
5422 79420327 77928822 75002150 71873824 68679981 64644692 60353780 56832476 52608594
5414 52608594 49146923 46215429 42765454 40265512 38081040 36140719 34926795 33466603
5406 33466603 32439556 31300446 30473593 29698422 28916541 28530217 28206199 28353798 28134099
5397 28134099 27639461 27488695 27588008 26619536 25734192 25268402 24593547 23935269 22768722
5388 22768722 22249909 21601551 20546687 20190566 20094779 19531836 19479214 19170277 19131492 19597534
5378 19597534 18964839 18464581 18903231 19160449 19103588 19145005 19259616 19454297 19709240 18680262
5368 18680262 18104401 17572072 16736851 16438638 16242203 15786775 14980138 14198462 14144796 14588199
5358 14588199 14219897 13641372 13283937 13375643 13123536 12918688 12754650 13018159 12916383 12360960
$$ packed form
5422G9420327j491505k926672l128326l193843m035289m290912l521304m223882
5414E2608594l461671k931494l449975k499942k184472j940321j213924j460192
5406C3466603j027047j139110q26853p75171p81881l86324l24018J47599k19699
5397B8134099m94638j50766R9313r68472q85344m65790o74855o58278j166547
5388B2768722n18813o48358j054864l56121r5787n62943n2622l08937l8785M66042
5378A9597534o32695n00258M38650K57218n6861M1417J14611J94681K54943j028978
5368A8680262n75861n32329q35221k98213j96435m55428q06637p81676n3666M43403
5358A4588199l68302n78525l57435R1706k52107k04848j64038K63509j01776n55423
$$ plain form
5348 12360960 12555813 12973988 12500811 12376725 12284282 12459929 12738830 12435801 12128292 12209827
5338 12209827 11823611 11659303 11735869 12186997 11987460 11767713 11733072 11895352 11744567 11310349
5328 11310349 11365060 11524466 12041926 11930104 11487270 12118081 12284755 12166427 12732441 12839997
5318 12839997 12540884 12246862 11965805 12196244 12512012 11845341 11963811 12316868 12257677 12329690
5308 12329690 12611117 12706553 13037094 12719575 12351347 12773183 12757540 12974379 13503039 13274378
5298 13274378 12797222 12943094 12880698 13200078 13348555 13145535 13407185 13345764 13574842 13912781
5288 13912781 14074396 14294175 14339373 13724121 13718981 14470563 14527443 14463294 14431616 14739868
5278 14739868 14878699 15007235 14820973 15086937 15878883 15430507 15687879 16223429 15697208
$$ packed form
5348A2360960J94853M18175m73177j24086r2443J75647K78901l03029l07509Q1535
5338A2209827l86216j64308P6566M51128j99537k19747l4641J62280j50785m34218
5328A1310349N4711J59406N17460j11822m42834O30811J66674j18328N66014J07556
5318A2839997k99113k94022k81057K30439L15768o66671J18470L53057n9191P2013
5308A2329690K81427R5436L30541l17519l68228M21836j5643K16839N28660k28661
5298A3274378m77156J45872o2396L19380J48477k03020K61650o1421K29078L37939
5288A3912781J61615K19779M5198o15252n140P51582N6880o4149l1678L08252
5278A4739868J38831J28536j86262K65964P91946m48376K57372N35550n26221
$$ plain form
5269 15697208 15834171 15973264 15963194 16871949 17067690 16915271 17449168 17553560 17685183 17709828
5259 17709828 17517053 17400557 18063394 18051634 18044036 18190887 18301194 18825396 18784932 18843883
5249 18843883 19119474 19122180 19258595 19475050 19814503 20015400 20191719 19895158 20296446 20848912
5239 20848912 21136435 21261839 21254552 21708268 22081126 22496835 22386781 22737629 22775761 23296345
5229 23296345 23831369 24161497 23852262 24292548 24367585 24300660 24333740 24316885 24096207 24106857
5219 24106857 24395043 24640255 24648513 24407260 24503429 24487831 24693853 25286177 25118668 25088038
5209 25088038 25574187 25636552 25695278 26666689 26543812 26384907 27421077 27470858 27843173 27918614
5199 27918614 27893166 28047514 28363971 28522324 28685804 29108158 28949294 28735170 28736531 28455602
$$ packed form
5269A5697208J36963J39093j0070R08755J95741j52419N33897J04392J31623K4645
5259A7709828j92775j16496O62837j1760p598J46851J10307N24202m0464N8951
5249A8843883K75591K706J36415K16455L39453K00897J76319k96561M01288N52466
5239B0848912K87523J25404p287M53716L72858M15709j10054L50848L8132N20584
5229B3296345N35024L30128l09235M40286P5037o6925L3080j6855k20678J0650
5219B4106857K88186K45212Q258k41253R6169j5598K06022N92324j67509l0630
5209B5088038M86149O2365N8726R71411j22877j58905J036170M9781L72315P5441
5199B7918614k5448J54348L16457J58353J63480M22354j58864k14124J361k80929
$$ plain form
5189 28455602 28492941 28758905 28263575 28351409 28582461 28216904 28478602 27937973 28235901 28926843
5179 28926843 28983433 29215769 29226190 29230831 29130940 29456379 29264907 29523232 29500549 29417225 29772884
5168 29772884 30069414 29738072 30093334 30585374 30431366 30778419 30424469 30285483 30833223
5159 30833223 30055175 29778499 30245052 29789911 29994708 30360689 30014403 29552246 29836672
5150 29836672 29827845 29831535 29967668 29742028 29656096 29849077 29689091 29433921 29863522 29770417
5140 29770417 29673716 29366329 28971838 29374003 29039944 29039683 29273297 29015526 29017910 28730388
5130 28730388 28376276 28737488 29028133 28754996 28607007 28578141 28318796 28778484 28570787 28054371
5120 28054371 28002629 28141767 27998560 28085171 27669012 27612853 27909246 27840244 27768512 27356956
$$ packed form
5189B8455602L7339K65964m95330Q7834K31052l65557K61698n40629K97928O90942
5179B8926843N6590K32336J0421M641r9891L25439j91472K58325k2683q3324L55659
5168B9772884K96530l31342L55262M92040j54008L47053l53950j38986N47740
5159C0833223p78048k76676M66553m55141K04797L65981l46286m62157K84426
5150B9836672q827L690J36133k25640q5932J92981j59986k55170M29601r3105
5140B9770417r6701l07387l94491M02165l34059k61K33614k57771K384k87522
5130B8730388l54112L61212K90645k73137j47989k8866k59345M59688k07697n16416
5120B8054371n1742J39138j43207Q6611m16159n6159K96393o9002p1732m11556
$$ plain form
5110 27356956 27207490 27339322 27039863 26978606 26715331 26716217 26357916 26124051 26519534 26201224
5100 26201224 25816706 25571392 25732835 25742341 25780547 25545729 25084708 24815743 24599771 24874971
5090 24874971 24672928 24204229 23927307 23522661 23345008 23713904 23662781 23283904 23231576 23086815
5080 23086815 23031035 22403615 22047114 22074843 22043928 22332721 21970577 21434987 21524646 21678277
5070 21678277 21325303 20971309 20766254 20862794 20118248 20206133 20713005 20481554 19483752 19279375
5060 19279375 19458664 19297148 19102095 18822776 18971310 18903723 18968009 18683924 18692536 18437269
5050 18437269 18275976 17870595 17933161 18201786 17612872 17304757 17299298 17067783 17304509 17062617
5040 17062617 16895445 16886740 16812058 16452931 16638002 16396459 16079468 15910925 15759546 15608525
$$ packed form
5110B7356956j49466J31832k99459o1257k63275Q86l58301k33865L95483l18310
5100B6201224l84518k45314J61443R506L8206k34818m61021k68965k15972K75200
5090B4874971k02043m68699k76922m04646j77653L68896n1123l78877n2328j44761
5080B3086815n5780o27420l56501K7729l0915K88793l62144n35590Q9659J53631
5070B1678277l52974l53994k05055R6540p44546Q7885N06872k31451r97802k04377
5060A9279375J79289j61516j95053k79319J48534o7587O4286k84085Q612k55267
5050A8437269j61293m05381O2566K68625n88914l08115n459k31515K36726k41892
5040A7062617j67172q705p4682l59127J85071k41543l16991j68543j51379j51021
$$ plain form
5030 15608525 15808517 15761196 15599811 15865519 15154274 14982818 15267234 15451290 15445084 15210118
5020 15210118 15139048 15111707 14612036 14140854 14285699 14546400 14538036 14121051 13883879 13842200
5010 13842200 13960847 13820572 14080749 13968597 13429795 13783464 14035371 13645667 13681067 13659233
5000 13659233 13544471 13550833 13743614 13150167 13014310 12848605 12661576 12710153 12736202 13027167
4990 13027167 12762369 12673676 12771359 12961173 12679180 12551881 12450661 12533283 12830726 12385652
4980 12385652 12064006 12563268 12774642 12288308 12441264 12386934 12843871 12665028 12435714 12698675
4970 12698675 12900735 12936875 12746560 12838970 12909958 13090066 13089450 13019624 12844774 13075174 12607722
4959 12607722 12995313 12994445 12617601 13164065 13733495 13642782 13632906 13488666 13718849 14359398
$$ packed form
5030A5608525J99992m7321j61385K65708p11245j71456K84416J84056o206k34966
5020A5210118p1070k7341m99671m71182J44845K60701q364m16985k37172m1679
5010A3842200J18647j40275K60177j12152n38802L53669K51907l89704L5400k1834
5000A3659233j14762O362J92781n93447j35857j65705j87029M8577K6049K90965
4990A3027167k64798q8693R7683J89814k81993j27299j01220Q2622K97443m45074
4980A2385652l21646M99262K11374m86334J52956n4330M56937j78843k29314K62961
4970A2698675K02060L6140j90315R2410P0988J80108o16o9826j74850K30400m67452
4959A2607722L87591q68l76844N46464N69430r0713r876j44240K30183O40549
$$ plain form
4949 14359398 14421636 14269620 14761281 14693732 15077082 15530756 15977003 16573442 16816381 16941270
4939 16941270 17095786 17699256 17994079 18323201 18331772 18806478 19751355 19931977 20727274 21532178
4929 21532178 21987998 23320401 24811418 25815658 27084720 28550193 29549728 30909787
4921 30909787 31983959 32904395 34025289 34751333 35221847 35538597 36097236 36376558 36503419
4912 36503419 36301072 36475238 37023809 36956953 36690490 36908978 36947566 36903458 36250851 35207115
4902 35207115 34414690 33958133 32948036 31394980 31162297 30244752 28896017 27899226 27119674
4893 27119674 26458838 26114655 25705892 25297105 24922080 24437454 24441876 24401388 23932564 24429578
4883 24429578 24943519 25287407 25656803 26070820 26379629 26911021 28258440 28309808 28689674
$$ packed form
4949A4359398O2238j52016M91661o7549L83350M53674M46247N96439K42939J24889
4939A6941270J54516O03470K94823L29122Q571M74706R44877J80622P95297Q04904
4929B1532178M55820J332403J491017J004240J269062J465473R99535J360059
4921C0909787J074172R20436J120894P26044M70514L16750N58639K79322J26861
4912C6503419k02347J74166N48571o6856k66463K18488L8588m4108o52607j043736
4902C5207115p92425m56557j010097j553056k32683r17545j348735r96791p79552
4893B7119674o60836l44183m08763m08787l75025m84626M422m0488m68824M97014
4883B4429578N13941L43888L69396M14017L08809N31392J347419N1368L79866
$$ plain form
4874 28689674 29863491 31192651 32801514 34026198 34991405 36495859 38482387 40809416
4866 40809416 42374371 43706309 45189331 46351260 47188619 48171388 48567821 48693840 48566129
4857 48566129 48423853 47897577 47232113 46951753 46865251 46363463 46020535 45332878 44512032 43617353
4847 43617353 42231452 40794090 38946767 37134381 35444653 33846151 31696800 29323178
4839 29323178 27296642 25841103 24627741 23514781 22247719 21137240 20175041 19336048
4831 19336048 18220187 17038449 16316445 16289036 15393465 14614502 14152115 13900349 13771335
4822 13771335 13280856 12626567 12483581 11849951 11670639 11673408 11310396 10841393 10567414 10254542
4812 10254542 10540308 10275093 9508972 9285031 9296187 8994140 9135541 8683977 8375806 8788574
$$ packed form
4874B8689674J173817J329160J608863J224684R65207J504454J986528K327029
4866D0809416J564955J331938J483022J161929Q37359R82769L96433J26019j27711
4857D8566129j42276n26276o65464k80360q6502n01788l42928o87657q20846q94679
4847D3617353j385901j437362j847323j812386j689728j598502k149351k373622
4839B9323178k026536j455539j213362j112960j267062j110479r62199q38993
4831A9336048j115861j181738p22004k7409q95571p78963m62387k51766j29014
4822A3771335m90479o54289j42986o33630j79312K769l63012m69003k73979l12872
4812A0254542K85766k65215p66121k23941J1156l02047J41401m51564l08171M12768
$$ plain form
4802 8788574 8798316 8631756 8238950 8040594 8168223 8004714 8036729 8262727 7884676 7860654
4792 7860654 7767042 7565128 7314964 7662805 7534871 7043033 6987478 7150298 6964299 7258986
4782 7258986 7117287 7274187 7465489 7178415 7368901 7071781 7146206 6971056 6874611 7008271
4772 7008271 7127550 7152005 7195306 6933475 6779102 6915325 7112609 7085960 7032153 7086498
4762 7086498 6585538 6817702 7295051 7147436 6840494 6847565 6606075 6619163 7047962 7230388
4752 7230388 7192965 7636914 7824665 8028603 7913715 7688665 7801405 7854234 7913793 8041554
4742 8041554 8221279 8040999 8080282 8115836 7897263 8230032 8225030 8610773 9195955 9173495
4732 9173495 8810409 9848548 10087964 9856106 10293880 10334476 10509340 10654699 10693760 11022472
$$ packed form
4802H788574R742j66560l92806j98356J27629j63509L2015K25998l78051k4022
4792G860654r3612k01914k50164L47841j27934m91838n5555J62820j85999K94687
4782G258986j41699J56900J91302k87074J90486k97120P4425j75150r6445J33660
4772G008271J19279K4455M3301k61831j54373J36223J97284k6649n3807N4345
4762G086498n00960K32164M77349j47615l06942P071k41490J3088M28799J82426
4752G230388l7423M43949J87751K03938j14888k25050J12740N2829N9559J27761
4742H041554J79725j80280L9283L5554k18573L32769n002L85743N85182k2460
4732I173495l63086J038139K39416k31858M37774M0596J74864J45359L9061L28712
$$ plain form
4722 11022472 11514459 11667517 12085896 12593023 12882170 13292372 13666720 14028559 14704185
4713 14704185 15002201 15509954 16294583 17067291 17730776 18725727 20011615 21048787 21774983
4704 21774983 23272319 24720498 26007576 27297563 28882726 30487388 31619310 33208739
4696 33208739 34370033 35233322 35722017 35603746 35102497 34865340 33577312 32292303 31704680
4687 31704680 30476070 29082563 28281909 27476275 26667094 25969283 24924999 24699484 24392493
4678 24392493 23965737 24043620 24035395 23075059 22801154 22932514 23193091 23874267 24423491 24967030
4668 24967030 24970607 25651018 26501357 27191265 27983115 28979212 30201982 31320013 32531480
4659 32531480 34336338 35323644 36130029 37720523 38324689 39164385 39351984 39515388 39471085
$$ packed form
4722A1022472M91987J53058M18379N07127K89147M10202L74348L61839O75626
4713A4704185K98016N07753P84629P72708O63485R94951J285888J037172P26196
4704B1774983J497336J448179J287078J289987J585163J604662J131922J589429
4696C3208739J161294Q63289M88695j18271n01249k37157j288028j285009n87623
4687C1704680j228610j393507q00654q05634q09181o97811j044284k25515l06991
4678B4392493m26756P7883q225r60336k73905J31360K60577O81176N49224N43539
4668B4967030L577O80411Q50339O89908P91850R96097J222770J118031J211467
4659C2531480J804858R87306Q06385J590494O04166Q39696J87599J63404m4303
$$ plain form
4650 39471085 38956877 38209384 37424113 36728516 36101629 35571947 34813625 34752411 35009505 34770129
4640 34770129 33839546 33567703 33094314 32357452 31323627 29984544 28958506 27692849 26244243
4631 26244243 25435733 24519423 22860400 22103965 21061093 20119532 19104944 18535127 18599367
4622 18599367 18360987 18127174 17691589 17453131 17042511 16973162 16849983 16571524 16922254 16809444
4612 16809444 16700854 17359461 17533659 17510788 17973901 18413409 18996842 19853340 20276719 21067488
4602 21067488 21788919 22214782 22489358 22599082 22651103 22980400 22410295 21465354 21149305 20163185
4592 20163185 18573280 17463456 16496711 15014352 14233488 13460137 12847896 12814579 12152724
4583 12152724 11633152 11085360 10498401 9298534 8860747 9103787 9075980 8320338 7610445
$$ packed form
4650C9471085n14208p47493p85271o95597o26887n29682p58322o1214K57094k39376
4640C4770129r30583k71843m73389p36862j033825j339083j026038j265657j448606
4631B6244243q08510r16310j659023p56435j042872r41561j014588n69817O4240
4622A8599367k38380k33813m35585k38458m10620o9349j23179k78459L50730j12810
4612A6809444j08590O58607J74198k2871M63113M39508N83433Q56498M23379P90769
4602B1067488P21431M25863K74576J09724N2021L29297n70105r44941l16049r86120
4592B0163185j589905j109824r66745j482359p80864p73351o12241l3317o61855
4583A2152724n19572n47792n86959j199867m37787K43040k7807p55642p09893
$$ plain form
4574 7610445 7573668 7791404 7592472 7146410 7094817 6828200 6571906 6172711 6393026 6694268
4564 6694268 5919177 5559451 5925293 5705772 5285005 5397048 5358943 5332303 5270471 4959793
4554 4959793 5172882 4919434 4947446 4909431 5062030 4668165 4475605 4329497 4514739 4591388
4544 4591388 4442769 4461687 4714850 4591371 4699998 4522431 4251193 4777991 4683357 4156726
4534 4156726 4346121 4149900 4339047 4025041 3993103 4130086 4005978 4332217 4148738 4360193
4524 4360193 4411994 4183051 3813005 3813927 3748007 3832172 4029680 3905549 3855398 3779363 3787968
4513 3787968 3930285 3968992 3985616 3911377 4026869 3812024 4001988 4086782 3847948 3739420
4503 3739420 4111083 3751101 3704944 4108292 4321651 4025869 4476712 4953577 4653197 4511248
$$ packed form
4574G610445l6777K17736j98932m46062n1593k66617k56294l99195K20315L01242
4564F694268p75091l59726L65842k19521m20767J12043l8105k6640o1832l10678
4554D959793K13089k53448K8012l8015J52599l93865j92560j46108J85242P6649
4544D591388j48619J8918K53163j23479J08627j77567k71238N26798r4634n26631
4534D156726J89395j96221J89147l14006l1938J36983j24108L26239j83479K11455
4524D360193N1801k28943l70046R22o5920Q4165J97508j24131n0151p6035Q605
4513C787968J42317L8707J6624p4239J15492k14845J89964Q4794k38834j08528
4503C739420L71663l59982m6157M03348K13359k95782M50843M76865l00380j41949
$$ plain form
4493 4511248 4489800 4824450 4928676 4550380 4652594 4989113 4873753 4632032 4759788 4905815
4483 4905815 4724743 3953831 4384995 4678764 4505466 4488331 4616923 4602323 4696594 4665456
4473 4665456 4533781 4954605 4777031 4698078 4685953 4569362 4768059 5355194 5205552 5050103
4463 5050103 5096814 5186651 5418854 5311099 5425300 5541301 4872753 4951756 5468474 5676087
4453 5676087 5386846 5324228 5641738 5802427 5756660 5995205 6122317 6145718 6146395 6408660 6697628
4442 6697628 7052434 6747658 6431061 6516753 6546037 6733519 6682534 6956926 7029549 7067887
4432 7067887 7478740 7731262 7964998 7778812 7862149 8052093 8069895 7777813 8068073 8852940
4422 8852940 9066995 9393056 9579786 10001470 10311252 10270600 10380297 11160459 11587890 11755045
$$ packed form
4493D511248k1448L34650J04226l78296J02214L36519j15360k41721J27756J46027
4483D905815j81072p70912M31164K93769j73298j7135J28592j4600R4271l1138
4473D665456j31675M20824j77574p8953j2125j16591J98697N87135j49642j55449
4463E050103M6711Q9837K32203j07755J14201J16001o68548P9003N16718K07613
4453E676087k89241o2618L17510J60689m5767K38545J27112K3401O77K62265K88968
4442F697628L54806l04776l16597Q5692K9284J87482n0985K74392P2623L8338
4432G067887M10853K52522K33736j86186Q3337J89944J7802k92082K90260P84867
4422H852940K14055L26061J86730M21684L09782m0652J09697P80162M27431J67155
$$ plain form
4412 11755045 11694873 12002602 12463674 12760125 12728880 13752832 14239413 14727966 15071970 15371152
4402 15371152 16297679 16842025 17566944 18503463 19353127 19805584 20725231 22028284 23333777
4393 23333777 24397841 25498994 27079124 28990714 30955365 33323880 35804776 38747805
4385 38747805 41677326 45346556 49254889 53037443 56310139 59150708 61663669 65081724
4377 65081724 68972948 73019958 77418949 81354040 84459424 86214975 87599768 89729602
4369 89729602 92123928 94210843 96592214 99460202 100907343 99684113 97337582 95351452
4361 95351452 93243727 90757332 88782775 86821691 84817653 81647480 77459289 72866292
4353 72866292 68835164 65032494 61602614 58064595 54348724 51031861 48030797 44214100
$$ packed form
4412A1755045o0172L07729M61072K96451l1245J023952M86581M88553L44004K99182
4402A5371152R26527N44346P24919R36519Q49664M52457R19647J303053J305493
4393B3333777J064064J101153J580130J911590J964651K368515K480896K943029
4385C8747805K929521L669230L908333L782554L272696K840569K512961L418055
4377F5081724L891224M047010M398991L935091L105384J755551J384793K129834
4369H9729602K394326K086915K381371K867988J447141j223230k346531j986130
4361I5351452k107725k486395j974557j961084k004038l170173m188191m592997
4353G2866292m031128l802670l429880l538019l715871l316863l001064l816697
$$ plain form
4345 44214100 40737472 37769754 34472836 31160960 28518235 26650008 24562180 23094215
4337 23094215 21543942 20015183 19159747 18263068 17201064 16787595 16206972 15572260 14868656
4328 14868656 14148658 13712895 13006095 12664176 12589754 11943564 11657800 11723481 10965831 10623035
4318 10623035 10602228 9951254 9829287 9574389 9393680 9287488 9261520 8961455 9073645 8782910
4308 8782910 8597228 8395796 7782662 7803490 7916344 7528719 7582603 7212750 7042289 7205958
4298 7205958 7329025 7280040 7182288 6809164 6824214 6601623 6465305 6754885 6265716 6266589 5986432
4287 5986432 5978121 5879377 5676133 5968152 5961943 5608747 5664363 5518129 5153460 5042808 4824007
4276 4824007 5006316 5398772 5393598 5281049 4766425 4558313 4660793 4743754 4432446 4365146
$$ packed form
4345D4214100l476628k967718l296918l311876k642725j868227k087828j467965
4337B3094215j550273j528759q55436q96679j062004m13469n80623o34712p03604
4328A4868656p19998m35763p06800l41919p4422o46190k85764O5681p57650l42796
4318A0623035k0807o50974j21967k54898j80709j06192k5968l00065J12190k90735
4308H782910j85682k01432o13134K0828J12854l87625N3884l69853j70461J63669
4298G205958J23067m8985r7752l73124J5050k22591j36318K89580m89169Q73k80157
4287E986432q311r8744k03244K92019o209l53196N5616j46234l64669j10652k18801
4276D824007J82309L92456n174j12549n14624k08112J02480Q2961l11308o7300
$$ plain form
4266 4365146 4496682 4542583 4420427 4206541 4095978 4282072 4523703 4687068 4603391 4468848
4256 4468848 4625676 4357980 4336846 4185781 4299771 4881551 4610611 4308233 4248983 4077294
4246 4077294 4469426 4351312 4468012 4538493 4417947 4146145 3942023 3830074 3605718 4286866
4236 4286866 3995771 3714501 3517256 3273381 3648426 4118604 4163912 4025400 3880373 3843236
4226 3843236 3921551 4093035 4141308 4300642 4065116 3801644 3716075 4049996 4002081 4227279
4216 4227279 4181272 3925927 3968529 3955238 4102830 4114283 3963001 3882461 4286320 4259914 4318840
4205 4318840 4198439 4140859 4431735 4178340 3946937 4116282 4401670 4240397 4401043 3972240
4195 3972240 4427165 4635094 4742953 4564620 4567138 4552451 4826944 4777548 4402031 4614867
$$ packed form
4266D365146J31536M5901j22156k13886j10563J86094K41631J63365q3677j34543
4256D468848J56828k67696k1134j51065J13990N81780k70940l02378n9250j71689
4246D077294L92132j18114J16700P0481j20546k71802k04122j11949k24356O81148
4236D286866k91095k81270j97245k43875L75045M70178M5308j38512j45027l7137
4226C843236P8315J71484M8273J59334k35526k63472q5569L33921m7915K25198
4216D227279m6007k55345M2602j3291J47592J1453j51282q0540M03859k6406N8926
4205D318840j20401n7580K90876k53395k31403J69345K85388j61273J60646m28803
4195C972240M54925K07929J07859j78333K518j4687K74493m9396l75517K12836
$$ plain form
4185 4614867 4787109 4990353 4737698 4776570 5013125 5140997 4963155 5039472 5107111 4929409
4175 4929409 5218663 5518096 5429635 5440534 5142512 5031973 5360396 5208598 5095303 5728970
4165 5728970 5731772 5860876 6078528 5827247 5154067 5571849 5668896 5863389 6265016 6327969
4155 6327969 6369743 6778820 6335038 6163712 6513050 6532533 6440470 6853950 6572340 6883247
4145 6883247 6816131 6425396 6778094 6914246 6910441 7295051 7430933 7426504 7628171 7693100 7600867
4134 7600867 7495243 7640675 8145269 7586206 7357307 7939169 8047692 8194082 8812387 8842215
4124 8842215 8536837 8860058 9052594 9168514 9257099 9481997 9590580 9914311 9951925 10222450
4114 10222450 10415468 10471628 10502561 10893966 10933333 11049669 11551480 11577504 11359968 11812503
$$ packed form
4185D614867J72242K03244k52655L8872K36555J27872j77842P6317O7639j77702
4175D929409K89254K99433q8461J0899k98022j10539L28423j51798j13295O33667
4165E728970K802J29104K17652k51281o73180M17782R7047J94493M01627O2953
4155F327969M1774M09077m43782j71326L49338J9483r2063M13480k81610L10907
4145F883247o7116l90735L52698J36152l805L84610J35882m429K01667O4929r2233
4134G600867j05624J45432N04594n59063k28899N81862J08523J46390O18305K9828
4124H842215l05378L23221J92536J15920Q8585K24898J08583L23731L7614K70525
4114A0222450J93018N6160L0933L91405L9367J16336N01811K6024k17536M52535
$$ plain form
4104 11812503 12061965 12487671 12944226 12763945 12831472 13197412 13483036 13697512 13914776 13814439
4094 13814439 14120174 14591010 14772584 15174397 15541968 15762152 16087856 16102497 16464888 16931109
4084 16931109 17708498 17742828 18051144 18113039 18485908 18970786 18774053 19583968 19663543 19712785
4074 19712785 20161800 20970648 21301683 21995906 22808311 23160137 23654926 24028270 24526984
4065 24526984 25250497 25599685 26510684 27041359 27409342 28427484 29117659 30081662 31401439
4056 31401439 32309188 33339287 34728054 36141664 37539019 38523989 39490638 40671229 42217178
4047 42217178 43763809 45710061 47755035 49172427 51839918 54149673 55467427 58015114
4039 58015114 60784378 63405366 66326268 68793203 71499135 75043247 78003216 80941412
$$ packed form
4104A1812503K49462M25706M56555j80281O7527L65940K85624K14476K17264j00337
4094A3814439L05735M70836J81574M01813L67571K20184L25704J4641L62391M66221
4084A6931109P77389L4330L08316O1895L72869M84878j96733Q09915P9575M9242
4074A9712785M49015Q08848L31035O94223Q12405L51826M94789L73344M98714
4065B4526984P23513L49188R10999N30675L67983J018142O90175R64003J319777
4056C1401439R07749J030099J388767J413610J397355R84970R66649J180591J545949
4047D2217178J546631J946252K044974J417392K667491K309755J317754K547687
4039E8015114K769264K620988K920902K466935K705932L544112K959969K938196
$$ plain form
4031 80941412 84573403 88269281 91809870 95242511 99492667 103642542 107431855 111318226
4023 111318226 115826618 120083669 123395031 127498235 131512956 135086697 139157960 142684789
4015 142684789 146078141 149359592 152444678 155034212 158483276 161118992 163201024 165541443
4007 165541443 167818043 169212084 170445631 171173434 171793417 171968756 171387324 171258857 171096402
3998 171096402 169690140 168126851 166820787 165017942 162750474 159702942 156717919 153643538
3990 153643538 150518577 147167293 143631015 140028161 136147118 131802577 127693682 123831480
3982 123831480 120173989 115854051 111681340 107487515 103679967 100193469 95868879 91951639
3974 91951639 88010572 84571514 80896127 77086201 74221441 71082643 68322393 65377332
$$ packed form
4031H0941412L631991L695878L540589L432641M250156M149875L789313L886371
4023A11318226M508392M257051L311362M103204M014721L573741M071263L526829
4015A42684789L393352L281451L085086K589534L449064K635716K082032K340419
4007A65541443K276600J394041J233547P27803O19983J75339n81432j28467j62455
3998A71096402j406262j563289j306064j802845k267468l047532k985023l074381
3990A53643538l124961l351284l536278l602854l881043m344541m108895l862202
3982A23831480l657491m319938m172711m193825l807548l486498m324590l917240
3974I1951639l941067l439058l675387l809926k864760l138798k760250k945061
$$ plain form
3966 65377332 62730196 60103647 57848997 55216568 52789067 50632225 48981504 47356738
3958 47356738 45325372 43299288 41707934 40235388 38553900 37464709 36659688 35566236
3950 35566236 34789348 33933339 33077991 31899607 30960471 30442415 29812718 29037049 28888401
3941 28888401 28675313 27901272 27512812 26981378 26683308 26759539 26380198 25543627 25102952 25134245
3931 25134245 24464132 24265870 24321651 24342171 24166496 23738086 24100045 24146868 23860935 23466974
3921 23466974 23344398 23422195 23317609 23422923 23306514 23064259 23154034 23352629 23376289 23268885
3911 23268885 23129342 23279159 23298783 23922089 24288477 24202694 24570426 24544194 24327602 24790269
3901 24790269 25635542 25648595 25567902 26098159 26194100 26279104 26863987 26990678 27764986 28457586
$$ packed form
3966F5377332k647136k626549k254650k632429k427501k156842j650721j624766
3958D7356738k031366k026084j591354j472546j681488j089191q05021j093452
3950C5566236p76888q56009q55348j178384r39136n18056o29697p75669j48648
3941B8888401k13088p74041l88460n31434k98070P6231l79341q36571m40675L1293
3931B5134245o70113j98262N5781K0520j75675m28410L61959M6823k85933l93961
3921B3466974j22576P7797j04586J05314j16409k42255Q9775J98595K3660j07404
3911B3268885j39543J49817J9624O23306L66388q5783L67732k6232k16592M62667
3901B4790269Q45273J3053q0693N30257R5941Q5004N84883J26691P74308O92600
$$ plain form
3891 28457586 28701455 29110298 29280139 29953172 30844894 31241903 31597200 32388221 32988999
3882 32988999 33526873 34145183 34917469 36276314 36949311 37307322 37988588 39723375 41144558
3873 41144558 41854187 42708772 43867104 45248543 46347931 47466825 48672956 50300276
3865 50300276 51103014 51875869 53640489 54311269 55292269 56238374 57344527 58706087 59728351
3856 59728351 60327020 61814148 62513032 63108682 64408231 65392448 66501538 67668395 68453084
3847 68453084 69150285 71095670 72284605 73486184 75315374 76719903 78360577 80018001
3839 80018001 81785360 84376251 86895479 88867482 91329746 94431521 97487294 101216159
3831 101216159 104536479 108229986 112642286 117437937 122518241 127701762 133740283 139826898
$$ packed form
3891B8457586K43869M08843J69841O73033Q91722L97009L55297P91021O00778
3882C2988999N37874O18310P72286J358845O72997L58011O81266J734787J421183
3873D1144558P09629Q54585J158332J381439J099388J118894J206131J627320
3865E0300276Q02738P72855J764620O70780R81000R46105J106153J361560J022264
3856E9728351N98669J487128O98884N95650J299549R84217J109090J166857P84689
3847F8453084O97201J945385J188935J201579J829190J404529J640674J657424
3839H0018001J767359K590891K519228J972003K462264L101775L055773L728865
3831A01216159L320320L693507M412300M795651N080304N183521O038521O086615
$$ plain form
3823 139826898 146761083 154127141 161702200 170112889 179046304 189019673 199531826 209726170
3815 209726170 220925763 232584476 244375424 257264799 269494548 281149945 293284199
3808 293284199 304649621 315507942 325634108 334665333 342195297 348829401 353975139 357711502
3800 357711502 360218043 360987183 360724923 359470311 356696691 352926236 347885975 341490953
3792 341490953 334651218 326208038 317598982 308214298 297533155 286345942 275354105 264047400
3784 264047400 252527361 241092744 229075235 217501235 206464169 195362013 185094503
3777 185094503 174952212 165628415 157035566 148634952 140910520 133535913 126967667 120853530
3769 120853530 115195119 109984483 105249435 100777240 96980629 93603529 90427189 87534040
$$ packed form
3823A39826898O934185P366058P575059Q410689Q933415R973369J0512153J0194344
3815B09726170J1199593J1658713J1790948J2889375J2229749J1655397J2134254
3808B93284199J1365422J0858321J0126166R031225P529964O634104N145738L736363
3800C57711502K506541P69140k62260j254612k773620l770455n040261o395022
3792C41490953o839735q443180q609056r384684j0681143j1187213j0991837j1306705
3784B64047400j1520039j1434617j2017509j1574000j1037066j1102156j0267510
3777A85094503j0142291r323797q592849q400614p724432p374607o568246o114137
3769A20853530n658411n210636m735048m472195l796611l377100l176340k893149
$$ plain form
3761 87534040 84810027 82072640 79532871 77347140 75536186 73956269 72135923 70850684
3753 70850684 69545592 68314909 67283536 65973187 65031364 63568617 62391179 61446677
3745 61446677 60154637 59786106 58720551 57292870 56379706 55746239 54826283 53846973 53285367
3736 53285367 52156484 51085031 50628560 49429830 48633876 48030486 47408915 46548348 45503296
3727 45503296 43790446 42861279 42719598 41764590 41199577 40048215 39215885 38927756 38565252
3718 38565252 37491907 36861963 36255733 35841830 35389506 34592938 34562998 34547147 34179475 33677430
3708 33677430 33187045 32788438 32759590 33026748 32629010 32661238 32858234 32830761 33103136 33126913
3698 33126913 33223863 33868460 34093057 34255542 35080047 35916284 36672236 37501884 38345523 38826178
$$ packed form
3761H7534040k724013k737387k539769k185731j810954j579917j820346j285239
3753G0850684j305092j230683j031373j310349r41823j462747j177438r44502
3745F1446677j292040l68531j065555j427681r13164o33467r19956r79310n61606
3736E3285367j128883j071453m56471j198730p95954o03390o21571q60567j045052
3727D5503296j712850r29167j41681r55008n65013j151362q32330k88129l62504
3718C8565252j073345o29944o06230m13903m52324p96568k9940j5851l67672n02045
3708C3677430m90385l98607k8848K67158l97738L2228J96996k7473K72375K3777
3698C3126913R6950O44597K24597J62485Q24505Q36237P55952Q29648Q43639M80655
$$ plain form
3688 38826178 39677890 40525274 41279768 42418903 43038141 43730616 44190133 44668602 45711731
3679 45711731 45457112 45391949 45923429 46165493 46149437 45885883 45683126 45727982 45679004 45593096
3669 45593096 45025060 45048175 44530444 44443296 44350566 43474635 43242843 42742050 42110264 42117143
3659 42117143 41656564 41362526 41686241 41490115 41551763 41836391 41626216 42068367 42757730 43594649
3649 43594649 44449655 45233689 46403209 47607883 48415462 49408199 50402694 51573620 52682928
3640 52682928 53738390 55729637 56688425 58147775 59309682 60046965 60770103 62048909 62948051
3631 62948051 63918967 65263365 65591148 66368630 67238847 67971785 68649319 68814327 69513842
3622 69513842 69364623 69626323 70232465 70397263 70217433 70319650 70650423 70614611 71187455 71636718
$$ packed form
3688C8826178Q51712Q47384P54494J139135O19238O92475M59517M78469J043129
3679D5711731k54619o5163N31480K42064j6056k63554k02757M4856m8978q5908
3669D5593096n68036K3115n17731q7148r2730q75931k31792n00793o31786O879
3659D2117143m60579k94038L23715j96126O1648K84628k10175M42151O89363Q36919
3649D3594649Q55006P84034J169520J204674Q07579R92737R94495J170926J109308
3640E2682928J055462J991247R58788J459350J161907P37283P23138J278806Q99142
3631F2948051R70916J344398L27783P77482Q70217P32938O77534J65008O99515
3622F9513842j49219K61700O06142J64798j79830J02217L30773l5812N72844M49263
$$ plain form
3612 71636718 72082673 72565780 73287623 74070219 74914200 75563880 76449175 77692289 78752326
3603 78752326 80751942 82480789 84694277 87451021 90242706 93316704 96029771 99311257
3595 99311257 103070216 107187380 111550745 116342577 121681303 127372263 132784010 138363357
3587 138363357 144556245 151128663 157878001 164219535 171137189 177276159 183319583 189769685
3579 189769685 195753360 202189777 208769539 215218884 220773925 226392243 232025215 237400989
3571 237400989 242723518 247169386 251392711 255263588 258965665 262078517 264386094 267179351
3563 267179351 268621097 269998073 271051677 271709960 272345620 272399444 272148179 271293388 270082317
3554 270082317 268660776 266877207 264787294 262480342 259890937 257049032 253720868 249908410
$$ packed form
3612G1636718M45955M83107P21843P82596Q43981O49680Q85295J243114J060037
3603G8752326J999616J728847K213488K756744K791685L073998K713067L281486
3595I9311257L758959M117164M363365M791832N338726N690960N411747N579347
3587A38363357O192888O572418O749338O341534O917654O138970O043424O450102
3579A89769685N983675O436417O579762O449345N555041N618318N632972N375774
3571B37400989N322529M445868M223325L870877L702077L112852K307577K793257
3563B67179351J441746J376976J053604O58283O35660N3824k51265q54791j211071
3554B70082317j421541j783569k089913k306952k589405k841905l328164l812458
$$ plain form
3546 249908410 245964517 241854350 236809611 231874500 226803445 221103078 214972908 208605283
3538 208605283 202150681 195442282 189202125 182840422 176475267 170260829 163899093 157449065
3530 157449065 151215149 144493460 138550081 132958160 126888282 120684995 115095271 109932718
3522 109932718 104933190 100312319 95793209 91471920 87885191 84490686 81144015 78987384
3514 78987384 76286006 74197368 72608058 70947908 69153863 68051563 67456149 67045046
3506 67045046 66099777 65198828 64964583 64117344 63455228 63014181 62078453 61569336 61772596
3497 61772596 61092116 60283690 60233551 59959886 59556386 58955477 58028006 57345626 56729229 55818586
3487 55818586 55056531 54004713 52854137 51774588 50114913 48811810 47521654 46437287
$$ packed form
3546B49908410l943893m110167n044739m935111n071055n700367o130170o367625
3538B08605283o454602o708399o240157o361703o365155o214438o361736o450028
3530A57449065o233916o721689n943379n591921o069878o203287n589724n162553
3522A09932718m999528m620871m519110m321289l586729l394505l346671k156631
3514G8987384k701378k088638j589310j660150j794045j102300n95414m11103
3506F7045046r45269r00949k34245q47239o62116m41047r35728n09117K03260
3497F1772596o80480q08426n0139k73665m03500o00909r27471o82380o16397r10643
3487E5818586p62055j051818j150576j079549j659675j303103j290156j084367
$$ plain form
3479 46437287 45227702 43647495 42382944 40824413 39874474 38350540 36798956 35801195
3471 35801195 34510415 32921551 31710882 30284776 29345980 28480696 27023036 26084977 24763111
3462 24763111 24146795 23524235 22672819 21586274 21004341 19854673 19285914 18954896 18243177
3453 18243177 17956716 17437816 17017093 16686906 15753028 15390764 15175692 14421812 14181829
3444 14181829 14021058 13523226 12786936 12559755 12577126 12101560 11691419 11766660 11485312 11027392
3434 11027392 10720452 10578724 10124613 10159069 10036635 9780994 9585078 9408264 9248604 9129964
3424 9129964 8698504 8508311 8620947 8353437 8553121 8324117 8167914 8317002 8206898 7801377
3414 7801377 7841542 7701073 7768355 7617825 7388247 7224964 7033462 6666156 6806572 6878022
$$ packed form
3479D6437287j209585j580207j264551j558531r49939j523934j551584r97761
3471C5801195j290780j588864j210669j426106r38796q65284j457660r38059j321866
3462B4763111o16316o22560q51416j086545n81933j149668n68759l31018p11719
3453A8243177k86461n18900m20723l30187r33878l62264k15072p53880k39983
3444A4181829j60771m97832p36290k27181J7371m75566m10141P5241k81348m57920
3434A1027392l06940j41728m54111L4456j22434k55641j95916j76814j59660j18640
3424I129964m31460j90193J12636k67510J99684k29004j56203J49088j10104m05521
3414G801377M0165j40469O7282j50530k29578j63283j91502l67306J40416P1450
$$ plain form
3404 6878022 6787131 6793937 6445461 6419524 6519048 6236227 5624747 5872485 5647217 5513219
3394 5513219 5590911 5986218 5828450 5361319 5181721 5373951 5693594 5578283 5212588 4791084
3384 4791084 4217512 4345659 4657861 4474205 4871931 5108780 4849376 4791068 4454992 4701901
3374 4701901 4940889 4690797 4238460 4357795 3857122 3968703 4467898 4189813 4398357 4601182
3364 4601182 4175718 4440895 4272080 3932236 4105217 4116500 3551333 3739299 3840024 3427032
3354 3427032 3713232 3425555 3674489 3679138 3219455 3131216 3733261 3166642 3425922 3279548
3344 3279548 3107665 2959153 3238876 2802555 2712976 3037337 3016581 3041593 3093319 3124545
3334 3124545 2931726 2533198 2950600 3243177 2812923 2658253 2923794 2652975 2675960 2537068
$$ packed form
3404F878022r0891O806l48476k5937R9524k82821o11480K47738k25268j33998
3394E513219P7692L95307j57768m67131j79598J92230L19643j15311l65695m21504
3384D791084n73572J28147L12202j83656L97726K36849k59404n8308l36076K46909
3374D701901K38988k50092m52337J19335n00673J11581M99195k78085K08544K02825
3364D601182m25464K65177j68815l39844J72981J1283n65167J87966J00725m12992
3354C427032K86200k87677K48934M649m59683q8239O02045n66619K59280j46374
3344C279548j71883j48512K79723m36321q9579L24361k0756K5012N1726L1226
3334C124545j92819l98528M17402K92577m30254j54670K65541k70819K2985j38892
$$ plain form
3324 2537068 2435562 2638993 2234283 2410365 2677211 2885937 2606577 2735379 2430708 2476961
3314 2476961 2549975 2320982 2344189 2697671 2650501 2653353 2333128 2258421 2525124 2452874 2279570
3303 2279570 2286975 2139937 2007004 2126407 2419863 2602336 2080775 1860139 2322898 2396593
3293 2396593 2412532 2181172 2308550 2461915 2313291 2125955 2223132 2564731 2775875 2629876
3283 2629876 2391693 2270274 2391343 2205676 2201676 2425256 3087817 2961981 3103592 2949511
3273 2949511 2694612 2557762 2323175 2642887 2889677 2712183 2531595 2581641 2355841 2687918
3263 2687918 2862733 2602467 2534915 2679411 2323363 2388451 2446049 2063125 2363404 2187557
3253 2187557 2312631 2171751 2006674 2239173 2353276 2137938 2228379 1853499 1622607 2269128
$$ packed form
3324B537068j01506K03431m04710J76082K66846K08726k79360J28802l04671M6253
3314B476961P3014k28993K3207L53482m7170K852l20225p4707K66703p2250j73304
3303B279570P405j47038j32933J19403K93456J82473n21561k20636M62759P3695
3293B396593J5939k31360J27378J53365j48624j87336R7177L41599K11144j45999
3283B629876k38183j21419J21069j85667m000K23580O62561j25836J41611j54081
3273B949511k54899j36850k34587L19712K46790j77494j80588N0046k25800L32077
3263B687918J74815k60266o7552J44496l56048O5088N7598l82924L00279j75847
3253B187557J25074j40880j65077K32499J14103k15338R0441l74880k30892O46521
$$ plain form
3243 2269128 1927410 1800527 2162663 2384599 2146058 2227070 1832680 1944230 1772152 1991490
3233 1991490 1761755 1722647 1935010 1827839 1532775 1914182 1928360 2162301 2034590 1724242
3223 1724242 1692811 2212018 2200045 1821475 2382632 2148352 2010273 1958091 2116983 2057831
3213 2057831 1947168 1703130 1890751 2403458 2102969 2102574 1900672 1600818 1743363 1640600
3203 1640600 1459445 2023165 1941106 1396511 1056115 1241260 1201115 1033048 985754 1279336
3193 1279336 1285066 1280876 930427 721517 695041 639163 706272 767619 822779 758768 852684
3182 852684 570896 913965 778055 887276 971808 1120430 917993 1059455 919111 1092796
3172 1092796 692067 430372 996787 1031504 922396 958850 1026536 1019634 832271 930216 638521
$$ packed form
3243B269128l41718j26883L62136K21936k38541Q1012l94390J11550j72078K19338
3233A991490k29735l9108K12363j07171k95064L81407J4178K33941j27711l10348
3223A724242l1431N19207j1973l78570N61157k34280j38079n2182J58892n9152
3213B057831j10663k44038J87621N12707l00489l95k01902k99854J42545j02763
3203A640600j81155N63720q2059n44595l40396J85145m0145j68067m7294K93582
3193A279336N730m190l50449k08910k6476n5878O7109O1347N5160o4011R3916
3182H52684k81788L43069j35910J09221Q4532J48622k02437J41462j40344J73685
3172A092796m00729k61695N66415L4717j09108L6454O7686o902j87363R7945k91695
$$ plain form
3161 638521 875424 1112494 870469 950915 865540 1160171 1068519 918571 745824 744629 972568
3150 972568 858567 1228249 1045176 477749 640434 1151256 1056748 1163595 1213799 1130685
3140 1130685 1064101 1162489 1597627 1770686 1555249 1390314 1562659 1787377 2014419 2149265
3130 2149265 2211654 1841479 1420776 1106714 1571784 1749678 1812857 1636210 1002269 1422844
3120 1422844 1703099 1432862 999470 1350291 1815970 1418028 1264002 939358 1321071 1071822
3110 1071822 950858 704977 762178 1169013 1025306 743852 791666 902549 1186022 1667837
3100 1667837 1708384 1873856 1927296 2028167 1425043 1465319 1641192 1407792 1768997 1965358
3090 1965358 2125019 2405998 2861431 3020654 2851403 3749495 3597409 4382615 4958013 5241362
$$ packed form
3161F38521K36903K37070k42025Q0446q5375K94631r1652j49948j72747j195K27939
3150I72568j14001L69682j83073n67427J62685N10822r4508J06847N0204q3114
3140A130685o6584R8388M35138J73059k15437j64935J72345K24718K27042J34846
3130B149265O2389l70175m20703l14062M65070J77894O3179j76647o33941M20575
3120A422844K80255k70237m33392L50821M65679l97942j54026l24644L81713k49249
3110A071822j20964k45881N7201M06835j43707k81454M7814J10883K83473M81815
3100A667837M0547J65472N3440J00871o03124M0276J75873k33400L61205J96361
3090A965358J59661K80979M55433J59223j69251Q98092j52086P85206N75398K83349
$$ plain form
3080 5241362 6406755 6731482 6168808 5602933 5192688 4749985 4613478 3852280 3539887
3071 3539887 3067981 2568412 2818715 2829657 2489466 2424276 2936529 3177526 3431826 3244069
3061 3244069 3294295 3318274 3625875 3906090 3933839 4520134 4913262 5555221 6317151 7208653
3051 7208653 8284149 8791845 10327602 12354094 12087667 10643521 9988516 9563019 8394751
3042 8394751 7590461 6221888 5240779 4909844 4294525 4283349 4184198 3720898 3621177 3298405
3032 3298405 3069816 2901931 2439850 2471663 2379376 2687862 3120541 2650585 2772177 3242848
3022 3242848 3486098 3763998 4478139 4867587 5851624 6223676 6162338 5870227 5495047 4942141
3012 4942141 5007026 4477245 3819725 3449281 2830982 2669568 2609392 2039461 1615204 1587637
$$ packed form
3080E241362J165393L24727n62674n65875m10245m42703j36507p61198l12393
3071C539887m71906m99569K50303J0942l40191o5190N12253K40997K54300j87757
3061C244069N0226K3979L07601K80215K7749N86295L93128O41959P61930Q91502
3051G208653J075496N07696J535757K026492k66427j444146o55005m25497j168268
3042H394751q04290j368573r81109l30935o15319j1176r9151m63300r9721l22772
3032C298405k28589j67885m62081L1813r2287L08486M32679m69956J21592M70671
3022C242848K43250K77900P14141L89448R84037L72052o1338k92111l75180n52906
3012D942141O4885n29781o57520l70444o18299j61414o0176n69931m24257k7567
$$ plain form
3002 1587637 1538292 1500800 1536021 1965162 1682682 1439703 1142661 1144274 1351371 1180788
2992 1180788 854744 692077 524528 454489 888129 783973 867837 712011 470118 700888
2982 700888 285104 305623 495754 423918 345468 393310 672812 425345 458255 597336 100881
2971 100881 376411 628912 500209 783346 536520 272099 388119 237039 142896 45023
2961 45023 83734 54813 195138 625701 451668 281360 309957 135770 -13611 -159371
2951 -159371 114805 -224503 -99774 59025 -220916 178530 434940 118082 -5799 -81326
2941 -81326 126347 -85002 -53023 -23005 -240489 -333899 -306973 -58659 447064 502335 49194
2930 49194 -350987 29526 440450 195791 304044 381270 624066 193284 -53792 -151899
$$ packed form
3002A587637m9345l7492L5221M29141k82480k42979k97042J613K07097j70583
2992A180788l26044j62667j67549p0039M33640j04156Q3864j55826k41893K30770
2982G00888m15784K0519J90131p1836p8450M7842K79502k47467L2910J39081m96455
2971A00881K75530K52501j28703K83137k46826k64421J16020j51080r4143r7873
2961D5023L8711k8921J40325M30563j74033j70308K8597j74187j49381j45760
2951a59371K74176l39308J24729J58799k79941L99446K56410l16858j23881p5527
2941h1326K07673k11349L1979L0018k17484r3410K6926K48314N05723N5271m53141
2930D9194m00181L80513M10924k44659J08253P7226K42796m30782k47076r8107
$$ plain form
2920 -151899 -151762 -5721 168926 -6204 -114934 344936 285060 138196 -386886 96170
2910 96170 548030 277000 283900 223314 40631 153934 4890 -15040 -119865 -304627 -485912
2899 -485912 -235477 -6847 88325 492096 217983 229175 2743 -67814 361369 224128
2889 224128 272028 489816 644128 527485 364354 336140 497289 866544 287241 -32382
2879 -32382 -139078 335970 600243 566547 416127 428484 331182 25645 38305 22479 126447
2868 126447 -318155 -7646 293162 -242518 -143807 261875 360057 334395 509110 31833
2858 31833 -356202 -95733 149273 -12200 -136743 31146 212837 576461 408623 45881
2848 45881 11736 438956 355329 460025 720561 778828 223143 -86376 253700 66849
$$ packed form
2920a51899J37J46041J74647j75130j08730M59870n9876j46864n25082M83056
2910I6170M51860k71030O900o0586j82683J13303j49044j9930j04825j84762j81285
2899d85912K50435K28630R5172M03771k74113J1192k26432p0557M29183j37241
2889B24128M7900K17788J54312j16643j63131k8214J61149L69255n79303l19623
2879c2382j06696M75048K64273l3696j50420J2357r7302l05537J2660j5826J03968
2868A26447m44602L10509L00808n35680R8711M05682R8182k5662J74715m77277
2858C1833l88035K60469K45006j61473j24543J67889J81691L63624j67838l62742
2848D5881l4145M27220q3627J04696K60536N8267n55685l09519L40076j86851
$$ plain form
2838 66849 -75896 -32281 209501 -84929 192476 83111 -48777 225814 150999 446359
2828 446359 228875 87814 118805 65543 397207 368658 -92126 -58816 -181773 -618870
2818 -618870 -606130 -335551 -327514 -345068 -412601 -178041 -205743 -194474 -4924 -278048 -66998
2807 -66998 60588 183430 118496 174777 89202 -24118 -142138 19649 -46673 -221015 -161997
2796 -161997 -339103 99523 -293636 -419341 19013 -54665 -163930 3341 -175130 -628690
2786 -628690 -341528 -308318 -86534 -221477 -37062 128037 29552 -224416 -273006 -263449 -234862
2775 -234862 -119080 -245557 -5317 -11704 -264843 -422054 -36446 -173667 -318760 42464
2765 42464 -68502 -234580 -208729 -70829 455490 333421 -79018 -305189 -188496 -24988
$$ packed form
2838F6849j42745M3615K41782k94430K77405j09365j31888K74591p4815K95360
2828D46359k17484j41061L0991n3262L31664k8549m60784L3310j22957m37097
2818f18870J2740K70579Q037j7554o7533K34560k7702J1269J89550k73124K11050
2807f6998J27586J22842o4934N6281q5575j13320j18020J61787o6322j74342N9018
2796a61997j77106M38626l93159j25705M38354p3678j09265J67271j78471m53560
2786f28690K87162L3210K21784j34943J84415J65099r8485k53968m8590R557K8587
2775b34862J15782j26477K40240o387k53139j57211L85608j37221j45093L61224
2765D2464j10966j66078K5851J37900N26319j22069m12439k26171J16693J63508
$$ plain form
2755 -24988 141474 282509 24753 -101160 15034 104696 165333 -61032 -368847 -467530
2745 -467530 -454494 79485 -79736 -504344 -220319 -256158 -473798 -249975 -122794 174635
2735 174635 110820 5065 -303323 -227872 -209163 -637412 -232616 -127174 -162526 -21240
2725 -21240 -506867 -415242 -85081 -83165 -149152 232133 -46408 -16541 378264 61341 132966
2714 132966 -269179 -214650 -77210 -100206 -443729 -253105 -168012 -300703 -163895 -294480
2704 -294480 -162681 72167 -593135 -362046 -16162 164594 -136412 -192862 -485829 22100
2694 22100 9201 156067 39565 -240846 138288 -172265 -165257 -605169 -254243 -725371
2684 -725371 -203351 314748 -401221 -574075 -735215 -1071777 -438734 -347132 -356999 161395
$$ packed form
2755b4988J66462J41035k57756j25913J16194Q9662O0637k26365l07815r8683
2745d67530J3036N33979j59221m24608K84025l5839k17640K23823J27181K97429
2735A74635o3815j05755l08388P5451J8709m28249M04796J05442l5352J41286
2725b1240m85627R1625L30161J916o5987L81285k78541K9867L94805l16923P1625
2714A32966m02145N4529J37440k2996l43523J90624Q5093j32691J36808j30585
2704b94480J31799K34848o65302K31089L45884J80756l01006n6450k92967N07929
2694B2100j2899J46866j16502k80411L79134l10553P008m39912L50926m71128
2684g25371N22020N18099p15969j72854j61140l36562O33043R1602r867N18394
$$ plain form
2674 161395 286127 -152386 -105562 103221 44220 -208081 -256876 -54322 8534 -742 176722
2663 176722 412933 337580 -48232 93029 27839 -139730 -187108 -500982 -169947 124328
2653 124328 346492 185867 347066 58947 -279754 -207784 -382592 -376599 -383598 -259323 -200085
2642 -200085 -515188 -359852 -420346 -301437 -434145 -436063 -356890 -307982 163623 203898 121275
2631 121275 -289505 -519345 -394700 -312876 -136560 -172925 -215633 -232190 -49354 294040
2621 294040 -93507 -83777 -341971 -178420 2147 -346322 -22187 -153136 -606871 -712569
2611 -712569 -183284 -76754 -196501 -495639 -665656 -522141 -473462 -234673 -998 -3369
2601 -3369 -109964 -404970 -653454 -287283 -43453 -531387 -229781 -8418 -115112 -124648
$$ packed form
2674A61395J24732m38513M6824K08783n9001k52301m8795K02554O2856r276J77464
2663A76722K36211p5353l85812J41261o5190j67569m7378l13874L31035K94275
2653A24328K22164j60625J61199k88119l38701P1970j74808N993o999J24275N9238
2642b00085l15103J55336o0494J18909j32708j918P9173M8908M71605M0275q2623
2631A21275m10780k29840J24645Q1824J76316l6365m2708j6557J82836L43394
2621B94040l87547R730k58194J63551J80567l48469L24135j30949m53735j05698
2611g12569N29285J06530j19747k99138j70017J43515M8679K38789K33675k371
2601c369j06595k95006k48484L66171K43830m87934L01606K21363j06694r536
$$ plain form
2591 -124648 -385821 -100316 238990 27988 -463113 -201610 -320922 -364353 -78583 184284
2581 184284 -189314 -514381 -42237 -183680 -351771 -330529 -630598 -508466 -238573 -185405
2571 -185405 62497 -36353 -166745 -287310 -558223 -247818 -179804 -735344 -587915 15635
2561 15635 -45197 -31281 -32452 -45217 189815 186209 -324958 -437006 -71858 -625812 -681618
2550 -681618 -334170 119187 248611 -242549 -315638 -350733 4919 44079 83852 45672 138078
2539 138078 177726 -83993 41725 530809 -185736 -103637 16181 -215860 -269895 -172768
2529 -172768 -177413 38076 87613 14093 121109 -153497 -295040 -68891 111581 85219 54774
2518 54774 -444120 -431337 -347329 -137599 -60621 -74268 -604921 -128160 154181 36130 127646
$$ packed form
2591a24648k61173K85505L39306k11002m91101K61503j19312m3431K85770K62867
2581A84284l73598l25067M72144j41443j68091K1242l00069J22132K69893N3168
2571a85405K47902r8850j30392j20565k70913L10405O8014n55540J47429O03550
2561A5635o0832J3916j171j2765K35032l606n11167j12048L65148n53954n5806
2550f81618L47448M53357J29424m91160p3089l5095L55652L9160L9773l8180R2406
2539A38078L9648k61719J25718M89084p16545Q2099J19818k32041n4035R7127
2529a72768m645K15489M9537p3520J07016k74606j41543K26149J80472k6362l0445
2518E4774m98894J2783Q4008K09730P6978j3647n30653M76761K82341j18051R1516
$$ plain form
2507 127646 287550 262179 101180 122302 -19234 -131498 -285015 -495759 -445517 -142672
2497 -142672 -21947 -234409 -387343 -290657 -386894 -592105 -378899 -143539 -327143 -447036
2487 -447036 -266888 -395037 -743132 -375439 -656895 -545020 128825 -392466 -155855 -47118
2477 -47118 -255733 -33097 -196768 125429 549895 297686 51665 375158 -75439 -332974
2467 -332974 -137082 -474554 -702934 -93022 110372 -180983 232910 285804 465273 148880
2457 148880 -323248 9548 -329229 -533079 -119797 -119205 -435318 -546096 -194094 -650772
2447 -650772 -400995 -457360 -296141 -200002 -273657 -453348 -499549 -30649 -421572 -265182
2437 -265182 9868 157704 472059 69729 -87564 259510 -269770 -362641 282684 -141039
$$ packed form
2507A27646J59904k5371j60999K1122j41536j12264j53517k10744N0242L02845
2497a42672J20725k12462j52934R6686r6237k05211K13206K35360j83604j19893
2487d47036J80148j28149l48095L67693k81456J11875O73845n21291K36611J08737
2477d7118k08615K22636j63671L22197M24466k52209k46021L23493m50597k57535
2467c32974J95892l37472k28380O09912K03394k91355M13893N2894J79469l16393
2457A48880m72128L32796l38777k03850M13282N92l16113j10778L52002m56678
2447f50772K49777n6365J61219R6139p3655j79691m6201M68900l90923J56390
2437b65182K75050J47836L14355m02330j57293L47074n29280r2871O45325m23723
$$ plain form
2427 -141039 -542069 -382526 -309838 -186016 297309 274884 294452 259761 51976 459421
2417 459421 100907 77698 -31165 -440696 -272550 -166324 54443 106297 206691 -162552
2407 -162552 -318392 146314 -54774 354957 413612 73694 356251 468679 -25602 -188783
2397 -188783 -125571 -110630 -219910 -171890 52990 558887 194469 -117175 -225627 -366420
2387 -366420 213414 124966 -105756 -69178 16486 -200729 116546 142659 166413 481956 440138
2376 440138 201225 -74037 90968 251925 368493 146425 315287 182574 -29043 365346
2366 365346 374023 340909 393609 391144 365968 291058 90725 409089 919531 723069 796456
2355 796456 813095 194099 -141394 513858 852968 294053 64261 56347 166335 43924
$$ packed form
2427a41039m01030J59543P2688J23822M83325k2425J9568l4691k07785M07445
2417D59421l58514k3209j08863m09531J68146J06226K20767N1854J00394l69243
2407a62552j55840M64706k01088M09731N8655l39918K82557J12428m94281j63181
2397a88783O3212J4941j09280M8020K24880N05897l64418l11644j08452j40793
2387c66420N79834q8448k30722L6578Q5664k17215L17275K6113K3754L15543m1818
2376D40138k38913k75262J65005J60957J16568k22068J68862j32713k11617L94389
2366C65346Q677l3114N2700k465k5176p4910k00333L18364N10442j96462P3387
2355G96456J6639o18996l35493O55252L39110n58915k29792p914J09988j22411
$$ plain form
2345 43924 -121749 152972 -6636 157163 441868 529007 214402 -54779 131219 226324
2335 226324 103885 -22669 40722 326626 426668 575895 371405 405641 660233 269383
2325 269383 4875 -28464 -5628 259351 -44379 -312251 -114047 -327487 104641 439776
2315 439776 223583 -189248 -190825 264627 81210 237326 402771 160587 61628 569166
2305 569166 185945 382574 599936 322973 -16075 -465608 173652 75358 -201700 136456
2295 136456 452179 631251 233045 28635 382899 130003 178038 634592 681310 259511
2285 259511 -2453 -72387 419020 510166 681637 400945 460646 268100 -193317 235524
2275 235524 147398 665189 560589 218527 494241 373148 384770 690531 458767 459582 395582
$$ packed form
2345D3924j65673K74721j59608J63799K84705Q7139l14605k69181J85998R5105
2335B26324j22439j26554O3391K85904J00042J49227k04490L4236K54592l90850
2325B69383k64508l3339K2836K64979l03730k67872J98204k13440M32128L35135
2315D39776k16193m12831j577M55452j83417J56116J65445k42184r8959N07538
2305E69166l83221J96629K17362k76963l39048m49533O39260r8294k77058L38156
2295A36456L15723J79072l98206k04410L54264k52896M8035M56554M6718m21799
2285B59511k61964o9934M91407R1146J71471k80692N9701j92546m61417M28841
2275B35524q8126N17791j04600l42062K75714j21093J1622L05761k31764Q15o4000
$$ plain form
2264 395582 21358 327568 694715 483374 551248 779858 319745 774155 912926 573914
2254 573914 866382 655795 154942 660980 603282 665761 538376 145586 591149 869607
2244 869607 283268 403753 777902 694925 773763 959264 790636 611552 456234 329089
2234 329089 484430 592145 132968 62461 332883 307727 366701 488927 570160 597600 100642
2223 100642 441496 967252 623468 589513 1008278 894224 797017 869632 581960 975505
2213 975505 917604 821208 1116156 944297 731605 588191 220275 548687 943440 962207
2203 962207 562130 959612 1061973 976385 856914 800092 882873 832816 963741 1361093
2193 1361093 1200382 1059512 1251123 1593615 1134427 826534 956951 877663 1007048 781575
$$ packed form
2264C95582l74224L06210L67147k11341O7874K28610m60113M54410J38771l39012
2254E73914K92468k10587n00853N06038n7698O2479j27385l92790M45563K78458
2244H69607n86339J20485L74149q2977P8838J85501j68628j79084j55318j27145
2234C29089J55341J07715m59177p0507K70422k5156N8974J22226Q1233K7440m96958
2223A00642L40854N25756l43784l3955M18765j14054r7207P2615k87672L93545
2213I75505n7901r6396K94948j71859k12692j43414l67916L28412L94753J8767
2203I62207m00077L97482J02361q5588j19471n6822Q2781n0057J30925L97352
2193A361093j60711j40870J91611L42492m59188l07893J30417p9288J29385k25473
$$ plain form
2183 781575 744266 1078269 1120370 1115427 1269205 795369 1283163 1429345 1185093 1740292
2173 1740292 1403142 1510910 1975797 1591281 1597311 1795829 1671971 1480811 1910812 2171155
2163 2171155 2485363 2506217 2255503 2703646 2024604 1970182 2188254 2124055 1818197 1969980
2153 1969980 2214695 2638446 3069756 3047276 3249839 2826758 2880040 3320447 3332973 3608609
2143 3608609 3578157 3516638 4147790 4354980 4091867 4011388 4488034 4243618 3874504 3964888
2133 3964888 4641662 4788512 4924806 5130913 5535142 5773326 5642355 5926106 6612685 6913653
2123 6913653 6759392 7153880 7259246 7846555 8443451 8432820 9072473 9738035 9963280 10713091
2113 10713091 11181814 11651097 12642488 13133792 13916414 15164182 16142535 17313093 18852548
$$ packed form
2183G81575l7309L34003M2101m943J53778m73836M87794J46182k44252N55199
2173A740292l37150J07768M64887l84516O030J98518j23858j91160M30001K60343
2163B171155L14208K0854k50714M48143o79042n4422K18072o4199l05858J51783
2153A969980K44715M23751M31310k2480K02563m23081N3282M40407J2526K75636
2143C608609l0452o1519O31152K07190k63113q0479M76646k44416l69114R0384
2133C964888O76774J46850J36294K06107M04229K38184j30971K83751O86579L00968
2123F913653j54261L94488J05366N87309N96896j0631O39653O65562K25245P49811
2113A0713091M68723M69283R91391M91304P82622J247768R78353J170558J539455
$$ plain form
2104 18852548 19670416 20817253 22225314 24230710 27022880 29831702 32835019 37121809
2096 37121809 42169133 48407385 55032249 62722959 72471057 87061741 96492483 88878642
2088 88878642 79748963 73657092 68366273 62098182 52797059 43323868 36287769 31305239
2080 31305239 27174631 24412428 21896058 20358745 19353685 18324674 16543764 15445132
2072 15445132 14624765 13641142 12711761 11936976 11026168 10425497 9614601 9449221 9111627
2063 9111627 8466832 8103151 7695780 7482853 6931323 7084098 6995752 6685004 6303156 5839712
2053 5839712 5298321 5575321 5212107 5054647 4695270 4707224 4600250 4251108 3875724 4131042
2043 4131042 4113303 3900637 3878853 3697241 3460457 3501898 3324366 3623378 3288731 2716590
$$ packed form
2104A8852548Q17868J146837J408061K005396K792170K808822L003317M286790
2096C7121809N047324O238252O624864P690710R748098J4590684R430742p613841
2088H8878642r129679o091871n290819o268091r301123r473191p036099m982530
2080C1305239m130608k762203k516370j537313j005060j029011j780910j098632
2072A5445132q20367r83623r29381p74785r10808o00671q10896j65380l37594
2063I111627o44795l63681m07371k12927n51530J52775q8346l10748l81848m63444
2053E839712n41391K77000l63214j57460l59377J1954j06974l49142l75384K55318
2043D131042j7739k12666k1784j81612k36784M1441j77532K99012l34647n72141
$$ plain form
2033 2716590 3195843 3312779 3313463 2848115 2474176 2765946 2749506 2341808 2162662 2008208
2023 2008208 2175939 1962772 1911049 2193829 2071947 1356336 1446224 1824143 2009594 1735775
2013 1735775 1307775 1390801 1295547 1069671 1626090 1253101 1451707 1240140 944793 955922
2003 955922 1317169 996628 686468 1019513 1224272 1173755 1037904 1137768 1429916 1081100
1993 1081100 1201587 622108 646798 1252578 938575 615935 923418 729213 866697 932191
1983 932191 291556 699032 883344 988982 862628 634198 489440 435701 960522 864903
1973 864903 543662 650173 801061 1063042 468521 735468 700988 309025 211500 686728
1963 686728 711805 419574 400136 150368 -37916 223822 551110 285369 592147 842963
$$ packed form
2033B716590M79253J16936O84m65348l73939K91770j6440m07698j79146j54454
2023B008208J67731k13167n1723K82780j21882p15611Q9888L77919J85451k73819
2013A735775m28000Q3026r5254k25876N56419l72989J98606k11567k95347J1129
2003I55922L61247l20541l10160L33045K04759n0517j35851R9864K92148l48816
1993A081100J20487n79479K4690O05780l14003l22640L07483j94205J37484O5494
1983I32191o40635M07476J84312J05638j26354k28430j44758n3739N24821r5619
1973H64903l21241J06511J50888K61981n94521K66947l4480l91963r7525M75228
1963F86728K5077k92231j9438k49768j88284K61738L27288k65741L06778K50816
$$ plain form
1953 842963 490090 668976 736403 893852 689151 202244 11669 336565 432694 543948
1943 543948 341217 408133 577563 387479 664929 640028 652128 227117 -195253 7073
1933 7073 134517 284981 533714 198416 2237 230733 153087 688457 764811 647561
1923 647561 844775 999834 211767 112667 702656 626558 865971 624897 313124 277557
1913 277557 -59809 -232968 -158283 181383 548873 307383 277286 640302 423115 602410
1903 602410 495566 428658 56062 -328136 -309116 70033 626191 429663 127821 -137645
1893 -137645 107223 91598 3717 -212521 -528250 272677 372664 241538 -32354 26265
1883 26265 614177 642063 685109 832211 626323 1040426 836165 324027 306238 -110419
$$ packed form
1953H42963l52873J78886O7427J57449k04701m86907j90575L24896R6129J11254
1943E43948k02731O6916J69430j90084K77450k4901J2100m25011m22370K02326
1933G073J27444J50464K48733l35298j96179K28496p7646N35370P6354j17250
1923F47561J97214J55059p88067r9100N89989p6098K39413k41074l11773l5567
1913B77557l37366j73159P4685L39666L67490k41490l0097L63016k17187J79295
1903F02410j06844o6908l72596l84198J9020L79149N56158j96528l01842k65466
1893a37645K44868j5625q7881k16238l15729Q00927R9987j31126k73892N8619
1883B6265N87912K7886M3046J47102k05888M14103k04261n12138j7789m16657
$$ plain form
1873 -110419 -280434 115769 157697 106793 281921 191519 343100 571949 539526 571869 798812
1862 798812 490897 501490 -51274 75141 93212 287890 356941 187366 -445067 -384966
1852 -384966 393959 391834 503168 591954 406762 505113 834847 715525 286549 280809 370609
1841 370609 609167 589767 504633 551869 297222 89814 373200 672277 313732 356376
1831 356376 652681 338313 390851 241486 -77845 89851 400993 474958 596957 371504
1821 371504 483267 877346 125145 11920 754258 963569 904374 762528 546991 716438
1811 716438 258233 493735 603568 9842 246386 306003 252555 92529 480634 316894
1801 316894 18168 132185 -248154 -103766 -72369 148146 574865 223689 217847 -294249
$$ packed form
1873a10419j70015L96203M1928n0904J75128r0402J51581K28849l2423L2343K26943
1862G98812l07915J0593n52764J26415J8071J94678O9051j69575o32433O0101
1852c84966P78925k125J11334Q8786j85192R8351L29734j19322m28976n740Q9800
1841C70609K38558j9400q5134M7236k54647k07408K83386K99077l58545M2644
1831C56376K96305l14368N2538j49365l19331J67696L11142P3965J21999k25453
1821C71504J11763L94079p52201j13225P42338K09311n9195j41846k15537J69447
1811G16438m58205K35502J09833n93726K36544N9617n3448j60026L88105j63740
1801C16894k98726J14017l80339J44388L1397K20515M26719l51176n842n12096
$$ plain form
1791 -294249 -106514 169818 -88040 92645 218504 53395 -47858 136230 41066 139590
1781 139590 -252536 -438825 -62470 247610 260742 413233 630317 510658 14457 16691
1771 16691 -416178 -438828 -128875 -158542 -398335 -99197 -397928 -331934 29058 181722
1761 181722 571659 79522 -45504 -117427 -114522 -59601 279797 188674 55003 -62154 -255057
1750 -255057 124529 -199429 -173031 20528 -59622 -185076 -78560 209729 295534 -34944
1740 -34944 -267443 94408 197499 294663 418755 289084 182835 66643 231301 84289
1730 84289 192198 148543 191870 -128443 -111969 225284 35401 194772 296639 461995
1720 461995 97273 305755 385732 263032 -54534 -147510 -231682 -30311 330224 284417
$$ packed form
1791b94249J87735K76332k57858J80685J25859j65109j01253J84088r5164R8524
1781A39590l92126j86289L76355L10080J3132J52491K17084j19659m96201K234
1771A6691m32869k2650L09953k9667k39793K99138k98731O5994L60992J52664
1761A81722L89937m92137j25026p1923K905N4921L39398r1123j33671j17157j92903
1750b55057L79586l23958K6398J93559q0150j25454J06516K88289Q5805l30478
1740c4944k32499L61851J03091R7164J24092j29671j06249j16192J64658j47012
1730H4289J07909m3655M3327l20313J6474L37253j89883J59371J01867J65356
1720D61995l64722K08482P9977j22700l17566r2976q4172K01371L60535m5807
$$ plain form
1710 284417 307210 240095 -13234 3234 -358070 -40135 371777 9817 294783 467129
1700 467129 370852 -4763 -203694 60965 137910 -598 -362823 -18204 310357 319398
1690 319398 590732 302059 -44232 228497 162953 -40773 94014 291724 117067 -24473
1680 -24473 278761 172932 82896 53254 -295222 -123412 -329620 -266675 90678 -454276
1670 -454276 -353505 -83862 268676 298926 251895 504149 888766 427351 -21042 -141996
1660 -141996 153833 150711 219553 96459 53141 206691 -130478 48081 229488 117254
1650 117254 -121844 -100129 15142 198128 -162421 -36834 54925 -372305 -521057 -137729
1640 -137729 407633 285679 233522 554628 320388 274871 49777 327859 365365 133307
$$ packed form
1710B84417K2793o7115k53329J6468l61304L17935M11912l61960K84966J72346
1700D67129r6277l75615j98931K64659P6945j38508l62225L44619L28561R041
1690C19398K71334k88673l46291K72729o5544k03726J34787J97710j74657j41540
1680b4473L03234j05829r0036k9642l48476J71810k06208O2945L57353n44954
1670d54276J00771K69643L52538L0250m7031K52254L84617m61415m48393j20954
1660a41996K95829l122O8842j23094m3318J53550l37169J78559J81407j12234
1650A17254k39098K1715J15271J82986l60549J25587R1759m27230j48752L83328
1640a37729N45362j21954n2157L21106k34240m5517k25094K78082L7506k32058
$$ plain form
1630 133307 400626 511795 343614 487636 328801 -5566 145215 -183259 133924 -14770
1620 -14770 196692 46325 -222467 102139 556740 430288 402431 550832 491896 285003
1610 285003 346385 306488 69780 105659 204506 81148 72475 -67163 167533 129745 -258289
1599 -258289 -63145 -199923 4642 329691 321534 329108 -102221 -451793 -6445 32604 358404
1588 358404 296234 632443 498253 541968 -64700 -113636 465999 127817 98047 328057
1578 328057 41322 -12962 73848 262341 176025 300806 -231205 -58950 261548 -48433
1568 -48433 49527 7074 134340 14940 113324 -149749 -337397 -40950 -101655 -116928 352783
1557 352783 281109 111490 -9790 -65356 -72779 -149043 -521175 -179305 -319548 -330881 -33912
$$ packed form
1630A33307K67319J11169j68181J44022j58835l34367J50781l28474L17183j48694
1620a4770K11462j50367k68792L24606M54601j26452k7857J48401n8936k06893
1610B85003O1382l9897k36708L5879R8847j23358q673j39638K34696l7788l88034
1599b58289J95144j36778K04565L25049q157P574m31329l49572M45348L9049L25800
1588C58404o2170L36209j34190M3715o06668m8936N79635l38182k9770K30010
1578C28057k86735n4284Q6810J88493q6316J24781n32011J72255L20498l09981
1568d8433R7960m2453J27266j19400R8384k63073j87648K96447o0705j5273M69711
1557C52783p1674j69619j21280n5566p423p6264l72132L41870j40243j1333K96969
$$ plain form
1546 -33912 -72330 263553 280660 46440 133811 -73971 -43426 63579 -216492 -346380 -443548
1535 -443548 -389358 -227991 -36681 -215398 -237450 -192142 -171920 106862 102317 135322 -270524
1524 -270524 -167621 -185386 -125289 176338 303703 239958 162720 71480 -121673 -132844 266028
1513 266028 207858 276380 390168 250945 175004 -192216 244651 -96915 -185954 -100481 -277222
1502 -277222 -177452 -419361 -301755 -229355 59737 110439 93992 83403 -236366 -23196 230432
1491 230432 52317 250326 567553 458983 258359 5207 194569 488539 118475 -212761
1481 -212761 -182213 -415517 -361582 -89548 -195751 -246081 141894 160231 69032 279082 -106023
1470 -106023 199021 651491 309601 456730 365495 108139 241035 -40294 -73227 264891
$$ packed form
1546c3912l8418L35883J7107k34220Q7371k07782L0545J07005k80071j29888r7168
1535d43548N4190J61367J91310j78717k2052M5308K0222K78782m545L3005m05846
1524b70524J02903j7765O0097L01627J27365o3745p7238r1240j93153j1171L98872
1513B66028n8170O8522J13788j39223p5941l67220M36867l41566q9039Q5473j76741
1502b77222R9770k41909J17606P2400K89092N0702j6447j0589l19769K13170K53628
1491B30432j78115J98009L17227j08570k00624k53152J89362K93970l70064l31236
1481b12761L0548k33304N3935K72034j06203n0330L87975J8337r1199K10050l85105
1470a06023L05044M52470l41890J47129r1235k57356J32896k81329l2933L38118
$$ plain form
1460 264891 88788 -78044 -47817 -324171 -331470 117621 -149632 169308 291389 39898
1450 39898 88526 145672 44134 21245 -168618 130189 34854 -28803 386998 287966 -232287
1439 -232287 -240356 -144558 -448458 -584162 -36078 209384 496336 234684 -639134 -330846
1429 -330846 51214 -187365 8787 21572 -43207 273120 214740 -126495 -211954 -143647 -428649
1418 -428649 -289168 -242744 -590145 -332623 -233635 -319646 -10758 -313037 -298825 -271627 -251038
1407 -251038 -390858 19555 -88988 233601 -41776 -41055 184590 -102889 -157830 -549532
1397 -549532 -405489 -202147 138325 205415 261963 160615 63622 15029 -408979 -311537 -78982
1386 -78982 52420 12469 134209 345360 437524 305761 -298965 -254045 301774 195309
$$ packed form
1460B64891j76103j66832L0227k76354p299M49091k67253L18940J22081k51491
1450C9898M8628N7146j01538k2889j89863K98807r5335o3657M15801r9032n20253
1439b32287q069R5798l03900j35704N48084K45462K86952k61652q73818L08288
1429c30846L82060k38579J96152J2785o4779L16327n8380l41235q5459O8307k85002
1418d28649J39481M6424l47401K57522R8988q6011L08888l02279J4212K7198K0589
1407b51038j39820M10413j08543L22589k75377P21K25645k87479n4941l91702
1397e49532J44043K03342L40472O7090N6548j01348r6993m8593m24008R7442K32555
1386g8982J31402l9951J21740K11151R2164j31763o04726M4920N55819j06465
$$ plain form
1376 195309 484672 708659 491397 290616 408994 325278 -15962 -144782 -72897 47530
1366 47530 221276 148329 265841 -163608 -241860 -306720 -128204 481595 405495 315050 142087
1355 142087 -429356 -340980 -78909 -371222 50814 -4948 -289104 23821 -133113 -77665
1345 -77665 4046 -217147 -597600 -274624 423648 446832 387298 395148 148965 316802 267254
1334 267254 -126508 383578 338228 239608 -177962 -50677 -65704 169113 170762 -4043 41458
1323 41458 -49720 -140329 216477 342292 328873 48607 -257875 -15851 226616 -72372
1313 -72372 491496 234336 67400 485457 47553 -230283 311387 446224 299640 624355
1303 624355 448004 -437023 -494023 -163358 -188096 -58418 -243357 -150997 -231440 -309163 -308222
$$ packed form
1376A95309K89363K23987k17262k00781J18378q3716l41240j28820P1885J20427
1366D7530J73746p2947J17512m29449p8252o4860J78516O09799p6100r0445j72963
1355A42087n71443Q8376K62071k92313M22036n5762k84156L12925j56934N5448
1345g7665Q1711k21193l80453L22976O98272K3184n9534P850k46183J67837m9548
1334B67254l93762N10086m5350r8620m17570J27285j5027K34817J649j74805M5501
1323D1458r1178r0609L56806J25815j3419k80266l06482K42024K42467k98988
1313g2372N63868k57160j66936M18057m37904k77836N41670J34837j46584L24715
1303F24355j76351q85027n7000L30665k4738J29678j84939R2360q0443p7723R41
$$ plain form
1292 -308222 -382270 51772 -122034 -219035 94427 312834 365686 114801 -120982 281636
1282 281636 77267 337174 64462 -316816 260563 -65650 -55240 -33274 -156910 -315627
1272 -315627 311098 301243 -192485 -66265 -208121 -170429 -483352 -251464 -73636 -93756
1262 -93756 142241 -269593 -214311 -74087 66559 335 -33326 213776 510534 -1742
1252 -1742 13994 540297 461751 -356 -262416 -318727 -8014 -38452 -431430 -258550 94614
1241 94614 -355200 111921 -70345 -162219 427206 292409 300670 577630 467779 171284
1231 171284 -437733 -317799 -330338 -166762 -38795 -47233 -150019 -31042 201172 285324
1221 285324 263414 171987 186785 62512 -148936 -69905 36038 -56231 73822 191648 189574
$$ packed form
1292c08222p4048M34042j73806r7001L13462K18407N2852k50885k35783M02618
1282B81636k04369K59907k72712l81278N77379l26213J0410K1966j23636j58717
1272c15627O26725r855m93728J26220j41856L7692l12923K31888J77828k0120
1262i3756K35997m11834N5282J40224J40646o6224l3661K47102K96758n12276
1252a742J5736N26303p8546m62107k62060n6311L10713l0438l92978J72880L53164
1241I4614m49814M67121j82266r1874N89425j34797Q261K76960j09851k96495
1231A71284o09017J19934j2539J63576J27967q438j02786J18977K32214Q4152
1221B85324k1910r1427J4798j24273k11448P9031J05943r2269J30053J17826k074
$$ plain form
1210 189574 198452 -13784 -565195 -35700 88150 -282682 -373959 41631 158311 -25735
1200 -25735 57226 370226 227932 486490 279670 197444 677500 121084 -195795 -97121
1190 -97121 175805 83417 -102318 -163658 -313170 -30596 -92708 1039 82152 16788 51132
1179 51132 24460 560235 399172 -174316 -261015 -154073 24458 324500 111575 -113438
1169 -113438 -190660 -673700 -411864 -458420 -7703 65182 -180325 13844 18540 -91056 -41537
1158 -41537 114736 21582 -137166 -258606 -38744 80641 -9679 -117886 -31457 -114999 -224545
1147 -224545 -289648 103560 8250 212811 312791 -233915 2923 322247 -55974 -247511
1137 -247511 -168022 -297418 96987 12927 209858 44285 -255616 -516185 -313085 -184464
$$ packed form
1210A89574Q878k12236n51411N29495J23850l70832r1277M15590J16680j84046
1200b5735Q2961L13000j42294K58558k06820q2226M80056n56416l16879R8674
1190i7121K72926r2388j85735o1340j49512K82574o2112R3747Q1113o5364L4344
1179E1132k6672N35775j61063n73488q6699J06942J78531L00042k12925k25013
1169a13438p7222m83040K61836m6556M50717P2885k45507J94169M696j09596M9519
1158d1537J56273r3154j58748j21440K19862J19385r0320j08207Q6429q3542j09546
1147b24545o5103L93208r5310K04561R9980n46706K36838L19324l78221j91537
1137b47511P9489j29396L94405q4060J96931j65573k99901k60569K03100J28621
$$ plain form
1127 -184464 96700 113665 -360036 -176698 30173 64303 388603 337798 -99303 -41466
1117 -41466 -173886 -79063 18715 -90564 -168798 -68114 -279967 -346281 -54957 100650 -181100
1106 -181100 -250112 -298390 -492942 -195251 -426219 13222 -13150 -309730 -102614 -242618
1096 -242618 -333514 3572 25886 -267936 -37852 -223284 -362977 -103270 -121843 -167106
1086 -167106 -294156 -68510 470798 505621 497143 432197 170597 188912 326935 -185016 -171526
1075 -171526 -332359 -197245 118769 275186 184350 -96995 -329321 -307620 156179 103044
1065 103044 -4300 258976 -64813 -147090 7780 -189527 -51078 -42547 264922 234102
1055 234102 81209 -328356 214829 215868 30679 461336 -107028 -238396 249341 -359093
$$ packed form
1127a84464K81164J6965m73701J83338K06871L4130L24300n0805m37101N7837
1117d1466j32420R4823R7778j09279p8234J00684k11853o6314K91324J55607k81750
1106a81100o9012m8278j94552K97691k30968M39441k6372k96580K07116j40004
1096b42618r0896L37086K2314k93822K30084j85432j39693K59707j8573m5263
1086a67106j27050K25646N39308L4823q478o4946k61600J8315J38023n11951J3490
1075a71526j60833J35114L16014J56417r0836k81345k32326K1701M63799n3135
1065A03044j07344K63276l23789q2277J54870j97307J38449Q531L07469l0820
1055B34102j52893m09565N43185J039j85189M30657n68364j31368M87737o08434
$$ plain form
1045 -359093 -483829 227727 -217448 -449336 132905 360142 290325 180363 132692 51463
1035 51463 8073 -4208 144327 341028 -65173 -270743 -326361 -265453 306544 -112473 -331709
1024 -331709 65536 -335921 -434334 -756282 -499450 -193844 -207958 -454573 -183194 -113741
1014 -113741 302565 269971 298451 28064 -122457 -25069 -333348 -151227 -25849 71498
1004 71498 -286622 80598 465971 734113 444705 -5433 447406 238227 -63714 -132635
994 -132635 168009 -117558 -229535 -156708 -202792 290634 270553 612377 342837 -219637
984 -219637 -80205 205760 76807 132967 453783 3597 157180 17352 -55592 161439
974 161439 -217040 -318855 128545 -43251 -335012 103254 -103612 182535 -71758 -361552
$$ packed form
1045c59093j24736P11556m45175k31888N82241K27237o9817j09962m7671q1229
1035E1463m3390j2281J48535J96701m06201k05570n5618O0908N71997m19017k19236
1024c31709L97245m01457r8413l21948K56832L05606j4114k46615K71379O9453
1014a13741M16306l2594K8480k70387j50521R7388l08279J82121J25378R7347
1004G1498l58120L67220L85373K68142k89408m50138M52839k09179l01941o8921
994a32635L00644k85567j11977P2827m6084M93426k0081L41824k69540n62474
984b19637J39432K85965j28953N6160L20816m50186J53583j39828p2944K17031
974A61439l78479j01815M47400j71796k91761M38266k06866K86147k54293k89794
$$ plain form
964 -361552 -509176 -501478 -268788 -112178 31828 159262 -20543 276654 63823 -9598
954 -9598 67530 -106788 216269 426227 201703 107759 374200 20523 110693 -113074 -122500
943 -122500 -24998 -261621 -52121 -130893 -119135 -272642 -498791 -142848 63821 -43701
933 -43701 -388567 -395401 38311 237488 -77774 146167 292186 -256494 141575 484841
923 484841 512741 442015 -69606 -321423 128181 654037 235527 194258 59534 -135785
913 -135785 -77954 103220 197611 -169713 -526032 -211538 16152 92158 13670 -107242 -208355
902 -208355 15908 283300 -311055 -17796 371816 -4916 56708 -119896 -193238 -467482
$$ packed form
964c61552j47624P698K32690J56610J44006J27434j79805K97197k12831p3421
954i598P7128j74318L23057K09958k24524r3944K66441l53677R0170k23767r426
943a22500R7502k36623K09500p8772J1758j53507k26149L55943K06669j07522
933d3701l44866o834M33712J99177l15262K23941J46019n48680L98069L43266
923D84841K7900p0726n11621k51817M49604N25856m18510m1269j34724j95319
913a35785N7831J81174R4391l67324l56319L14494K27690P6006p8488j20912j01113
902b08355K24263K67392n94355K93259L89612l76732O1624j76604p3342k74244
$$ [...]
##END NTUPLES=NMR SPECTRUM
##END=
