##TITLE=1H_CA-9026
 CDCl3
 8 sc, 
 28.06.2022
##JCAMPDX= 6.0         $$ Bruker NMR JCAMP-DX V2.0
##DATA TYPE= NMR SPECTRUM
##DATA CLASS= NTUPLES
##ORIGIN= UXNMR, Bruker Analytische Messtechnik GmbH
##OWNER= root
$$ XWIN-NMR		Version 3.5
$$ Tue Jun 28 13:57:35 2022 Russian Standard Time (UT+4h)  she@DPX200
##.OBSERVE FREQUENCY= 200.1313499994
##.OBSERVE NUCLEUS= ^1H
##.ACQUISITION MODE= SIMULTANEOUS
##.ACQUISITION SCHEME= undefined
##.AVERAGES= 8
##.DIGITISER RES= 18
##SPECTROMETER/DATA SYSTEM= spect
##.PULSE SEQUENCE= zg30
##.SOLVENT NAME= CDCl3
##.SHIFT REFERENCE= (INTERNAL, CDCl3, 0, 15.7744)
##AUDIT TRAIL= $$ (NUMBER, WHEN, WHO, WHERE, WHAT)
$$ ##TITLE= Audit trail, XWIN-NMR		Version 3.5
$$ ##JCAMPDX= 5.01
$$ ##ORIGIN= Bruker BioSpin GmbH
$$ ##OWNER= she
$$ F:/spectra/data/she/nmr/H-F/1/pdata/1/auditp.txt
$$ ##AUDIT TRAIL=  $$ (NUMBER, WHEN, WHO, WHERE, WHAT)
(   1,<2022-06-28 13:56:05.93 +0400>,<she>,<DPX200>,
      <created by zg, POWCHK disabled, PULCHK disabled
       configuration hash MD5:
       00 E9 B6 7A A2 85 ED C7 34 08 36 98 17 FE 4E 26
       data hash MD5: 16K
       43 7B E5 E1 AE 96 36 3D 98 11 E0 BB 71 BE 72 63>)
(   2,<2022-06-28 13:56:11.76 +0400>,<she>,<DPX200>,
      <Start of raw data processing
       efp BC_mod = 2 LB = 0.24 FT_mod = 6 PKNL = 1 PHC0 = -18056.97 PHC1 = 12.20069 SI = 16K 
       data hash MD5: 16K
       B3 28 C8 5F 23 D1 43 A5 84 E6 01 A6 2D 0A 4D 6E>)
(   3,<2022-06-28 13:56:28.10 +0400>,<she>,<DPX200>,
      <pk PHC0 = -7.472677 PHC1 = 9.8 
       data hash MD5: 16K
       29 67 7E F9 79 0E 5A E2 7E 64 B6 A6 79 58 B5 A0>)
(   4,<2022-06-28 13:56:31.60 +0400>,<she>,<DPX200>,
      <abs ABSG = 5 
       data hash MD5: 16K
       66 8A EA 1B 07 CE CE 20 93 44 D8 CF C7 80 AE C7>)
$$ ##END=
$$ 
$$ hash MD5
$$ 4C 80 42 59 74 56 76 3A CD 54 51 A0 49 6C 3D 64
##$RELAX= 
##$RELAX= 
##$RELAX= 
##$RELAX= 
##$RELAX= 
##$RELAX= 
$$ Bruker specific parameters
$$ --------------------------
##$DU= <F:/spectra>
##$EXPNO= 1
##$NAME= <H-F>
##$PROCNO= 1
##$TYPE= <nmr>
##$USER= <she>
##$AMP= (0..31)
100 100 100 100 100 100 100 100 100 100 100 100 100 100 100 100 100 100 
100 100 100 100 100 100 100 100 100 100 100 100 100 100 
##$AQSEQ= 0
##$AQ_mod= 1
##$AUNM= <au_zg>
##$AUTOPOS= <>
##$BF1= 200.13
##$BF2= 200.13
##$BF3= 200.13
##$BF4= 200.13
##$BF5= 200.13
##$BF6= 200.13
##$BF7= 200.13
##$BF8= 200.13
##$BYTORDA= 1
##$CFDGTYP= 0
##$CFRGTYP= 5
##$CHEMSTR= <none>
##$CNST= (0..31)
1 1 145 1 1 1 1 1 1 1 1 1 1 1 1 1 1 1 1 1 1 1 1 1 1 1 1 1 1 1 1 1 
##$CPDPRG= <>
##$CPDPRG1= <>
##$CPDPRG2= <>
##$CPDPRG3= <>
##$CPDPRG4= <mlev>
##$CPDPRG5= <mlev>
##$CPDPRG6= <mlev>
##$CPDPRG7= <mlev>
##$CPDPRG8= <mlev>
##$CPDPRGB= <>
##$CPDPRGT= <>
##$D= (0..31)
0 1.2 0 0 0 0 0 0 0 0.06 0 0.03 0 0 0 0 0.0002 0 0 0 0 0 0 0 0 0 0 0 0 
0 0 0 
##$DATE= 1656410165
##$DBL= (0..7)
120 120 120 120 120 120 120 120 
##$DBP= (0..7)
150 150 150 150 150 150 150 150 
##$DBP07= 0
##$DBPNAM0= <>
##$DBPNAM1= <>
##$DBPNAM2= <>
##$DBPNAM3= <>
##$DBPNAM4= <>
$$ [...]
##$SUBNAM2= <"">
##$SUBNAM3= <"">
##$SUBNAM4= <"">
##$SUBNAM5= <"">
##$SUBNAM6= <"">
##$SUBNAM7= <"">
##$SUBNAM8= <"">
##$SUBNAM9= <"">
##$SW= 18.0517283424941
##$SWIBOX= (0..15)
0 0 2 0 0 0 0 0 0 0 0 0 0 0 0 0 
##$SW_h= 3612.71676300578
##$TD= 16384
##$TD0= 1
##$TE= 0
##$TE2= 300
##$TE3= 300
##$TEG= 300
##$TL= (0..7)
0 120 120 120 120 120 120 120 
##$TP= (0..7)
150 150 150 150 150 150 150 150 
##$TP07= 0
##$TPNAME0= <>
##$TPNAME1= <>
##$TPNAME2= <>
##$TPNAME3= <>
##$TPNAME4= <>
##$TPNAME5= <>
##$TPNAME6= <>
##$TPNAME7= <>
##$TPOAL= (0..7)
0.5 0.5 0.5 0.5 0.5 0.5 0.5 0.5 
##$TPOFFS= (0..7)
0 0 0 0 0 0 0 0 
##$TUNHIN= 0
##$TUNHOUT= 0
##$TUNXOUT= 0
##$USERA1= <user>
##$USERA2= <user>
##$USERA3= <user>
##$USERA4= <user>
##$USERA5= <user>
##$V9= 5
##$VALIST= <valist>
##$VCLIST= <CCCCCCCCCCCCCCC>
##$VD= 0
##$VDLIST= <DDDDDDDDDDDDDDD>
##$VPLIST= <PPPPPPPPPPPPPPP>
##$VTLIST= <TTTTTTTTTTTTTTT>
##$WBST= 1024
##$WBSW= 4
##$XGAIN= (0..3)
0 0 0 0 
##$XL= 0
##$YL= 0
##$YMAX_a= 445187
##$YMIN_a= -533082
##$ZGOPTNS= <>
##$ZL1= 120
##$ZL2= 120
##$ZL3= 120
##$ZL4= 120
##$ABSF1= 15.73698
##$ABSF2= -2.314869
##$ABSG= 5
##$ABSL= 3
##$ALPHA= 0
##$AQORDER= 0
##$ASSFAC= 0
##$ASSFACI= 0
##$ASSFACX= 0
##$ASSWID= 0
##$AUNMP= <proc_1d>
##$AZFE= 0.1
##$AZFW= 0.1
##$BCFW= 0
##$BC_mod= 2
##$BYTORDP= 0
##$COROFFS= 0
##$CY= -3
##$DATMOD= 1
##$DC= 0
##$DFILT= <>
##$DTYPP= 0
##$F1P= 0
##$F2P= 0
##$FCOR= 1
##$FTSIZE= 16384
##$FT_mod= 6
##$GAMMA= 0
##$GB= 0
##$INTBC= 1
##$INTSCL= 0
##$ISEN= 128
##$LB= 0.24
##$LEV0= 0
##$LPBIN= 0
##$MAXI= 10000
##$MC2= 0
##$MEAN= 0
##$ME_mod= 0
##$MI= 1.114404
##$NCOEF= 0
##$NC_proc= -5
##$NLEV= 6
##$NOISF1= 3.799351
##$NOISF2= 2.8
##$NSP= 0
##$NTH_PI= 0
##$NZP= 0
##$OFFSET= 15.77444
##$PC= 1
##$PHC0= -18064.44
##$PHC1= 22.00069
##$PH_mod= 1
##$PKNL= yes
##$PPARMOD= 0
##$PSCAL= 0
##$PSIGN= 0
##$REVERSE= no
##$SF= 200.129999421098
##$SI= 16384
##$SIGF1= 3
##$SIGF2= 2
##$SINO= 5.538805
##$SIOLD= 16384
##$SREGLST= <1H.CDCl3>
##$SSB= 0
##$STSI= 16384
##$STSR= 0
##$SW_p= 3612.71676300578
##$SYMM= 0
##$S_DEV= 0
##$TDeff= 16384
##$TDoff= 0
##$TI= <>
##$TILT= no
##$TM1= 0
##$TM2= 0
##$TOPLEV= 0
##$USERP1= <user>
##$USERP2= <user>
##$USERP3= <user>
##$USERP4= <user>
##$USERP5= <user>
##$WDW= 1
##$XDIM= 16384
##$YMAX_p= 272852883
##$YMIN_p= -186569
$$ End of Bruker specific parameters
$$ ---------------------------------
##NTUPLES= NMR SPECTRUM
##VAR_NAME=  FREQUENCY,     SPECTRUM/REAL,   SPECTRUM/IMAG
##SYMBOL=    X,             R,               I
##VAR_TYPE=  INDEPENDENT,   DEPENDENT,       DEPENDENT
##VAR_FORM=  AFFN,          ASDF,            ASDF
##VAR_DIM=   16384,         16384,           16384
##UNITS=     HZ,            ARBITRARY UNITS, ARBITRARY UNITS
##FACTOR=    0.220516191357247, 1,           1
##FIRST=     3156.93863038498, 0,            0
##LAST=      -455.778132620805, 0,           0
##MIN=       -455.778132620805, -186569,     0
##MAX=       3156.93863038498, 272852883,    0
$$ Real data points
##PAGE= N=1
##DATA TABLE= (X++(R..R)), XYDATA
$$ [...]
10322 77469 57961 68219 68747 88638 63619 66768 64594 25118 62163 75944 94917 107204
10310 107204 118293 96697 69379 60592 71635 23315 63411 81043 61774 59595 83247 133782
10298 133782 96873 75821 96686 79593 104643 117281 94805 88511 99072 82571 84760 102018
10286 102018 104459 50831 85385 100705 93716 91146 78662 107939 141751 93373 65211 100762
10274 100762 68216 55722 52728 38165 13325 39502 69016 62237 68995 108455 135961 113316
10262 113316 92464 118833 70699 57466 94962 100102 31516 84117 92435 100199 122148 128605
10250 128605 134954 134082 93539 100823 72821 9409 1968 77163 131088 128093 140112 43389 75395
10237 75395 111567 93390 87441 176476 128235 63218 103791 172767 154316 108128 98598 132956
10225 132956 138394 141385 173213 141576 146848 129070 109633 95982 117501 112061 118967 117707 82462
10212 82462 89266 123843 145260 104309 99770 110084 100004 139555 102757 97127 109875 80122
10200 80122 62926 77556 88616 93204 104608 108492 91481 75203 68771 76106 100115 97865 100879
10187 100879 115995 144642 156691 145444 125672 122349 131763 78990 106191 92053 80806 112635
10175 112635 145476 112295 132793 150002 142719 104233 137471 138490 89928 36882 55477 93445
10163 93445 119564 146610 136795 134493 101507 63978 82086 114699 110190 129236 146911 124718
10151 124718 121164 128839 93141 89982 136049 136218 118556 187879 167340 123657 127283 138575 141756
10138 141756 143345 142763 148041 95530 119145 123378 126528 193563 172468 130362 141948 122191 127752
10125 127752 99142 128683 141578 98381 144248 193857 144140 90899 127603 171292 182698
10114 182698 141064 159802 181427 172479 141847 147803 183193 139407 142378 147703 170987 160166
10102 160166 176459 162773 182112 149626 133526 157850 179569 177725 212259 219776 173853 145197
10090 145197 139196 137995 114825 125460 157691 123706 133208 169808 168721 147827 117581 161729
10078 161729 134407 131271 192496 177118 130820 134446 151999 147959 130127 130641 185620 165756
10066 165756 150698 155254 160663 163332 188708 139808 137386 177523 177797 169754 160749 166048 162914
10053 162914 153965 161364 156122 91621 156577 160937 123178 139399 170961 116765 140696 181063
10041 181063 216302 219489 145586 194418 232622 158718 153055 162227 185087 198693 201605 182373
10029 182373 167700 186724 205124 191677 201085 175460 193924 201011 205753 193853 139480 164218
10017 164218 189948 167510 210141 239622 189412 155442 166764 177030 159686 157191 213308 203980
10005 203980 207144 230475 224893 153500 147807 158902 144405 155411 145339 148286 183506 166074
9993 166074 142985 155613 166256 166695 153439 156249 190587 186994 196847 243400 199735 141192 160832
9980 160832 189803 148743 143529 208264 225713 208123 234069 195328 177005 168139 178154 192796
9968 192796 186123 188230 223625 215575 205800 166681 187335 167313 182038 217859 243358 225976
9956 225976 197964 223630 192456 207112 213543 183331 188354 185696 215129 214037 218155 207720 196293
9943 196293 163302 166116 177073 159754 243651 232070 180985 204073 218384 159226 167655 219676
9931 219676 211203 198214 232197 252647 219160 202499 184194 167748 191025 246017 209584 207294
9919 207294 214620 184564 158230 190488 205781 212587 210254 220130 276943 196455 195674 223644 224923
9906 224923 178508 174900 205511 210793 199340 203015 212871 183901 212226 234845 209859 238026
9894 238026 243171 224830 164527 189939 213411 221325 185422 230646 218119 206931 263713 217440
9882 217440 239313 235913 244267 249144 212352 148329 198296 211403 212036 205431 202761 233061 238884
9869 238884 218099 228532 218928 234491 200226 221339 258112 233611 179758 199444 208816 190872
9857 190872 236866 201028 205819 216332 200575 215948 243282 285926 219038 180283 210298 238746
9845 238746 256153 287934 323610 297375 302517 306801 306927 272792 233570 252715 283481 280477 304549
9832 304549 331317 316425 289488 293991 304702 270611 275883 306968 256551 239194 247480 226419
9820 226419 250653 287862 247416 228635 255169 282089 297040 273124 270101 297163 268618 288807
9808 288807 251119 248336 216085 233898 248776 262900 300669 282752 321522 323994 310203 371267
9796 371267 323004 269822 279128 286483 306836 353602 348736 323081 329602 311219 321422 325838 353252
9783 353252 319228 357950 337158 333852 332224 296674 310967 313646 308257 276570 276013 311303 316679
9770 316679 280545 256329 301005 283430 290085 303844 352926 347006 331621 326836 297297 296317 337748
9757 337748 354999 308723 277441 298331 311801 305451 344987 349316 367404 337988 300889 329551
9745 329551 334304 345842 363094 351781 380604 376108 382045 329564 365517 425831 401218 390824
9733 390824 392088 377737 408838 389111 403049 428608 418463 402051 384470 404672 401104 420541
9721 420541 467827 444565 492868 527777 513544 560985 559252 557011 567297 570889 613394 639797
9709 639797 646073 707367 697320 663701 650925 600051 566174 571211 573067 543481 539438 580918
9697 580918 500985 489676 479755 415760 384004 422953 497938 493296 498732 475187 452918 458070
9685 458070 455819 417096 381241 384577 425892 471011 477005 502776 446717 434388 457065 414286
9673 414286 418647 432151 418024 391570 364685 368484 374833 423800 450687 442837 419005 394062
9661 394062 397350 386978 412200 405718 425062 490500 476002 445666 459423 442061 448630 474087
9649 474087 448461 431014 448174 443204 410229 455507 474901 458162 464354 432570 427763 519703
9637 519703 506594 512478 531267 490471 504865 518406 488166 440144 487016 478357 453670 515432
9625 515432 521693 498862 508450 485130 460437 517494 536437 558253 582068 527909 534561 540808
9613 540808 549512 554402 544614 558228 524476 551813 552353 555602 583071 568959 571971 604836 625759
9600 625759 603701 614700 600567 629477 604158 616804 611187 611769 612294 571349 595583 581462 584059
9587 584059 606690 616602 607659 585465 581720 609015 633132 602714 604035 678431 669802 662971 676630
9574 676630 669034 659454 714798 714580 713142 682816 619982 662835 701174 660361 649539 670163 628138
9561 628138 644628 625716 650248 655249 708883 706193 677541 651029 628188 664764 707749 742232
9549 742232 769333 732910 732316 732654 674619 692943 693297 756294 753594 706062 687212 662652 727154
9536 727154 680171 688188 745251 748142 736790 730842 754261 708570 693671 741947 706966 696681
9524 696681 765989 741592 767005 782968 724369 760905 779770 769191 776944 769112 753978 760384
9512 760384 801236 786382 778008 809628 795288 794790 804591 781023 833892 815342 794111 813527
9500 813527 812303 809627 863774 876221 903516 923102 900253 896886 891297 878150 868740 883425 897743
9487 897743 938594 963044 918426 921350 914675 931068 966520 963736 957321 954615 938212 964698 998096
9474 998096 966923 988051 977363 952847 962057 1003552 1020532 1008437 1082247 1070518 1089481 1097791
9462 1097791 1109901 1096876 1095251 1112958 1161586 1157804 1117629 1155606 1109700 1130193 1147141 1106267
9450 1106267 1119369 1153534 1180588 1188548 1216321 1206493 1288626 1325121 1247461 1262738 1306262 1334073
9438 1334073 1310023 1358442 1347624 1337684 1371200 1338530 1349121 1434771 1385866 1382198 1438386 1402286
9426 1402286 1366325 1418436 1408372 1413074 1453805 1472084 1518581 1534218 1519992 1522020 1549465 1539311
9414 1539311 1516583 1577756 1579141 1597333 1674540 1683043 1683127 1716019 1686971 1722845 1751469 1783231
9402 1783231 1829713 1823397 1799757 1744742 1818385 1856591 1846154 1887535 1906350 1930615 1976020 1969825
9390 1969825 1998393 2048959 2074495 2109647 2144189 2157610 2182460 2232086 2193901 2249261 2317100
9379 2317100 2313716 2345180 2378975 2376217 2402576 2444247 2530305 2592069 2548749 2638260 2664786 2695594
9367 2695594 2697134 2698444 2795547 2843095 2893423 2971692 3000121 3045540 3132132 3180538 3260778 3324223
9355 3324223 3395435 3496362 3557825 3641772 3763730 3788960 3773958 3872583 3944734 4005246 4132736
9344 4132736 4212244 4229674 4319433 4439614 4512285 4641434 4727622 4806719 4912090 5008357 5119745
9333 5119745 5231477 5352645 5446299 5539564 5690262 5772266 5893220 6006206 6129460 6350965
9323 6350965 6535286 6714589 6884931 6991497 7169918 7357637 7564813 7786483 8013050 8315415
9313 8315415 8563828 8924988 9225784 9559334 9907890 10266686 10590629 10977537 11403919 11806417
9303 11806417 12301399 12801168 13298588 13761199 14339806 14950629 15546679 16195796 16896989
9294 16896989 17778429 18745853 19870478 21098642 22534313 24263296 26161096 28324071
9286 28324071 30790239 33524248 36525132 39842701 43416836 47170072 50953241 54616480
9278 54616480 57833018 60448115 62273755 62940110 62440592 60888388 58362295 55051424
9270 55051424 51215789 47094965 43002446 39059175 35409880 32213968 29429584 26952614
9262 26952614 24912975 23265545 21864941 20737196 19789432 19034609 18429114 17936448 17488045
9253 17488045 17016933 16594525 16203864 15779620 15501061 15364845 15304902 15324216 15459323 15696196
9243 15696196 15964591 16282833 16649131 17069883 17531795 17875364 17974228 17839291 17447937 17002789
9233 17002789 16645365 16370298 16216989 16122133 16092738 16143843 16294563 16354204 16371678 16273888
9223 16273888 16163016 16029952 16020260 16178212 16491881 17020153 17579811 17997373 18110461 17929617
9213 17929617 17521871 17025696 16509750 16194268 16054465 16161742 16392339 16656995 16936553
9204 16936553 17120292 17162155 17125104 17115682 17137997 17338720 17648319 18052976 18342484 18285280
9194 18285280 17940109 17281869 16540029 15835353 15281340 14912574 14680736 14600866 14709557 14936314
9184 14936314 14991034 14930483 14776968 14544051 14357394 14333010 14418466 14671473 15061001 15395268
9174 15395268 15526466 15321647 14730422 13889306 13016076 12229652 11613144 11251832 10969864
9165 10969864 10840737 10880983 10845669 10826700 10635262 10329601 9972923 9530730 9068263 8639325
9155 8639325 8346839 8014757 7750722 7548900 7392736 7262886 7101004 7052350 7054737 7067952
9145 7067952 6954960 6939143 6884037 6760456 6707761 6635178 6634675 6620144 6664407 6656401 6664678 6632691
9133 6632691 6586429 6575412 6451607 6277199 6132738 6079102 6035366 6009974 5975896 5918926 5913873
9122 5913873 5896544 5835604 5776188 5704074 5585255 5478591 5391074 5280443 5230384 5210506 5232479
9111 5232479 5277014 5273221 5258129 5267233 5260584 5258559 5254684 5287607 5331873 5380282 5412807 5436209
9099 5436209 5461516 5460850 5392968 5326561 5235690 5186575 5154169 5142256 5155158 5210921 5257729 5278762
9087 5278762 5287753 5327066 5306430 5352108 5343462 5313076 5302660 5283466 5301731 5282296 5243310 5155221
9075 5155221 5118876 5065080 5018017 5070141 5063464 5064665 5145668 5223493 5211963 5225716 5263166 5232945
9063 5232945 5227824 5232366 5310657 5365969 5452435 5522348 5561245 5567480 5526084 5453960 5417753 5338963
9051 5338963 5323781 5309021 5351009 5406513 5475104 5559779 5694427 5830203 5883027 5962432 6061066
9040 6061066 6112693 6182711 6300524 6361158 6461650 6587247 6726080 6956539 7203106 7428758
9030 7428758 7575893 7830589 8127441 8316569 8589475 8837413 9103861 9454448 9846275 10360437
9020 10360437 10912265 11692969 12648237 13863452 14872684 15435514 15412615 14908742 14143606
9011 14143606 13321315 12761102 12416955 12373864 12527037 12800729 12940242 12968109 12937066 12908343
9001 12908343 12903447 13048207 13393895 13841133 14554158 15562848 16805928 17960537 18664646
8992 18664646 18782931 18395387 17893257 17308311 17057925 17159466 17710853 18516352 19314230
8983 19314230 19898946 20199066 20349314 20309403 20348752 20459995 20813999 21395874 22149883 22550178
8973 22550178 22215309 21338625 20055618 18747007 17571314 16832617 16518631 16435826 16574244
8964 16574244 17055541 17637805 18120364 18607561 18960110 19208212 19369596 19494372 19686414
8955 19686414 20035059 20539778 21182971 21599178 21329992 20443545 19212891 17871878 16505940
8946 16505940 15451408 14762284 14382108 14179273 14166007 14224880 14362485 14483858 14421186 14227314
8936 14227314 13851273 13304492 12683745 12035557 11408578 11014092 10783535 10608346 10536252 10455591
8926 10455591 10398666 10438277 10526604 10600194 10763391 11012470 11251192 11600863 11816405 11887385
8916 11887385 11742176 11533845 11099293 10560993 9909181 9231030 8594860 8087333 7644498
8907 7644498 7310366 7077023 6832809 6696972 6576639 6468753 6399881 6319022 6197306 6122559
8897 6122559 6100026 6013332 5923670 5832919 5682315 5629686 5551969 5449036 5446763 5416053 5327612
8886 5327612 5306205 5227246 5123992 5035850 4933743 4850459 4849167 4814427 4764367 4808758 4839629
8875 4839629 4788791 4848568 4817917 4746495 4710986 4626889 4448055 4303886 4185348 4081212 4005616
8864 4005616 3943250 3870303 3777147 3716200 3694754 3688376 3662635 3573031 3566056 3566980 3539188 3600657
8852 3600657 3637132 3641604 3678007 3729480 3738631 3761360 3734732 3704279 3686229 3704342 3698062 3725807
8840 3725807 3745245 3686180 3707017 3660370 3623587 3636452 3595146 3554637 3547973 3569794 3505992 3503826
8828 3503826 3507955 3528109 3601244 3666544 3590113 3546559 3458300 3405325 3376134 3355358 3394158 3384530
8816 3384530 3391999 3398584 3465576 3482307 3446846 3455930 3408094 3387102 3454720 3527818 3589946 3624974
8804 3624974 3602328 3592304 3604370 3575290 3503515 3477087 3469787 3460436 3525954 3595343 3659643 3688192
8792 3688192 3678938 3659463 3690378 3700882 3772609 3876361 3943736 4049254 4168156 4166981 4184928
8781 4184928 4196097 4188151 4165153 4157015 4135955 4119012 4114943 4088059 4067875 4079342 4099775 4162747
8769 4162747 4241331 4246730 4288226 4279630 4301148 4366543 4371624 4318445 4283910 4316867 4333322 4326538
8757 4326538 4301986 4268782 4269561 4286454 4289804 4245845 4205322 4265053 4266343 4252393 4187001 4138979
8745 4138979 4122350 4073615 4051895 4111030 4160701 4235440 4335721 4398095 4436740 4452292 4494618
8734 4494618 4517086 4608995 4708043 4707833 4841816 5025989 5075267 5159357 5205806 5165786 5208430
8723 5208430 5284596 5327120 5345486 5369630 5422644 5438983 5547509 5667684 5773655 5876753 6031875
8712 6031875 6268698 6542661 6768341 7080277 7341148 7548530 7658166 7785437 7857385 7971994
8702 7971994 8133048 8420337 9019752 9794542 9561719 8516190 7335700 6244804 5593131
8693 5593131 5157925 4894006 4623647 4424406 4266089 4174032 4050676 3961005 3909289 3890853
8683 3890853 3830365 3800315 3820300 3821133 3806386 3821125 3809967 3807677 3771280 3763433 3758765 3748854 3712840
8670 3712840 3727701 3701330 3728393 3759202 3850077 3877354 3883436 3912536 3933140 3898276 3916337 3925058
8658 3925058 3911626 3965479 3914499 3978610 4045802 4124223 4214607 4268548 4367099 4496963 4544730
8647 4544730 4545474 4513886 4474046 4346793 4267031 4186170 4135456 4142729 4131868 4033355 4022215 4008941
8635 4008941 3942531 3932323 3898483 3935199 3958362 3976885 4017915 4011064 4019496 4088986 4128209 4174479
8623 4174479 4212317 4263356 4315072 4338683 4420967 4496083 4585841 4668621 4731365 4836806 4963291
8612 4963291 5098533 5235615 5327064 5452687 5600223 5725583 5781269 5843107 5898853 5884074
8602 5884074 5888344 5923433 5946927 5922199 5958206 5991985 6022173 6053953 6097912 6127814 6238798
8591 6238798 6360557 6447616 6591201 6762449 6875232 7055670 7235046 7365340 7485868 7645381
8581 7645381 7795502 7900990 8012122 8261469 8484176 8637046 8812948 9047348 9340791 9740419
8571 9740419 10188772 10535504 10748971 10979181 11192092 11348671 11514792 11633985 11735516 11790788
8561 11790788 11835154 11895191 11988725 11990576 12016416 12059944 12132900 12159693 12291707 12393131 12569261
8550 12569261 12826063 13101568 13363028 13623925 13982516 14323537 14685719 15085802 15572632
8541 15572632 16193536 16933098 17767753 18723277 19615545 20279289 20895463 21315333 21693869
8532 21693869 22056690 22498753 23208035 24056374 25097685 26324940 27732687 29296618 31105964
8523 31105964 33078636 34534461 35013668 34677897 33568975 32101431 30574401 29456298
8515 29456298 28685025 28326362 28185169 28100672 28016049 27862264 27542611 27238429 27046193 26832886
8505 26832886 26818249 26961877 27260161 27711148 28437546 29400701 30398573 31377074 32400164
8496 32400164 33496236 34831904 36230148 37593901 38920664 40121257 41143431 42056405
8488 42056405 42970861 44155063 45632752 47262852 48456280 49063655 49026407 48526131 47215672
8479 47215672 45082495 42672900 40194061 37851210 35764533 34060635 32639868 31340918
8471 31340918 30021164 28867375 27997745 27347536 26936261 26805147 26800318 26873574 27091835 27381163
8461 27381163 27834843 28522330 29466606 30681106 32031881 33311282 34329341 35211718 35824379
8452 35824379 36003007 35729919 35098814 34430047 33778397 33392198 33342888 33568137 33868230 33993868
8442 33993868 33379289 31874495 29851506 27607862 25373063 23396088 21859691 20679098
8434 20679098 19762689 18954733 18284748 17651776 17097301 16629591 16371293 16100284 15898382
8425 15898382 15726185 15606793 15471826 15330513 15305332 15366384 15441877 15614817 15830013 16089974
8415 16089974 16349246 16520963 16393137 16091780 15704362 15144960 14502282 13742738 12928194
8406 12928194 12268192 11664136 11097511 10707681 10370448 10150232 9985348 9808790 9534538
8397 9534538 9278431 8957124 8660980 8359268 8043197 7757864 7537007 7324782 7087188 6893920
8387 6893920 6726550 6585837 6524705 6468054 6357617 6324698 6328689 6353787 6373809 6359878 6398553
8376 6398553 6425925 6353268 6268530 6208953 6043400 5891572 5758284 5539419 5289127 5098208
8366 5098208 4982586 4811439 4699507 4601854 4556008 4463067 4377979 4375737 4340083 4236385 4269151
8355 4269151 4227268 4157860 4176417 4122886 4049497 4004203 3960548 3875086 3817798 3829121 3785823
8344 3785823 3694213 3653424 3704361 3719846 3713683 3743448 3759421 3816015 3804130 3786794 3747964 3642933
8332 3642933 3561165 3483431 3367906 3267599 3170293 3067867 3018205 2940439 2912812 2866855 2835124
8321 2835124 2807365 2775458 2826606 2846022 2869953 2899025 2910061 2890419 2907048 2899951 2871853 2808813
8309 2808813 2770145 2673018 2670563 2651864 2683875 2761730 2762492 2711312 2720319 2613588 2557645 2534269
8297 2534269 2485139 2480501 2523616 2537772 2527360 2534575 2562312 2547874 2483186 2420524 2314255 2268096
8285 2268096 2229242 2123007 2037102 2017502 2028360 2024202 2054919 2092780 2116265 2116714 2098953 2061500
8273 2061500 2031982 2002611 1984302 1976637 1973975 1945162 1972038 1978652 1937955 1957172 1978932 1953507
8261 1953507 1887804 1877717 1843015 1788147 1756743 1754285 1694550 1658303 1620825 1619310 1615824 1569683
8249 1569683 1557093 1532184 1525602 1503943 1442728 1416958 1361788 1354555 1352755 1361389 1343597 1364911
8237 1364911 1338744 1349419 1357253 1332694 1281948 1236234 1256427 1266216 1270090 1283252 1310086 1398058
8225 1398058 1352319 1402039 1418161 1380483 1355713 1331519 1270185 1215676 1188415 1184825 1184859 1171865
8213 1171865 1106835 1111024 1135233 1067946 1080202 1074189 1011719 1023290 1052887 1049501 1087172 1089990
8201 1089990 1074171 1035120 1066678 1035108 1047681 1078561 987024 990386 872919 379013 618811
8190 618811 818629 768284 733125 748465 808412 815392 887267 916014 904988 878510 832071 808955
8178 808955 810012 745138 741077 762767 794621 769555 804018 803565 811675 783329 787472 763583 793605
8165 793605 732055 746396 755258 714597 715257 734670 721549 783019 753213 695601 717815 713231
8153 713231 676406 699624 720538 712569 696240 714096 717644 708049 725967 685241 692616 755370
8141 755370 776664 772959 746414 729611 744231 725306 706575 730740 721290 647589 685927 731853
8129 731853 706667 642123 639387 672140 721338 726506 701117 732860 705816 696975 711876 706931
8117 706931 665406 688521 734185 760674 777708 732639 738040 766830 797774 775960 813548 764532
8105 764532 775917 805967 825000 856072 852137 860067 798084 787739 828311 741732 729723 702081
8093 702081 649650 672437 650659 671526 670718 658843 671375 671763 687960 720157 741326 692885
8081 692885 661097 619966 653455 684327 680470 654917 647222 622866 602599 584944 586348 584541
8069 584541 587247 621327 636970 577187 574410 574108 577638 565561 566535 540100 503269 510293 473240
8056 473240 464472 513228 495047 459459 495230 473014 449991 460802 481070 506818 537052 477269
8044 477269 442506 438618 426723 440566 425881 418987 392093 402309 385150 383174 413382 410270
8032 410270 376635 394274 381680 312568 305272 296825 351125 354275 365331 339950 309909 277888
8020 277888 243981 240912 276112 272438 299730 296382 282637 259040 259569 257402 270018 304997 308315
8007 308315 327807 293189 262375 289615 256008 253825 288579 318632 302614 280465 259283 279149
7995 279149 292397 322152 328042 341801 371100 399253 376821 322540 326295 333770 353510 321070
7983 321070 291927 250591 254539 294296 261135 243176 228330 211303 203864 239330 239238 232599 244682
7970 244682 228497 232155 255120 249469 269060 231760 222303 257611 219979 183516 211820 251044
7958 251044 191912 144421 193344 206321 216116 187477 147538 203312 212645 156983 156557 130255
7946 130255 104307 124206 142693 174732 167029 154524 138626 134610 165493 145852 96386 142570
7934 142570 148554 157105 114924 114623 144156 144923 185608 181601 193265 230277 206241 244351 225828
7921 225828 248009 227866 179343 209201 187755 158121 198579 205790 207333 190742 249056 284746
7909 284746 318032 350798 370003 359270 343557 336882 382378 364628 326034 376919 350432 349564
7897 349564 327816 312718 251783 225510 252334 230393 222171 236391 208161 233255 275115 267175
7885 267175 265644 244492 208476 200981 201491 178008 207880 198706 186747 225021 199857 209849 172182
7872 172182 136192 150186 222817 248446 257811 223112 186462 223184 216889 222670 217080 208311 224861
7859 224861 190332 173597 179620 215228 161199 158262 165286 140949 141236 129904 119539 142626 157600
7846 157600 170258 173864 139452 143801 151933 148649 114352 140340 106473 97753 116389 98166 93616
7833 93616 71046 46743 46456 35381 84836 92272 84612 64506 15240 33080 24015 60097 101211
7820 101211 98881 100062 57656 53416 70074 121222 57568 27677 24665 37242 33055 11806 -34128
7807 -34128 -8235 78498 62304 86397 142295 133779 109914 45494 32480 50412 8754 -7477
7795 -7477 5107 82234 47598 30195 47103 22428 44515 15621 37296 15111 41828 70186
7783 70186 39996 38100 31378 13415 -21231 -1953 1845 10080 16602 27024 16670 -2662 6239
7770 6239 81160 47152 40921 18988 31875 33758 1219 10290 20499 25007 51787 36900 25708
7757 25708 1959 12210 66506 42180 18890 -125 -39207 -31327 -6007 -26259 -32055 5528
7745 5528 -6452 4001 21773 -30197 -32219 835 -26500 5676 -12426 -28001 -1993 -42806
7733 -42806 -46619 -128 -34610 -27225 -29944 -13959 -26820 -24122 -50622 -70227 -17419 22325 19204
7720 19204 17106 10713 -12540 31516 -9555 -25928 -532 9865 16553 35121 6499 -8022
7708 -8022 4961 -22719 -10050 -2287 -12515 -1344 13957 4959 11369 622 -130773 -94842
7696 -94842 -65031 -61987 -60794 -69257 -17742 -15973 -38812 -26910 -29255 -27285 -49787 -7513 -20076
7683 -20076 -52753 -58539 -50468 -25526 -37477 -22986 -5907 -21709 -30122 -48459 -43019 -6118 -22802
7670 -22802 -14483 11517 45315 44131 8449 -10638 7255 -4311 -29987 -70046 -78734 -68985 -27129
7657 -27129 34590 32531 17691 -11409 -10984 -48640 -47034 -51069 -30624 3139 1454 6909 2751
7644 2751 -12263 -49909 -53546 16734 -2206 -18056 -81436 -31662 -29853 -68060 -39802 -29624
7632 -29624 -24645 -61612 -44830 -54665 -104233 -76809 -60830 -68142 -33157 -9358 -50337 -107791
7620 -107791 -97531 -86399 -38953 -15995 -7004 -20930 -36779 -5871 6992 -24085 -33855 -29215
7608 -29215 -55951 -100814 -45774 -31026 -52616 -50835 -13029 19667 -1964 -35007 -35724 -43964 -72918
7595 -72918 -48103 -62473 -30083 -8012 -28682 -29764 -35923 20528 38560 15686 9939 -26404
7583 -26404 -38407 -13938 2974 -2998 -17903 -43730 -120367 -53951 834 -9720 -1098 34020
7571 34020 34083 27513 36395 25209 -19195 -17618 -4920 47223 28540 10547 20762 17650 1130
7558 1130 36435 -22153 -38911 -2071 -11666 -17755 -40688 -5495 -25737 -6888 -21549 -49446
7546 -49446 -42769 -17975 -17137 -14271 -6266 10846 23057 -7205 -9969 -1031 -57020 -11658 1845
7533 1845 4693 -33448 -15557 17197 12487 40473 -22492 -55059 -49576 -19159 6706 75735 69895
7520 69895 8288 -1304 25741 38328 11143 9492 37965 97325 87697 60526 71142 78426 86471
7507 86471 56046 56289 94917 140488 127767 123732 117397 102835 118502 138638 156341 138817 130008
7494 130008 136548 188026 226820 182362 163845 205305 258629 298885 292670 224871 176497 150325
7482 150325 154588 125653 140379 137838 98153 85671 55046 69494 53600 20316 40711 82164
7470 82164 61925 22790 -7699 -3954 24141 52706 35003 -3642 52966 50105 63714 35001
7458 35001 -7633 17645 43311 49222 55875 81178 93801 114728 88685 81850 93734 86238 62199
7445 62199 123902 117314 137302 167547 184404 150118 167706 158647 195966 230854 266338 244460
7433 244460 211160 248939 314086 364934 363122 353604 444896 487266 587724 689706 769139 877898
7421 877898 953486 988095 1081951 1048331 950113 874569 801891 716062 676966 618112 516145
7410 516145 472695 423215 430050 408151 394604 423381 403257 329410 338977 297137 275913 228594
7398 228594 247359 211811 240445 203113 199369 158934 123704 112011 127664 118623 119695 99353
7386 99353 81430 110185 147864 100350 51834 77476 116637 100404 143199 132276 152315 146166
7374 146166 101456 127466 89812 96527 94380 75439 89343 81018 103114 120626 137990 191199
7362 191199 170345 213448 251814 207592 219036 231676 198770 159545 202256 211380 171684 216258
7350 216258 266432 286283 309839 289070 257371 331698 409276 453456 440228 438700 457821 419392
7338 419392 399579 442599 455580 410962 364806 394189 344350 324299 293421 272982 252317 228091
7326 228091 199303 167083 127305 158561 164065 141289 109386 106615 76452 71170 71939 69949 81716
7313 81716 70576 55581 18103 58535 84232 80024 68445 81399 74683 64191 102119 88790
7301 88790 60392 74970 49749 30791 21537 31977 86125 80610 80782 116995 128015 135009 120814
7288 120814 135732 196380 178009 217463 180730 128147 169631 125080 155251 182640 174841 149649
7276 149649 124284 119328 135298 168948 153737 157678 132236 140050 124100 132486 113706 114184 121454
7263 121454 113909 201770 149262 138773 224893 202545 119575 185933 199271 188544 209688 221797
7251 221797 225505 178085 133285 140141 125307 148435 122051 115124 114063 64043 64099 72695 69233
7238 69233 103783 49036 42332 47345 15648 13932 40759 13720 -22002 -22298 -20948 31978 -6357
7225 -6357 -17433 5999 -4654 14022 17525 -2620 35367 -7572 -1560 6254 13483 -205 -15966
7212 -15966 -1870 28057 1701 -55095 -44301 4890 19638 27367 32766 17449 -16442 -30469
7200 -30469 -9813 -15357 13730 60394 30595 5653 -73 25970 62258 11809 3867 23804
7188 23804 13627 35573 44410 58464 46899 30688 6723 27317 48474 20772 12727 -2279
7176 -2279 15257 1036 -7757 -33647 -27584 -22468 -33659 7596 -39120 -20258 -2365 6532 1872
7163 1872 24441 25980 25249 55966 33201 23977 55851 44092 35033 63144 31233 87948 75176
7150 75176 37112 68772 73341 65601 80580 73787 74832 22303 2626 27342 47397 -3320 54755
7137 54755 89201 76661 75025 77134 63500 74844 91161 125862 146781 156855 144302 162091
7125 162091 175549 118831 165902 153087 118564 177092 198041 172069 152749 157076 188577 219980
7113 219980 230865 206929 221931 198272 255663 276952 203743 196708 213262 221105 298455 344326
7101 344326 312566 281616 305830 333964 360729 402643 445247 445828 432165 459091 463517 462006
7089 462006 471110 496955 478534 497325 559899 560452 560401 566524 597355 614868 647449 655260 708266
7076 708266 676487 660538 704789 744827 747276 718417 775908 775803 792574 856179 896978 936353
7064 936353 986015 955242 962703 986200 994548 1018614 1074050 1131095 1185877 1250872 1310666 1359480
7052 1359480 1428673 1494670 1587591 1643864 1664575 1788767 1917107 2024964 2131657 2196374 2260740
7041 2260740 2406932 2565349 2703396 2841812 3023082 3234416 3449468 3699637 4030719 4321981
7031 4321981 4753693 5228290 5797518 6508849 7358037 8427333 9703384 11234130 13115074
7022 13115074 15356093 17833661 19998151 21444467 21572425 20345316 18139798 15365108
7014 15365108 12610900 10183953 8269884 6866757 5895199 5115969 4552961 4093726 3683807
7005 3683807 3399073 3130390 2881543 2634338 2368201 2214537 2107248 1990737 1889531 1793448
6995 1793448 1701346 1588545 1536381 1454834 1386337 1383828 1304978 1232801 1170470 1151150 1102918
6984 1102918 1055314 998918 1002000 972493 964624 935309 908001 844934 874929 856433 837944 810073
6972 810073 783666 724560 733433 734166 719089 681327 719140 762895 726676 688189 686987 690882 641397
6959 641397 647567 626712 588725 613723 590495 570333 593796 569327 585778 561957 573806 552187
6947 552187 576069 529265 515272 549590 505031 525563 545750 505451 521691 540857 516803 471597
6935 471597 530432 555302 530986 521366 526977 559968 594264 572904 565473 605302 587698 548781
6923 548781 544717 563877 565252 580132 625259 623903 611904 561584 589503 656068 658778 639380
6911 639380 688350 693350 677000 709873 717685 765647 749585 755899 763666 803634 858602 931073
6899 931073 938949 992392 1066026 1072764 1058395 1124807 1223720 1225434 1229477 1285337 1315965 1426800
6887 1426800 1522071 1634851 1765290 1893546 2063612 2290478 2509635 2793099 3154336 3576450
6877 3576450 4157929 4819844 5662795 6597786 7838997 9651813 11789862 12411396 11839510
6868 11839510 10549687 8920215 6989137 5219511 4095945 3383172 2883090 2477005 2204079
6859 2204079 1993293 1781124 1562020 1450764 1295865 1235943 1153239 1087384 986381 934556
6849 934556 866425 827155 785025 719018 635847 640941 640243 643819 630773 599174 572025 585855
6837 585855 554228 492835 485910 480079 468671 467893 442948 416431 386876 408494 391811 315875
6825 315875 268046 297789 299301 261193 295096 313809 262894 255388 232867 244628 227505 212156
6813 212156 234123 213928 202016 236790 189698 172299 224362 249372 251306 248970 267723 279112
6801 279112 311051 273923 307127 392958 395517 394686 407176 433299 388290 356529 427533 380000
6789 380000 334243 339342 312310 292560 281153 279089 260229 242582 202710 214977 223790 175226
6777 175226 146072 187508 208921 211167 240779 199238 183951 246358 194717 171731 206992 145619
6765 145619 115290 150510 139397 133486 113649 111690 88023 104836 98862 73842 93657 82139
6753 82139 135485 173225 121096 129613 161094 119416 116631 127791 117456 148930 123060 98730
6741 98730 141861 164996 149406 135553 122752 82650 74398 84015 55922 110565 134824 112569
6729 112569 93692 57122 38828 47169 76567 83863 94923 47765 33301 76084 51346 21774
6717 21774 24779 43969 31481 7290 14178 35273 52126 35321 20469 38419 65899 45799
6705 45799 12982 -14558 4512 18483 8464 34788 31726 8627 16437 17696 21822 -55315 -35872
6692 -35872 20907 8049 -15365 -4017 -7644 -29832 -38142 -32849 -88858 -89038 -76636 -29116 20830
6679 20830 15750 -32027 17440 -11342 -11146 19978 9091 -48210 -7881 -411 -69162 -44633 -23614
6666 -23614 -27148 -45231 -79026 -43118 -22926 -32779 26288 14580 -12998 -31557 29247 -894
6654 -894 -51091 -20749 -33209 52034 38785 30247 69214 26441 18429 85630 136952 122192 114634
6641 114634 193005 196885 174420 255033 219420 224675 295113 312380 262176 275979 279008 315344
6629 315344 260743 310651 354524 279707 240386 239238 241377 212572 216065 230756 228423 163428
6617 163428 133793 157401 144776 112163 115044 66208 48201 44277 64780 58562 -29129 -44844
6605 -44844 10199 4681 -11532 -26182 -33012 -26524 -51511 -55138 -79219 -11335 -57806 -68513 -65338
6592 -65338 -42813 -50567 -64242 -57937 -25709 -39537 -53260 -36093 -76433 -79688 -49924 -17968
6580 -17968 -23427 -48216 -18658 -37518 -49633 -57498 -21284 -1313 -4151 -10397 27567 33593 19427
6567 19427 74606 97306 124773 147145 178073 196339 193907 212003 242079 238426 200682 215254
6555 215254 222164 156506 172574 146695 118496 167903 171477 120281 123430 46255 30161 58816
6543 58816 54339 15479 9621 23169 64936 39936 -7274 -37917 -36611 -17365 -74583 -56196
6531 -56196 -52319 -3521 11554 -18343 -54575 -54329 -50573 -39809 -21884 -20252 -15363 -26366 -5437
6518 -5437 53740 16491 -469 67617 5759 -21048 37890 34188 19442 55647 16337 5011
6506 5011 30950 86010 34758 42254 14629 4808 12309 -48606 -39475 -21418 -27405 2847 6928
6493 6928 -718 -7321 -31684 -48034 -59471 -77805 -128062 -93833 -82564 -92245 -67320 -87877 -82850
6480 -82850 -45472 -99972 -134979 -79684 -77434 -122268 -101148 -64745 -75154 -108032 -64479 -77846
6468 -77846 -71180 -83894 -121983 -131432 -58748 -35381 -13645 -12471 -63147 -59591 -67131 -83686 -82186
6455 -82186 -85292 -133175 -96966 -121934 -150074 -126614 -144668 -162747 -145342 -150677 -126181 -97764
6443 -97764 -116447 -109209 -94961 -124689 -157798 -116716 -120799 -140413 -141051 -151982 -134654 -171080 -110449
6430 -110449 -110619 -116743 -124040 -81317 -108552 -117637 -130717 -137928 -158350 -186569 -148405 -161426 -144152
6417 -144152 -172083 -165013 -153580 -147358 -136444 -140829 -135336 -129925 -124576 -95748 -83722 -53593 -78015
6404 -78015 -96327 -68285 -65826 -65551 -86502 -102289 -131981 -124579 -126351 -140557 -155280 -163975 -126183
6391 -126183 -78628 -87603 -65318 -67218 -103331 -66043 -101690 -109902 -36015 -61154 -87328 -88904
6379 -88904 -145838 -152699 -136771 -131599 -110242 -106233 -74665 -24573 -55274 -73400 -51458 -48118 -53190
6366 -53190 -12351 -36475 -81347 -127862 -75965 -75280 -122645 -118301 -79218 -126005 -72425 -2753
6354 -2753 -57537 -68535 -63171 -104668 -121913 -121726 -117184 -85267 -68668 -52822 -42052 -23303 -2710
6341 -2710 -13625 -5632 -58029 -8944 -4663 -22363 -3589 19568 60590 65571 63821 56102 32502
6328 32502 63165 88255 82681 81135 67347 90865 114393 135004 157395 165438 130541 117307
6316 117307 154270 176045 191532 261343 321519 280071 279598 252646 287699 331400 320536 351539
6304 351539 394700 401948 445130 464868 528526 640191 697660 831603 918644 1027842 1195142
6293 1195142 1377225 1609140 1921522 2282538 2690645 2964218 3127244 3157509 3050508 2811157
6283 2811157 2459408 2061656 1664905 1397653 1142197 903487 770456 645289 601339 494048
6273 494048 455266 397040 369751 332307 314422 267919 249193 201623 172554 181661 145808 95253
6261 95253 108148 94421 138000 118206 87943 79226 100893 127367 80990 99841 59100 105146
6249 105146 119501 76450 80706 83467 92973 80939 151962 148130 62387 8073 -5990 4616
6237 4616 10084 20821 -2275 -10423 7796 -34793 -69418 -35200 -38610 -85757 -87086 -61002 -69988
6224 -69988 -54836 -62001 -16442 -52116 -124347 -110180 -59269 -49584 -94157 -92959 -132973 -135869 -100184
6211 -100184 -75101 -97193 -96047 -93229 -45988 -10055 -48043 -90036 -83792 -92903 -99095 -64958 -70965
6198 -70965 -54641 -127332 -116613 -78775 -91720 -104741 -89799 -87304 -59868 -78534 -89074 -62406
6186 -62406 -14372 -36897 -54118 -78844 -36080 -12192 -34083 -43342 -12316 -7900 -49253 -47651
6174 -47651 -35542 -34064 -18824 -24801 -31686 -56971 -51180 -72185 -70973 -41432 -57823 -44921 -50232
6161 -50232 -70876 -78095 -58742 -44638 -26844 -27440 -76394 -58536 -34233 6287 -21614 -13729 42763
6148 42763 37188 738 26680 65555 27743 39096 62166 30842 -5616 -16580 33179 35379
6136 35379 8524 3324 -32165 -71409 -51121 5398 9007 -12211 2154 39951 663 -3246
6124 -3246 33322 16615 11092 25138 55438 56052 62672 104866 106889 136683 169115 172373 122246
6111 122246 153597 185207 117768 108571 187529 233256 216410 201739 184839 136472 167122 133375
6099 133375 130380 137100 166790 165575 160634 141740 141222 134054 142209 164917 146356 150830 127705
6086 127705 92049 56540 32615 51214 91937 112880 116146 142204 165204 166287 187821 166724
6074 166724 121996 105298 111023 128097 188206 151178 161035 167700 184185 208874 180819 191126
6062 191126 188637 123958 156414 255924 247411 270781 238221 217955 193718 222345 271899 328385
6050 328385 302167 308044 312570 307646 360015 428088 401335 414440 521629 496154 461033 537572
6038 537572 563812 552663 646073 695252 691987 654515 607456 589523 540521 506273 539352 505533
6026 505533 474874 515069 561406 578631 561446 588322 583751 610260 653647 695165 725719 753795
6014 753795 807012 852015 861820 927701 1008401 1052542 1133910 1250984 1421602 1578006 1758429
6003 1758429 1948430 2096261 2122984 2077741 1893060 1743341 1547493 1416479 1295396 1267386
5993 1267386 1289125 1228346 1192294 1203424 1189673 1190367 1204625 1169057 1151844 1177175 1186444 1200625
5981 1200625 1289672 1391944 1467022 1615592 1744258 1830295 1928333 2165489 2464450 2767617
5971 2767617 3008411 3141813 3071998 2885573 2603019 2296548 1989952 1786736 1753150 1683920
5961 1683920 1621996 1609649 1593903 1536198 1509853 1490511 1452546 1417709 1463023 1431470 1391563
5950 1391563 1423632 1461673 1456951 1522875 1527304 1617665 1665844 1720743 1826132 1904017 2011697
5939 2011697 2070213 2037526 1895453 1804337 1742020 1619229 1567950 1540047 1496802 1460461 1434472
5928 1434472 1445470 1539184 1570002 1578357 1545262 1498038 1470485 1483273 1494955 1531495 1529846 1525147
5916 1525147 1550386 1522333 1469684 1517838 1641238 1561678 1602329 1662650 1619731 1650935 1708504
5905 1708504 1758316 1753289 1774806 1827575 1863884 1883826 1878981 1947626 1961484 1933447 1944499 1953036
5893 1953036 1937449 2032554 2090106 2070998 2078259 2132643 2251189 2285072 2349634 2389452 2384156 2401333
5881 2401333 2460114 2565680 2634604 2707331 2863730 2994013 3092403 3202457 3265632 3238398 3271094
5870 3271094 3294730 3259019 3307299 3363483 3370396 3451491 3513022 3590428 3622397 3660774 3764316
5859 3764316 3900539 4029384 4284186 4649012 4929703 5327358 5820580 6434505 7142003 7917176
5849 7917176 8371079 8413227 8114689 7625066 6992159 6385632 5911809 5581750 5385966 5274882
5839 5274882 5162105 5120371 5112162 5081052 5104275 5198680 5309251 5412699 5569596 5781712 6049616
5828 6049616 6381579 6785566 7371389 8072179 8884329 9807591 10964036 12322529 14031142
5819 14031142 16171283 18596485 20060948 20011981 18966483 17180626 14996282 12649524
5811 12649524 10771335 9402132 8602481 7950706 7423023 7069466 6796934 6578480 6478901
5802 6478901 6425579 6358304 6371721 6490029 6641794 6805111 7091504 7455354 7998136 8639472
5792 8639472 9387500 10323151 11404888 12724297 14377381 16470662 18870554 20308297 20168095
5783 20168095 18943265 17034338 14731300 12234292 10223932 8772288 7788372 7067017
5775 7067017 6420605 5921696 5586089 5242406 4999280 4843271 4685213 4555133 4465760 4412960
5765 4412960 4407153 4395883 4415738 4496697 4669534 4903308 5148814 5509468 5880399 6368689
5755 6368689 6981946 7673200 8080746 7957439 7513691 6895828 6070474 5286724 4575738 4028426
5745 4028426 3671769 3389163 3123743 2897005 2778588 2646036 2522326 2446775 2347508 2243192
5735 2243192 2119278 2048678 2012174 1969386 1970179 1952741 1870417 1812748 1797702 1744706 1720442 1701171
5723 1701171 1655381 1585042 1553006 1550195 1542794 1516378 1516668 1465538 1463793 1465564 1478140 1490764 1420719
5710 1420719 1423578 1418961 1457240 1477203 1529496 1573641 1536497 1548543 1561158 1579356 1607679 1615249
5698 1615249 1662909 1625731 1572151 1538645 1529844 1511956 1434983 1401372 1321753 1219424 1200911
5687 1200911 1134200 1065774 1046812 1036211 1001582 1030193 1048858 1038487 1062437 1074138 1128641
5676 1128641 1195566 1261755 1276288 1265464 1235332 1293671 1272700 1308925 1405905 1459574 1503397
5665 1503397 1566273 1588409 1589857 1612900 1613926 1555135 1471533 1429084 1284145 1172021 1146555
5654 1146555 1070426 949453 957062 928623 883909 925485 930878 936707 976536 1050133 1107415 1142664
5642 1142664 1176680 1200095 1171448 1162828 1156822 1186168 1085608 1000802 1010211 987205 930723 834461
5630 834461 902086 900996 826075 784782 740709 684773 637417 587845 577511 528381 496197 466164
5618 466164 449134 457773 469947 456286 443244 466078 436919 458254 473010 494328 476816 444933
5606 444933 448741 396908 364797 362260 358661 301752 301972 334009 303994 279540 273244 233605 218519
5593 218519 253226 245071 189224 181189 174738 208263 213667 227449 181653 150640 166382 187314
5581 187314 188710 203337 217233 186293 145911 134043 143632 143052 133534 151461 197067 184145 143523
5568 143523 120951 159132 168989 199193 196020 168060 215269 252520 225748 276531 261105 250121
5556 250121 249636 236523 225840 174969 166851 187558 172155 145450 132968 168081 153132 132995
5544 132995 157874 125485 167604 180574 93975 70678 140284 136578 149335 217658 184136 146281
5532 146281 187216 227378 242889 250581 236390 252619 268671 295270 297466 314113 317339 354984
5520 354984 331226 302506 328233 352017 330310 298744 249820 236601 198782 166768 201250 205919
5508 205919 165528 167678 176820 104004 112285 125004 108450 82817 102270 133678 131586 157968
5496 157968 148009 170073 147848 170691 148861 165746 171456 162402 171362 212126 257392 252889 237242
5483 237242 242519 260130 193317 203913 150166 183530 248957 204058 169433 175804 189482 197624
5471 197624 205557 197204 212658 181243 160517 190027 176957 160571 167420 131300 139844 159719
5459 159719 162510 152677 150990 172367 185446 202299 223702 221588 189589 211042 202771 180693 141713
5446 141713 120663 113341 129925 130077 150778 151933 195948 200854 147070 151049 169421 147215 109061
5433 109061 140570 201951 200753 214424 171664 158672 176471 187280 241329 245739 229478 278661
5421 278661 308873 370521 358257 333334 371382 350279 343361 372560 396493 394866 369834 403496
5409 403496 368015 403134 397890 403272 449092 441321 395988 439788 427637 394118 439789 409302
5397 409302 441353 439484 429040 477947 415251 357271 365205 414822 392310 414294 424409 334086
5385 334086 388515 447867 444218 457553 475051 491155 519679 576865 656036 661580 684417 686930
5373 686930 637596 523612 496844 466138 459419 389328 380247 356431 337885 338272 360982 370642
5361 370642 357666 340487 345092 341951 297659 305378 326145 313964 357963 396135 430140 456623
5349 456623 493733 530957 514106 563006 598549 610602 662241 703090 709794 712594 718375 704064
5337 704064 663543 624942 575773 603995 589550 558646 585554 604178 634500 654761 732212 757546
5325 757546 748259 801407 808910 859375 854882 788677 778232 669081 649429 660884 597983 555393
5313 555393 587109 556114 494494 534908 479519 376737 417159 449838 388182 352023 291462
5302 291462 314446 395990 401321 406021 372723 303443 245844 297848 277238 276182 348244 305811
5290 305811 288693 301662 294325 287356 279880 249234 309917 294720 233613 248031 252579 210754
5278 210754 228472 185053 161325 221421 244666 176995 144596 207976 216223 161643 136675 174506
5266 174506 178617 157262 143248 187177 217885 233054 231713 280732 270691 238578 256446 262527
5254 262527 237068 195297 238925 222748 229158 166954 186141 237479 200823 182108 184030 172818
5242 172818 212886 204256 194368 211072 229341 269484 224003 206943 198442 211683 211965 198839 211779
5229 211779 196343 192646 197215 197685 212168 229701 251507 232388 240459 269531 228720 185103 242871
5216 242871 243821 227345 250998 303795 286402 252285 260794 300905 299378 287735 273523 265958 293458
5203 293458 328558 310297 295610 314715 374412 385614 450016 456745 438659 478802 497373 549268
5191 549268 559425 574038 601651 637840 631195 670402 620899 681946 824981 874775 895266 1022075
5179 1022075 1083502 1192227 1341777 1479613 1697982 1931388 2208165 2439565 2732460 3034285
5169 3034285 3239102 3369668 3447494 3451097 3268460 3057672 2858162 2605945 2272684 1995649
5159 1995649 1787652 1535319 1328060 1185492 1105097 989683 900812 795876 725297 659782
5149 659782 632123 643089 591036 556104 548310 507429 444351 491048 459892 417307 404727 396000
5137 396000 357265 373157 322467 350965 347422 327111 326529 328916 330997 373859 379654 332466 320365
5124 320365 316785 327495 299809 285960 287682 321615 346056 368916 385741 351096 266223 281133
5112 281133 317382 390489 335346 323501 375739 428213 427418 450637 478877 428928 430467 470376
5100 470376 487276 523902 542734 550860 504996 451182 473354 442805 405874 396035 397526 360711
5088 360711 367847 381955 351405 340362 303760 327157 343262 349058 297505 297234 269229 311536
5076 311536 331340 257064 229394 295059 263434 216828 280138 294947 245412 302109 335421 325319
5064 325319 318489 258461 312435 316854 292605 319104 345424 304509 329235 355916 349960 375313
5052 375313 405318 404362 474794 557054 553473 558985 576231 603220 626088 608809 646134 699798
5040 699798 680834 729349 793201 813107 794403 849823 897788 974259 1068808 1140424 1225803 1403631
5028 1403631 1585080 1725632 1842284 1855992 1704320 1514202 1357173 1143334 1009987 881109
5018 881109 770798 732651 729260 667074 604302 557890 550721 530467 474513 469397 487870 492303
5006 492303 465421 451890 461817 443595 438602 464967 439287 446959 484949 534073 533375 552382 523164
4993 523164 527124 587972 631207 599440 577211 622878 626207 661628 640902 684991 641830 630002
4981 630002 719814 723764 655345 680760 674864 672130 736101 735625 688874 706881 680408 721057 767832
4968 767832 755208 738158 733997 788998 820222 827789 885892 959432 1013979 1122584 1266775 1355005
4956 1355005 1504404 1687737 1817871 1917721 1950951 1912983 1760425 1614039 1435651 1218451
4946 1218451 1099855 1036925 992332 937209 899556 802771 792764 777775 780681 792009 741211
4935 741211 706116 724422 752560 776700 794239 769177 793474 795238 853411 864581 862142 860675
4923 860675 865742 904531 915481 965213 980253 998387 1018627 1025648 1023521 1020045 1011267 1021802 1036231
4910 1036231 1017735 1043558 1085160 1051651 1033525 1050490 1037462 1031800 1042408 1071752 1047073 1034115
4898 1034115 1026180 1001456 1014658 1027111 1086373 1156091 1278122 1339408 1353437 1391597 1465226
4887 1465226 1513235 1527211 1597366 1681929 1710799 1784078 1880235 1926828 1948667 2023932 2020272 2006809
4875 2006809 1979975 1948644 1912488 1900604 1865769 1816712 1879113 1887688 1909556 1949850 2029228 2031941
4863 2031941 2115420 2127753 2086255 2088517 2025638 1981716 1987519 1992122 2012324 2024711 2043962 2100915
4851 2100915 2146754 2091494 2080327 2126441 2208449 2214134 2249628 2276186 2293841 2257825 2312656 2295580
4839 2295580 2312306 2310698 2380241 2465739 2470923 2524288 2603508 2579718 2618874 2658053 2674410 2691510
4827 2691510 2671809 2751606 2810013 2834785 2858229 2909652 2981390 2982073 3068341 3158853 3262486 3352739
4815 3352739 3430197 3493696 3579963 3672910 3726648 3759446 3894643 3966270 4077336 4236434 4353058
4804 4353058 4448508 4573638 4697140 4787681 4926073 5073048 5179936 5311176 5475546 5680014
4794 5680014 5896324 6074195 6273367 6446133 6635605 6770529 6920223 7070888 7224034 7318323
4784 7318323 7450857 7577982 7728486 7827030 8046799 8249024 8453653 8613851 8836996 9094744
4774 9094744 9314797 9525303 9804172 10096644 10286213 10539096 10766975 11021056 11337583 11603635
4764 11603635 11827055 12108634 12484449 12754789 13128142 13488529 13869609 14240525 14671485
4755 14671485 15138280 15645969 16167571 16760176 17437494 18214408 18946514 19806332 20733057
4746 20733057 21715996 22630034 23572668 24548690 25633424 26682979 27847072 28997410 30219145
4737 30219145 31500568 33001704 34576355 36468073 38628698 41110559 44044215 47550873
4729 47550873 51606982 56507885 62326653 69428131 78037098 88390641 100688620 115711799
4721 115711799 133314998 155149029 183194667 216751260 245569553 265773261 272852883
4714 272852883 261976850 240515766 210126015 177380863 145589921 118498188 98719790
4707 98719790 84830496 74675734 66935213 60705085 55594870 51299007 47690884 44619671
4699 44619671 42045771 39897816 37959884 36332274 34957579 33780400 32640196 31636648
4691 31636648 30737980 29936290 29246774 28587197 28000800 27526432 27162373 26869994 26621539
4682 26621539 26439647 26328236 26257248 26234754 26315349 26408574 26596947 26798566 27187917 27634296
4672 27634296 28156095 28742136 29398153 30046728 30766808 31434420 32177756 32912707 33755464
4663 33755464 34623444 35598672 36725134 38033236 39627787 41553725 43784825 46360900
4655 46360900 49539592 53376292 58081843 63796824 70906718 79588940 90001619 102826751
4647 102826751 118136096 136555551 160316019 190509683 218375293 237094312 252622919
4640 252622919 257430325 245046137 221484827 192393654 163641572 135311484 110057681
4633 110057681 91273458 77844805 67878243 60208037 54024898 48967590 44777712 41273328
4625 41273328 38271537 35671224 33434068 31478114 29729010 28169304 26749529 25433869
4617 25433869 24200750 23080129 22056649 21051058 20197788 19410786 18619867 17909089 17297812
4608 17297812 16715190 16129902 15568716 15097306 14529163 14009844 13547634 13125866 12746495
4599 12746495 12331439 11993323 11678212 11368315 11079259 10835830 10496340 10258210 9979879
4590 9979879 9668701 9407432 9152965 8883660 8617659 8355498 8138554 7975049 7785570 7600903
4580 7600903 7438158 7272415 7086699 6914511 6731549 6559829 6421324 6310196 6166495 6032408
4570 6032408 5970155 5852434 5706822 5573463 5471479 5314093 5119298 4949773 4825068 4710797
4560 4710797 4560929 4461030 4380490 4239371 4189567 4083630 4016888 3969743 3903529 3834184 3755902
4549 3755902 3723599 3697752 3615850 3589240 3530461 3462196 3430959 3338739 3329612 3302036 3283095 3253665
4537 3253665 3202153 3208306 3234952 3198376 3157596 3082061 2956788 2894266 2871946 2832246 2796114
4526 2796114 2777513 2715754 2661938 2580202 2546751 2549999 2536496 2515280 2476571 2489495 2484560 2428151
4514 2428151 2369731 2389356 2319464 2271155 2236097 2264383 2273458 2243861 2286840 2323950 2322246 2387674
4502 2387674 2384598 2367769 2368406 2314300 2219389 2193280 2148099 2168240 2195447 2172270 2099849 2088967
4490 2088967 2060519 2006590 2023731 2023043 2072378 2091210 2058220 2060095 2025439 2042260 2098141 2123581
4478 2123581 2150217 2139348 2120184 2066801 2012891 1974484 1992413 2024558 1994104 2048761 2044625 2026446
4466 2026446 2027212 1978650 1999463 1994805 1982142 1967906 1959562 1988732 2015082 1973029 1934022 1920135
4454 1920135 1929656 1881860 1872920 1843060 1816578 1827617 1835786 1836199 1790903 1804050 1825319 1801045
4442 1801045 1847033 1940295 1989857 1962130 1965644 2029927 2084843 2130069 2243434 2328631 2382915
4431 2382915 2512392 2687261 2869777 3118995 3402167 3746446 4122746 4617788 5147113 5423273
4421 5423273 5486055 5372585 5046837 4615935 4172431 3716648 3328863 3073359 2965400 2826883
4411 2826883 2722775 2701054 2699638 2725598 2780665 2840901 2980150 3176506 3352819 3522369 3606595
4400 3606595 3574200 3502261 3385546 3213629 3022229 2839845 2727583 2582585 2478096 2406577
4390 2406577 2356105 2336704 2295074 2312422 2317389 2354505 2351135 2376970 2360477 2275311 2180019 2158297
4378 2158297 2152354 2080355 2116927 2136473 2110794 2094247 2092752 2083904 2070657 2097789 2136133 2096842
4366 2096842 2135380 2189874 2181543 2194651 2261145 2284074 2303910 2365772 2367268 2405240 2467496 2534853
4354 2534853 2641016 2679754 2710139 2785747 2904689 2980245 3117364 3258366 3320494 3480987
4344 3480987 3683415 3860974 4080256 4461744 4871197 5052567 5115184 5094794 5031738 4907071
4334 4907071 4790333 4763446 4821856 5007934 5280427 5636359 6111571 6550697 6876605 7161359
4324 7161359 7341349 7518889 7693035 7995265 8511593 9101147 9658166 9818405 9516275 8780095
4314 8780095 7849521 6930064 6011324 5337034 4868264 4555013 4267882 4090727 3923343 3817588
4304 3817588 3779461 3725067 3632688 3618124 3616457 3631850 3679273 3742371 3805350 3913146 4067236
4293 4067236 4257826 4385035 4543124 4721848 4777518 4805575 4796641 4687370 4524899 4420286
4283 4420286 4282079 4078315 3901025 3831187 3800451 3774310 3755797 3844821 3938232 4020674 4205469
4272 4205469 4416309 4568093 4706667 4888187 5012362 5112829 5289616 5300399 5255102 5287967
4262 5287967 5243690 5183271 5116470 4986090 4860279 4701481 4573660 4450267 4310373 4267514
4252 4267514 4342595 4319405 4358882 4495909 4685360 4885364 5174616 5531648 5909710 6342449
4242 6342449 6849868 7376375 7765590 7907197 7798877 7491688 7059601 6610211 6153257 5711014
4232 5711014 5445843 5245624 5106965 4992467 4865101 4852660 4845995 4879377 4897592 4901183 4970648
4221 4970648 5075426 5232483 5371597 5515166 5700732 5917873 6281482 6635986 6975287 7474420
4211 7474420 8039037 8713856 9585825 10559494 11443749 11952606 12247621 12446861 12637442 12716465
4201 12716465 12776583 12802339 12839861 12927292 13031798 13188930 13487548 13670637 13321740 12741100
4191 12741100 11954471 11046177 10033499 9108063 8359635 7860323 7437118 7123528 6937047
4182 6937047 6736660 6648338 6632172 6621087 6543336 6589764 6695047 6763982 6794368 6904539 6973548
4171 6973548 6994027 7070188 7201829 7280894 7364669 7472457 7589820 7708201 7916528 8158718
4161 8158718 8332762 8594536 8876792 9084352 9226688 9338306 9318901 9262025 9132483 8946904
4151 8946904 8813842 8656469 8587529 8567321 8482947 8409068 8378000 8408594 8414995 8463945 8452721
4140 8452721 8480723 8562689 8631160 8743274 8837212 8957434 9136163 9349765 9567530 9801510
4130 9801510 10064722 10363136 10734011 11111242 11474790 11938160 12371542 12881747 13482675 14080595
4120 14080595 14735614 15568625 16477121 17501996 18613365 20131346 21926321 23654283 24819273
4111 24819273 25487840 25915325 26309827 26767999 27712911 29200448 31454557 34330334 38015598
4102 38015598 42372131 47830906 54657195 63357403 71825594 77717131 79029094 75393411
4094 75393411 68693817 59814630 50944558 43084005 37364893 33378900 30734679 28806560
4086 28806560 27294888 25977848 24802545 23787987 23002111 22408241 21951980 21621490 21531853
4077 21531853 21569162 21683474 21910015 22314228 22802202 23419213 24197528 25066506 25814220 26441907
4067 26441907 26857553 27070022 27196667 27424323 27880186 28953058 30738037 32882362 33496314
4058 33496314 32478645 30587656 28194954 25257295 22286026 20141206 18542649 17443380
4050 17443380 16747083 16236348 15853923 15629070 15401002 15288774 15318099 15381419 15503018 15654587
4040 15654587 15821102 15992626 15933160 15767064 15541460 15201930 14742828 14308874 13844685 13462778
4030 13462778 13187558 12917748 12715754 12615808 12544798 12580347 12707823 12950183 13034286 13107511
4020 13107511 13117368 13032665 12783696 12354205 11899590 11531395 11140005 10878410 10716886 10651060
4010 10651060 10604449 10633084 10603932 10610212 10745441 10850389 10954106 11117624 11263022 11429565
4000 11429565 11709116 12002482 12328032 12704126 13171370 13769838 14389212 15126134 16058158
3991 16058158 17172023 18445604 20053972 21966549 24150695 26716566 29691078 33068944
3983 33068944 36982523 41390306 45533610 47791238 47593745 45327916 41486634 36674541
3975 36674541 31566477 27100799 23547588 20833868 18643314 16906708 15532539 14364345
3967 14364345 13392552 12634600 11977160 11330648 10840601 10433217 10014834 9642177 9293037
3958 9293037 8976383 8687952 8458003 8220509 7994766 7819017 7651447 7536817 7374074 7267561
3948 7267561 7206941 7169025 7121264 7027006 6920317 6848282 6790848 6688212 6636006 6586941 6615938
3937 6615938 6641854 6584784 6547162 6585797 6555567 6587685 6569969 6504932 6503723 6484686 6518156 6519446
3925 6519446 6494252 6522155 6582681 6647078 6667095 6717667 6819876 6934952 7089757 7236132 7378109
3914 7378109 7568883 7827316 8041633 8303949 8572782 8861723 9232463 9610438 10021072 10466093
3904 10466093 10930969 11387988 11830131 12136726 12355519 12450881 12365059 12145449 11875121 11630853
3894 11630853 11485755 11376524 11379712 11504965 11739508 12076322 12462644 12917857 13457084 14110479
3884 14110479 14888753 15749898 16681769 17777046 19089599 20620348 22470151 24709445 27352988
3875 27352988 30193875 33457186 37088852 40902874 44176254 45644044 44234118 40405796
3867 40405796 35626551 30939619 26898882 23609760 20942485 18810108 16983663 15519541
3859 15519541 14315566 13233802 12348807 11599131 10963350 10341993 9822133 9333996 8929510
3850 8929510 8508298 8140647 7813665 7518607 7227936 6990064 6800194 6571092 6407427 6200393
3840 6200393 6004164 5859853 5775385 5675084 5577931 5456391 5349307 5272405 5104086 5059379
3830 5059379 4932768 4855200 4785546 4682128 4589737 4497345 4432764 4388507 4296824 4170322 4095093
3819 4095093 4032926 3938759 3921427 3839144 3793326 3747957 3695528 3673231 3728408 3687064 3626076
3808 3626076 3589695 3577072 3593827 3616978 3606324 3487654 3435649 3427474 3366480 3289678 3285618 3287440
3796 3287440 3281985 3261179 3259136 3231271 3238526 3246168 3235889 3243214 3167450 3150049 3179787 3119055
3784 3119055 3201964 3243129 3206792 3212270 3253140 3257827 3268281 3338977 3374998 3410464 3417076 3474256
3772 3474256 3501282 3503376 3615936 3649159 3619642 3592661 3614272 3612808 3572450 3575249 3556630 3541094
3760 3541094 3571638 3675984 3740746 3829941 3999556 4130533 4331645 4650644 5030105 5287552
3750 5287552 5474722 5488393 5443581 5288748 5090846 4899730 4681041 4585829 4570867 4589788
3740 4589788 4609854 4552374 4472522 4287519 4053047 3822638 3696316 3549252 3396434 3302186
3730 3302186 3232762 3179463 3109267 3062579 3072297 3036554 3032135 3053083 3011037 2989344 2969028 2971888
3718 2971888 2949465 2937944 2992800 2993208 2998057 3032601 3076077 3135749 3144945 3230185 3318372 3387991
3706 3387991 3459161 3623863 3747390 3833291 4007477 4141921 4064787 4001376 3929267 3834141 3729758
3695 3729758 3688241 3673387 3675871 3716901 3731255 3725305 3795961 3836028 3907305 3970834 4009645 4092590
3683 4092590 4120419 4139190 4220548 4254400 4269840 4345312 4484032 4571232 4701944 4793281 4925089
3672 4925089 5153597 5337578 5551789 5802183 6124055 6531191 7034800 7562173 8204741 8994780
3662 8994780 9918145 11005299 12297543 13850082 15610684 17530693 19039403 20059038
3654 20059038 20242070 19546650 18129091 16272792 14281999 12377329 10882604 9683090
3646 9683090 8790510 8097346 7577896 7198498 6905444 6643604 6472958 6318670 6144889 5993565
3636 5993565 5920615 5812663 5772324 5730105 5736456 5682068 5722472 5744667 5686191 5706143 5718268
3625 5718268 5712884 5718608 5714209 5813744 5825552 5849947 5921388 5976358 5992394 6093615 6228363 6304450
3613 6304450 6415956 6592479 6770794 6999908 7362870 7766968 8329116 8986666 9749459 10712386
3603 10712386 11881687 13237116 14835794 16547228 18341456 19735370 20583261 20532417 19735437
3594 19735437 18254708 16318955 14441652 12684701 11168789 9943125 9087820 8362530
3586 8362530 7840794 7383359 6962321 6695540 6426583 6195101 6022168 5811909 5711781 5591265
3576 5591265 5468195 5323644 5222024 5121445 4971359 4887673 4864399 4784787 4719120 4723264 4736907
3565 4736907 4675916 4653582 4639683 4615672 4584851 4533385 4477549 4462269 4432221 4396897 4356017
3554 4356017 4364093 4431450 4463106 4468473 4338786 4206178 4122909 4066004 4003519 3874880 3816333
3543 3816333 3763821 3704777 3687697 3748597 3703390 3636929 3687340 3743516 3761495 3761403 3791410 3788732
3531 3788732 3851071 3865169 3858159 3832561 3853224 3855242 3854637 3872310 3879526 3901433 3919505 3974696
3519 3974696 4059015 4140440 4233366 4376403 4460595 4464322 4580549 4690175 4762714 4871440 5023000
3508 5023000 5085249 5204300 5388823 5566338 5656203 5730455 5758395 5682010 5610842 5585971 5524001
3497 5524001 5318767 5198372 5102294 4999286 4861662 4769821 4742523 4660352 4620092 4584097 4493639
3486 4493639 4513507 4553504 4550843 4599441 4583908 4675782 4776479 4806862 4921492 5091215 5198596
3475 5198596 5379054 5550276 5694722 5885308 6107469 6299750 6484994 6629379 6735193 6809713
3465 6809713 6721423 6549835 6389662 6125930 5846995 5625548 5389183 5238565 5125924 5068647
3455 5068647 4994193 4961248 4904313 4846766 4862389 4888113 4868061 4871771 4859300 4800711 4830809 4863399
3443 4863399 4873107 4858520 4869478 4858905 4867462 4846033 4878664 4925908 4978375 5019912 5070151 5063881
3431 5063881 5168175 5253340 5290131 5366529 5454204 5621042 5769518 5887106 6015533 6090464
3421 6090464 6107029 6197566 6264242 6293875 6337637 6433186 6535210 6647319 6773428 6914021 7002070
3410 7002070 7138231 7299579 7433419 7593972 7802160 7987976 8154932 8373894 8597444 8843681
3400 8843681 9186110 9626063 10048794 10540413 11144229 11797224 12529540 13391282 14488508
3391 14488508 15742022 17138679 18658346 20113129 21490387 23035426 24984306 27128974
3383 27128974 28154167 27838803 26516310 24563655 22206292 19750971 17780873 16425682
3375 16425682 15555248 14950298 14560656 14336550 14272835 14328028 14405143 14593263 14855257 15218950
3365 15218950 15714256 16277920 16992819 17837245 18808267 19888171 21292802 22946187 24969922
3356 24969922 27438120 30283232 33915920 38730240 44026623 46563358 46210856 43904546
3348 43904546 40316584 35773567 31004915 27369314 24740101 22823240 21404671 20316984
3340 20316984 19323613 18505071 17805547 17272899 16838752 16503512 16365334 16359404 16352937 16545975
3330 16545975 16825987 17189141 17662161 18322447 19136665 20190081 21438797 22982876 24896955
3321 24896955 27320491 29820281 31011444 30756984 29484376 27647833 25433381 23100489
3313 23100489 21204860 19681743 18479960 17548935 16717951 16004903 15524601 15124310 14847028
3304 14847028 14591511 14409254 14242559 14124883 14006929 13935888 13883764 13899910 13928455 13996068
3294 13996068 14066700 14173839 14382685 14550371 14721595 14936260 15198312 15478809 15774440 16188286
3284 16188286 16654395 17197304 17795807 18457418 19108551 19775091 20441963 20927432 21067953
3275 21067953 21012385 20853184 20729976 20694905 20870727 21351999 22009960 22512963 22698351 22502550
3265 22502550 22136496 21702888 21172315 20795373 20553150 20394080 20306063 20330544 20426658 20576685
3255 20576685 20720671 20835156 20987171 21193980 21390786 21593865 21921323 22268599 22623117
3246 22623117 23104005 23626009 24234658 24903188 25713190 26630926 27603240 28670626 29964910
3237 29964910 31332767 32635938 33972220 35363878 36729818 37737450 38360667 38879461
3229 38879461 39277322 39639134 40127672 40776945 41646406 42740105 44107185 45738289 47634368
3220 47634368 49855285 52311814 55104944 58105372 61327974 64652350 67951268 71034027
3212 71034027 73568044 75102661 75228996 73592625 70344856 65987378 61131474 56350170
3204 56350170 51954219 48210845 45058785 42409902 40147842 38209525 36555689 35031898
3196 35031898 33721613 32539937 31472280 30492518 29545198 28677580 27833267 27095093 26460249
3187 26460249 25724384 24943080 24248005 23616903 22917324 22270628 21712358 21121656 20586918
3178 20586918 20113291 19678840 19245973 18876069 18516239 18226625 17924606 17612953 17371479
3169 17371479 17145830 16895576 16602480 16367073 16027446 15672962 15315906 14948186 14592785
3160 14592785 14355900 14109050 13878042 13665508 13398440 13235389 13062227 12902170 12664189
3151 12664189 12437994 12202446 12017890 11831322 11566609 11370231 11264064 11178770 11052962 10994704
3141 10994704 10958042 10937124 10995095 11031847 11120616 11190751 11259068 11239410 11024558 10732066 10428242
3130 10428242 10153544 9827084 9573615 9380537 9256204 9154094 9013138 8952966 8837067 8689086
3120 8689086 8603926 8491034 8365430 8289342 8202060 8057922 8015800 7999006 7943725 7858924 7836333
3109 7836333 7809875 7776976 7743550 7711802 7770054 7812355 7807317 7858213 7781145 7656321 7536318
3098 7536318 7406365 7276673 7154014 7063423 6930244 6874500 6810633 6725492 6634680 6562732 6481578
3087 6481578 6417793 6302740 6249164 6187999 6165747 6083873 6077313 5976691 5874927 5960498 5920702
3076 5920702 5868628 5842710 5824142 5818261 5813674 5787108 5756827 5775866 5790627 5774842 5842071 5893754
3064 5893754 5848294 5770067 5722738 5687993 5593607 5569001 5501279 5426454 5408942 5364335 5338363
3053 5338363 5302694 5301582 5262530 5179387 5185379 5160077 5117652 5086067 5060655 5038872 5047879 5086689
3041 5086689 5089677 5075034 5061281 5082494 5129422 5194277 5271620 5365845 5418220 5391650 5342720 5290342
3029 5290342 5177555 5098531 4989320 4919841 4885095 4865986 4785871 4728948 4659307 4605864 4579067
3018 4579067 4514769 4545347 4535434 4487507 4447655 4491337 4467867 4460354 4487604 4469910 4472941 4473903
3006 4473903 4474837 4506683 4480985 4476764 4551823 4599178 4585006 4564911 4530247 4456525 4441064 4453949
2994 4453949 4418459 4460306 4539014 4515691 4540094 4537944 4528139 4555460 4558774 4541023 4617964 4701733
2982 4701733 4716695 4774379 4834921 4882362 4908804 4983146 5077555 5114915 5190244 5324931 5474891
2971 5474891 5613112 5711081 5815327 5829566 5729167 5652183 5583424 5459480 5366654 5296578 5235234
2960 5235234 5225596 5246707 5235828 5285425 5253678 5311609 5393195 5448136 5498711 5590417 5717786
2949 5717786 5819367 6011239 6065595 6199994 6388183 6563222 6779523 6977649 7168462 7422884
2939 7422884 7733584 8008182 8139589 8282224 8260437 8117005 7834862 7506005 7285043 7106638
2929 7106638 6837642 6703313 6709131 6601962 6526610 6467556 6386791 6338571 6361296 6399638 6406003
2918 6406003 6466365 6578429 6651030 6732245 6819312 7010925 7216174 7349255 7554532 7760057
2908 7760057 7989391 8246937 8548141 8858936 9097713 9237611 9331787 9426500 9491297 9506175
2898 9506175 9535771 9582149 9629829 9710186 9751134 9789321 9867317 9841650 9818876 9878941 9902574
2887 9902574 9948420 9956426 10018114 10116458 10180894 10391798 10539326 10690400 10878875 11040346 11287530
2876 11287530 11531764 11766064 12027818 12388647 12755353 13166123 13580049 13988556 14290437
2867 14290437 14547457 14804571 14968931 14977904 14749180 14423599 13992220 13574710 13242266 12964236
2857 12964236 12740352 12688364 12696186 12683383 12781555 12827329 12907130 12957356 13011490 13107928 13170460
2846 13170460 13231414 13344333 13394827 13391827 13442224 13463053 13443011 13287078 13132441 12973556 12753391
2835 12753391 12568049 12337120 12080663 11775605 11503726 11303229 11099722 10858586 10696848
2826 10696848 10547881 10417015 10365429 10282923 10098979 10024775 9864960 9689276 9528220 9323817
2816 9323817 9077675 8817799 8588688 8316220 8031463 7710375 7403744 7163558 6903179 6610268
2806 6610268 6388710 6179462 5958320 5777460 5624615 5427184 5326066 5204906 5122132 5036962
2796 5036962 4882155 4791713 4769169 4644731 4553429 4501014 4440073 4305017 4195756 4129811 4038865
2785 4038865 3986734 3868562 3780654 3687161 3623326 3561703 3463345 3325199 3264915 3209160 3163146
2774 3163146 3129119 3098596 3005890 2963069 2870899 2742480 2756345 2716322 2691335 2645626 2637310
2763 2637310 2586131 2541440 2518415 2469472 2459970 2397129 2374416 2363098 2279036 2227676 2211575 2167408
2751 2167408 2130533 2136523 2138823 2120527 2074562 1984801 1911039 1868625 1879306 1885441 1823764 1821196
2739 1821196 1741490 1712309 1694151 1642567 1649989 1635584 1597747 1575570 1599920 1561829 1503269 1517839
2727 1517839 1517780 1511365 1524838 1499415 1478264 1439814 1395254 1395295 1394429 1350628 1322106 1312800 1300525
2714 1300525 1298743 1272665 1247370 1200559 1172939 1222696 1225270 1206725 1156695 1191158 1140319 1074673
2702 1074673 1105655 1067434 1053211 1042883 1022723 1004495 1031947 1006560 1004717 1033394 999399 960841
2690 960841 970070 962363 930987 916633 946413 921323 898192 885680 880668 877650 842794 856807
2678 856807 868414 847927 853053 830873 813221 817446 804976 771759 792448 790907 756447 758331
2666 758331 799400 778833 801428 829311 801472 787677 756605 750093 751096 691375 744472 788417
2654 788417 745791 780842 773061 765819 712940 760934 762561 689385 714642 712500 728941 746865
2642 746865 700635 714851 716230 701093 713239 746777 725149 717596 713858 699930 742771 758497
2630 758497 744655 748867 736811 710131 748030 771432 783632 779184 790552 755690 752880 807279
2618 807279 761891 802105 840656 844362 803924 782381 801327 796844 806176 781834 834627 859949
2606 859949 869585 860896 865083 888715 926161 932492 895365 934333 956439 923814 926226 911387 861801
2593 861801 904250 888712 876545 900160 919961 917828 961733 967439 977110 1005540 993644 986861
2581 986861 992552 1004241 959848 985197 997814 994354 991965 956241 980317 1021850 978193 990610
2569 990610 1076121 1095582 1095450 1148758 1131136 1104249 1103469 1057671 1057380 1087826 1067937 980629 942343
2556 942343 945870 964007 883740 815130 894441 907131 871344 884740 911607 887737 870287 889029
2544 889029 855690 854338 865711 852890 882279 887199 856228 887835 818896 811822 819557 809611 832294
2531 832294 832199 840494 842474 784056 763185 810082 798281 765441 702412 644715 672034 610875 594664
2518 594664 574288 553342 591931 581470 583694 607512 570776 517506 539473 544982 561451 524746
2506 524746 524431 535833 490983 469348 533984 590300 497439 429203 456064 451909 439895 462568
2494 462568 451863 440953 447773 434677 418288 398116 435063 408314 357791 316931 358377 358037
2482 358037 311867 287837 344295 327244 300190 366702 357309 302523 312602 327795 228566 208843
2470 208843 232321 243712 271157 250030 284106 286826 260054 263605 275008 266973 224279 227537
2458 227537 239166 222542 223563 206676 186669 204868 233723 255385 228258 212183 228742 230050
2446 230050 231591 257381 205458 127525 140073 197500 214725 214056 227150 230259 241449 193074
2434 193074 186036 179239 149176 126859 134441 165257 147106 116593 175157 190711 160199 180416
2422 180416 111814 130980 191837 196320 193230 138492 164112 136021 168525 173836 162004 163238
2410 163238 156071 144554 141483 140350 140380 127409 151971 138927 122977 122409 131242 127382 127564 182810
2396 182810 153921 138746 126077 80973 91592 119029 103519 107478 110255 84743 105099 149201
2384 149201 171552 229607 173234 91916 129441 105861 105940 145590 150438 109212 118805 137076 112354
2371 112354 121302 110117 127685 92209 125557 145805 104962 87747 101212 50894 51626 39993
2359 39993 127283 102993 75040 91942 98686 98270 102334 123537 84160 72285 52911 47060 32360
2346 32360 24575 63605 46512 99151 89240 94842 138894 99618 133526 182192 160719 173412
2334 173412 116344 107644 117046 106519 104060 72233 79529 98076 107815 58861 54956 137213 123006
2321 123006 72964 44901 86651 107124 77730 60965 78217 88867 37376 45836 84933 50738
2309 50738 67017 88407 56928 31971 64683 101714 93034 90094 47494 40710 64084 72998 41353
2296 41353 29210 5863 63571 85904 89372 98339 50455 53697 108905 120936 71955 64462 97422
2283 97422 93971 91758 47670 50791 71703 104635 106764 104041 44661 16220 94180 92215 58133
2270 58133 85605 59402 52124 60402 60029 73994 94538 36638 56811 77917 86277 59773 43115
2257 43115 68121 99111 129954 60070 43137 71823 51959 70892 112330 98622 66942 107305
2245 107305 67810 68879 135002 83763 115893 125490 116617 107151 98027 92718 71838 94945 78137
2232 78137 42320 31942 48141 60854 83597 80597 67065 30299 57700 110973 104931 73270
2220 73270 75936 115790 81471 35698 17120 42051 36060 57335 76762 97666 90703 118385
2208 118385 155655 87178 91022 90944 44219 18885 89508 100587 81360 85004 75497 76386 37157
2195 37157 26732 59391 79890 103510 62715 67160 41346 55976 100104 103818 86822 59253
2183 59253 86650 97956 94227 159149 181060 145240 134516 106550 83108 132702 123759 86901
2171 86901 65230 39894 62353 55421 99857 119470 92352 120324 109987 112196 92460 160103
2159 160103 154436 126681 196174 217093 244779 205489 187712 192021 273831 284150 251102 263404
2147 263404 272090 236432 246282 231725 234147 234644 276875 282705 257755 234910 245785 238877 236117
2134 236117 240699 311458 308709 276273 281236 306393 326254 319455 338075 312750 300904 361666
2122 361666 340392 357766 366656 390043 420155 413576 401039 443707 422416 428970 438215 421963
2110 421963 480155 528031 520244 536234 619049 614885 559331 585423 662696 727744 729292 764439
2098 764439 820740 859911 907259 933928 967656 1021249 1051173 1093238 1170143 1225691 1310343 1427551
2086 1427551 1512157 1613249 1757726 1934282 2071686 2216540 2321986 2542335 2707460 2994867
2076 2994867 3443233 3942630 4505880 5308741 6173670 7213451 8638745 10927438 13053117
2067 13053117 13363124 12526335 10939239 9085556 7076742 5598959 4580011 3919662 3417171
2058 3417171 3006279 2657329 2452754 2290818 2205399 2132518 2024903 1868730 1717972 1575621
2048 1575621 1475047 1401236 1309465 1221707 1071935 1014183 1011450 936301 919265 906885 850852
2037 850852 795269 737422 756562 736715 708305 649607 610738 658692 644790 584752 607943 601690
2025 601690 578647 567660 525982 480395 451918 463049 445472 438306 439844 424808 385579 378584
2013 378584 390175 400727 387539 346687 348773 344185 308025 296369 265458 306464 289289 316524
2001 316524 314958 278699 253440 230443 268068 268209 240806 266362 295136 281221 282880 273022 230976
1988 230976 178327 196581 212740 210185 184132 153831 146799 206191 229843 202775 194452 208554
1976 208554 223173 204022 201410 182575 167634 177521 162636 164937 148044 170619 137154 157388
1964 157388 152467 116013 132662 158347 127196 128027 97269 81744 73253 94437 93595 101768 128324
1951 128324 103666 141889 140777 107666 145358 147157 139849 144911 146344 117670 118322 84508 85815
1938 85815 128097 123094 99186 76286 97466 108240 110207 78516 75636 122633 98274 49354
1926 49354 76617 68915 84317 128186 115145 69487 30926 24704 24363 38055 78983 115284 107082
1913 107082 112736 81743 102765 68736 98582 80278 58546 93367 107419 61388 43541 55361
1901 55361 34706 49085 81420 67223 78453 76656 80156 109340 87769 87740 91720 58796 82901
1888 82901 83377 42997 45606 36620 38996 31201 48911 25653 64294 8826 39698 17393 -23217
1875 -23217 -31170 16767 80824 71670 98616 48736 9295 62688 61144 11580 32747 -4679
1863 -4679 17448 60854 51661 30638 30907 46219 85125 40263 32789 -6545 8175 31663 41014
1850 41014 67071 76066 86884 28975 93527 98422 8534 40068 78291 56668 58666 64977 52437
1837 52437 75135 76295 13366 29357 -7700 62517 56349 21279 24774 36947 8831 37105
1825 37105 60239 36070 -5848 -11374 -14456 -8509 3276 -18948 50553 60416 51726 18207 36852
1812 36852 36401 54479 37903 11792 25197 67805 93869 82018 86129 69311 125222 75789
1800 75789 77906 70632 98924 115056 129467 115452 97292 69786 73872 77454 54499 41450 31509
1787 31509 57711 36173 25920 39019 16691 45466 78621 60160 46863 -15399 -5162 34095
1775 34095 15754 22139 28916 19220 33386 66725 37899 29936 30101 24972 2485 27738 15372
1762 15372 26407 22963 42008 51117 45894 -13965 35147 58365 17093 31567 13032 24291
1750 24291 16754 29543 8995 44086 3615 37839 26451 -54566 -48546 44949 47371 50444 39130
1737 39130 18096 11014 54009 36502 15310 24740 56634 37241 15591 5007 39092 44221
1725 44221 26850 26384 22822 17313 7323 1695 25062 60277 12940 8649 38069 -8707 -18779
1712 -18779 7562 2421 -13325 12589 -2324 -10626 -13627 -2191 63478 63373 20429 30413 -26679
1699 -26679 -8066 29873 13302 12665 46382 39381 42485 21504 19953 -47311 -53580 12710 54432
1686 54432 28326 5655 28383 24503 5481 16442 470 -6594 -3425 -239 48262 54897 70496
1673 70496 23215 1175 -8134 15800 26815 -10763 11901 60 -80675 -14487 42396 49087
1661 49087 -703 48246 31414 53306 70618 2972 13769 21841 -46511 -9174 24037 -25741
1649 -25741 -20678 -11503 28792 15762 34708 21578 29232 -4934 -22590 49348 46979 57431 18883
1636 18883 -42620 6948 13321 26454 37864 -4509 2538 -10012 31188 15925 24798 18702 -1583
1623 -1583 -3119 -11934 -14924 14948 26023 32423 36630 57816 49717 2164 -57931 -25014 -1156
1610 -1156 -13857 -23621 19602 -15972 -46521 -17383 -44477 -28208 -3699 14636 -12775 -2773
1598 -2773 12722 -11729 -23867 -20856 -29549 -48767 11184 10944 -11846 -27350 35882 48491 -16392
1585 -16392 -108 487 17950 16452 6757 30890 47596 14133 27405 18021 2930 8559 74737
1572 74737 39922 2127 15717 44285 64485 29182 34877 36803 7498 -19273 21681 -3853
1560 -3853 -15195 -26983 -82330 -85415 -2743 12928 -5407 16565 4448 10710 -12887 -42011
1548 -42011 -22350 20712 -5738 -15469 -26892 -48943 -27664 -5338 -8557 -7701 7331 -16760 -21079
1535 -21079 -4781 10021 13797 2281 14747 30575 -2737 -45810 -14858 44096 40924 52946
1523 52946 52566 38858 -11086 -22164 18330 2966 22739 26686 6329 -49633 -27014 13026
1511 13026 -10078 -18917 5950 -17131 -20321 4373 -10192 -12388 -26911 5837 29378 -53073
1499 -53073 -27858 -59866 -53062 -6657 26639 18590 -15172 14600 48948 39093 1502 4506 -41045
1486 -41045 -28610 16706 -24662 -10289 -15902 -25808 -23576 -9024 -12584 -53636 -27269 -20210 5260
1473 5260 75256 38922 19467 28301 -6930 -71640 -34671 44386 22483 7030 -32147 -22737
1461 -22737 2958 -22040 -1539 33272 30576 24508 32484 7609 -2330 -441 -3801 5856 19142
1448 19142 25722 -7346 1329 10868 31743 331 22261 11487 -8547 29682 3885 55765
1436 55765 79296 35699 -6452 5756 46825 31742 -1148 13607 28746 28751 9363 6885 3696
1423 3696 17530 30050 -4024 -8237 -54830 -37196 -65153 -58268 -35317 -19134 -71253 -36967
1411 -36967 -52215 -41263 -38026 -59010 -2245 -11885 11225 14578 73832 54515 12200 15345 41884
1398 41884 39591 18262 -9872 26687 31660 -54760 -14193 22498 -22962 -21579 695 -23288
1386 -23288 -40837 -17886 -45638 -61247 -37108 -61157 -69680 -11177 17272 -28233 -13825 -4183
1374 -4183 7083 9246 -22254 -22603 -32487 -53731 -49062 501 -354 -746 -18663 -40722 -739 -17122
1360 -17122 -38217 -1902 1706 -2442 633 -1036 -13482 -12601 1855 -32544 -37667 -40552 -27667
1347 -27667 -38158 16850 15828 -25397 -34963 -18146 -230 -21470 -39728 -54909 -43230 -69158
1335 -69158 -42627 -28484 -50367 -12716 8959 -32938 -26146 -16537 13967 42236 -20431 -52289
1323 -52289 6615 -5482 -34674 8831 31517 -22967 4104 17008 39424 41799 -10045 -21615
1311 -21615 -6973 -18156 -32186 -19899 -37130 -4201 9360 -23836 11162 13236 -36959 21968
1299 21968 17700 -30392 -35312 347 12269 9677 -5857 -21894 -51712 -44226 463 41686 -30714
1286 -30714 -42787 -20782 -23147 5801 25119 14627 -80597 -82519 -44124 -4197 -22541 -7511
1274 -7511 16544 40319 13507 -18439 -37884 -24235 -48613 -47603 -38120 -30960 10830 -12446 -61907
1261 -61907 -48194 932 8409 -1069 2842 20928 4697 -7097 -40804 -55983 -61709 -42495 -24125
1248 -24125 14127 21477 8798 37237 45511 -21586 -49493 1392 -48198 -8847 37401 -21514
1236 -21514 -67240 -8270 8226 -47927 -16152 -57063 -29502 4062 -410 -22926 -25722 -545
1224 -545 15963 20096 6786 2224 -22005 -40370 654 2764 -31388 -41286 -29207 19500 -20476
1211 -20476 -27963 8621 36246 -43250 -48126 -31078 -6646 -17190 12114 55800 32337 3162
1199 3162 -33030 -62440 -39027 -27231 -32427 -6809 4062 19866 3434 13186 -8943 5790
1187 5790 -23051 -33812 -39402 -62905 -40175 39774 58331 12931 2204 -22666 -21345 -21188 -41288
1174 -41288 -20147 -4525 -12665 -27323 -35189 -14034 -17775 -18081 26713 -29439 -74327 -35489 -17923
1161 -17923 1345 -10555 5431 -32430 -32662 -16159 -26290 -42678 -22094 16285 8478 12686 8291
1148 8291 24191 -5686 -24450 -1881 -50532 -22132 -2776 -24520 -53765 -36204 5614 -29677
1136 -29677 -29979 -48528 -45828 -62009 -68905 -2515 32431 -8426 -15191 23839 29218 21856 -12851
1123 -12851 -2439 11992 6934 1292 -44529 -35124 -68163 12115 30848 -10296 55774 53416 -6658
1110 -6658 50572 30855 54057 -7881 -36399 -35308 -47858 -46431 -18721 31735 3933 10621 8736
1097 8736 -32064 -17946 635 -29665 11046 90871 69971 40418 41782 10793 -22145 -28987
1085 -28987 2407 9020 25790 -51100 -53846 5190 -21706 -40526 -17802 -35939 -1566 24250
1073 24250 -14075 -56765 -39731 18982 -30015 -40315 -1895 37283 -3443 -53576 2044 -7829
1061 -7829 -11488 -3728 -32288 -54740 -16934 -52769 -69925 -30327 -28755 -24047 -24560 -43939 -1689
1048 -1689 -1923 9193 -15138 -3023 -25638 -21716 -3035 -918 394 -20175 -16613 -45655 -37363
1035 -37363 -43669 -51492 -59965 -30000 -9382 -10483 -66262 -75741 -41983 -48994 -18110 -33699 -61467
1022 -61467 -62662 -23999 -9820 -30730 -39954 -60984 -36710 -5098 -24401 16868 18090 -19267
1010 -19267 -19498 -13319 -49808 -9601 -29389 -40038 1221 13099 14013 16583 -18604 -15297 22760
997 22760 19787 26354 67326 -10948 -28822 20851 -7826 -45287 -35348 -16257 -38592 -9048 -53567
984 -53567 -56004 -30148 28944 1986 -16950 -13748 -39074 -11216 -36124 -41174 -39685 -40328 9416
971 9416 6659 185 -50772 -2508 7014 -32320 -59388 -38161 -31375 -27090 -40140 -16306 53495
958 53495 21470 -13106 8734 -6045 -3862 27991 -4620 9987 8240 392 -115 1348 -66529
945 -66529 -84309 -3853 -53053 -26731 11112 -59368 -65725 -40629 -16520 -36321 -560 -31136
933 -31136 -35430 -29187 -71871 -30235 -33776 -45536 -21834 -5884 -54633 -48304 4893 -32795 3966
920 3966 23755 10773 55009 -4140 -23042 -8140 1967 20444 58949 3407 19308 9612
908 9612 -19136 -14237 16164 -15709 -51118 -27403 -3956 -4309 -4581 -18308 -29681 -11016 -51827
895 -51827 -46751 1986 -43013 -59806 -27183 -40706 -2638 48908 29757 12444 25293 7058
883 7058 17144 8949 14666 51061 23367 -17059 -21731 -25289 20552 38845 25980 -5761 -17368
870 -17368 31979 5826 -4647 51819 24780 38820 10804 -17765 -11519 -27336 -44775 -34499
858 -34499 -57022 -49742 -40312 -70 -43041 -23995 -6553 -54653 -29148 -2722 -15077 5146
846 5146 -9279 -28088 -16437 46762 48501 -8582 -581 -12493 40473 60030 66728 20628 -22467
833 -22467 11835 12648 26918 -15658 20125 27471 34237 63650 5427 -16893 -6830 36824 31042
820 31042 15842 -17101 -2777 -923 17456 44273 20064 -3928 -22891 -28281 -12989 23110
808 23110 34617 -7805 33628 38165 17979 -23172 5042 -7120 -28213 -28246 -52547 -53516 -73593
795 -73593 -113534 -51448 -16755 -49284 -19954 -36581 -27535 11167 44784 4200 25159 25608 -587
782 -587 2021 -7622 -73561 -25262 -6048 9827 -8420 -34927 -26269 -7090 -14962 -14265 20139 -15463
768 -15463 17300 10387 -25138 -9640 -3261 -91844 -35096 -20451 -17683 -11924 -35831 -13564 -34637
755 -34637 -772 39077 4325 -67504 -46631 -23758 -19655 -2960 29508 42513 -10071 -31827
743 -31827 38921 11590 -34725 -9364 -10895 -13475 3444 28790 -6952 11439 54568 38691
731 38691 -7724 -62336 -54606 -8931 9824 23616 9879 -50536 -41447 -28012 -55322 -75438
719 -75438 -25332 -39203 -27643 -17042 -14222 -6068 -23418 6751 12105 31980 30640 12279 -46647
706 -46647 -72127 -63939 -16162 -14521 -15924 -12879 -69740 -73514 -66920 -82029 -39675 28161 -591
693 -591 6727 57729 22982 20558 1921 -23306 4298 23745 -47148 -10824 -7769 -30172 3140
680 3140 -6662 -40176 -19722 -13644 -15214 26454 -15193 -50278 5972 -32710 -60595 -26359 -37659
667 -37659 -26778 2580 -20026 -23375 -30438 4128 11652 398 -23445 -16524 63827 59575 58104
654 58104 46509 29701 4663 6625 60299 15361 39956 44294 43898 38206 -1283 -6902 23839
641 23839 54449 5441 50589 -1872 -16747 18257 13648 -4727 -2725 -52124 21376 78152
629 78152 4796 -5533 5013 9924 59127 59529 22161 -28171 -15439 -14050 -16503 -31504 -45366
616 -45366 -30223 -4470 -15325 8791 13092 -30928 -2702 36690 -28390 -39125 -64257 -104428
604 -104428 -27115 -5872 -12174 -14062 -28523 -63580 -43676 1435 7333 -2272 1546 -35661 -41805
591 -41805 -71267 -30165 13254 -29723 -25522 -21336 43450 88861 58785 -1274 -10682 -15708 -2619
578 -2619 7082 -10813 1255 6833 -4964 -57408 -43889 -10480 -11501 15612 8719 -34459 -19585
565 -19585 -16815 -9241 13234 28051 21186 19985 18731 -6460 10370 -28134 -30364 9327 -30526
552 -30526 8561 -34536 -48990 -8315 22370 -7316 21742 -16884 -42138 7621 -16006 8083
540 8083 9836 19542 -26559 -47245 -10185 -20004 -6489 26340 5706 -27966 -26158 -6338 -21814
527 -21814 -27058 -32373 1082 2948 -7409 -18520 -3176 12682 1409 -11095 5074 -8933 -32755
514 -32755 -33981 -6269 -6903 3269 -9836 -13584 -34382 -30635 -27268 -69474 -51413 -9277 -46178
501 -46178 -70515 -50143 -48896 -9304 4822 35421 36062 68812 62651 42560 -6598 -35207 -49299
488 -49299 -10654 5063 16358 -10118 -55926 -25718 18363 -11444 14005 12447 -13813 -512
476 -512 -19118 53108 50293 -1991 26449 23768 11619 -1862 -3762 1001 8839 46711 33076
463 33076 -47302 -20818 -14529 -33993 -41731 1876 44902 13900 35008 21573 15667 -37635 16969
450 16969 763 -56369 -53043 -44480 -41000 -32757 -8541 -32783 -19574 -6047 -17094 -33752 -14529
437 -14529 -17758 -49116 -53272 -23293 -15787 -42834 -23568 -13121 -77848 -33572 3912 -3323 -11838
424 -11838 -7004 8311 -36163 -72775 -5192 22942 -6510 16660 4442 -18184 -29303 -9711
412 -9711 -36455 -5360 11493 -26250 -19873 21260 10104 6865 39479 2191 496 10898 -10390
399 -10390 8830 -27662 -14557 10464 -31968 -21547 -7388 -4332 -4973 -2075 24940 3448 32025
386 32025 -25243 -57320 -38112 -30361 30669 -7199 -11992 57854 3772 14538 14142 -36232 -63332
373 -63332 -22065 3831 -7411 44641 32080 7062 27248 13824 -5068 -26880 -59495 -12302
361 -12302 -5235 -44233 -32096 7394 -6227 26685 78325 -9562 -29910 -25118 -47859 -58220
349 -58220 -4211 43363 18623 -9633 -5777 45706 26891 -7861 17285 32360 -10056 45588
337 45588 67963 18223 54104 45318 1243 62882 66465 13369 14403 5783 -16307 -10278 -25087
324 -25087 40036 2918 -1671 -4545 15748 14108 4030 21068 -14593 -6437 23997 26814 -1892
311 -1892 6898 -816 -39317 -37180 -38600 -55263 -41029 -14040 -535 -69031 -70465 -33754 -38896
298 -38896 -11704 23115 44111 5858 -20240 -31789 -24040 -3388 -5090 -13707 -25441 7959 34197
285 34197 10110 17722 31852 12829 -34741 1587 -62571 -74056 -8465 -5959 40316 37030 19638
272 19638 18880 -8972 -56164 -11367 -28092 -32076 -21040 -29397 -8763 35710 -30861 -36928 -3458
259 -3458 -9011 3230 -14078 -21359 11227 8629 -4199 48835 10651 -23752 -20418 -15558 -27971
246 -27971 42530 30265 -32092 -1901 53187 53368 7136 34133 -2582 -47907 -6654 -19728
234 -19728 -25200 -15143 -43321 -21960 -49933 -35973 14207 8022 2399 28325 -8007 -32956 -7964
221 -7964 8566 -9423 -18995 -24842 15047 12688 19728 23753 9110 -6473 -26446 -27319 -6379 21178
207 21178 12123 -37251 -18721 -35705 -16648 14378 19388 -30790 -51228 12743 13406 -19489 -29383
194 -29383 30588 27474 32311 33983 15333 -8146 -5656 -11455 -280 36438 36872 18036 35322
181 35322 34697 68158 46967 2656 54360 63069 42898 49885 31937 54735 61384 27811 20007
168 20007 14313 -22904 4097 6813 -20616 -22032 7034 1730 41029 34977 -9189 -46130 -14786
155 -14786 -12246 -47157 -26126 9576 10415 -4548 -15352 -21417 13095 15276 16078 -16366 -9110 -26464
141 -26464 -28041 -33726 -41132 -54860 -15106 35691 36362 -27382 -35994 -17137 -4210 8040 8081 -13573
127 -13573 -2903 -10267 -23403 -16627 -20168 -28586 -28459 -9819 6064 -31491 -7540 51480 11296
114 11296 12882 -25215 -8596 26423 13290 -15413 -28851 -18282 2860 19706 7214 -23212
102 -23212 -19975 -19073 -26813 -2849 -28579 -28913 -14126 -41281 -30037 -6469 -34916 -43211 5792
89 5792 -30618 -14663 -12773 -47136 -31826 18447 22630 16617 41516 -10794 5838 4973 -20309
76 -20309 -14716 -21189 14584 23143 21472 7572 14119 8732 -134 23636 17676 6490 26933 -29862
62 -29862 -22739 -722 3818 -4394 4619 17414 26532 -5344 -13339 20848 3814 -1164 -21200 -31256
48 -31256 16780 23008 32098 50673 25144 35120 10504 6922 -26813 -20894 -5388 -16155 -22625
35 -22625 13378 -6026 2064 -18705 -8114 13467 -16982 -30405 22434 25292 18607 28626 41957
22 41957 17227 6311 21018 14554 22321 -16346 -10534 9382 -3262 -31950 -33068 -24094 -33483
9 -33483 -42584 -43143 -12146 -17539 -4168 14546 -284 6383 14386
0 14386
$$ Imaginary data points
##PAGE= N=2
##DATA TABLE= (X++(I..I)), XYDATA
16383 -738514 -685086 -687244 -685530 -635706 -602202 -608899 -579729 -599459 -540378 -529470 -560571 -567475
16371 -567475 -519501 -540895 -526624 -476785 -467094 -396181 -401516 -415340 -395429 -379576 -398759 -398696
16359 -398696 -349306 -336535 -316169 -291129 -267338 -244763 -263770 -246111 -227553 -227623 -199278 -188060
16347 -188060 -150823 -126126 -136484 -125195 -109547 -62492 -38387 -27622 -52189 -57598 -61166 -69056
16335 -69056 -52790 -13886 20901 -5435 -3672 38109 66914 80356 92312 116962 154123 152570
16323 152570 150154 161873 170431 149881 205165 221068 255174 277328 272496 282645 293278 288659
16311 288659 321248 327622 307113 358365 353188 347409 385073 386834 365562 414208 456397 427724
16299 427724 426003 464976 456307 421022 431113 502265 519934 499955 530881 528455 487761 536661
16287 536661 567749 582337 603360 647223 607830 632506 701695 697859 672670 667875 687674 731397
16275 731397 720126 724977 731967 742507 722704 739465 707425 746676 778981 750787 776697 806198
16263 806198 799461 770777 795188 817093 798185 812231 804532 819560 901486 883260 867358 876603
16251 876603 906944 914182 898652 899237 973017 964779 941052 936286 974480 994131 979684 1001980
16239 1001980 1031722 1037812 1048899 1050293 1055650 1019926 1018784 1079923 1078879 1079068 1122220 1110790 1160447
16226 1160447 1177153 1126308 1063551 1088905 1119503 1117055 1123757 1131455 1125846 1143078 1189498 1215555
16214 1215555 1211731 1173561 1188914 1203229 1228641 1192596 1189715 1231230 1244041 1263074 1290593 1262895
16202 1262895 1302004 1314307 1290378 1321916 1324273 1318794 1288064 1268705 1273383 1302207 1391623 1398859
16190 1398859 1354887 1329827 1335867 1328246 1354163 1329824 1353300 1433666 1387158 1363031 1326226 1342003
16178 1342003 1361841 1360866 1372170 1394751 1396148 1376213 1366917 1358739 1360394 1372604 1370634 1378793 1391485
16165 1391485 1420444 1427350 1397991 1408338 1443789 1450130 1450785 1452512 1459319 1455040 1451606 1439042 1403293
16152 1403293 1442539 1442831 1434070 1481105 1458771 1505863 1556962 1550779 1514719 1538441 1547516 1498349
16140 1498349 1542566 1521592 1517231 1529397 1512509 1504417 1542023 1495575 1524512 1511367 1520645 1532828
16128 1532828 1489770 1524325 1542445 1546750 1531543 1490699 1506432 1542094 1528278 1541847 1556458
16117 1556458 1590846 1593555 1596784 1599931 1597486 1557795 1518657 1549186 1600626 1615484 1607638 1576235
16105 1576235 1550430 1564044 1598534 1599522 1601638 1589849 1584510 1553299 1557138 1556732 1535117 1571361 1570813
16092 1570813 1581907 1593750 1542717 1535088 1561883 1554597 1548010 1563868 1562755 1562062 1568250 1588744 1609123
16079 1609123 1574601 1588650 1580698 1562661 1592485 1615687 1650647 1636109 1599238 1612369 1643711
16068 1643711 1662853 1617329 1556599 1574799 1589740 1655438 1635113 1569710 1576744 1607557 1618345
16057 1618345 1630502 1601527 1574512 1643402 1630686 1601864 1607991 1600404 1592686 1617494 1617906 1612652
16045 1612652 1652829 1650190 1612116 1626834 1604313 1620078 1574892 1576349 1626671 1639719 1613396 1600923
16033 1600923 1648610 1646385 1643848 1664671 1627873 1572039 1596031 1597641 1637204 1667483 1668990 1636861
16021 1636861 1653223 1619361 1622802 1624086 1565049 1601251 1622542 1650526 1669144 1612567 1559050 1600565
16009 1600565 1626044 1642716 1619828 1592210 1623350 1630269 1604674 1601970 1616426 1611659 1654465 1667181
15997 1667181 1633291 1624292 1640352 1607841 1634050 1651188 1612609 1616068 1606629 1586612 1627954 1631023
15985 1631023 1648610 1650151 1599681 1638597 1619624 1608174 1636148 1664320 1619443 1609961 1645496 1670300
15973 1670300 1629042 1620124 1618364 1620562 1639730 1598258 1618997 1582714 1602916 1658170 1663722 1649151
15961 1649151 1614500 1635023 1628265 1684155 1679731 1648552 1657314 1672152 1659148 1613743 1617943 1630134
15949 1630134 1616387 1604159 1666799 1702319 1669996 1664010 1657352 1649371 1674285 1636232 1618564 1635072
15937 1635072 1666625 1655615 1669406 1687562 1631595 1603187 1631691 1659455 1661169 1612647 1632541
15926 1632541 1616633 1597504 1595486 1625533 1635781 1635383 1674478 1623942 1608845 1558132 1564271 1558336
15914 1558336 1609223 1683419 1638963 1622385 1627400 1636103 1615790 1599708 1639771 1672503 1644730 1651533
15902 1651533 1659192 1622646 1642538 1602626 1606704 1648500 1631435 1624614 1636194 1677567 1677204 1654141
15890 1654141 1658861 1697300 1725450 1669804 1654430 1657637 1652281 1650127 1629054 1632333 1653991 1645650
15878 1645650 1645682 1679154 1652903 1613640 1650741 1670906 1661711 1676714 1624212 1625519 1647140 1641835
15866 1641835 1625034 1621276 1608656 1597423 1613824 1640979 1637699 1691040 1698740 1669003 1665886 1666950
15854 1666950 1653809 1670041 1669995 1633970 1648465 1665638 1716300 1679689 1633357 1631705 1615910 1666783
15842 1666783 1700104 1697238 1684146 1657505 1674219 1691824 1656941 1655607 1696186 1682082 1645172 1653025
15830 1653025 1695440 1644082 1666446 1673239 1667858 1700699 1674216 1637544 1608598 1614653 1636805 1645492
15818 1645492 1662065 1710788 1724664 1698452 1714635 1677080 1677903 1665454 1721702 1690464 1686279 1692040
15806 1692040 1693766 1692262 1627510 1678213 1703947 1684893 1683298 1653086 1595850 1638037 1656238 1670782
15794 1670782 1681528 1732849 1696970 1705710 1687752 1672650 1695665 1710667 1679901 1698436 1740750
15783 1740750 1740770 1694397 1656431 1659119 1687377 1690270 1629922 1658272 1664564 1706245 1687732 1640470
15771 1640470 1650295 1647135 1660661 1692052 1678464 1644629 1632573 1616601 1631438 1656164 1632841 1664692
15759 1664692 1651916 1631418 1668098 1683839 1688755 1672377 1658540 1662674 1692543 1716799 1705755 1697580
15747 1697580 1711719 1714255 1657056 1668648 1682963 1667765 1674173 1663826 1650041 1627905 1676952 1703910
15735 1703910 1707358 1717110 1712332 1689188 1664511 1646089 1637164 1615720 1669838 1677186 1659674 1678442
15723 1678442 1736264 1711705 1711091 1621836 1643258 1631414 1613833 1677166 1666271 1641046 1604211 1641547
15711 1641547 1683655 1667145 1628118 1646475 1647338 1687511 1700814 1675825 1682391 1743599 1694554 1648774
15699 1648774 1654526 1687682 1641068 1690825 1727755 1727801 1692880 1700984 1714744 1678733 1707555 1708703
15687 1708703 1658521 1664900 1704569 1686745 1672395 1671469 1716333 1691620 1632544 1669933 1679996 1707392
15675 1707392 1720482 1705192 1683526 1671587 1670268 1653797 1701786 1710884 1719643 1707674 1643450 1668531
15663 1668531 1664574 1662648 1643449 1685280 1687824 1715475 1657629 1665427 1687288 1681170 1682266 1669424
15651 1669424 1691463 1676819 1622239 1655287 1639152 1645928 1707983 1691406 1745367 1702295 1682344
15640 1682344 1709178 1709004 1725624 1743161 1701853 1693442 1698677 1700544 1690390 1732623 1746599 1695463
15628 1695463 1689958 1782502 1704701 1712706 1707220 1720760 1782053 1756333 1735902 1708043 1695400 1709021
15616 1709021 1726825 1723617 1735760 1742058 1768760 1766572 1755477 1778219 1717550 1750821 1757567 1711929
15604 1711929 1718849 1699241 1663080 1660243 1659105 1677728 1633271 1650273 1683152 1745068 1748739 1743485
15592 1743485 1722549 1674904 1717949 1724822 1702796 1727105 1716162 1698083 1702564 1677614 1695260 1698968
15580 1698968 1702771 1690812 1670839 1661724 1651096 1639386 1651941 1692664 1702063 1708911 1671237 1657007
$$ [...]
##END NTUPLES=NMR SPECTRUM
##END=
