##TITLE=1H_CA-9026-4
 CDCl3
 8 sc, 
 29.06.2022
##JCAMPDX= 6.0         $$ Bruker NMR JCAMP-DX V2.0
##DATA TYPE= NMR FID
##DATA CLASS= NTUPLES
##ORIGIN= UXNMR, Bruker Analytische Messtechnik GmbH
##OWNER= root
$$ XWIN-NMR		Version 3.5
$$ Wed Jun 29 16:41:16 2022 Russian Standard Time (UT+4h)  she@DPX200
##.OBSERVE FREQUENCY= 200.1313499994
##.OBSERVE NUCLEUS= ^1H
##.DELAY= (6, 6)
##.ACQUISITION MODE= SIMULTANEOUS
##.ACQUISITION SCHEME= undefined
##.AVERAGES= 8
##.DIGITISER RES= 18
##SPECTROMETER/DATA SYSTEM= spect
##.PULSE SEQUENCE= zg30
##.SOLVENT NAME= CDCl3
##.SHIFT REFERENCE= (INTERNAL, CDCl3, 0, 15.7039)
##AUDIT TRAIL= $$ (NUMBER, WHEN, WHO, WHERE, WHAT)
$$ ##TITLE= Audit trail, XWIN-NMR		Version 3.5
$$ ##JCAMPDX= 5.01
$$ ##ORIGIN= Bruker BioSpin GmbH
$$ ##OWNER= she
$$ F:/spectra/data/she/nmr/H-F/1/audita.txt
$$ ##AUDIT TRAIL=  $$ (NUMBER, WHEN, WHO, WHERE, WHAT)
(   1,<2022-06-29 16:39:54.50 +0400>,<she>,<DPX200>,
      <created by zg, POWCHK disabled, PULCHK disabled
       configuration hash MD5:
       00 E9 B6 7A A2 85 ED C7 34 08 36 98 17 FE 4E 26
       data hash MD5: 16K
       22 9B 13 8C 71 89 B2 FD A2 C8 ED 6D 45 3B A7 F9>)
$$ ##END=
$$ 
$$ hash MD5
$$ E4 0C CE C7 8E 60 CB 82 72 00 29 B6 9B 54 04 28
##$RELAX= 
##$RELAX= 
##$RELAX= 
##$RELAX= 
##$RELAX= 
##$RELAX= 
$$ Bruker specific parameters
$$ --------------------------
##$DU= <F:/spectra>
##$EXPNO= 1
##$NAME= <H-F>
##$PROCNO= 1
##$TYPE= <nmr>
##$USER= <she>
##$AMP= (0..31)
100 100 100 100 100 100 100 100 100 100 100 100 100 100 100 100 100 100 
100 100 100 100 100 100 100 100 100 100 100 100 100 100 
##$AQSEQ= 0
##$AQ_mod= 1
##$AUNM= <au_zg>
##$AUTOPOS= <>
##$BF1= 200.13
##$BF2= 200.13
##$BF3= 200.13
##$BF4= 200.13
##$BF5= 200.13
##$BF6= 200.13
##$BF7= 200.13
##$BF8= 200.13
##$BYTORDA= 1
##$CFDGTYP= 0
##$CFRGTYP= 5
##$CHEMSTR= <none>
##$CNST= (0..31)
1 1 145 1 1 1 1 1 1 1 1 1 1 1 1 1 1 1 1 1 1 1 1 1 1 1 1 1 1 1 1 1 
##$CPDPRG= <>
##$CPDPRG1= <>
##$CPDPRG2= <>
##$CPDPRG3= <>
##$CPDPRG4= <mlev>
##$CPDPRG5= <mlev>
##$CPDPRG6= <mlev>
##$CPDPRG7= <mlev>
##$CPDPRG8= <mlev>
##$CPDPRGB= <>
##$CPDPRGT= <>
##$D= (0..31)
0 1.2 0 0 0 0 0 0 0 0.06 0 0.03 0 0 0 0 0.0002 0 0 0 0 0 0 0 0 0 0 0 0 
0 0 0 
##$DATE= 1656506393
##$DBL= (0..7)
120 120 120 120 120 120 120 120 
##$DBP= (0..7)
150 150 150 150 150 150 150 150 
##$DBP07= 0
##$DBPNAM0= <>
##$DBPNAM1= <>
##$DBPNAM2= <>
##$DBPNAM3= <>
##$DBPNAM4= <>
##$DBPNAM5= <>
##$DBPNAM6= <>
##$DBPNAM7= <>
##$DBPOAL= (0..7)
0.5 0.5 0.5 0.5 0.5 0.5 0.5 0.5 
##$DBPOFFS= (0..7)
0 0 0 0 0 0 0 0 
##$DE= 6
##$DECBNUC= <off>
##$DECIM= 32
##$DECNUC= <off>
##$DECSTAT= 4
##$DIGMOD= 1
##$DIGTYP= 9
##$DL= (0..7)
0 120 120 120 120 120 120 120 
##$DP= (0..7)
150 150 150 150 150 150 150 150 
##$DP07= 0
##$DPNAME0= <>
##$DPNAME1= <>
##$DPNAME2= <>
##$DPNAME3= <>
##$DPNAME4= <>
##$DPNAME5= <>
##$DPNAME6= <>
##$DPNAME7= <>
##$DPOAL= (0..7)
0.5 0.5 0.5 0.5 0.5 0.5 0.5 0.5 
##$DPOFFS= (0..7)
0 0 0 0 0 0 0 0 
##$DQDMODE= 0
##$DR= 18
##$DS= 0
##$DSLIST= <SSSSSSSSSSSSSSS>
$$ [...]
##$SUBNAM2= <"">
##$SUBNAM3= <"">
##$SUBNAM4= <"">
##$SUBNAM5= <"">
##$SUBNAM6= <"">
##$SUBNAM7= <"">
##$SUBNAM8= <"">
##$SUBNAM9= <"">
##$SW= 18.0517283424941
##$SWIBOX= (0..15)
0 0 2 0 0 0 0 0 0 0 0 0 0 0 0 0 
##$SW_h= 3612.71676300578
##$TD= 16384
##$TD0= 1
##$TE= 0
##$TE2= 300
##$TE3= 300
##$TEG= 300
##$TL= (0..7)
0 120 120 120 120 120 120 120 
##$TP= (0..7)
150 150 150 150 150 150 150 150 
##$TP07= 0
##$TPNAME0= <>
##$TPNAME1= <>
##$TPNAME2= <>
##$TPNAME3= <>
##$TPNAME4= <>
##$TPNAME5= <>
##$TPNAME6= <>
##$TPNAME7= <>
##$TPOAL= (0..7)
0.5 0.5 0.5 0.5 0.5 0.5 0.5 0.5 
##$TPOFFS= (0..7)
0 0 0 0 0 0 0 0 
##$TUNHIN= 0
##$TUNHOUT= 0
##$TUNXOUT= 0
##$USERA1= <user>
##$USERA2= <user>
##$USERA3= <user>
##$USERA4= <user>
##$USERA5= <user>
##$V9= 5
##$VALIST= <valist>
##$VCLIST= <CCCCCCCCCCCCCCC>
##$VD= 0
##$VDLIST= <DDDDDDDDDDDDDDD>
##$VPLIST= <PPPPPPPPPPPPPPP>
##$VTLIST= <TTTTTTTTTTTTTTT>
##$WBST= 1024
##$WBSW= 4
##$XGAIN= (0..3)
0 0 0 0 
##$XL= 0
##$YL= 0
##$YMAX_a= 240658
##$YMIN_a= -506522
##$ZGOPTNS= <>
##$ZL1= 120
##$ZL2= 120
##$ZL3= 120
##$ZL4= 120
##$ABSF1= 10
##$ABSF2= 0
##$ABSG= 5
##$ABSL= 3
##$ALPHA= 0
##$AQORDER= 0
##$ASSFAC= 0
##$ASSFACI= 0
##$ASSFACX= 0
##$ASSWID= 0
##$AUNMP= <proc_1d>
##$AZFE= 0.1
##$AZFW= 0.1
##$BCFW= 1
##$BC_mod= 2
##$BYTORDP= 1
##$COROFFS= 0
##$CY= 11.3945322036743
##$DATMOD= 1
##$DC= 2
##$DFILT= <>
##$DTYPP= 0
##$F1P= 2.36226072786647
##$F2P= -0.459571619588291
##$FCOR= 0.5
##$FTSIZE= 0
##$FT_mod= 4
##$GAMMA= 1
##$GB= 0.15
##$INTBC= 1
##$INTSCL= 1
##$ISEN= 128
##$LB= 0.24
##$LEV0= 0
##$LPBIN= 0
##$MAXI= 10000
##$MC2= 0
##$MEAN= 0
##$ME_mod= 0
##$MI= 1.114404
##$NCOEF= 0
##$NC_proc= 0
##$NLEV= 6
##$NOISF1= 3.799351
##$NOISF2= 2.8
##$NSP= 1
##$NTH_PI= 0
##$NZP= 0
##$OFFSET= 15.70392
##$PC= 1
##$PHC0= -18046.06
##$PHC1= 6.40069
##$PH_mod= 1
##$PKNL= yes
##$PPARMOD= 0
##$PSCAL= 0
##$PSIGN= 0
##$REVERSE= no
##$SF= 200.130013532006
##$SI= 16384
##$SIGF1= 3
##$SIGF2= 2
##$SINO= 400
##$SIOLD= 16384
##$SREGLST= <1H.CDCl3>
##$SSB= 0
##$STSI= 0
##$STSR= 0
##$SW_p= 3612.71676300578
##$SYMM= 0
##$S_DEV= 0
##$TDeff= 0
##$TDoff= 0
##$TI= <>
##$TILT= no
##$TM1= 0
##$TM2= 0
##$TOPLEV= 0
##$USERP1= <user>
##$USERP2= <user>
##$USERP3= <user>
##$USERP4= <user>
##$USERP5= <user>
##$WDW= 1
##$XDIM= 8192
##$YMAX_p= 0
##$YMIN_p= 0
$$ End of Bruker specific parameters
$$ ---------------------------------
##NTUPLES= NMR FID
##VAR_NAME=  TIME,          FID/REAL,        FID/IMAG
##SYMBOL=    X,             R,               I
##VAR_TYPE=  INDEPENDENT,   DEPENDENT,       DEPENDENT
##VAR_FORM=  AFFN,          ASDF,            ASDF
##VAR_DIM=   8192,          8192,            8192
##UNITS=     SECONDS,       ARBITRARY UNITS, ARBITRARY UNITS
##FACTOR=    0.0002768,     1,               1
##FIRST=     0,             0,               0
##LAST=      2.2672688,     0,               0
##MIN=       0,             -506522,         0
##MAX=       2.2672688,     240658,          0
$$ Real data points
##PAGE= N=1
##DATA TABLE= (X++(R..R)), XYDATA
0 0 0 0 0 0 0 0 0 0 0 0 -8 8 -8 8 -16 16 -24 24 -32 40 -48 56 -64 78 -88 104 -122 142 -164 188 -214 246
32 246 -278 316 -357 402 -451 505 -566 631 -702 781 -867 960 -1062 1174 -1295 1428 -1576
49 -1576 1735 -1911 2105 -2319 2559 -2828 3129 -3472 3866 -4321 4859 -5502 6287 -7274 8555
64 8555 -10292 12800 -16756 23960 -41417 180189 67599 -227409 36739 196558 194932 129349
76 129349 181620 85524 -55065 16766 200230 115310 -110673 -159173 68302 165273 -433
87 -433 -113684 -58544 -26066 -12940 15227 41449 -42445 -157220 -109646 17949 26497 -55770
99 -55770 -132232 -96446 -15895 -4550 1572 18327 -5929 -26085 -30473 -4839 15119 -10492 -7186
112 -7186 23444 35097 45823 24733 14232 32063 -3703 -34943 -4325 32671 35483 -13502
124 -13502 -39171 -9791 -4259 -455 13047 -5744 -29980 -45868 -5524 69226 39390 -38755
136 -38755 -29766 34762 75350 48323 19170 19939 -20729 -37499 19250 43833 -3457 -64925 -40722
149 -40722 55924 55036 -22514 -41566 -19722 -11468 -24523 -8215 31548 -8562 -57024 -7472 45949
162 45949 25857 -35871 -48433 13633 27236 -13270 -10927 12270 16677 -1625 -2773 40662 39160
175 39160 -1159 2046 18371 19730 565 -20702 9061 32300 8986 -7566 -2872 22676 20137
188 20137 -31312 -42448 -18875 -14254 -15662 -20998 -6688 -3267 -37347 -24384 22438 13341 -33559
201 -33559 -52959 -2107 43719 7779 -17835 3618 10688 7179 11606 33751 27922 -31076 -33336
214 -33336 29843 43616 3048 -28047 -1848 36526 19013 9480 22359 -3021 -28942 -16387
226 -16387 21351 30417 -20409 -34898 10947 26274 7929 -12274 -15189 -9065 -24556 -12794 20082
239 20082 3362 -24832 -21456 7312 30193 3465 -20453 -4849 -925 -2601 636 3774 7685
252 7685 -13110 -15138 22610 29580 7365 -13970 -15132 10538 7309 -9628 1180 3386 -3299
265 -3299 -2296 10990 31240 4858 -33015 -14938 11906 11203 -8719 -19154 3973 6528 -9485
278 -9485 8646 17698 -5355 -28820 -19240 23146 18501 -25949 -21317 7676 15751 6115 -1236 12227
292 12227 2377 -22206 535 24714 7372 -20659 -20599 19422 31493 8 -4671 1970 -2642
305 -2642 -3605 -2775 5928 -3187 -24286 -5030 17921 12255 -2088 -16960 -7421 6543 -2344 -3067
319 -3067 -6587 -11897 742 4890 8163 10031 -3156 -2432 2903 5661 10864 -6979 -15089 4211
333 4211 10515 7298 -455 -656 12152 416 -9141 4045 621 -11874 -14681 -810 17149 -1863
347 -1863 -17689 6193 12504 -4828 -16240 -5815 10458 -8665 -20382 8478 16119 -3174 -9493
360 -9493 5833 22197 -1061 -18203 9645 16936 -4857 -10999 6721 24895 5125 -12435 11798
373 11798 16940 -4123 -10845 -1686 9015 -7421 -19892 7148 15725 -5021 -14467 -4844 11343
386 11343 -1033 -22556 -8763 570 -7792 -7539 -1421 8031 -2160 -18474 382 14318 -1177
399 -1177 -17688 -16689 8024 13605 -8073 -4281 8812 5399 676 1833 14749 8297 -19454 -7816
413 -7816 22214 20179 -3278 -13519 13573 28793 1694 -4354 10222 4102 -8635 -5871 18725
426 18725 19374 -18604 -17200 19772 23177 -6008 -25280 -3400 11895 -14008 -15517 7209 -1025
439 -1025 -20881 -16667 13433 16871 -24691 -30413 3987 9822 -10444 -20454 -1401 10465 -10981
452 -10981 -6099 21075 9963 -14846 -12413 14292 22532 -7493 -13178 13916 17807 6518 1937
465 1937 11377 16065 -5274 -6945 15467 10719 -6885 -9507 4606 16596 -121 -10033 2618
478 2618 3261 -4110 -10829 -8330 4512 -5832 -16207 -1370 5064 16 -7563 -6415 5999 -1738
492 -1738 -13380 -2696 4299 2313 -6849 -7093 14025 12566 -6551 -2534 6280 4464 -3651 -3960 11228
507 11228 5374 -9786 2640 16277 12443 -3657 -11728 8617 12890 -6876 -5990 3282 2398 -3707
521 -3707 -2843 12856 6437 -15711 -8296 7269 7772 -5748 -18495 -3009 10231 -2001 -4252 759
535 759 -291 -5327 -9008 3811 4295 -14809 -13337 201 8963 6001 -11438 -7441 8787 4598
549 4598 -1825 -2507 -66 781 -4696 6317 16721 1555 -6137 2267 14622 16796 -5017 -10147
563 -10147 8183 8901 1116 1358 6009 4740 -8507 116 17623 1399 -16966 -10920 5044 10774
577 10774 -8277 -13949 4330 3036 -7302 -3470 4212 -758 -19803 -12315 12923 2784 -15668
590 -15668 -9391 4871 9551 -3945 -7375 7352 2329 -8152 -1264 9205 8267 -7762 -5283 16770
604 16770 9965 -5707 -396 6359 5889 -4296 -5707 8673 5891 -4388 -1045 5233 7847 -2837
618 -2837 -7501 6674 2070 -10933 -4624 3582 5530 -3692 -10346 2419 6706 -1314 -5009 -5527 538
633 538 -2027 -7907 4687 5895 -7199 -6341 2522 11707 4784 -10840 -5002 5593 4949 1877 -2640
648 -2640 2496 3399 -4330 6426 11942 -2825 -10471 -4971 7921 8041 -7670 -7221 1317 2717 3641
663 3641 222 -155 -2021 -11274 -638 9904 -1549 -9647 -6509 3933 8540 -1458 -2334 -534 -4181
678 -4181 1289 3220 1931 -97 -7060 769 11087 3801 -707 -2263 -668 4473 1316 495 -852
693 -852 -5959 1773 4326 -202 1305 -2701 -3410 900 -1001 -49 -3589 -7431 1149 2929 -62 -1658
709 -1658 -3025 4181 2241 -4915 1771 2299 -3148 -1079 3018 6822 606 -5177 6391 8046 -1769
724 -1769 -3635 -937 4863 -26 -7357 3561 5289 -5475 -3772 3221 5256 -5018 -11507 2830
738 2830 6165 -6143 -5921 823 5713 -320 -7121 4316 6869 -5994 -5582 2691 6693 -342 -7977
753 -7977 4960 9903 -2011 -2778 3100 6706 1227 -8208 735 7453 -2048 -4098 342 4735 1119
768 1119 -7011 879 6712 -4830 -8159 -2551 4064 3251 -7844 -4157 4458 69 -1740 -439 1272
783 1272 -176 -7829 -406 10000 1442 -5513 -2911 4964 8467 -2117 -3824 2701 -1800 -2711 1228
798 1228 4002 2627 -7987 -3471 10466 4914 -3891 -4858 50 5222 -1539 -1661 5203 -1127 -4805
813 -4805 805 5938 5615 -6677 -7884 4683 3062 -2874 -2498 -255 2662 -2752 -2077 6900 1194
828 1194 -5583 -3170 552 4255 -2401 -5189 3028 1165 -2107 130 1032 3699 -2217 -5942 2333
843 2333 2609 -469 -588 -1827 2920 1888 -2078 3722 2484 -2238 -2337 -1527 5372 3518 -5426 -1213
859 -1213 2630 2465 1396 -3035 416 318 -5462 566 4395 -79 -3996 -5307 5269 7789 -4078
874 -4078 -4229 600 1733 866 -3090 974 1927 -5918 -1647 5467 2480 -3572 -8112 475 6807 -3054
890 -3054 -5359 -337 1577 1994 -1677 1914 4580 -3875 -2076 5084 4333 41 -5709 960 9867 2277
906 2277 -2433 1164 2994 3720 -1190 331 4731 -3446 -4485 3544 4719 324 -8173 -4162 7025
921 7025 74 -7148 -4309 -1664 -312 -5106 -3050 4542 -3632 -8656 458 5703 1521 -8889 -5887
936 -5887 8445 4043 -4027 364 4267 4242 -1181 1212 10562 1846 -7198 1642 8913 5326 -5551
951 -5551 -4396 8391 3495 -5630 -291 2360 -499 -5879 -3294 6147 -699 -9892 -1418 5323 1674
966 1674 -6521 -5241 5833 775 -7086 3 3258 424 -2551 -971 6807 1596 -5954 1932 5667
981 5667 1819 -3556 -3550 5864 3593 -4478 355 2355 69 -395 -1138 2457 -1087 -6183 103 3395
997 3395 1079 -2487 -5409 2014 4479 -2209 -800 -853 -1930 1191 967 2668 485 -4146 913 3569
1013 3569 3106 974 -5691 -1583 4005 353 209 -1335 -2950 235 364 2081 1130 -4966 -2629 578
1029 578 2073 2619 -4439 -3718 3298 1397 1384 665 -2191 249 -98 1971 3499 -1948 -1550 502 1887
1046 1887 4982 -919 -3814 1623 947 744 120 -2772 -384 -709 -183 2015 -1700 -1459 -1066 -2337 2875
1063 2875 -41 -4762 -416 1024 1365 302 -2292 1450 1482 -780 1540 -22 271 502 -1923 3629
1079 3629 2839 -3754 -478 2786 2203 -605 -3917 1179 1639 -2646 135 237 -355 -724 -2906 3361
1095 3361 3274 -5638 -3019 2738 2618 -1527 -4340 2275 3753 -2654 34 2200 783 -936 -3089 3268
1111 3268 4191 -4867 -3019 3498 3358 -838 -4586 1374 3724 -3539 -1048 1817 -694 -1449 -2148 2861
1127 2861 3921 -4520 -2960 3228 3034 -292 -3810 620 3723 -2014 430 3137 -959 -1196 -1215 2880
1143 2880 3833 -4204 -4238 2116 2381 389 -3233 -1168 2322 -2455 -633 2695 -1728 -2636 -2136 1373
1159 1373 4470 -2061 -3822 1122 1800 1898 -1169 -1036 2349 -1515 35 3967 191 -1149 -624 801
1175 801 4466 -278 -2636 252 -373 858 -121 -1772 1101 -1817 -1365 2505 -847 -1701 -850 -1001 1717
1192 1717 -655 -1788 639 -875 1178 1363 -1450 1048 228 -311 1999 -1270 -615 1427 -404 1398
1208 1398 496 -561 379 -1529 1277 1894 -3076 -1245 861 162 771 -2419 -803 1955 -1435 -460
1224 -460 988 -695 -880 -2090 2020 4180 -2786 -2297 2300 2526 1397 -2100 -486 2672 -1508 -554
1240 -554 2446 229 -1299 -2575 1873 4914 -2999 -3970 1689 1492 363 -2716 -1130 2073 -2358 -1121
1256 -1121 2986 149 -2294 -3110 1357 5147 -2318 -4125 1703 2130 762 -1326 -299 2441 -2197
1271 -2197 -1643 3674 1081 -2349 -3275 353 5317 -1127 -4450 871 1482 231 -1457 -479 2401 -2252
1287 -2252 -2750 3547 2827 -1047 -2737 145 5743 707 -3849 924 2352 637 -622 -354 3085 -1195
1303 -1195 -3452 2687 2385 -1565 -3573 -1745 3813 158 -5089 -84 1234 -861 -2076 -1193 2636
1318 2636 -1297 -4741 1763 2977 -1343 -2462 -748 4563 1368 -3774 1467 3024 272 -507 98
1333 98 3677 571 -2924 2644 3683 -1190 -2355 -822 3152 535 -4453 -143 1069 -1292 -943 -981
1349 -981 593 -1183 -3993 1289 1922 -2363 -2129 -867 1934 1440 -2714 320 1270 -592 1782 750
1365 750 405 14 -1473 2624 3008 -1157 -450 -172 1385 2213 -1101 -69 -164 -1525 1417 825 -750
1382 -750 -650 -2015 729 1840 -1247 -413 -1559 -985 2002 -96 -385 -714 -1519 2437 1425 -1149 371
1399 371 -901 168 1332 -295 1035 -813 -2068 1733 1042 -580 -1429 -2108 1420 885 -2271 -272
1415 -272 -253 -783 496 -417 1498 -444 -2499 1539 2007 -76 -790 -1324 2444 1973 -1751 1037 1354
1432 1354 -270 362 30 1772 -89 -2957 1202 2378 -839 -1500 -1609 1772 1395 -3017 -559 625
1448 625 -1367 -802 -417 1553 -70 -3605 1186 3160 -173 -1568 -1382 2351 2515 -1987 390 1967
1464 1967 -550 -208 540 1855 439 -3632 504 3127 -716 -1635 -1763 1288 1931 -2282 -614 1368
1480 1368 -1646 -854 333 1172 -6 -3632 251 3349 -318 -1229 -749 1129 2143 -1163 -162 1901
1496 1901 -1233 -626 1215 1405 299 -3436 -173 3527 -385 -1371 -1243 -184 1727 -895 -546 875
1512 875 -1730 -951 1030 1255 770 -3067 -917 2894 309 -312 -170 -738 1554 779 596 1390 -1355
1529 -1355 -742 1262 1360 1042 -2145 -1760 1963 -376 -831 25 -1649 -381 -650 -382 903 -1799 -1461
1546 -1461 597 131 966 -1345 -1407 1888 -4 -222 1302 -306 201 1259 1039 1727 -563 243 1918
1563 1918 168 686 103 -902 1267 -416 -753 752 -1694 -1034 693 81 -695 -2586 -1030 1762
1579 1762 -916 -1019 -83 -1085 288 -227 40 1439 -1452 -1206 1809 2021 969 -1516 218 3693
1595 3693 258 -231 1715 -280 -275 118 1013 1787 -2536 -2403 1394 995 -808 -2399 -1157 1734 -1607
1612 -1607 -1287 2024 -684 -2067 -623 1175 1927 -2109 -2154 2169 1524 -85 -1021 137 2706 -576
1628 -576 -770 2995 536 -1974 -239 1848 2129 -2029 -2267 2174 840 -882 -1166 -837 874 -1270
1644 -1270 -1860 2060 -121 -2710 -721 1347 1468 -1664 -2252 2177 948 -516 211 -109 1278 -34
1660 -34 -563 2879 678 -2008 -179 1715 2142 -1223 -2242 1374 556 -1195 271 -610 94 -516 -1380
1677 -1380 1463 624 -1959 -813 201 1468 -856 -2482 1039 775 -928 285 -173 178 263 -1019
1693 -1019 1434 1086 -1613 -177 497 1321 24 -2284 1006 1013 -1149 347 -172 -428 347 -635 1175
1710 1175 418 -1721 -12 588 1053 132 -1585 348 1075 -648 686 283 -836 598 67 1245 846
1727 846 -1613 -140 364 566 894 -1460 -575 505 -842 792 -67 -1957 -131 -22 372 193 -1582
1744 -1582 -86 149 -218 1435 -541 -1071 245 -185 1556 498 -1447 269 786 484 675 -913 543
1761 543 192 -797 1650 254 -1109 -67 -296 1697 664 -1975 -50 625 -2 536 -315 452 115
1778 115 -1101 1598 1048 -1373 -559 62 1384 499 -1880 277 1009 -494 95 -166 381 -365 -1723
1795 -1723 1155 1340 -1775 -1221 96 1235 439 -2318 185 1239 -836 -201 349 661 -24 -1498 1448
1812 1448 2089 -1472 -764 782 1740 740 -2013 462 2043 -582 106 718 264 -236 -1549 1307 1689
1829 1689 -1991 -1224 335 809 25 -1972 -32 978 -1689 -246 816 -223 -873 -1400 1481 2090
1845 2090 -1857 -1133 1010 915 953 -1333 260 1383 -852 278 1394 -60 -551 -1180 806 1907 -1589
1862 -1589 -1620 715 -364 211 -1025 -374 476 -1609 13 1234 -688 -749 -671 760 1682 -1043 -562 752
1880 752 -119 498 222 54 430 -1104 226 1866 -492 -641 -541 158 1306 -683 -659 653 -747 -55
1898 -55 235 -569 -89 -1162 15 1204 -583 -688 -40 -198 1094 -246 -311 686 -821 587 1107 -330
1916 -330 98 -415 206 1820 -796 -709 316 -263 283 -393 -459 203 -1390 -221 945 -655 -405 -840
1934 -840 -179 1545 -771 -957 445 -271 193 160 102 757 -745 261 1821 67 -197 -81 381 1543
1952 1543 -377 -809 838 -343 -260 514 -227 273 -1873 -817 1973 -363 -1296 -525 -91 1032 -840
1969 -840 -1097 846 -430 -249 671 97 535 -1169 -606 2509 338 -1031 -78 488 1249 -171 -495 1231
1987 1231 -603 -876 707 151 174 -1357 -1127 1854 217 -1877 22 188 418 -466 -606 1305 -685
2004 -685 -1120 1282 582 239 -905 -684 2057 342 -1327 348 212 485 48 -213 1275 -707 -1321
2021 -1321 1270 436 -457 -1069 -1046 1788 504 -1249 76 -115 -206 42 -255 862 -637 -1226 1486 593
2039 593 -307 -235 -730 1419 1024 -695 817 6 -99 646 113 596 -545 -1219 1324 641 -871 69
2057 69 -1133 389 39 -888 464 -211 -965 388 -48 307 -384 -1022 1234 497 -634 493 -306 317
2075 317 524 -418 510 -292 -746 1191 404 87 -207 -902 1132 656 -928 292 -363 -684 633 -83
2093 -83 250 -834 -1541 943 514 -473 32 -604 918 689 -596 806 -35 -775 681 711 738 -532 -1471
2112 -1471 1143 885 -408 178 -789 336 397 -662 779 -86 -1506 63 367 465 -875 -1484 1054
2129 1054 432 -1066 310 -113 -82 97 -588 1241 329 -1100 229 910 508 -426 -1050 1374 859 -1111
2147 -1111 307 267 -223 261 -559 823 116 -1517 232 794 438 -665 -1599 804 890 -1126 164 623
2165 623 -467 119 -220 1018 562 -1617 271 1159 270 -231 -1194 539 1071 -1239 245 757 -592
2182 -592 -422 -399 701 381 -2163 -107 919 -11 -561 -1126 473 1122 -1212 -22 1120 -548 -561 63
2200 63 1007 801 -1523 151 1711 321 96 -507 426 1147 -962 -67 970 -876 -312 -24 414 245
2218 245 -1824 -269 1191 -591 -635 -417 -172 395 -853 144 739 -1053 -602 406 694 503 -1384 100
2236 100 1566 -355 80 218 -14 201 -611 280 1068 -998 -556 483 431 198 -1198 -536 983 -829
2254 -829 -205 710 -774 -313 -376 240 883 -1385 -518 866 -15 195 -488 -91 918 -667 195 1334
2272 1334 -559 -307 14 606 686 -1245 -399 1177 -301 -108 -167 -377 362 -862 172 938 -904 -647
2290 -647 193 382 603 -1004 -397 1090 -496 23 435 -334 472 -300 415 1288 -812 -549 861 438
2308 438 268 -763 -251 1185 -869 -191 717 -550 -385 -578 -8 1237 -1334 -995 661 182 136 -962
2326 -962 -300 1110 -442 -209 1138 -190 -251 -211 411 1400 -729 -673 905 282 244 -403 -372 863 -531
2345 -531 -370 988 -269 -711 -83 218 563 -883 -1278 898 -169 -478 -302 -435 722 -398 -568 1332
2363 1332 -120 -571 120 144 1490 -474 -789 1044 384 -323 362 50 528 -299 -569 1137 -217 -867
2381 -867 -172 -137 604 -569 -1063 586 -134 -296 451 -344 155 -296 -521 1229 -74 -1081 421 209
2399 209 600 210 -653 932 -76 -598 841 152 -186 -395 -418 1052 -169 -1097 173 118 211 -325 -624
2418 -624 307 -310 -729 947 -129 -652 -118 -118 1220 95 -634 582 523 329 587 -283 592 5 -660
2437 -660 1263 -41 -687 -220 56 917 -417 -1293 456 -29 -677 173 -213 -18 -636 -998 1043 197
2455 197 -1015 -37 86 733 19 -732 586 467 -466 783 424 238 -261 -524 1656 632 -1356 155
2473 155 330 244 -145 -733 569 -60 -943 529 345 -432 -616 -786 1273 299 -1291 30 398 -50 35
2492 35 -266 991 117 -1197 1179 1163 -358 -317 -355 1007 638 -1347 68 593 -173 -106 -547 581 57
2511 57 -1350 812 884 -1016 -676 -147 876 295 -1165 246 706 -408 87 67 459 73 -1305 958
2529 958 1246 -671 -197 172 861 438 -875 385 731 -563 183 77 151 -281 -1284 616 1079 -1352
2547 -1352 -627 -120 212 202 -951 151 567 -858 318 553 211 171 -802 679 1375 -596 -128 325
2565 325 113 329 -380 373 455 -818 342 567 -63 -421 -825 296 687 -897 -407 432 -86 191 -606
2584 -606 331 450 -939 181 969 -88 -70 -312 51 985 -519 -210 505 -49 503 52 307 456 -1087
2603 -1087 321 1034 -350 -459 -337 -121 508 -671 -536 111 -598 -105 100 39 30 -1010 -62 1365 -291
2622 -291 -343 147 141 532 -198 312 820 -267 207 499 -81 149 -899 -344 1126 -499 -460 311 -338 240
2642 240 -359 -52 488 -882 -406 547 -182 0 -565 -180 926 -692 -443 544 60 221 -160 410 687
2661 687 -1005 -240 1265 101 -388 -458 -21 1150 -517 -643 380 -149 -567 -143 40 408 -1051 -679
2679 -679 1106 -124 -605 -290 76 800 -348 -374 908 -220 -122 278 461 646 -772 -154 1369 -131
2697 -131 -481 281 106 410 -533 -369 581 -506 -611 143 311 306 -971 -702 1093 -192 -580 302 319 53
2717 53 -258 -85 987 -209 -578 785 460 193 -306 -516 1371 -156 -954 566 -163 -153 -168 -125 555
2736 555 -933 -849 699 29 -141 -665 -473 684 -185 -871 649 146 -511 238 645 931 -395 -756 783
2755 783 309 -210 -35 -232 790 -53 -437 673 -267 -616 79 187 509 -548 -820 800 186 -377 -63
2774 -63 -143 431 39 -468 819 -121 -537 321 278 398 -115 -571 682 155 -308 595 -20 371 201 -240
2794 -240 672 -175 -983 364 345 242 -683 -966 438 262 -779 188 -221 -188 77 -241 656 -30 -820 618
2814 618 601 84 -2 -307 806 311 -409 696 138 -294 156 -24 692 -68 -1264 449 332 -519 -117
2833 -117 -830 91 83 -798 534 164 -674 -78 81 613 -100 -1167 513 567 -331 -104 -215 450 298 -422
2853 -422 479 431 -553 -53 312 595 76 -1042 405 407 -548 106 -83 -99 -114 -668 564 309 -909 -223
2873 -223 104 417 -169 -856 467 739 -539 -32 162 267 72 -201 991 503 -931 -262 613 271 27
2892 27 -793 187 612 -761 -78 190 -228 -262 -588 453 156 -1225 54 506 10 36 -479 141 418 -696
2912 -696 152 448 -197 -65 43 581 639 -798 271 678 -68 73 -249 -44 186 -659 104 437 -667
2931 -667 -334 -221 254 338 -974 -45 608 -520 -8 24 54 164 -700 389 798 -446 -36 309 369 529
2951 529 -757 241 708 -272 102 332 -137 147 -575 354 595 -903 -317 246 -169 89 -506 -164 499
2970 499 -488 144 455 -252 -130 -382 369 740 -411 -377 486 86 250 -305 -180 516 -405 256 777 -299
2990 -299 -177 -54 232 596 -622 -187 349 -394 53 -221 -65 211 -821 -98 688 -408 -467 1 388
3009 388 595 -311 -249 687 55 -106 361 -38 235 -413 -37 656 -193 -496 142 72 241 -499 -354 574 -538
3030 -538 -90 123 -199 -14 -461 -66 925 -300 -581 278 194 474 -401 -34 696 -224 -87 791 70 -86
3050 -86 -104 216 900 -407 -834 409 27 33 -391 -245 540 -675 -538 636 -181 -204 -169 -55 518 -299 -893
3071 -893 381 -294 60 -108 -168 481 -232 17 828 147 -394 -114 78 806 -250 -314 697 132 -437 -34
3091 -34 -291 274 -373 -650 732 23 -777 -104 91 390 -372 -540 655 8 -286 334 145 278 -121 -265
3111 -265 1154 114 -548 86 332 347 -186 -271 650 -114 -480 319 27 -235 -544 -285 763 -124 -861 -55
3131 -55 120 -27 -325 -429 352 -147 -494 704 262 -143 -6 -32 789 106 -432 504 223 134 133 167 295 -167
3153 -167 -734 586 -2 -367 -242 -184 584 -207 -824 459 21 -246 91 -299 266 0 -491 881 344
3172 344 -630 -156 -14 519 38 -663 495 -131 -386 486 -153 86 -172 -663 692 328 -749 -170 10
3191 10 326 -182 -425 220 71 -872 171 22 167 -130 -727 560 482 -295 374 359 216 119 -280 796
3211 796 289 -627 739 262 -340 70 -354 288 435 -805 82 12 -256 141 -425 146 14 -791 425
3230 425 266 -434 -86 -529 225 164 -607 35 416 -174 447 -67 483 338 -631 225 477 -338 -32 -249
3250 -249 -79 166 -726 19 93 -493 -43 68 141 -78 -888 214 747 -655 192 37 228 116 -257 183
3270 183 456 -599 240 117 245 140 -720 114 484 -617 -97 38 -30 -99 -364 180 84 -733 -26 196
3290 196 -53 81 -673 257 495 -467 -91 58 154 280 -159 243 574 -867 150 850 147 111 -213 51
3310 51 350 -405 35 479 -393 -120 -222 373 167 -792 -185 496 -295 -153 -465 -90 361 -471 6 433
3330 433 -598 58 -28 124 146 -614 -153 815 -283 -92 52 61 354 -312 97 448 -586 -146 259 -96
3350 -96 336 -580 10 605 -206 -531 88 103 402 -392 138 476 -430 18 482 137 6 -427 -128 715 -389
3371 -389 -154 423 -143 291 -107 61 403 -652 -318 393 -18 -26 -436 -85 333 -384 -370 309 -304 32 22
3392 22 59 278 -396 -215 771 -156 27 -78 -198 703 -199 -200 742 96 -271 110 144 347 -395 -304 491 -150
3414 -150 -358 3 -83 234 -286 -250 695 -401 -259 105 157 389 -311 -315 609 -68 -53 238 67 212 -12 117
3436 117 562 -94 -363 383 216 108 -352 -140 736 -235 -357 258 -237 -77 -172 -115 670 -485 -760 330
3456 330 -45 71 -267 -377 579 40 -154 599 -13 -203 112 103 723 -150 -520 592 304 56 -183 -5
3476 -5 336 -264 -261 324 71 -378 -110 -35 455 -172 -746 252 33 -306 177 -244 76 -100 -290 554 47 -440
3498 -440 283 -86 293 -236 -549 807 67 -51 53 -110 3 -177 -311 569 63 -489 163 65 132 -353
3518 -353 -549 576 -30 -368 217 6 -93 -14 71 556 189 -634 305 266 132 20 -248 640 -54 -276 356
3539 356 -31 -233 -216 -273 567 -160 -554 212 64 -122 -108 -401 375 83 -420 231 36 -299 56 -46 331
3560 331 231 -702 476 307 -136 158 -237 150 124 -416 292 299 -468 -159 85 410 -90 -809 310 94
3580 94 -364 100 -64 -11 22 -490 395 279 -569 45 77 377 107 -384 247 286 -166 210 254 139 -16 -141
3602 -141 434 171 -332 -65 344 86 -80 -450 397 205 -596 232 178 -346 -50 -292 348 287 -600 165 266
3623 266 76 165 -97 283 358 -559 173 467 -135 -59 -90 219 288 -471 -210 210 64 -113 -169 68 170 -623
3645 -623 23 399 -328 -262 134 150 29 -483 -44 298 -111 307 141 183 123 -479 286 530 -227 -186 367 328
3667 328 181 -517 84 230 -307 -69 -11 13 155 -536 108 343 -484 -94 108 -84 124 -407 43 453 -571
3688 -571 -9 374 -86 -105 -232 137 614 -388 -49 362 34 120 -112 0 322 -407 -236 324 -291 -223 -463
3709 -463 173 529 -673 -404 316 93 -23 -194 -80 257 -232 -47 417 -26 -143 240 92 403 -363 -12
3729 -12 517 -166 -86 159 -18 129 -506 74 824 -150 -282 -24 -68 207 -459 -35 280 -267 -50 57 17
3750 17 122 -316 -111 778 116 -116 152 226 315 -213 -134 431 -138 -60 327 -56 -165 -363 -12 539 -265 -332
3772 -332 -110 71 43 -261 -394 322 -409 -204 350 245 -87 -308 181 491 -17 -302 379 33 158 -98
3792 -98 -10 506 -84 -260 729 4 -241 -109 -67 370 -182 -440 310 -14 -171 95 -107 250 -107 -482 517
3813 517 -58 -204 11 -64 314 -110 -64 569 116 -62 251 -80 194 -90 -201 477 117 -384 53 194 265
3834 265 -191 -310 235 -98 -667 -84 -66 96 -230 -274 438 117 -273 100 -18 80 -51 -44 509 99 -328 443
3856 443 320 -149 39 -97 325 114 -371 97 37 5 -65 -71 104 -226 -359 20 212 -163 -134 -135 403 -92 -424
3879 -424 178 168 -65 -178 104 205 -73 -481 433 307 -16 146 -173 404 63 -265 219 113 -241 -4
3899 -4 -44 252 -160 -440 282 197 -289 184 -81 188 209 -253 181 133 -343 125 252 4 55 -467 479 174
3921 174 -230 -172 157 37 -47 -277 339 10 -505 86 233 -307 -157 -524 61 38 -337 70 28 -44 -26 -135
3943 -135 294 -25 -546 160 370 -158 -167 -138 276 258 -74 231 241 -275 118 -145 166 -65 -386 158 142 -39
3965 -39 -67 -108 106 2 -403 66 298 -272 98 -89 -65 55 -501 256 605 -98 -86 194 202 282 -208 150 203
3988 203 -237 -11 291 82 151 -556 297 338 -50 -103 -152 -89 68 -219 78 209 -391 169 156 179 18 -314
4010 -314 100 273 -271 -113 383 106 151 82 149 227 -413 13 286 57 55 -190 88 163 -291 -118 258 -200
4032 -200 -23 -300 42 318 -400 108 233 -7 -13 -21 -18 107 -140 69 579 -127 -164 121 175 258 -333 -37 229
4055 229 -109 45 -84 -120 194 -104 -127 254 -223 -282 1 38 141 -372 -161 488 -142 -84 196 43 34 -221
4077 -221 98 475 -164 -186 248 -140 328 -124 90 508 -157 -237 412 115 -45 -185 57 116 -382 -345 56
4098 56 -96 63 -122 -112 48 -18 -169 247 -80 190 -25 -38 309 -126 -145 261 8 -18 7 186 296 -140
4120 -140 -31 239 31 -20 -169 -86 95 -291 -335 413 -22 -113 -309 -94 469 -302 -272 353 -6 -281 -72 84
4142 84 266 -199 -102 452 -250 7 175 37 90 -220 -163 498 -93 -210 106 102 304 28 -395 217 12 -426
4164 -426 148 -259 -79 -154 -31 429 152 -286 200 79 268 -205 -157 455 134 -86 30 78 -51 18 -55 260
4186 260 -172 -251 222 -167 -54 -144 -253 296 -60 -348 316 125 -270 -122 41 325 -145 -277 309 179 -47
4207 -47 -26 -171 130 64 -207 377 182 -38 56 213 315 -4 -257 212 -28 -380 37 -79 28 -39 -535 244
4229 244 245 -335 60 26 207 29 -352 277 131 -148 115 206 143 -152 -207 100 316 -42 21 160 51 -31 -288
4252 -288 239 -11 -307 131 85 -36 -68 -223 266 256 -402 -31 16 26 15 -10 188 171 -346 -56 264 -185 -133
4275 -133 84 265 82 -359 125 242 -142 -109 -96 45 51 -309 192 355 -335 152 52 -16 -74 -322 176 78
4297 78 -223 47 62 40 -30 -268 367 312 102 -114 -35 265 21 -189 34 267 -241 137 -76 135 -54 -404
4319 -404 81 264 -445 -48 -32 89 180 -230 115 -85 -484 -171 -131 17 -87 -407 294 275 -244 155 40
4340 40 144 312 -28 275 266 -395 111 399 -17 -92 -243 264 246 -463 135 264 -122 25 -9 200 267 -379
4362 -379 28 309 -4 51 -229 165 270 -249 -89 222 29 143 106 63 247 -382 98 264 -363 -43 -232
4383 -232 11 17 -127 -102 262 -224 -99 23 -67 159 -134 174 236 -76 -68 -69 -18 141 -198 4 439 -10 101
4406 101 134 -66 34 -297 237 197 -189 -156 250 -332 -245 -169 62 266 -422 -45 131 -104 -129 -176 -33 260
4428 260 -67 -47 326 109 64 -130 161 242 -101 -66 389 18 -50 -197 -127 445 -182 -143 308 -117 39 9 16
4451 16 258 -202 -305 258 -102 -177 59 -109 264 -112 -78 226 -52 -118 79 23 177 -448 -152 348 -67 -136
4473 -136 117 36 -16 -34 -6 167 -143 -77 19 -78 145 -240 -190 87 101 -111 35 40 110 -247 164 451 -184 -139
4497 -139 301 143 108 -217 -13 233 -14 -52 189 180 -54 67 54 267 27 -280 107 -84 -50 -316 -231 170
4519 170 170 -22 372 188 -117 322 -108 43 -319 -109 348 63 -112 64 -228 201 128 -220 109 -67 -327
4540 -327 -28 -208 100 -183 -175 207 76 -55 -176 -22 161 -66 -241 302 -120 3 62 -90 -90 -40 -277 533
4562 533 186 -154 153 -101 6 123 -337 356 54 -237 131 -65 89 -208 -195 127 159 -284 202 190 -370
4583 -370 -53 -194 110 -94 -271 160 20 193 -54 -224 362 118 -43 203 -20 -138 16 5 130 -59
4603 -59 -62 157 16 -188 83 114 40 131 -294 68 88 -116 110 -99 86 178 -388 43 180 -130 41 -17 -77
4626 -77 101 -216 208 262 -173 -80 76 6 86 -298 230 31 -176 -121 71 -68 -29 -264 108 -108 -264 -80
4648 -80 108 -125 -31 -74 293 192 -160 192 238 -168 -107 101 273 261 -18 226 -43 88 89 -87 209 293 -235
4671 -235 -57 178 -130 51 112 251 -203 -144 62 30 40 -73 -68 249 87 -337 173 144 -199 38 -103 24
4693 24 67 -203 133 343 -238 -9 255 112 216 -335 79 343 -223 51 66 119 41 -144 -24 261 -298 40
4715 40 -3 29 89 130 33 460 57 -117 -21 100 7 -175 248 155 -260 34 138 36 10 94 145 106 -381 -223
4739 -223 -140 -35 297 2 -133 153 -73 159 250 -115 28 -159 -78 152 -241 6 625 -59 158 -39 190
4760 190 122 -98 -156 210 -196 75 -141 49 264 -237 1 250 -70 -67 -96 115 153 -313 147 100 -155 10
4782 10 -88 -115 301 4 -20 134 68 -138 222 -72 227 10 71 256 135 -97 15 183 140 -257 -40 281
4804 281 -203 -105 -32 74 30 -36 4 382 -82 -68 51 55 61 5 -71 204 56 -125 242 -111 -47 69 106 196 0
4829 0 -155 78 -24 -80 -75 -87 71 -87 -6 114 -70 -279 -126 31 120 -11 -56 228 248 13 -60 5 452 -78
4853 -78 -109 67 216 -219 -230 -2 121 16 -172 26 24 -145 183 221 -82 -185 -144 337 39 -35 6 -107 -44
4876 -44 27 34 85 -99 -14 153 17 101 33 41 439 23 -4 188 131 95 60 -33 122 132 -357 126 229 -61 -92 -98
4902 -98 425 -148 -129 22 -42 82 -31 -27 311 54 -21 87 206 -148 121 -55 195 -44 -227 -99 77 1
4924 1 62 -122 246 294 -184 140 -60 -141 -96 151 125 63 -352 154 -100 -133 -54 52 -65 7 -47 339 163 -138
4948 -138 -100 -70 169 18 5 -28 67 -234 324 -72 146 -59 -44 151 -12 -117 -114 304 176 -2 -235 -17 -150
4971 -150 -238 -18 294 100 -1 -327 412 198 -222 -104 220 42 -31 -223 -28 261 -166 264 -5 -5 25 -187
4993 -187 132 -74 -307 -65 88 -101 275 -214 257 -30 -276 -241 248 -42 191 28 -12 325 -85 184 227
5014 227 -78 -2 39 80 1 -207 194 87 47 35 -93 56 109 -115 -122 63 -122 -225 78 112 -19 -46 5 115
5038 115 -264 -69 -88 -84 2 -124 -32 175 14 -68 154 -139 -16 -65 186 330 -166 155 91 -155 34 10 74
5061 74 181 -158 133 317 18 100 -158 135 154 32 66 38 -17 118 28 124 77 41 94 218 -167 13 73 75 39
5086 39 -58 -119 72 -34 60 32 101 130 -86 10 343 -35 10 33 26 14 -229 300 135 145 34 -25 80 26 -496
5111 -496 113 323 66 -126 66 -93 104 -73 26 282 -104 -234 -117 -57 7 -258 61 228 -4 -107 41
5132 41 -61 -33 -132 61 202 -150 182 -61 -358 -103 -45 61 91 -12 -10 33 80 143 -70 87 61 -71 -246 351
5156 351 -70 -168 -39 -91 -90 -75 -70 211 -84 74 -30 -132 -13 -373 -90 425 -67 -33 -410 -54 -39 -90 19
5179 19 143 1 -87 234 -54 255 66 -151 207 -58 -145 -19 -124 4 -388 -43 154 -150 -143 -70 -5 -8 -190
5202 -190 -23 182 -26 -138 75 -5 48 -67 -128 213 112 -136 104 40 79 79 127 249 -42 22 -54 -79 -84 115
5226 115 80 -36 188 -305 0 18 -138 -94 -123 86 192 -451 26 -31 -58 117 24 192 17 -271 -7 -39 -155
5249 -155 -155 -59 171 -144 -179 66 39 -37 -188 30 203 -95 -104 41 26 -171 -155 -114 -43 37 -67 165 193 -112 17
5274 17 13 77 27 -204 87 30 -85 23 203 21 85 -278 97 -54 -314 122 -28 212 -30 -135 132 0
5296 0 -213 218 18 122 -98 -56 240 120 -53 154 -49 -83 34 -160 388 -253 -76 3 168 26 -94 -107
5318 -107 83 -19 -158 116 -135 -171 68 145 93 -25 -5 221 -255 21 160 -27 43 -152 91 70 189 15
5340 15 -50 -96 41 -90 -129 -41 126 25 -325 89 -118 112 -29 85 180 -78 -145 16 -37 22 -189 38 145
5363 145 -77 40 -249 42 74 -339 -10 209 -61 347 -4 76 3 -15 340 219 -102 20 25 -75 92 -111
5385 -111 -27 25 -27 79 -10 -180 -186 -254 65 89 -276 -218 72 -55 35 -172 -19 109 -459 69 143 -199 40 -218
5409 -218 -68 -21 -93 -141 -78 -32 -66 -88 76 204 24 -73 4 -95 -80 -57 95 167 -12 123 77 34 106 121 92 13
5435 13 -18 -42 121 -16 14 66 50 30 -52 -80 39 -311 -126 171 156 244 -161 -168 218 -24 -154 63 -20 -12 112
5460 112 -235 113 -121 226 204 33 -8 -276 -216 317 -158 -218 81 -59 75 -85 37 255 -98 -57 101 -101
5482 -101 10 -63 -126 8 -75 -169 222 -174 24 6 -48 -181 -242 102 168 19 -86 83 103 351 -68 2 269
5505 269 -66 -74 127 -222 83 -137 -249 69 115 -163 65 7 53 26 -133 175 -87 52 -53 -184 -14 -117
5527 -117 -11 209 -136 -34 148 -115 -1 -56 -241 392 -225 -114 -74 346 -68 58 -120 49 -162 -312 -144
5548 -144 -80 -151 -148 -135 -42 6 -43 174 37 -69 -68 -13 122 -56 -134 249 -46 35 -173 -28 153 -15 -114 193 -61
5573 -61 -5 -35 -61 228 -137 -146 93 -102 -219 -30 20 50 53 35 221 131 -17 -174 8 -45 62 -243 184 87 108
5598 108 89 -49 -4 -109 -110 257 150 86 -15 33 40 271 -175 28 -132 -329 -159 -124 -83 62 9 49 -111 -478
5622 -478 36 37 146 -61 5 13 191 -153 -226 159 63 38 -91 91 -107 -41 63 44 -206 215 -64 27 -57 -202
5646 -202 13 -90 -144 42 -129 -50 -129 -78 119 -2 -72 -246 -13 -133 -149 -138 117 46 -15 -240 -74 -82 -159 -67
5670 -67 108 -96 -196 75 75 128 -65 -136 0 60 -119 -280 -50 -6 -101 137 99 41 -234 -168 171 40 123 -136
5694 -136 100 147 -118 202 -67 -33 -47 28 119 173 -254 60 90 41 167 -123 -48 150 -136 -287 30 77 -71
5717 -71 -292 36 48 41 123 -113 -130 -138 -87 137 180 -163 5 53 -190 -13 -123 163 -124 -58 -134 172 201 -42 49
5742 49 -162 -36 -58 267 223 63 32 15 138 58 -176 -38 112 -135 -116 -134 -240 -13 -33 51 41 -122 117 267
5766 267 -90 -208 -15 50 31 -125 -146 44 94 18 150 82 172 -143 -25 56 74 96 -12 49 -56 -36 4 177
5790 177 -110 207 56 121 61 -233 -273 -59 -1 -26 68 -116 49 -167 314 188 -56 23 -240 64 176 -101
5812 -101 -93 41 -49 5 -53 -88 68 -15 34 51 -110 -52 -23 -4 -52 -323 -76 96 59 86 -40 -7 -25 -22 30 272 -59
5839 -59 -106 -44 21 -51 -101 -24 27 -95 46 194 67 137 -97 -331 333 6 -225 361 -27 158 -152 -211 150
5862 150 -155 -76 197 -22 86 -281 -40 6 -120 -91 118 -23 -79 -162 -104 61 -138 -32 215 8 86 -207
5884 -207 -39 55 -174 34 54 -78 -264 163 -54 -49 -254 133 197 75 18 -28 83 -147 109 -1 119 11
5906 11 31 129 14 32 -64 -339 175 157 17 53 8 216 182 -88 235 -36 56 -112 -220 57 79 75 40 -285 -183
5931 -183 50 -70 9 99 -75 185 9 -161 -3 -16 100 57 123 10 101 32 90 -17 -173 70 245 19 190
5954 190 -113 112 -92 63 -106 -39 81 -190 -48 -64 326 -100 -90 123 -30 56 -110 161 195 -83 -3 -167
5976 -167 125 16 13 174 238 85 -157 20 24 112 -188 4 166 32 -105 -48 97 -198 -74 -126 -23 -71 24
5999 24 -27 90 30 -163 -114 -27 -103 -27 26 53 38 -138 -29 40 -160 8 -60 240 176 -44 36 167 12 -6 23
6024 23 17 69 -149 179 149 -113 -6 187 166 41 -75 81 196 207 18 116 -53 -59 10 40 -54 -133 -110 -32 -4 27
6050 27 94 146 184 80 23 165 -53 5 -345 -122 -110 -213 -68 246 -115 27 -26 154 145 11 210 -118 -139 124
6074 124 -27 5 16 -122 -15 310 -127 -39 -46 109 17 -122 62 -109 75 -23 -198 -209 37 -175 143 24 27
6097 27 -28 117 -70 221 -1 28 83 16 9 240 128 5 101 160 196 -183 -102 -80 116 243 -10 -169 -48 24
6121 24 -84 200 126 -82 -9 -179 294 -84 117 79 -286 -141 56 -53 -98 -102 122 -196 44 -197 124 60 114
6144 114 -183 78 178 -39 108 -105 130 153 -214 -134 -15 -81 9 -112 -147 -3 -273 81 178 -129 -42 41 5
6167 5 -232 -249 -189 -90 -199 -17 -88 55 -19 87 -3 -9 203 159 70 -10 66 -72 -170 124 24 -161 -95 85 137 186
6193 186 84 76 -43 -8 223 14 -122 -211 66 168 185 -40 93 106 154 -45 50 88 -27 -31 84 11 9 0 -78 291
6219 291 -295 -63 111 -172 -71 -130 137 -82 -16 -154 3 45 -199 -109 -165 47 -137 -83 183 1 -136 157
6241 157 91 155 37 -27 258 12 1 -39 -70 -167 -222 54 -174 34 -163 72 71 33 -103 -117 198 9 -79 -22 108
6266 108 -83 61 82 45 185 63 214 96 -11 124 -299 -47 -104 -173 72 104 -289 80 118 -266 183 -276
6288 -276 16 55 -182 -220 -2 45 193 -49 0 -72 -128 -41 -114 107 9 -177 -16 144 37 -44 92 117 19 -59
6312 -59 -91 -71 -52 149 59 216 -56 -322 99 -385 -61 -56 32 63 108 -73 -32 147 -48 -95 -117 173 -41 -58 64
6337 64 -2 -53 109 -30 -167 188 -231 -26 -36 -177 129 -171 -131 126 52 186 341 -227 167 46 -3 62 -189
6360 -189 -125 27 -148 51 77 -281 -65 -27 244 148 -165 -40 110 -74 64 310 38 112 -16 36 276 -125
6382 -125 -148 -76 46 -203 -118 9 -58 -240 -195 -122 33 21 -74 -56 12 -20 -44 -58 318 -232 89 44 84 -89 172
6407 172 120 -41 226 -88 278 151 91 -83 95 -21 45 -229 103 -67 -99 51 305 163 -34 -232 -40
6428 -40 74 -7 -41 -294 -100 53 -32 187 -103 -328 143 77 144 -12 -8 63 17 -220 -118 128 -66 -82 7 14 42
6453 42 -115 63 323 -210 -119 136 -102 -73 -101 -9 47 -32 90 -61 -340 271 89 66 350 -9 -88 71 -29
6476 -29 -143 5 72 115 -139 -65 58 -176 -173 -3 103 156 108 -103 -58 -87 212 -94 -177 224 7 -213 12 -206
6500 -206 -172 2 59 255 -10 45 71 -178 46 -191 -73 102 -160 -152 -155 90 -74 96 -112 303 289 -30 -205
6523 -205 -197 13 22 -129 178 -66 -117 62 -184 -14 27 -98 -69 -40 -16 53 73 -152 19 -47 -211 40 10 171
6547 171 73 -25 47 -2 -238 -163 -101 -101 -9 -263 -66 -18 217 -116 -20 158 270 -133 206 -86 -17 37 -63 225
6571 225 0 -180 222 25 -7 -275 -45 403 -49 -86 -79 72 -425 -82 -106 -18 -167 -171 153 -194 34 38 42 89
6595 89 -37 -156 16 -83 155 -56 -39 251 -121 -70 19 -38 -137 38 11 31 71 -178 -178 -89 50 -186 -35 46 -171
6620 -171 -142 50 -37 98 87 -136 70 -67 -413 127 51 25 -4 40 137 134 211 -63 -8 4 -77 -55 85 -108 13
6645 13 289 300 -131 42 90 -125 -8 -241 273 -6 -254 118 -111 -37 -59 211 19 179 95 153 109 -20 4
6668 4 -60 -116 42 -10 -18 44 -160 -105 62 126 140 -225 -6 72 40 -106 -201 307 17 -43 -173 -69 -98 -59 146 25
6694 25 -24 -205 -18 196 -4 14 -154 14 96 -139 140 256 96 112 1 45 201 95 84 360 -49 -13 77
6717 77 -47 129 -11 -134 111 -18 -92 -28 -195 150 -182 27 -20 -10 -138 -19 -183 137 -159 -171 -67 -109
6739 -109 3 37 138 -206 -28 -104 9 43 149 -284 -135 -33 -74 -59 -35 -26 -4 145 50 -55 72 4 33 5
6763 5 28 118 -77 -78 -206 -69 30 -27 -2 141 124 100 -277 9 77 -215 -15 279 -25 -96 -73 89 -152 104 329
6788 329 133 215 16 -57 114 292 123 -98 -170 -43 199 36 -180 52 -247 60 58 -108 -125 18 20 149 -14
6811 -14 -3 0 -21 3 58 116 -58 -24 -56 17 -96 -68 109 -133 223 17 163 46 -97 -172 189 -138 62 -10 36
6836 36 -83 -97 -194 -73 -39 141 -89 90 301 -129 -113 -30 35 173 -96 -39 271 -147 21 -113 74 -316 45
6859 45 110 434 14 131 87 -96 -141 39 -82 -41 143 -176 -185 -52 -151 -220 -3 68 -63 -97 252 123 -24 198
6883 198 -129 -36 -48 52 64 -28 -198 -55 67 75 176 -63 -83 -39 -10 70 -142 16 90 -171 -91 34 105 41 146
6908 146 -48 365 -46 14 -147 -45 -152 49 82 25 -131 61 230 -103 -34 -68 -70 24 -17 4 50 -179 69 -172
6932 -172 -88 139 -171 39 -8 -122 191 -92 -77 -19 -112 -40 114 -186 120 -145 -142 26 -4 157 -94 -94 120 -22
6956 -22 -252 118 -57 -184 -221 -126 6 320 13 -35 27 62 -69 -114 106 164 -179 69 160 -244 47 -106 63
6979 63 106 139 43 77 78 54 30 -96 -32 -121 82 -99 19 -68 -95 53 192 -291 71 72 -86 10 75 245 -154 -34
7005 -34 99 125 24 249 1 -75 128 -203 45 29 183 19 -67 97 126 -231 -96 104 83 -66 -206 286
7027 286 79 -132 69 131 -174 -91 -73 69 -53 -97 -75 97 47 169 -36 -80 -122 -261 82 113 -104 -253 -87
7050 -87 -128 198 -267 -268 179 64 -50 -151 -79 63 28 -112 -65 97 -157 52 68 -71 -110 -17 -54 -150 20 30
7074 30 -77 1 -36 -135 162 71 -39 -107 85 113 22 103 -203 38 -41 -30 81 104 56 -187 110 83 -11 142 66
7099 66 43 -198 200 154 -54 -168 -26 27 39 33 108 108 -67 46 173 -30 -161 -64 27 -48 229 147 -92 0 -20
7124 -20 59 4 320 -27 -14 97 -4 -99 -18 145 68 -125 -115 186 16 131 32 108 -30 -65 -57 266 17 174
7148 174 53 98 -10 -26 81 -6 -397 -21 57 80 34 -70 -14 138 -204 -214 8 126 -105 -254 -236 296 72
7171 72 23 50 85 66 -127 -38 221 -15 54 90 144 -131 -66 40 -16 42 -338 234 107 -62 -111 -163 126 -43 -39
7196 -39 347 -33 -77 118 -149 -84 -110 -26 82 157 -85 105 20 36 -153 -173 185 33 -81 3 192 -109 -58 -228
7220 -228 -11 -182 -197 -53 26 25 -72 -6 128 -154 -98 33 -125 98 23 -99 -49 -128 1 65 -257 3 -175 -34
7244 -34 24 55 -115 167 12 38 25 27 225 -79 -149 59 25 -102 -171 -95 28 66 -70 1 13 -33 -208 -40 15
7269 15 -125 119 112 223 62 92 -57 -16 182 84 244 -12 -9 -202 20 -108 -181 -101 -14 -78 -166 22 -91 -164 -1
7294 -1 -184 -59 32 -130 42 -9 -65 32 101 211 -5 17 112 71 136 -203 -97 -187 -117 -52 -98 -43 -62 -122 -5 5
7320 5 97 -35 14 -160 -125 -2 36 79 -43 -33 195 62 -63 4 158 101 176 20 163 38 -87 14 0 -98
7344 -98 104 109 148 -27 75 61 56 3 89 -130 41 105 -108 13 155 1 -28 39 -96 -130 164 -68 351 -12
7368 -12 65 -172 110 70 114 126 -49 -76 -72 42 -99 167 42 85 -69 26 44 211 75 104 -45 40 -31 -164 -76
7393 -76 103 1 91 -220 35 -1 53 -61 -161 127 72 -130 70 145 57 42 169 61 105 -203 -81 105 -99
7416 -99 -67 -90 242 3 17 11 192 -69 -155 -38 40 51 -99 -52 37 -24 -44 -136 129 58 -138 108 -18 -64 68
7441 68 -1 -82 -2 53 3 88 -260 76 110 -62 -23 -146 -24 -16 -119 153 87 -42 -9 11 -19 208 -38 -105 -83 -65
7467 -65 120 -39 -28 -101 -76 -10 60 -31 45 -39 -94 100 -127 190 49 -186 -281 178 93 153 -90 -245 10 11 99
7492 99 34 -128 110 -88 -39 -160 6 116 -27 -12 251 -220 32 199 -28 67 -169 16 -161 165 -28 128
7514 128 -170 -122 -29 -105 80 30 47 178 81 103 88 104 6 -194 -8 207 84 -53 -34 -207 85 89 -184 -141 -224
7539 -224 -123 -145 12 -62 -53 -86 229 -32 1 -122 -202 2 -34 107 -106 -175 -259 225 88 26 41 -134 62 -61
7563 -61 -250 -11 45 61 83 161 -34 -230 14 -9 -173 91 15 -99 183 46 -56 -54 -19 81 46 81 221 -259
7587 -259 -118 -60 133 -54 150 -207 152 -171 -68 213 -76 -85 -62 289 5 80 -301 16 271 -36 -290 199
7609 199 42 27 -86 -364 -22 -194 -34 101 18 37 -95 211 -195 -239 -82 -98 -86 79 -31 2 89 -49 -197
7632 -197 -11 -96 -247 -77 -22 56 32 256 102 -132 -205 -48 97 -157 -91 247 83 -146 -93 83 -157 235
7654 235 -1 186 93 -19 -10 -124 47 -35 -90 39 -127 -107 45 -245 153 -83 -120 -36 -95 -68 -152 -103 -112 -57 -154
7679 -154 94 -209 23 134 -60 99 -91 -170 -90 -116 88 -211 187 77 71 223 176 109 -191 -11 67 24 -165
7702 -165 -168 31 -76 76 -176 7 108 22 -170 105 229 -19 -26 54 -123 -110 67 -35 107 56 -8 45 53 -16
7726 -16 -187 230 -41 -20 35 -12 29 193 -33 82 99 -64 -18 30 -80 124 -100 -106 112 -218 36 36 -120 -33
7750 -33 147 -48 127 55 -236 166 -265 -34 -79 -203 89 -93 133 -94 -85 -86 106 144 -300 63 -91 93 -30
7773 -30 90 51 106 -113 -496 99 -114 -176 -57 2 57 131 8 45 157 16 -161 139 -111 -188 -138 134 134 -84
7797 -84 82 -9 -94 -119 -247 117 110 -264 27 -86 79 -28 76 -73 62 -41 -161 124 -87 77 -16 137
7819 137 204 -137 -279 -141 -287 -159 149 -165 42 -16 -324 -99 210 -150 74 108 -163 -65 -64 -61 58 226 -165
7842 -165 116 -307 -178 44 -230 110 6 16 66 295 -163 -169 338 124 -59 178 241 27 23 -152 26 -45 46
7865 46 195 -41 25 -156 -24 -184 -244 -28 -453 -26 64 92 308 278 104 421 -74 100 182 -73 -121 35 212
7888 212 -34 237 127 3 86 -153 307 -218 -295 197 -53 -204 4 -208 31 -42 178 191 -94 -102 117 30
7910 30 -19 -202 -49 40 -370 92 52 -209 -21 -110 180 238 242 288 -211 82 -55 21 -98 25 197 -535 -67
7933 -67 40 45 -184 -122 -73 -180 -95 -30 -22 -155 18 -21 254 72 -87 -198 -7 9 -145 -83 -27 265 63 -109
7957 -109 88 120 156 152 221 88 -109 -77 -148 -22 25 321 -58 32 64 209 -139 0 -164 146 -160 -13 -249
7980 -249 -90 20 0 162 -67 196 -6 73 47 306 329 65 -273 -124 257 -195 21 -56 109 -129 -91 63
8002 63 11 -53 387 -97 -3 -92 -24 331 -27 -245 -425 -154 -347 24 -279 179 -532 2 53 59 85 -226 61
8025 61 -96 -18 -144 81 -57 -109 366 199 171 177 -47 -80 -3 78 -6 -170 15 68 97 7 -55 104 -124 78 -5
8050 -5 10 63 -5 245 7 -378 -179 -4 -87 -57 -223 -47 -106 372 -80 -308 272 -96 -243 61 159 -41 223
8073 223 250 -141 -400 376 277 218 214 136 262 87 -115 -192 -258 -204 -354 -22 114 148 -251 -193 178 -313 204 48
8097 48 -225 -125 167 97 287 -141 164 180 -192 -194 -321 -101 -99 372 -337 197 -208 -359 66 -123 297 -192
8119 -192 -102 86 -84 -257 354 45 -394 3 199 -138 45 -40 122 109 -234 -135 7 -231 72 118 -151 -27
8141 -27 -63 -444 31 254 -158 -104 518 162 -91 -212 106 -102 -146 -161 -110 334 -115 -64 110 -141 -61 224 94
8164 94 49 181 -34 -26 -408 -93 -342 160 -133 6 -42 -66 470 339 139 163 392 -160 132 446 -215 -170 -112
8187 -112 -38 -49 -29 30
8191C0
$$ Imaginary data points
##PAGE= N=2
##DATA TABLE= (X++(I..I)), XYDATA
0 0 0 0 0 0 0 0 0 0 0 0 8 -8 8 -8 8 -16 16 -24 24 -32 40 -48 56 -64 74 -88 104 -120 136 -156 178 -202 229
33 229 -260 294 -330 371 -415 463 -518 576 -639 708 -782 867 -957 1054 -1163 1282 -1411
50 -1411 1555 -1714 1890 -2088 2306 -2556 2840 -3168 3551 -4004 4553 -5232 6094 -7235 8819
65 8819 -11172 15044 -22527 42361 -210983 -506522 -68966 168973 128506 18859 66167
76 66167 42000 -33895 52346 228547 130211 -73216 -63247 170011 240658 35490 -86776
87 -86776 27266 100701 94317 88525 81958 11433 -66967 -4786 119311 83730 -34426 -92446
99 -92446 -42573 39517 27030 -18190 -22335 -51361 -72065 -58856 -32576 -10339 -29700 -33012 3904
112 3904 8386 939 -14573 -29457 -5905 -13848 -32161 13723 52129 40163 -3758 -24045 15928
125 15928 28840 8682 6655 -17847 -43507 -41310 -11840 35518 -850 -79509 -50867 29485
137 29485 54375 14409 -24456 -9168 -10009 -13542 44576 64740 9775 -32326 397 79267 62185
150 62185 -37052 -51573 -5124 10789 1331 4726 31030 2049 -45377 2120 50336 9113
162 9113 -50859 -52621 10234 26234 -27795 -31699 154 658 -14135 -15899 16413 18715 -25912
175 -25912 -20847 9397 9130 -1742 -10469 17917 45825 18798 919 14949 32639 29242 -13179
188 -13179 -18731 21701 28563 17025 9241 8945 10077 -19574 -20026 18189 -247 -49529 -53092 -3474
202 -3474 34599 -8409 -45892 -14416 2157 -5935 -4105 5006 239 -40640 -37181 30327 38945
215 38945 -12512 -33743 -825 38413 17168 -9842 4767 -6161 -23168 1802 34577 35082
227 35082 -9581 -23445 27469 40486 5202 -14759 -12768 1270 -2796 -594 25313 8199 -24530
240 -24530 -12519 13957 23993 -5320 -33679 -11095 3063 -3825 -1028 -490 574 -9163 -12619
253 -12619 19801 22907 -10605 -24735 -15978 9727 12195 -10011 -950 9377 267 3145 11147
266 11147 18575 -2291 -34895 -10019 24914 15512 -5675 -12333 9172 17892 -3857 3291 13090
279 13090 -11086 -25951 -9815 24042 18469 -28081 -22385 16235 17295 -595 -11132 -2379 -2586
292 -2586 -22281 -3758 22334 915 -22330 -12000 23319 31956 -6748 -16936 1928 587 -69
305 -69 3256 6654 3571 -11591 4052 27265 11216 -8897 -16298 -6352 10263 -280 -8210 -4454
319 -4454 -7870 2351 8039 1581 1049 -9618 -10266 596 353 1815 -7734 -14317 8164 15922 4652
334 4652 -928 -1836 8729 2949 -10112 3565 6007 -6887 -3661 8832 19620 3057 -16913
347 -16913 4843 14202 -8421 -16227 -4205 9724 -3307 -18314 7239 16227 -9405 -15623 -137
360 -137 10585 -7889 -26280 1155 14813 -9263 -12846 7127 20864 3802 -16146 7345 18817
373 18817 -5380 -9226 5306 14504 3841 -8390 14608 24563 -2019 -10967 2619 13775 3453
386 3453 -17722 -4018 12497 477 -2242 3413 6017 -1829 -17082 -2772 12376 -7675 -21888
399 -21888 -13379 7443 12192 -12599 -13654 4145 -984 -8387 -6685 -118 -2653 -22911 -11893 20014
413 20014 12440 -13075 -16559 8416 23239 -4784 -16097 5673 5157 -5446 1041 19451 20086
426 20086 -11732 -11173 27907 27093 -6518 -18589 5346 25120 1437 -7961 17195 11231 -9761
439 -9761 -3354 18994 17529 -21388 -27928 11013 15921 -11926 -20097 -2405 9928 -10683 -15486
452 -15486 9235 -1426 -27809 -19168 6147 11122 -16610 -23195 8338 13630 -4437 -7560 1049
465 1049 7129 -6844 -10145 14501 12957 -6424 -2999 12521 20791 5577 -7800 7404 10790
478 10790 202 -2587 513 10829 3935 -9211 4426 11421 -351 -7175 -6735 2793 -1343 -15040
492 -15040 -4288 5386 -1661 -7662 -7912 7671 7696 -14536 -10813 2804 -451 -6535 -6271 5944 4787
507 4787 -10899 70 14357 4853 -9043 -11520 6919 15088 -5772 -6609 8726 7197 1536 1795
521 1795 11636 7685 -13155 -5832 13439 8573 -4617 -11870 2764 17468 2550 -5647 2589 1325
535 1325 -2735 -4580 3162 5849 -11482 -10850 6743 8994 1198 -13568 -11797 6568 1017 -10760
549 -10760 -8480 -5171 -2564 -5274 -526 8799 -5583 -14091 -629 8249 6371 -10313 -14219 8357
563 8357 12279 168 1019 6247 6392 -2056 1954 17897 3927 -14764 -2115 14720 15291 -2042
577 -2042 -9480 9936 11497 -3543 -745 5865 826 -12029 -7003 16415 6488 -16754 -8130 6760
591 6760 5921 -7708 -14155 378 -232 -12878 -4896 5520 2122 -9592 -8632 11966 7349 -12365
605 -12365 -5311 5173 2676 -4231 -5117 8318 8140 -4956 -535 7094 6211 -1462 -6641 6390 6858
620 6858 -7786 -838 9198 6596 -1045 -7118 4073 9416 -2741 -6318 -3380 1166 1694 -5214
634 -5214 2675 6448 -7960 -7430 3521 6447 -927 -14654 -7576 6966 3425 -1994 -4074 -298
648 -298 4238 -2306 2525 9573 -4924 -10651 269 10221 8854 -6489 -6814 6404 5895 2951 -37
663 -37 -2617 -1023 -5564 1148 11638 -894 -10126 -2282 6068 7877 -3708 -7739 -1357 -3440 -834
678 -834 2793 -1741 -2637 -5393 -83 10106 1280 -6236 -3201 -523 4360 2154 -1536 909 -1756
693 -1756 3524 7822 519 99 -165 -2316 2601 1428 -653 -934 -4570 2762 5177 -1786 -2796 -3186
709 -3186 703 1565 -7092 -2580 2288 -4586 -2151 2609 3386 -982 -6626 3098 7313 -4351 -4645 1259
725 1259 5411 3029 -4325 3873 8793 -3061 -2626 5456 4440 -3619 -9207 3535 9081 -5143 -5923
740 -5923 3133 4572 -510 -7763 603 5685 -7540 -7821 3015 4270 -2187 -8355 1833 9084 -4145
755 -4145 -6338 2838 4167 -196 -6649 373 10028 72 -3985 3417 5492 2369 -4571 398 8158
770 8158 -2887 -6843 2248 6224 4061 -5655 -4279 6540 985 -4229 -1491 -1165 -1577 -6361 -1910
785 -1910 8714 -499 -8804 -2164 4499 6037 -3204 -7117 2516 1061 -2281 2662 3183 662 -5573
800 -5573 -3543 9986 3864 -8137 -5283 971 5314 -178 -3530 4470 922 -4542 2669 5880 2891
815 2891 -5977 -7016 6207 5849 -3712 -1978 999 2700 -563 -2455 5466 1502 -6867 -2076 2802
830 2802 3882 -533 -5166 2849 3433 -3071 -373 653 594 -2058 -6110 1743 4015 -2244 -1238 -947
846 -947 1087 2204 -2805 624 1789 -4010 -2207 201 3970 3824 -5319 -1832 5247 2496 353 -2580
862 -2580 -667 2286 -3138 592 5436 -874 -3872 -2409 4375 6849 -5225 -6629 2406 2638 811
877 811 -1565 269 3640 -3018 -1008 6909 1645 -4473 -5695 981 7215 -3002 -7407 575 1769
892 1769 504 -2394 -1981 1980 -4616 -5215 3776 1715 -3716 -5445 -162 7966 887 -6228 247 2791
908 2791 2310 -265 -916 5111 333 -2590 6921 7470 860 -3982 -605 9959 3988 -6180 -1237
923 -1237 3170 2665 -997 -1927 4395 -1291 -8816 768 5113 -2485 -10185 -7285 5964 2414 -9451
938 -9451 -3968 1502 -142 -3849 -3020 4984 -23 -9257 898 9656 3179 -4965 -3007 9480 6841
953 6841 -5094 344 5648 1134 -2161 -358 7295 2391 -7679 700 7791 1004 -5921 -4539 5269
968 5269 2338 -8288 -1561 3963 -1670 -3847 -1755 3540 472 -7352 -296 5576 -707 -4205 -2565
983 -2565 5687 4888 -4928 -522 4196 312 89 3 1809 969 -4357 1425 5410 435 -2767 -3661 1867
1000 1867 4993 -3296 -3395 -471 -1614 1102 1147 -155 -219 -3873 138 4545 1218 -983 -4073 -1049
1016 -1049 6202 1658 -1157 193 -1440 1645 2369 999 659 -4438 -2680 3014 1905 739 -4103
1031 -4103 -4333 3942 1916 -1936 -892 -3059 -1024 204 283 2185 -2379 -2828 2290 1870 2738 -857
1047 -857 -4561 2182 3426 283 884 -1271 805 2092 404 2539 -367 -1899 601 -875 1544
1062 1544 1269 -5025 -657 2611 -89 -621 -3024 -90 1556 -2433 -343 -246 -1279 377 -960 2069
1078 2069 3046 -4014 -917 3994 1426 -942 -2959 1245 3802 -1807 5 2109 -193 12 -1302
1093 -1302 1786 3153 -5251 -3358 4193 1809 -1991 -4280 985 3988 -2998 -1995 2379 -446 -1552
1108 -1552 -1912 1801 4360 -3993 -3226 5153 3102 -1741 -3702 1069 4635 -2666 -2358 2752 -305 -1378
1124 -1378 -699 1516 2934 -4527 -4133 4054 2195 -2236 -4021 -201 4117 -1121 -1466 3220 -880 -2053
1140 -2053 765 2289 3413 -3196 -3795 4157 3585 85 -2117 -1086 3390 -412 -1600 2653 -1182
1155 -1182 -3376 -402 1433 3117 -2211 -5105 1283 2045 -56 -1583 -3017 1217 -365 -1960 3043
1170 3043 -81 -2484 151 1150 3339 -130 -3066 1098 1584 794 1000 -1167 1244 485 -1269 2918
1186 2918 -194 -2526 92 -513 1033 -42 -2488 487 -13 -471 1006 -1873 -472 667 -1407 1180
1202 1180 -604 -1811 1995 165 264 1126 -726 766 44 584 2585 -2080 -1483 2531 805 587 -1224
1219 -1224 -1220 2553 -591 -1745 717 -1082 -1181 -1336 469 3160 -3074 -3904 2656 1935 -415 -2300 -1288
1236 -1288 2865 -80 -1375 2863 252 -1408 -1002 1740 4548 -2194 -4451 3033 3063 -157 -1599 -794
1252 -794 2640 -676 -1947 2924 108 -3125 -1770 1152 3937 -2186 -5529 2121 2849 -584 -1386 -1058
1268 -1058 1868 -847 -2120 3607 1216 -2966 -1783 1241 4814 -443 -5476 1267 2591 -644 -1273
1283 -1273 -945 1611 -1202 -3271 2938 1994 -3126 -2812 -265 3969 518 -5142 334 3026 45 -654
1299 -654 -2 2871 668 -2805 3053 3856 -1719 -2218 114 4350 1797 -4344 237 3178 -707 -1437
1315 -1437 -700 1647 -108 -4607 1143 3186 -2683 -3385 -728 2560 381 -5260 -750 2986 -1365
1330 -1365 -1822 -330 2003 970 -3013 2114 4437 -1225 -1487 1260 3648 1914 -3226 359 3822
1345 3822 -98 -423 318 697 531 -2455 920 2511 -3074 -2576 153 1330 620 -3531 -1551 1122
1361 1122 -1628 -338 -87 -1620 -433 -1405 1263 2681 -2114 -1210 887 1135 2060 -1022 -824 1390
1377 1390 -301 1528 1880 -1204 -114 -338 851 2414 -1408 -1203 -136 -561 2069 252 -1799 -262
1393 -262 -884 1194 1316 -2267 -368 -23 -196 1604 -305 244 276 -1370 2256 2080 -1237 -728 -747 1405
1411 1405 1889 -2229 -446 619 -750 524 -438 -419 -453 -2761 561 1757 -1590 -1628 -949 1345 1930
1428 1930 -2386 -495 1816 -495 294 634 886 654 -2104 1322 3370 -892 -1385 -102 1876 2057
1444 2057 -2594 -725 2297 -840 -728 274 572 -47 -3267 143 3137 -1686 -2703 -1063 1437 2230
1460 2230 -2496 -1401 2304 -481 -695 815 878 425 -2486 293 4081 -545 -1906 -170 1354 2352
1476 2352 -1545 -1307 1987 -883 -1047 1028 577 -421 -2793 -353 3329 -1128 -2829 -404 242 1557
1492 1557 -1251 -1249 1663 -552 -905 1695 1050 260 -1868 -76 3986 -96 -2241 -118 302 1864 -87
1509 -87 -1393 991 -698 -1270 1413 556 -430 -2341 -1315 3001 291 -2138 -368 -947 776 638 -691
1526 -691 895 -908 -802 2388 1459 709 -1320 -965 2995 1090 -882 677 -675 -74 899 -163 596
1543 596 -1199 -1943 1087 57 -464 -1281 -1989 984 32 -1912 222 -825 -1311 492 -168 325 -765
1560 -765 -563 1984 414 -76 957 185 1701 1369 -368 1530 313 -420 1703 842 -291 -1397 -484
1577 -484 2349 -356 -1930 463 -694 -439 100 -1355 131 -1663 -2447 1378 746 -1006 -2104 -980
1593 -980 2611 184 -1671 1348 115 -55 1259 1542 1905 -656 -1518 2643 2118 -457 -1437 -551 2542
1610 2542 -299 -2051 1877 15 -2376 -264 890 791 -2433 -2719 1926 1031 -1862 -1501 -293 1845
1626 1845 -414 -1929 2165 1117 -2238 235 2243 1781 -1095 -1907 2710 2129 -1349 -493 200 1387
1642 1387 -32 -1604 1803 516 -2472 -183 1564 639 -1645 -2715 1499 1084 -1866 -691 -701 162
1658 162 -27 -1482 1353 628 -2465 -62 2080 1471 -487 -1972 1788 2202 -898 486 504 170 450
1675 450 -997 1188 1131 -2320 -694 1359 1074 -326 -2197 702 1841 -1324 -218 114 -737 51 -893
1692 -893 381 983 -1575 -487 1146 658 85 -1666 369 1701 -1115 -198 696 -494 260 -271 301
1709 301 542 -1724 -233 1191 35 -221 -1594 -83 1717 -740 137 238 -1125 362 534 381 875
1726 875 -1555 -69 1551 432 688 -471 -509 1607 239 364 504 -1596 197 791 225 366 -1469
1743 -1469 -556 690 -708 450 -533 -1616 358 136 353 290 -2196 -88 974 -231 115 -1082 -421
1760 -421 851 -688 860 481 -1670 4 666 782 814 -1819 -270 1430 -17 -91 -518 -262 438 -1206
1778 -1206 665 1355 -1674 -400 753 1087 626 -1676 158 1583 -351 240 692 22 440 -1237 959
1795 959 1923 -1656 -1233 924 874 95 -2160 -600 1676 -857 -1064 -159 -356 -366 -1800 298 1730 -2215
1813 -2215 -1619 895 1075 219 -2077 -241 2085 -451 -557 1280 397 -115 -697 928 2237 -1560 -1462
1830 -1462 1499 987 82 -1395 -234 1831 -879 -798 973 -550 -1143 -1118 552 1499 -1945 -1939 1455 766
1848 766 -348 -1295 -324 1614 -501 -86 1790 -78 -911 -245 1326 2232 -1055 -1587 1463 775 179
1865 179 -260 -587 689 -686 -421 1546 -769 -1333 -298 361 1185 -994 -1595 1006 5 -213 140
1882 140 -536 283 -547 -64 1959 -394 -1191 514 565 1213 -381 -1271 1042 -200 -193 729 -556 -222 -259
1901 -259 -286 1553 -821 -1430 399 -279 339 -95 -944 318 -407 91 1046 -549 -547 200 -63 1508 -241
1920 -241 -985 974 247 444 542 -392 573 -237 -299 1367 -485 -935 -99 -248 1056 -550 -1630 556
1938 556 -63 -404 170 -784 -122 -715 -616 1642 -142 -1088 149 194 972 137 -1157 1027 473 8 648
1957 648 281 376 -222 -387 1916 240 -1650 -19 352 758 -361 -1453 710 -149 -1306 502 84
1974 84 -360 -1211 -916 1751 403 -1917 -117 744 688 62 -936 970 551 -941 1266 721 -43 -540
1992 -540 -592 2046 974 -1912 20 604 64 -114 -763 797 -277 -1358 841 496 -884 -933 -783 1336
2010 1336 480 -2157 216 915 -189 303 -356 991 14 -1250 1305 1194 -796 -440 -380 1351 1023
2027 1023 -1719 -160 647 -310 44 -114 119 -176 -1468 901 687 -1038 -561 -244 683 844 -1177 72
2045 72 611 -709 429 413 394 162 -897 1386 1268 -1161 131 300 445 710 -810 328 353 -1104
2063 -1104 347 358 -148 -308 -1127 736 930 -1328 -15 408 -327 401 -598 -161 190 -816 724 603
2081 603 -500 -173 -444 847 1076 -954 181 531 -457 962 108 -256 -335 -1108 959 843 -1426 -518
2099 -518 -499 217 717 -1267 -168 547 -1051 595 670 63 -572 -1123 1204 1463 -1036 -188 123 134 1070
2118 1070 -551 403 429 -1185 474 1306 113 -447 -1056 615 1012 -1474 -139 175 -530 236 -474 400
2136 400 398 -1610 212 1169 -198 -310 -882 741 1415 -1469 -269 845 -431 237 -266 358 826 -1234
2154 -1234 -61 1438 -147 -371 -1072 680 1393 -1369 -496 768 -527 -313 -177 206 406 -1563 -173
2171 -173 1650 -225 -294 -700 577 1595 -980 -213 1239 -327 -348 422 472 596 -1566 -269 1584 -171
2189 -171 -473 -485 1 1193 -1227 -999 958 -900 -940 -11 164 220 -1472 -649 1662 -87 -563 57 14
2208 14 1203 -292 -340 1267 -216 -368 810 857 476 -1158 -51 1881 -367 -1052 322 -204 343 -334
2226 -334 -680 497 -958 -981 560 327 -235 -1317 -661 1493 -413 -890 548 -398 560 333 -1 1185
2244 1185 -651 -651 1534 586 178 -470 -321 1482 -54 -521 770 -412 -507 401 -6 445 -837 -853 735
2263 735 84 -422 -349 -421 825 -197 -521 1021 -426 -794 680 255 605 -731 -600 1587 85 -386
2281 -386 211 66 588 60 -253 1371 -544 -1100 408 471 257 -904 -871 763 -211 -1041 472 -421 -283
2300 -283 -39 -400 730 -555 -1095 1293 753 154 -564 -324 1260 -78 -700 1008 -86 -63 255 103
2318 103 828 -603 -1211 1128 402 -432 -498 -634 812 -286 -929 767 -284 -628 104 124 914 -573
2336 -573 -1116 905 495 -217 128 -282 841 266 -855 1157 231 -1023 257 380 628 -251 -1376 868
2354 868 473 -704 -106 -367 211 -337 -819 849 -152 -1251 307 484 480 -571 -1347 920 973 -591
2372 -591 369 -114 172 197 -457 1316 422 -1128 188 475 359 -24 -1243 363 557 -900 376 84
2390 84 -370 -126 -446 841 85 -1521 244 731 315 108 -642 536 619 -623 710 510 -528 141
2408 141 167 940 35 -1383 298 624 -295 -109 -589 181 533 -858 169 116 -906 -153 -19 347 125
2427 125 -1438 108 702 -581 47 -242 -36 383 -490 1024 535 -871 116 394 707 335 -1215 488
2445 488 788 -571 311 291 38 -194 -837 730 773 -1335 -321 504 339 -85 -1055 378 683 -950 315
2464 315 399 -476 -78 -158 963 886 -1210 111 1152 304 43 -477 514 689 -893 446 746 -567 -434
2483 -434 -384 588 587 -1610 -302 1099 -511 -311 -620 304 182 -1003 254 1003 -835 -600 -63 861 885
2502 885 -1109 15 1224 21 -111 83 529 457 -1025 637 1217 -943 -710 297 522 461 -1208 -311
2520 -311 919 -671 -445 114 -55 -143 -1099 333 978 -1136 -678 672 360 430 -656 -39 1180 -568
2538 -568 34 557 238 87 -605 491 1464 -893 -881 535 205 45 -802 -235 572 -778 16 557 -419
2557 -419 -96 -549 259 1171 -697 -817 716 71 298 -189 224 720 -643 22 786 -159 -159 77 79 1048
2577 1048 -592 -865 536 -86 -371 -234 -124 351 -647 -371 928 -488 -632 -50 -37 882 -414 -724
2595 -724 699 36 83 319 2 587 -242 149 1407 -360 -677 243 192 583 -291 -590 652 -497 -422
2614 -422 436 -342 -144 -676 -369 1195 -390 -1120 120 -19 363 -173 -569 717 -346 -322 812 84
2632 84 36 -277 -11 1356 105 -775 767 73 244 -30 -216 396 -304 -349 659 -171 -379 -332 -236 1034
2652 1034 -227 -1048 856 -15 -293 142 -93 349 -697 -196 1264 144 -608 -77 102 944 161 -770
2670 -770 909 388 -156 197 4 369 -721 -684 955 -187 -1063 -258 4 544 -51 -817 557 -205 -750
2689 -750 502 255 47 -558 -525 1334 263 -861 381 239 356 41 -293 891 -113 -758 521 510
2707 510 -99 -755 -648 849 126 -1156 99 178 -161 -287 -505 575 -326 -1144 825 487 -210 -343 -232
2726 -232 1222 464 -957 548 301 -90 366 -22 551 -244 -835 945 534 -501 -42 -310 598 132
2744 132 -996 327 252 -672 290 -184 281 -475 -888 872 594 -750 -177 234 476 162 -676 696 511
2763 511 -640 380 407 403 -39 -601 925 647 -653 -87 38 1 221 -566 333 175 -825 239 171 -182
2783 -182 -293 -793 586 569 -823 123 269 -48 264 -189 525 275 -952 640 694 -20 -174 -638 437
2802 437 519 -809 -7 235 -448 55 -120 78 -35 -1129 251 446 -451 -319 -460 381 483 -593 328
2821 328 530 -356 241 411 601 276 -843 416 1043 -260 142 -183 180 379 -702 141 438 -757
2839 -757 -55 243 283 -2 -1244 46 663 -629 -431 -145 -238 317 -660 119 553 -699 23 669 224
2858 224 49 -778 260 898 -290 -114 309 167 152 -181 381 599 -965 -245 550 124 -134 -850 128
2877 128 853 -703 -245 375 -229 -246 -436 390 401 -922 -220 885 123 -87 -519 281 983 -720 -151
2896 -151 867 -190 -97 -110 209 466 -878 -496 700 -229 -480 -221 -64 355 -532 -139 606 -560 -279
2915 -279 316 272 320 -870 -242 848 -47 -319 150 59 494 -127 182 963 -363 -294 600 222 243 -832
2935 -832 -595 971 -252 -543 23 -441 84 -457 47 433 -866 -647 303 -47 163 -417 -333 791 -304
2954 -304 -23 652 -56 158 -102 380 724 -321 -355 770 276 128 -369 -259 509 -442 -364 506 -369 -268
2974 -268 9 -44 406 -644 -652 707 265 -265 -368 -72 366 -305 13 755 -222 -157 248 73 400 -268 -348
2995 -348 833 40 -203 155 -238 284 -353 -218 570 -353 -803 189 118 284 -739 -601 751 26 -289
3014 -289 462 -159 56 -108 93 888 -141 -548 598 228 157 -125 -284 866 -129 -380 373 -292 -158
3033 -158 -210 -83 529 -292 -802 -30 52 -41 -273 -513 525 -172 -379 196 -211 -410 113 178 670 27 -711
3054 -711 679 425 42 83 -123 740 37 -659 637 -77 -443 26 -72 620 -424 -944 371 -128 -323
3073 -323 -28 -162 257 -98 -599 821 228 -661 -41 -2 375 -45 -680 728 489 -200 203 78 144 -51
3093 -51 -451 857 3 -967 -178 363 -110 -327 -601 336 283 -604 42 36 -72 -215 -280 670 234 -763 192
3114 192 413 70 188 -431 556 300 -615 747 333 -43 14 -105 414 252 -811 -61 319 -208 -222 -234
3134 -234 423 -166 -750 420 364 -658 45 -133 346 154 -828 233 472 -265 324 -124 332 102 -457
3153 -457 560 452 -570 -154 231 291 104 -819 119 499 -287 39 -117 57 -12 -488 497 463 -903 -65
3173 -65 189 58 -5 -645 322 286 -528 220 219 -323 186 -254 642 643 -656 -66 413 -9 13 -556 280 336 -655
3196 -655 263 69 -345 -66 -394 336 238 -990 -252 341 -124 279 2 324 407 -659 567 477 -344 -86
3216 -86 -40 516 642 -515 57 680 18 251 -171 -30 334 -639 77 658 -558 -405 -219 -42 353 -794
3236 -794 -353 537 -161 13 85 -4 286 -705 269 706 -448 -86 252 296 394 -191 4 335 -589 22 261
3257 261 128 151 -585 44 516 -715 -621 114 -54 -58 -368 -225 539 -713 -192 473 -155 -21 -468 3 748
3278 748 -233 -177 424 189 375 64 -46 479 -370 -158 548 -122 -18 -192 -203 608 -434 -560 439 -202
3298 -202 132 -2 -32 173 -572 -65 751 -428 -166 84 93 583 -87 -276 660 -270 -27 315 261 375 -352
3319 -352 -346 690 -28 -334 136 -43 276 -130 -375 439 -152 -352 228 -73 104 -511 -148 774 -345 -615
3339 -615 309 -226 210 -198 -15 946 -195 -196 603 262 -45 -354 -66 781 -290 -562 302 -158 -213 -347
3359 -347 -182 358 -726 -473 349 -264 -20 -271 -262 519 -327 -603 477 234 -104 70 19 577 -151 -88 721
3380 721 209 -222 -86 -64 509 -211 -559 583 -357 -401 349 99 224 -424 -553 625 73 -517 82 -141
3400 -141 264 -169 -376 361 128 -374 232 166 202 -144 -287 512 159 -331 117 112 186 -176 -503 758 -75
3421 -75 -677 231 1 -131 -204 -742 553 190 -557 149 -108 -1 132 -211 644 4 -583 233 511 158
3441 158 -111 -83 635 235 -619 413 242 74 23 -21 412 -202 -674 226 161 -170 -336 -232 220 26 -716
3462 -716 425 20 -402 131 46 236 -35 -439 494 422 -85 177 -68 152 114 -174 317 218 -363 111 -9
3483 -9 231 -63 -774 203 380 -441 127 -85 324 224 -347 203 164 -931 33 149 65 -57 -732 436 508
3504 508 -372 318 237 199 212 -154 379 252 -552 54 335 -67 -54 -708 154 415 -789 65 98 -303 16
3525 16 -156 311 95 -647 48 450 -47 -6 -198 273 432 -500 223 471 -152 -55 -8 298 248 -401 285 485
3547 485 -227 -254 -130 113 10 -291 185 250 -368 -378 109 220 -22 -438 111 485 -500 27 -40 48 253 -455
3569 -455 266 279 -642 -114 295 166 199 -531 484 414 -426 -165 175 -147 -5 -215 177 338 -712 -331
3589 -331 199 240 -34 -456 138 334 -558 139 355 -128 109 -318 89 251 -524 -8 510 -45 129 -76
3609 -76 148 446 -447 -115 532 -232 -244 -300 217 423 -580 -64 511 20 -23 -249 131 79 -435 97 475
3630 475 -187 -283 165 174 567 -586 -232 348 49 71 194 -54 192 -313 -128 410 -633 -280 118 218 46
3651 46 -442 -79 448 -503 -9 37 8 258 -378 -136 433 -305 -260 266 279 320 -191 -106 580 -130 -44 201 -35
3674 -35 -96 -250 129 447 -465 -228 279 187 -154 -369 -166 196 -312 -337 285 -304 -134 -95 173 529 -288 -377
3696 -377 450 46 -7 110 -52 354 25 -207 390 -96 -391 -123 28 423 -258 -517 230 45 -63 -131 43
3717 43 -55 -386 -103 353 -316 -502 141 64 305 -317 -261 456 267 61 6 169 143 -123 -189 404 -110 -420
3739 -420 380 93 132 -255 -289 426 -236 -463 292 -132 -79 -192 -231 611 -46 -732 211 181 -65 -104 -124 491
3761 491 -9 -97 605 215 -222 -265 -86 727 -12 -561 60 67 225 76 -271 176 -162 -290 292 34 -450
3782 -450 -260 -68 329 -40 -655 192 120 -287 112 -41 183 220 -454 515 231 -372 144 154 132 -142 -458
3803 -458 395 -13 -112 232 -11 192 -137 -293 455 282 -543 -100 -9 133 25 -310 439 130 -356 282 202
3824 202 -19 -7 -370 375 134 -657 162 302 179 32 -445 245 13 -394 381 65 -289 -56 -25 262 117
3845 117 -623 -116 79 -140 96 -221 135 25 -213 60 330 -287 -118 -52 293 90 -332 380 186 -224
3865 -224 262 171 82 185 -265 118 41 -374 -62 -24 117 -152 -485 0 168 -370 -227 15 240 65 -313
3886 -313 329 284 -398 -74 3 109 246 -347 153 303 -221 237 444 -39 142 -388 -43 280 -717 -180 320
3907 320 -220 106 -314 135 66 -364 -44 -46 -17 28 -199 129 497 -344 -129 299 217 262 150 199 358 -401 -73
3930 -73 359 -108 101 -86 63 334 -383 -87 375 -57 -28 4 62 299 -482 79 365 -64 -210 -53 158
3951 158 319 -343 -134 274 -97 -2 24 346 166 -378 146 506 -243 -124 -20 111 34 -238 -213 279 -352
3972 -352 -348 211 134 -36 -500 19 469 -247 -395 81 106 269 -141 184 466 -446 -39 340 286 175 -189 -107
3994 -107 485 -176 -184 232 18 -106 -463 14 112 -273 -316 362 44 -213 -285 24 351 -149 -261 437 -179 -33
4016 -33 -68 99 323 -339 -201 457 19 -58 -91 145 414 -201 -405 388 48 -312 165 38 353 -260 -138
4037 -138 387 -23 -244 -7 -15 128 -215 -158 435 33 -291 173 -55 52 -261 -237 530 114 -293 436 22
4058 22 432 -63 -179 197 -298 -266 -7 142 165 -335 -244 162 -81 -363 124 -94 94 -83 -261 331 -328
4079 -328 -262 378 102 95 -109 -69 324 -45 -372 400 154 -23 -21 -84 445 -48 -281 425 -180 45 -300 -74
4101 -74 154 -354 -403 142 -121 -166 -25 -125 228 -35 -176 405 254 126 -33 -133 235 -75 10 218 139 -202
4123 -202 164 125 134 -196 -407 201 162 -439 99 21 177 71 -318 459 -36 -333 -150 -120 65 -174 -310 329
4145 329 171 -315 41 59 26 86 -141 415 84 -189 375 29 353 51 -368 388 303 -223 61 24 -399 -87
4167 -87 -145 200 -79 -616 119 55 -77 -33 -208 335 157 -576 83 166 -155 -19 -48 571 39 -225 349 327
4189 327 -111 165 -127 264 85 -422 480 161 -334 -48 -51 190 -69 -395 333 337 -310 88 -25 -12 -14 -348
4211 -348 7 293 -419 -42 194 199 -27 -172 299 71 -568 -49 125 21 -113 -76 30 193 -368 -95 -7
4232 -7 -15 -180 -96 -16 16 -265 36 51 -86 -95 -288 210 353 -275 -18 334 92 132 -125 273 257 -321 203 498
4256 498 -120 -41 -33 150 199 -552 49 322 -108 167 22 182 267 -308 31 213 -345 183 79 58 153 -239
4278 -239 72 297 -73 90 193 164 203 -127 148 269 -248 -122 50 187 153 -65 -163 342 -456 -97 460
4299 460 -56 -4 -403 31 243 -20 43 34 3 55 -182 43 518 -128 -72 172 16 174 -218 213 446 -268
4321 -268 -42 124 119 -123 -246 -149 223 -333 -62 483 -125 -139 -98 155 167 -308 -161 136 199 46 -94 48
4343 48 -138 -98 210 374 76 47 -13 122 86 -73 39 165 28 166 223 67 -61 -226 -66 176 -134 -280
4365 -280 105 -170 239 -202 18 327 -122 -349 105 156 -23 91 45 587 -238 -138 125 175 34 -11 -88 379
4387 379 -228 -259 68 -299 0 -319 -226 377 -97 -506 -101 164 229 -272 -210 146 -156 -236 268 105 37 -373
4409 -373 -273 426 -78 -467 307 365 215 149 -214 97 -253 -169 353 1 -245 -223 -108 262 -203 -229 72 108
4431 108 45 -171 -86 -26 -405 -279 220 209 -279 61 225 437 117 -92 468 216 -126 93 45 96 42 -46 330
4454 330 145 -140 -5 136 138 -200 -334 120 -81 -169 -8 95 143 78 -247 355 -224 -305 36 -87 50 185
4476 185 -164 186 74 -85 39 141 187 15 3 311 54 -155 -14 -84 -122 -160 12 8 80 -127 65 -76 -135
4499 -135 -152 7 242 78 -553 165 132 -188 223 -29 105 179 58 124 257 -167 151 -70 37 28 -386 63
4521 63 75 -355 136 -141 88 -164 -343 118 6 -286 46 116 175 196 -180 53 145 -163 308 203 -61 92
4543 92 -124 61 102 96 -66 30 -63 -90 -140 31 255 -197 201 -135 -166 -177 -168 -10 379 -157 -56 -25 -80 11 35
4568 35 376 -59 -150 134 172 -1 40 -153 156 227 -198 1 156 46 -111 -237 243 -26 -269 -94 335 -184
4590 -184 -24 -261 206 68 -328 30 112 -229 30 87 130 -85 -210 213 264 -59 -42 91 269 -42 -367 209
4612 209 67 -167 -126 166 -111 16 -155 -96 339 -177 -161 75 -65 173 -210 -39 325 -19 40 347 -75
4633 -75 27 -347 -12 357 -229 6 65 -65 231 126 93 149 -296 -219 273 -288 10 -292 -150 201 -335 -24
4655 -24 -126 -61 37 -253 140 153 -158 -246 257 -65 104 2 -60 285 -411 -176 406 -201 -70 -41 169 -32
4677 -32 -193 -10 257 -82 -183 -138 78 51 -212 -225 129 -238 -347 54 -93 143 -185 -66 587 -5 -29 -31
4699 -31 35 226 -88 45 356 -196 -103 220 251 125 -279 -78 333 -433 48 199 -8 51 -84 -40 14 -86
4721 -86 -262 138 35 23 -65 -149 343 209 2 231 45 -152 -77 80 272 -174 -139 169 42 -204 -144 119
4743 119 60 -30 -129 29 38 -120 -41 -180 -69 -335 -12 247 -23 -171 5 104 112 -19 -123 302 -17 -156 174
4766 174 7 -127 26 34 144 59 -48 84 -43 -18 139 -14 40 -165 -181 -44 106 51 -273 -134 146 100 -365
4789 -365 -64 50 59 170 -35 124 98 -225 209 195 -115 -36 220 198 -139 -150 46 138 -100 -184 -197 246 -115
4812 -115 -423 25 -61 139 -49 -111 160 19 -122 184 386 -293 -116 -153 167 40 -379 244 -127 -152 -26
4833 -26 60 198 -12 -268 143 -35 -179 1 -62 98 -44 -205 132 98 -194 44 5 199 -26 -203 126 12
4855 12 -208 -91 91 108 -79 -28 44 160 -22 132 -198 33 -199 -9 263 85 -244 9 142 -193 -110 -149
4877 -149 75 -138 -371 151 -44 -97 -246 -76 219 55 -284 7 176 -42 214 -27 204 94 -70 337
4897 337 98 -133 -102 109 102 98 -305 7 193 -150 47 -82 81 42 -302 201 125 -130 -298 -143 217 -220
4919 -220 -121 156 58 -196 227 -8 76 52 -206 -60 211 -294 -34 144 198 -78 -191 140 20 -138 79 -167
4941 -167 -21 -212 -329 -25 230 -302 -29 235 -111 -2 -74 158 352 -246 184 200 -20 167 -196 145 469
4962 469 -6 69 257 70 255 -168 -40 57 14 4 6 -131 -39 32 37 172 -252 15 96 -125 -234 60 285 327
4986 327 -151 -322 219 99 123 33 127 99 -188 44 46 -118 -46 117 -16 58 -199 -23 124 -121 -197 -181 29
5009 29 75 -315 -147 318 -3 -132 230 -136 -60 -3 -54 462 19 -14 -13 65 20 -33 -122 267 -92 141 164 58
5033 58 -149 -175 -173 127 -223 -84 150 67 56 -254 -20 20 -337 -37 59 282 32 -30 40 182 -18 -23 168 162 -15
5058 -15 -31 35 -20 2 -190 112 107 39 -45 -26 31 -212 89 85 -112 20 37 63 232 -47 33 90 -137 -217 -139 -90 -61
5085 -61 -135 90 270 30 -155 -50 -54 30 -227 -58 35 -19 -24 20 -74 79 -49 -78 177 -65 -153 59 -82 -237
5109 -237 -338 -198 241 -269 -86 211 125 42 205 -154 323 136 -161 332 75 167 35 -183 255 -21 -80
5130 -80 182 47 8 101 138 200 -46 -136 -14 -159 33 -99 117 150 -2 -125 221 170 -39 38 -28 1 -138 -215
5154 -215 227 158 -141 -85 94 148 -67 97 106 173 -63 -223 -29 238 -83 -202 39 83 -146 -25 95 200
5176 200 -55 -77 33 221 -8 72 64 84 -62 -149 241 -8 -162 12 153 -65 -160 2 108 -22 -207 112
5198 112 73 232 -125 -346 -104 -65 -146 -41 -19 -24 -235 123 211 14 -291 77 -28 -116 131 -40 304 209 -50
5221 -50 97 236 -128 39 -78 101 -14 -143 201 -88 -190 -47 -94 -62 51 -199 -22 114 -211 36 -17
5242 -17 87 63 -123 84 332 -83 -97 107 8 12 -151 -15 75 -39 62 158 -133 -37 28 63 124 -272 76 -13
5266 -13 -110 150 -80 158 -79 -181 1 81 121 67 -289 48 74 -236 -65 -54 125 -81 23 56 149 -51 98
5289 98 65 -293 95 -129 182 -26 -111 -33 79 -51 4 71 3 57 -449 -124 131 -210 -274 -82 79 73 -8 70
5313 70 173 -17 -91 24 94 19 -71 17 227 -23 104 30 -118 -24 -142 -116 63 -37 119 66 89 118 -68 103
5337 103 321 -219 127 286 77 83 -170 38 44 -173 -64 67 240 39 -85 -12 -4 -110 -166 74 20 -210 -81
5360 -81 117 146 -201 -197 99 45 16 -166 -146 109 -210 -49 226 -58 143 18 -58 300 -5 138 303 67 -137
5383 -137 -75 1 147 -31 -38 83 25 -165 -39 -111 233 -210 -149 -82 1 84 185 32 66 103 -123 209 -138 -37
5407 -37 -45 108 72 -195 -71 160 145 -153 -124 -11 151 21 -302 290 69 -22 249 122 81 -113 -169 153 -189
5430 -189 -102 57 -67 33 -131 -10 -5 -36 -260 249 56 -302 -106 -133 31 12 -39 -58 60 -14 -74 -16 43 -312
5454 -312 -185 9 175 -10 -9 131 65 -170 -27 -27 100 -12 76 148 79 33 -42 41 85 -5 -3 -2 150 189 -32 104
5480 104 -59 -203 -125 154 -173 -15 -212 224 -22 75 -22 -78 -63 -118 16 225 -171 -256 -174 -70 128 -60 -126
5503 -126 218 -32 10 225 42 71 44 -123 116 103 -75 120 -64 62 -145 -240 79 -98 -183 200 -119 -47
5525 -47 -23 53 -48 -98 -259 208 158 28 132 161 27 105 -154 2 159 -157 171 -101 194 32 -112 179
5547 179 42 95 15 -130 128 193 -194 142 -11 -176 -156 -306 132 -81 -330 -105 -176 -35 -28 -30 304 142 -88
5570 -88 -20 -1 -113 166 -193 316 14 -289 128 -66 -62 150 109 131 233 -53 96 53 3 76 37 -96 83 -323
5594 -323 -56 94 -49 -132 236 -164 -165 -83 213 161 -177 194 154 111 -43 -74 114 157 15 154 -5 64 40 5
5618 5 -121 -32 -92 33 -3 65 53 10 148 183 -125 83 21 -88 194 113 1 40 -112 173 60 -131 -181 193
5642 193 192 24 -143 -17 -14 -96 -98 -96 -22 27 -122 16 32 -264 22 -76 -122 147 -197 -91 214 -224 166 39 77
5667 77 -13 -53 88 156 -132 -77 183 50 125 -255 332 368 173 111 289 -115 100 -65 -58 108 -211 -82 83
5690 83 -148 -56 -118 -70 -41 -10 -55 144 -38 -44 -100 -18 221 17 -74 30 60 -77 -35 67 162 -240 -284 -3 -74 -15
5716 -15 -123 -68 -215 -28 -177 99 -139 121 -91 25 80 -5 97 69 -84 -98 23 -233 208 -106 53 93
5738 93 -76 -131 102 27 54 199 46 86 -343 29 -65 -22 -24 -165 -74 317 -47 26 19 83 -156 -19 -43 52 27 -50
5764 -50 77 -62 61 4 -93 149 -219 -24 -48 238 136 -48 -81 132 -139 -91 163 39 -59 19 -147 104 85
5787 85 -128 323 168 -14 164 135 -24 -233 -203 122 -11 -57 87 120 70 247 -107 205 -203 -61 -35 -199
5809 -199 16 90 -46 137 -86 71 -15 -62 -108 -151 21 -195 -158 -103 -35 82 -15 -20 13 189 41 38 -91 -31 89
5834 89 -111 -372 46 -161 151 128 -44 -133 -8 -38 168 91 259 11 -116 60 -53 22 49 -42 -168 56 82
5857 82 -14 -249 46 163 -57 -262 83 -27 -98 12 67 -68 24 -28 61 120 -181 -119 -78 -11 1 -187 338 66
5881 66 -94 -181 -12 -23 148 -235 113 112 -180 95 40 189 31 54 -131 203 -138 -133 47 5 55 -403 170 59
5905 59 -135 -74 94 87 -70 -131 -146 -73 -27 78 -201 -79 26 -34 -158 89 -239 -123 -105 -97 80 15 112 39 -24
5930 -24 -185 96 -95 2 -252 150 204 -277 1 -8 -10 -68 -124 -16 -175 1 -107 199 64 19 -155 87 31 -214
5954 -214 11 156 -209 -111 108 146 -150 -172 105 25 -148 8 -85 -98 79 -9 -107 -70 14 101 56 287 -42 -92
5978 -92 -157 109 -165 -24 186 -89 5 -112 -168 -19 180 -112 83 -179 22 -72 60 253 -102 -126 196 -205
6000 -205 -4 85 48 54 -35 27 90 -52 -130 48 225 71 -48 -218 -114 -155 -5 -67 -13 20 -328 168 46 116
6024 116 111 143 97 30 89 -58 22 49 103 -22 -281 80 -136 -43 165 3 51 -227 172 -100 -93 15 -28 -40 -91
6049 -91 -10 151 306 -250 124 204 -96 -40 -162 -10 108 -145 57 67 -85 -133 11 298 5 -172 -128 71
6071 71 -122 -14 129 -98 -37 -141 -72 -43 -175 78 91 57 16 -111 -23 107 114 -45 114 -30 -127 105 243 45
6095 45 -142 -144 1 -32 -252 128 -108 -192 10 -15 159 141 -155 177 171 204 64 23 157 -27 80 144 -76 80
6119 80 205 -59 160 -262 -41 -205 51 172 -119 -163 9 146 -125 -47 -61 131 -247 -29 263 148 12
6140 12 -87 -56 161 -26 -313 -5 -96 -52 -113 -68 205 -77 -67 190 115 -20 38 96 200 127 -151 97 -2 -81 277
6165 277 -335 -101 -96 -113 108 -82 -277 160 78 39 34 26 106 138 18 176 61 38 61 -44 93 104 238 66 75
6190 75 -146 -90 -56 -68 36 -56 -73 87 -200 41 -98 -62 -24 -93 155 -143 92 145 -51 -138 103 91 464 51
6214 51 115 62 198 162 159 -4 40 135 39 -99 1 45 -20 -50 114 58 -49 27 44 77 -16 -23 4 -192 -151 157 -164
6241 -164 -139 -5 -54 78 53 -84 -79 -3 -55 71 -157 -53 -41 -100 40 -182 106 -146 -134 51 113 -253 12 -63
6265 -63 26 22 35 4 -76 -190 -66 131 -235 -45 -121 12 241 -43 42 437 122 -39 66 16 9 -255 -248 118 -95
6290 -95 207 -202 -36 -55 -17 140 107 -141 -45 73 188 66 -90 -71 190 -130 -15 -261 2 179 -61 -2
6312 -2 -100 -33 13 -119 -2 173 -19 -269 116 -22 -72 20 109 78 286 43 22 -25 -55 77 43 -28 -243 -263 -100
6337 -100 -54 -144 98 4 -163 51 30 119 -63 89 11 -9 111 -25 -21 198 3 19 -111 -66 -195 111 105 -32
6361 -32 -136 86 84 -59 -181 -246 114 -53 -295 -121 26 -121 -115 63 186 210 32 77 223 21 81 103 19 165
6385 165 -39 -128 348 -74 -107 59 -4 65 -173 81 132 -64 123 64 -35 -93 -57 -55 78 -4 181 84 67 84 35
6410 35 115 38 30 -405 50 197 -98 69 -17 249 1 -47 207 23 49 -162 -104 213 -3 -100 -19 -187 189 86
6434 86 -224 296 -64 -197 3 -29 83 107 111 173 -29 -39 -22 198 109 -29 112 97 -271 -94 296 -200 -75
6457 -75 46 39 165 -123 -149 17 -76 -213 61 163 128 57 -162 47 -124 -87 44 41 117 -93 -66 110 195 67
6481 67 -168 86 3 227 148 40 -15 -99 125 87 154 -130 11 43 179 -156 49 226 122 -424 -178 250 -12
6504 -12 -236 303 186 -137 -45 83 85 -129 -145 205 64 -152 164 -168 38 37 -11 -212 -160 14 -216 165 42
6527 42 -203 -100 45 77 73 -94 -184 133 -168 -130 -21 24 24 186 115 170 168 -105 71 80 -90 -141 65 131 -180 -194
6553 -194 87 -46 33 25 76 58 -114 -59 78 -33 -72 -104 -100 43 94 -124 -69 65 -122 31 -35 -123 -27 -149 178
6578 178 127 -49 -1 127 -152 -43 46 19 110 30 81 31 87 39 36 67 -119 -73 -2 21 -124 241 -31 105 -22
6603 -22 26 177 395 -103 58 -123 -161 -86 -82 -91 -85 -139 15 -52 -57 71 -107 139 -66 -44 -81 32 11 157 134 78
6629 78 103 27 -411 -23 65 35 -133 76 -7 127 -106 -6 -160 28 33 132 171 -159 147 -55 -80 84 -161 130
6653 130 -92 49 -111 30 -241 -169 -18 -38 58 -37 -62 -64 6 140 24 -80 -140 99 -155 25 320 -68 93
6676 93 -192 112 -71 -153 11 55 -203 -124 -85 125 -112 -19 -26 -96 57 36 -100 163 -40 81 49 234 -26 -212
6700 -212 104 151 59 -122 85 35 -16 140 -108 304 -28 -100 -95 -67 175 -62 132 69 -56 3 49 5 -84 100
6724 100 101 -49 -68 39 231 119 -54 -142 -27 147 -206 169 302 -248 -31 159 -132 27 -170 -48 -174
6745 -174 -49 86 86 109 -218 0 148 87 -4 -1 -32 -84 13 105 102 85 67 -50 135 54 100 -220 32 215 135 -60
6771 -60 -8 14 161 23 54 -10 -146 -3 105 96 36 36 -228 132 73 15 -212 -14 0 180 124 131 62 -12 19 -37 -53
6798 -53 -38 89 90 -58 35 304 -77 -27 102 -148 -106 -170 -130 298 60 -13 -136 158 43 51 -129 125 25 42
6822 42 191 135 -148 -218 40 -85 54 -133 -35 34 58 43 7 336 99 -248 201 82 -176 -96 -174 230 79
6845 79 -56 119 -69 51 238 188 -232 192 -81 94 128 3 -1 -139 -130 61 -164 120 -25 -150 94 -17
6867 -17 46 12 -15 57 -179 -45 -50 -53 45 82 -311 -32 -17 -274 135 112 26 19 -109 301 47 -16 252 163 -8 125
6893 125 175 165 -36 -56 3 -47 -112 32 113 -62 -148 -1 19 6 -21 -14 52 49 83 -52 211 124 33 79 -107 202 94
6920 94 -151 98 331 68 -107 118 120 13 -30 49 115 64 -92 -35 -174 13 -158 82 4 -45 165 121 157 -73
6944 -73 -277 45 -199 -24 -6 -44 158 -226 -208 116 -66 -39 59 21 -51 117 -118 106 -33 -75 25 40 -9 -9
6968 -9 158 37 50 -156 49 -258 118 -95 -212 -38 85 -361 -151 -8 124 166 -95 88 166 83 -64 -1
6990 -1 -222 -83 150 -93 94 -129 -40 176 -104 49 -19 -30 -43 162 228 -93 130 -139 -52 34 191 -104 84
7013 84 -52 -203 104 -114 -143 106 -108 68 39 -11 -37 -5 -25 110 -4 -47 -59 -125 -197 -35 37 -55 -140 -96 2
7038 2 -115 -33 4 134 10 -197 178 295 -117 -90 90 166 194 -223 -23 304 -107 -50 208 76 99 66 -215
7061 -215 -41 -332 -209 -36 -85 -87 66 103 10 137 -36 17 139 -37 -146 63 54 -436 53 187 35 29 -282
7084 -282 17 -9 -22 -141 129 21 0 55 38 134 103 -77 -18 -90 -9 45 45 37 -114 28 -82 -231 -111 -34 1 113
7110 113 18 67 240 -121 -88 127 49 142 -152 -33 99 85 16 41 67 -31 -126 -37 300 -101 -139 4 336 96
7134 96 -82 -59 84 -15 -306 115 233 46 197 -51 101 -8 -201 25 -32 44 -29 40 102 26 47 -33 -95 -45
7158 -45 113 -51 6 101 44 217 1 -125 -179 92 -54 -154 -213 14 33 94 133 18 202 -5 114 10 -260
7181 -260 39 141 50 195 -5 55 174 24 -102 117 -150 80 -222 13 77 -48 -12 -34 -163 3 -55 -203
7203 -203 113 22 17 100 72 41 164 -277 306 -92 -45 61 -127 32 -32 -75 79 -54 -2 14 126 39 11 59 141
7228 141 10 -280 14 57 -41 -56 146 -77 -182 -384 265 30 9 -99 -82 167 197 67 238 -151 78 -27
7250 -27 75 142 -139 -227 45 -57 133 22 -127 13 12 -22 156 -16 -133 -156 14 -9 66 -235 -52 -116 -242
7273 -242 -73 45 15 13 25 -68 123 -212 -172 233 -6 -56 -3 107 89 12 -129 30 -97 -91 -96 -101 66 -152 132
7298 132 167 -54 -180 93 -19 217 179 106 104 -173 -35 -12 125 -28 -25 140 42 9 108 62 -217 76 -96 271
7322 271 132 -107 57 99 128 -11 -100 -108 72 -23 -46 -220 -179 294 -96 12 -4 6 -54 139 117 125 -75 -33 143
7347 143 -106 31 -68 -58 3 -218 -22 -3 -205 -37 -65 120 93 -198 -18 157 -207 -241 46 140 -91 -116 -136
7370 -136 88 -148 39 -246 89 81 -132 124 73 35 110 155 110 156 52 -88 211 63 74 206 -302 -17 -105
7393 -105 132 -100 -326 61 193 -94 39 164 2 90 -97 -200 166 -382 -118 -44 3 80 32 -218 -183 -147
7415 -147 81 96 201 270 32 170 54 40 210 149 -12 12 -83 29 207 17 24 403 -31 34 -4 -208 202
7438 202 37 -14 167 -57 41 152 21 -178 45 -2 3 -13 67 -159 113 -132 23 28 82 134 103 161 73 -5 -275
7463 -275 -187 103 -147 -144 68 -157 166 66 -237 65 170 99 157 38 128 -103 53 156 -213 -172 148 30
7485 30 -3 -44 164 -69 52 18 -65 -132 75 77 22 -95 25 -31 -249 -27 22 225 -167 318 61 -56 -54 167
7509 167 -13 58 -143 -40 147 132 -234 -60 22 -61 8 -61 -51 -11 8 -128 183 -6 -37 113 6 -63 -47 114
7533 114 33 -145 28 226 97 -205 -88 191 -123 161 -49 84 248 -178 313 105 40 -198 -116 167 -150
7554 -150 -126 273 165 109 -23 51 47 39 -140 197 -22 241 -94 -154 60 -169 -54 78 71 -59 78 17 34 145
7578 145 -294 186 114 1 -87 -148 -126 -104 -100 137 -131 -21 97 -90 107 -63 -98 -43 172 -71 -279 -5 261
7601 261 -32 169 -27 92 41 -98 154 21 59 -149 41 -3 -137 -92 78 -13 55 -55 56 -40 146 -105
7623 -105 -103 -16 -91 -9 18 221 -39 181 -32 -106 15 49 298 97 -183 88 -32 104 60 56 20 48 16 -158 -214
7648 -214 -158 -16 -106 97 132 -152 166 -68 -34 -95 225 35 158 -69 19 -60 167 -1 -99 47 284 -118 -43
7671 -43 151 -44 -98 -202 64 -152 -179 -8 -68 -26 -111 92 -286 70 -51 -219 5 -124 -2 -1 -224 -83 -188
7694 -188 220 159 -74 163 -15 35 161 -249 -4 193 -283 115 -48 83 126 -178 57 -76 -3 -33 119 113
7716 113 203 86 212 -12 -297 -18 98 12 -138 -87 -34 -71 -110 240 260 121 -68 49 -104 -18 -271 -128 -36
7739 -36 19 81 -56 -70 68 -297 -87 295 -200 -137 212 -2 66 -25 -79 102 106 -58 139 -2 121 -26 -197
7762 -197 -162 -17 -42 274 95 169 -232 -135 181 242 -110 100 3 214 -67 83 35 -203 -50 194 2 85 109
7785 109 -83 6 -40 -31 239 65 100 -12 -261 -17 49 58 -317 -64 -195 66 131 279 -137 -114 67 45 174 238
7809 238 13 1 -76 110 19 132 -64 8 -42 89 120 -30 18 -177 -148 86 -230 -49 375 -137 159 -115 -269
7832 -269 -16 222 -11 -199 -9 -201 96 226 -315 352 -152 -129 -350 -158 38 234 200 -283 14 71 -30
7853 -30 76 151 -99 59 -75 240 100 88 7 -221 -30 -86 -526 218 86 -14 16 20 -161 63 -116 -12 23
7876 23 -496 -164 17 -200 261 223 -59 -44 -11 265 -98 -57 133 202 147 -3 -146 -306 172 163 -288 78 65
7899 65 46 -128 85 -61 -349 120 -109 -194 249 8 237 281 -348 210 -138 97 86 -218 21 -264 -278 -170
7921 -170 27 -49 316 -80 183 133 -84 268 141 33 -87 301 -24 -235 198 61 310 -113 130 -28 -31
7942 -31 143 193 22 352 84 204 170 98 -107 -47 152 172 4 -167 195 -66 230 -7 324 23 -56 224
7964 224 -153 -210 150 -269 -317 130 79 -144 34 -278 101 23 543 -99 -426 158 -46 -481 133 -11 -37 -24
7986 -24 -366 242 207 -328 -139 -229 -141 -124 -238 119 337 -66 150 -213 114 123 29 146 247 -218 -173 461 41
8009 41 117 -402 -376 -142 -56 19 -123 101 -36 -133 147 116 235 460 189 35 -84 -30 91 220 163 11 174
8032 174 -113 -333 52 -361 -324 7 -79 218 232 22 2 97 -18 78 268 -144 224 -99 147 -2 126 -62
8054 -62 -209 138 -3 183 207 -60 541 117 -75 381 -188 154 -45 124 -83 -102 10 562 -82 90 -213
8075 -213 -80 -109 163 163 114 84 348 457 155 477 32 297 23 3 -25 125 56 -161 -129 -15 276 -258 -309
8098 -309 51 152 -20 -70 -200 384 -262 -278 30 84 158 -102 0 10 -49 267 67 299 133 -16 -96 287
8120 287 -24 -108 644 -107 404 -180 -60 -168 237 -103 -116 207 -131 -83 -245 529 138 -216 -98 43 -12
8141 -12 106 339 326 139 -223 -454 33 207 185 122 24 -29 -35 60 -479 -123 147 -65 -253 -251 149 263 37 82
8165 82 -16 -280 170 -49 -257 -60 55 -250 -1 236 2 -210 -248 229 38 -22 -609 -131 -101 -200 -67 -11
8187 -11 224 -68 289 -87
8191h7
##END NTUPLES=NMR FID
##END=
