##TITLE=1H_CA-9026-3
 CDCl3
 8 sc, 
 29.06.2022
##JCAMPDX= 6.0         $$ Bruker NMR JCAMP-DX V2.0
##DATA TYPE= NMR SPECTRUM
##DATA CLASS= NTUPLES
##ORIGIN= UXNMR, Bruker Analytische Messtechnik GmbH
##OWNER= root
$$ XWIN-NMR		Version 3.5
$$ Wed Jun 29 15:49:31 2022 Russian Standard Time (UT+4h)  she@DPX200
##.OBSERVE FREQUENCY= 200.1313499994
##.OBSERVE NUCLEUS= ^1H
##.ACQUISITION MODE= SIMULTANEOUS
##.ACQUISITION SCHEME= undefined
##.AVERAGES= 8
##.DIGITISER RES= 18
##SPECTROMETER/DATA SYSTEM= spect
##.PULSE SEQUENCE= zg30
##.SOLVENT NAME= CDCl3
##.SHIFT REFERENCE= (INTERNAL, CDCl3, 0, 15.7447)
##AUDIT TRAIL= $$ (NUMBER, WHEN, WHO, WHERE, WHAT)
$$ ##TITLE= Audit trail, XWIN-NMR		Version 3.5
$$ ##JCAMPDX= 5.01
$$ ##ORIGIN= Bruker BioSpin GmbH
$$ ##OWNER= she
$$ F:/spectra/data/she/nmr/H-F/1/pdata/1/auditp.txt
$$ ##AUDIT TRAIL=  $$ (NUMBER, WHEN, WHO, WHERE, WHAT)
(   1,<2022-06-29 15:47:18.03 +0400>,<she>,<DPX200>,
      <created by zg, POWCHK disabled, PULCHK disabled
       configuration hash MD5:
       00 E9 B6 7A A2 85 ED C7 34 08 36 98 17 FE 4E 26
       data hash MD5: 16K
       E9 45 B0 8E D3 AE D6 9A C0 EF 06 23 89 08 FF 83>)
(   2,<2022-06-29 15:47:20.82 +0400>,<she>,<DPX200>,
      <Start of raw data processing
       efp BC_mod = 2 LB = 0.24 FT_mod = 6 PKNL = 1 PHC0 = -18041.33 PHC1 = 9.00069 SI = 16K 
       data hash MD5: 16K
       04 9B 81 11 EF 27 7E DB E3 F0 C5 04 2B AA 90 8E>)
(   3,<2022-06-29 15:47:34.54 +0400>,<she>,<DPX200>,
      <pk PHC0 = -3.248277 PHC1 = 0 
       data hash MD5: 16K
       1A 4D 35 B1 1C B4 4B BC 00 9F 26 DD 50 0D 56 8B>)
(   4,<2022-06-29 15:47:38.53 +0400>,<she>,<DPX200>,
      <abs ABSG = 5 
       data hash MD5: 16K
       21 58 27 6B 0B 7C 5C B2 61 02 FB DA BF 64 96 C4>)
$$ ##END=
$$ 
$$ hash MD5
$$ 18 4E 89 42 32 43 15 A2 A2 00 A5 5E EA CA 58 AD
##$RELAX= 
##$RELAX= 
##$RELAX= 
##$RELAX= 
##$RELAX= 
##$RELAX= 
$$ Bruker specific parameters
$$ --------------------------
##$DU= <F:/spectra>
##$EXPNO= 1
##$NAME= <H-F>
##$PROCNO= 1
##$TYPE= <nmr>
##$USER= <she>
##$AMP= (0..31)
100 100 100 100 100 100 100 100 100 100 100 100 100 100 100 100 100 100 
100 100 100 100 100 100 100 100 100 100 100 100 100 100 
##$AQSEQ= 0
##$AQ_mod= 1
##$AUNM= <au_zg>
##$AUTOPOS= <>
##$BF1= 200.13
##$BF2= 200.13
##$BF3= 200.13
##$BF4= 200.13
##$BF5= 200.13
##$BF6= 200.13
##$BF7= 200.13
##$BF8= 200.13
##$BYTORDA= 1
##$CFDGTYP= 0
##$CFRGTYP= 5
##$CHEMSTR= <none>
##$CNST= (0..31)
1 1 145 1 1 1 1 1 1 1 1 1 1 1 1 1 1 1 1 1 1 1 1 1 1 1 1 1 1 1 1 1 
##$CPDPRG= <>
##$CPDPRG1= <>
##$CPDPRG2= <>
##$CPDPRG3= <>
##$CPDPRG4= <mlev>
##$CPDPRG5= <mlev>
##$CPDPRG6= <mlev>
##$CPDPRG7= <mlev>
##$CPDPRG8= <mlev>
##$CPDPRGB= <>
##$CPDPRGT= <>
##$D= (0..31)
0 1.2 0 0 0 0 0 0 0 0.06 0 0.03 0 0 0 0 0.0002 0 0 0 0 0 0 0 0 0 0 0 0 
0 0 0 
##$DATE= 1656503237
##$DBL= (0..7)
120 120 120 120 120 120 120 120 
##$DBP= (0..7)
150 150 150 150 150 150 150 150 
##$DBP07= 0
##$DBPNAM0= <>
##$DBPNAM1= <>
##$DBPNAM2= <>
##$DBPNAM3= <>
##$DBPNAM4= <>
$$ [...]
##$SUBNAM2= <"">
##$SUBNAM3= <"">
##$SUBNAM4= <"">
##$SUBNAM5= <"">
##$SUBNAM6= <"">
##$SUBNAM7= <"">
##$SUBNAM8= <"">
##$SUBNAM9= <"">
##$SW= 18.0517283424941
##$SWIBOX= (0..15)
0 0 2 0 0 0 0 0 0 0 0 0 0 0 0 0 
##$SW_h= 3612.71676300578
##$TD= 16384
##$TD0= 1
##$TE= 0
##$TE2= 300
##$TE3= 300
##$TEG= 300
##$TL= (0..7)
0 120 120 120 120 120 120 120 
##$TP= (0..7)
150 150 150 150 150 150 150 150 
##$TP07= 0
##$TPNAME0= <>
##$TPNAME1= <>
##$TPNAME2= <>
##$TPNAME3= <>
##$TPNAME4= <>
##$TPNAME5= <>
##$TPNAME6= <>
##$TPNAME7= <>
##$TPOAL= (0..7)
0.5 0.5 0.5 0.5 0.5 0.5 0.5 0.5 
##$TPOFFS= (0..7)
0 0 0 0 0 0 0 0 
##$TUNHIN= 0
##$TUNHOUT= 0
##$TUNXOUT= 0
##$USERA1= <user>
##$USERA2= <user>
##$USERA3= <user>
##$USERA4= <user>
##$USERA5= <user>
##$V9= 5
##$VALIST= <valist>
##$VCLIST= <CCCCCCCCCCCCCCC>
##$VD= 0
##$VDLIST= <DDDDDDDDDDDDDDD>
##$VPLIST= <PPPPPPPPPPPPPPP>
##$VTLIST= <TTTTTTTTTTTTTTT>
##$WBST= 1024
##$WBSW= 4
##$XGAIN= (0..3)
0 0 0 0 
##$XL= 0
##$YL= 0
##$YMAX_a= 392385
##$YMIN_a= -665105
##$ZGOPTNS= <>
##$ZL1= 120
##$ZL2= 120
##$ZL3= 120
##$ZL4= 120
##$ABSF1= 15.73366
##$ABSF2= -2.31819
##$ABSG= 5
##$ABSL= 3
##$ALPHA= 0
##$AQORDER= 0
##$ASSFAC= 0
##$ASSFACI= 0
##$ASSFACX= 0
##$ASSWID= 0
##$AUNMP= <proc_1d>
##$AZFE= 0.1
##$AZFW= 0.1
##$BCFW= 0
##$BC_mod= 2
##$BYTORDP= 0
##$COROFFS= 0
##$CY= -3
##$DATMOD= 1
##$DC= 0
##$DFILT= <>
##$DTYPP= 0
##$F1P= 0
##$F2P= 0
##$FCOR= 1
##$FTSIZE= 16384
##$FT_mod= 6
##$GAMMA= 0
##$GB= 0
##$INTBC= 1
##$INTSCL= 0
##$ISEN= 128
##$LB= 0.24
##$LEV0= 0
##$LPBIN= 0
##$MAXI= 10000
##$MC2= 0
##$MEAN= 0
##$ME_mod= 0
##$MI= 1.114404
##$NCOEF= 0
##$NC_proc= -6
##$NLEV= 6
##$NOISF1= 3.799351
##$NOISF2= 2.8
##$NSP= 0
##$NTH_PI= 0
##$NZP= 0
##$OFFSET= 15.74469
##$PC= 1
##$PHC0= -18044.58
##$PHC1= 9.00069
##$PH_mod= 1
##$PKNL= yes
##$PPARMOD= 0
##$PSCAL= 0
##$PSIGN= 0
##$REVERSE= no
##$SF= 200.130005373002
##$SI= 16384
##$SIGF1= 3
##$SIGF2= 2
##$SINO= 5.538805
##$SIOLD= 16384
##$SREGLST= <1H.CDCl3>
##$SSB= 0
##$STSI= 16384
##$STSR= 0
##$SW_p= 3612.71676300578
##$SYMM= 0
##$S_DEV= 0
##$TDeff= 16384
##$TDoff= 0
##$TI= <>
##$TILT= no
##$TM1= 0
##$TM2= 0
##$TOPLEV= 0
##$USERP1= <user>
##$USERP2= <user>
##$USERP3= <user>
##$USERP4= <user>
##$USERP5= <user>
##$WDW= 1
##$XDIM= 16384
##$YMAX_p= 344490899
##$YMIN_p= -389667
$$ End of Bruker specific parameters
$$ ---------------------------------
##NTUPLES= NMR SPECTRUM
##VAR_NAME=  FREQUENCY,     SPECTRUM/REAL,   SPECTRUM/IMAG
##SYMBOL=    X,             R,               I
##VAR_TYPE=  INDEPENDENT,   DEPENDENT,       DEPENDENT
##VAR_FORM=  AFFN,          ASDF,            ASDF
##VAR_DIM=   16384,         16384,           16384
##UNITS=     HZ,            ARBITRARY UNITS, ARBITRARY UNITS
##FACTOR=    0.220516191357247, 1,           1
##FIRST=     3150.98488256988, 0,            0
##LAST=      -461.731880435897, 0,           0
##MIN=       -461.731880435897, -389667,     0
##MAX=       3150.98488256988, 344490899,    0
$$ Real data points
##PAGE= N=1
##DATA TABLE= (X++(R..R)), XYDATA
$$ [...]
7014E3443628n989006m943571m200720l778820l002602k610892k446467j945793
$$ 53443628 47454622 42511051 38310331 34531511 31528909 28918017 26471550 24525757
7006B4525757j855236j536273j352193j114621j042518j051112q12003p82120
$$ 24525757 22670521 21134248 19782055 18667434 17624916 16573804 15761801 14979681
6998A4979681p22222p54626n01208m99922m09752m95465o37596l21211m11712
$$ 14979681 14257459 13502833 13001625 12501703 12091951 11596486 10958890 10637679 10225967
6989A0225967m96063l05659k68465m91206k01520k87412l50284l23188j69120
$$ 10225967 9729904 9424245 9155780 8664574 8463054 8175642 7825358 7502170 7333050
6980G333050j89573j33937r0676k31751k05033k88129l2666k83357p0635L2760
$$ 7333050 7143477 7009540 6918864 6687113 6482080 6193951 6161285 5877928 5807293 5840053
6970E840053k28048k42390k34768k4771q8365j66531j40761l2151K5121p6282
$$ 5840053 5612005 5369615 5134847 5110076 5021711 4855180 4714419 4682268 4707389 4631107
6960D631107j71014Q916m5075j33934p9833k7582o2581R433k8851k48993k0861
$$ 4631107 4460093 4469009 4423934 4290000 4210167 4182585 4120004 4129437 4100586 3851593 3830732
6949C830732n6524N0754l2978q8255j16640J10165J6396j34347n1807n6918j918
$$ 3830732 3774208 3824962 3791984 3703729 3587089 3697254 3713650 3579303 3527496 3470578 3468660
6938C468660P3235r5690m4326m9327j83571m2051M1394j30208m0746K9169j01490
$$ 3468660 3541895 3446205 3401879 3352552 3168981 3126930 3168324 3038116 2997370 3026539 2925049
6927B925049p4680j03558K7996J17806j0460q3157r35j16456k693j30114J607
$$ 2925049 2850369 2746811 2774807 2892613 2882153 2798996 2798061 2681605 2678912 2548798 2550405
6916B550405j852n665q3519j0126J6084j4907R7311j24292J20052o7451O5701
$$ 2550405 2548553 2542888 2459369 2449243 2465327 2450420 2547731 2423439 2543491 2476040 2541741
6905B541741R9537r920j39682Q6948l9886k849j58694R485J40537M6150k5016
$$ 2541741 2641278 2631358 2491676 2578624 2538738 2535889 2377195 2386680 2527217 2573367 2548351
6894B548351n7700J6049j88053R5362J30663J7422o5547k1812O1234l5091L8730
$$ 2548351 2490651 2506700 2318647 2414009 2544672 2562094 2496547 2474735 2535969 2500878 2539608
6883B539608M986o631k3125J103M0464K7562r3810r7523K652K2693O6285P0781
$$ 2539608 2544594 2537963 2514838 2515941 2556405 2583967 2490157 2392634 2395286 2417979 2484264 2555045
6871B555045j23087p0862O394O2673N5016L628Q1960o2722j05274j52920J41845
$$ 2555045 2431958 2361096 2367490 2430163 2485179 2488807 2570767 2508045 2402771 2249851 2391696
6860B391696J23604k8843K1357O1262k5753l4663l6294N8300J0589j64443J88396
$$ 2391696 2515300 2486457 2507814 2569076 2543323 2508660 2472366 2530666 2541255 2376812 2565208
6849B565208Q5950J584P5017m8835P8311j1943j5184J48983n5210j13004j9945
$$ 2565208 2651158 2652742 2727759 2678924 2757235 2745292 2730108 2879091 2823881 2710877 2690932
6838B690932J10212K43136O6629j28521M4645K26814l8757m9694n7979j34593
$$ 2690932 2801144 3044280 3110909 2982388 3027033 3253847 3215090 3165396 3107417 2972824
6828B972824p9455K7134j68058M2114J205k30384o4350J3082O4105R6390q1100
$$ 2972824 2893369 2920503 2752445 2794559 2795764 2565380 2501030 2514112 2578217 2674607 2593507
6817B593507L1876J668k05186Q1818R5694j35011L3235j9476Q177r5117m954J97467
$$ 2593507 2625383 2627051 2421865 2503683 2599377 2464366 2497601 2478125 2486302 2391185 2386231 2583698
6805B583698j15511m9773K29461p8770J01721l9120j05504R806r2077j5336L6242
$$ 2583698 2468187 2418414 2647875 2569105 2670826 2631706 2526202 2536008 2443931 2428595 2464837
6794B464837Q8810p8187J8898L0041j05888j08966L1722O9458N4731m5587k3578
$$ 2464837 2553647 2475460 2494358 2524399 2418511 2309545 2341267 2410725 2465456 2419869 2396291
6783B396291n3756k0197k943K54241J38931j07520m5149n2512r1713j44141L1491
$$ 2396291 2342535 2322338 2319395 2573636 2712567 2605047 2559898 2507386 2415673 2271532 2303023
6772B303023Q1839Q4419j1644L4221m1106r7424n9564N2213L1091n4060k6388
$$ 2303023 2384862 2469281 2457637 2491858 2450752 2353328 2293764 2345977 2377068 2323008 2296620
6761B296620O951J5460N7909P5066m8709j86552M7098q876L5509M5336J0492Q9583
$$ 2296620 2303571 2319031 2376940 2452006 2403297 2216745 2263843 2254967 2290476 2335812 2346304 2435887
6749B435887Q994o5263J6574L4983j29101l7074Q0609r1207K6945J35554o9292
$$ 2435887 2444881 2379618 2396192 2431175 2302074 2265000 2345609 2254402 2281347 2416901 2347609
6738B347609k3397N5591j06606k306m9984Q2453J18728r9401O103O1295J15067
$$ 2347609 2324212 2379803 2273197 2270891 2220907 2303360 2422088 2322687 2328790 2390085 2505152
6727B505152q5981j03761m4903J44494Q5762m0312j53524J36904L6139l5682j64975
$$ 2505152 2419171 2315410 2270507 2415001 2500763 2460451 2306927 2443831 2479970 2444288 2279313
6716B279313J25827M7567n4390j07541K580N6661n0129p2063J69545k9444M6489
$$ 2279313 2405140 2452707 2398317 2290776 2293356 2350017 2299888 2227825 2397370 2367926 2414415
6705B414415l8560l8921J47106j43022J48191o4055n6644J03407J30205j39130
$$ 2414415 2375855 2336934 2484040 2341018 2489209 2425154 2368510 2471917 2602122 2462992
6695B462992J53q0815K5748J54489J14253O7554j23877p0696q3357J27904K1695
$$ 2462992 2463145 2382330 2408078 2562567 2676820 2744374 2620497 2549801 2466444 2594348 2616043
6684B616043j37255k131J91218K4325r0230L8069J73628o2598j42711O6867L8291
$$ 2616043 2478788 2476657 2667875 2692200 2601970 2640039 2813667 2751069 2608358 2675225 2713516
6673B713516K9439q1342j3431R2860k8290n3587R902J10155K2377J3043j20892
$$ 2713516 2742955 2661613 2648182 2741042 2712752 2659165 2669067 2779222 2801599 2814642 2693750
6662B693750k7149R7137o6308O5790R7161J1212Q803l4177N0346r489r7860J47679
$$ 2693750 2666601 2763738 2697430 2763220 2860381 2871593 2880396 2846219 2896565 2887076 2789216 2936895
6650B936895M9850P9349j32109n5557J17835r854q0236m7765M6246Q0674O1956
$$ 2936895 2986745 3066094 2933985 2878428 2996263 2986409 2906173 2858408 2904654 2985328 3047284
6639C047284l6457N1219K0967N0405p1744K633J35892O3697j55097O9781K65002
$$ 3047284 3010827 3062046 3083013 3133418 3061674 3064307 3200199 3263896 3108799 3178580 3443582
6628C443582p3824J2653p3953Q3396J73643n6169M8069J30293O3Q2353J24372
$$ 3443582 3369758 3382411 3308458 3391854 3565497 3509328 3557397 3687690 3687753 3770106 3894478
6617C894478j67637r0664l6883J2579Q5538k20492L5961Q2383K13910k9597j30005
$$ 3894478 3726841 3636177 3599294 3611873 3697411 3476919 3512880 3595263 3809173 3779576 3649571
6606C649571K5709J15126Q2406p2535o7588q9682K05867J13012L1413n5063K10329
$$ 3649571 3675280 3790406 3872812 3800277 3732689 3643007 3848874 3961886 3993299 3938236 4148565
6595D148565N1473j53292M7580Q1686J24588m0539K3840n9001R6336J38144J45202
$$ 4148565 4200038 4046746 4094326 4176012 4300600 4260061 4283901 4224900 4321236 4459380 4604582
6584D604582l6434j06865n8387O1878M8265O1285J07681K5228R8352M8343J38177
$$ 4604582 4568148 4461283 4402896 4464774 4513039 4574324 4682005 4707233 4805585 4853928 4992105
6573D992105J42255K49557J64126J26739K67417K41560L04509K76857K40203K80848
$$ 4992105 5134360 5383917 5548043 5674782 5942199 6183759 6488268 6765125 7005328 7286176
6563G286176J72589M4655j29152j35360p7790j81679j18277k14385k6510j53170
$$ 7286176 7458765 7503420 7374268 7238908 7161118 6979439 6861162 6646777 6620267 6467097
6553F467097j20150J20513J48372J14535m2946m9038K33222K17796J59094L38901
$$ 6467097 6346947 6467460 6615832 6730367 6687421 6638383 6871605 7089401 7248495 7587396
6543G587396K56693M54965N61017M44019M32038O53157N21933O48297M21135K71337
$$ 7587396 7844089 8299054 8860071 9304090 9736128 10389285 10911218 11559515 11980650 12251987
6533A2251987p6008k41449m58001o31750m25761m73284n52314l76969j66377k58861
$$ 12251987 12175979 11934530 11476529 10844779 10419018 9945734 9393420 9016451 8850074 8591213
6523H591213j79750O3379r0080p4510P2113K12061K81053J17762M27446M73431
$$ 8591213 8411463 8474842 8384762 8310252 8382365 8594426 8875479 8993241 9420687 9894118
6513I894118L33969O37312P56025O62205N28567O24185P22427M10030L1817l77969
$$ 9894118 10228087 10865399 11621424 12283629 12812196 13436381 14158808 14568838 14600655 14222686
6503A4222686n24455p40049r06268q21911o59778n69244m60636n77548k30975
$$ 14222686 13698231 12958182 12051914 11230003 10570225 10000981 9540345 8962797 8731822
6494H731822j55921j76471k40779n5285r4717J30674J64851o2416K55178K61830
$$ 8731822 8575901 8399430 8158651 8103366 8008649 8139323 8304174 8241758 8496936 8758766
6484H758766M14958N14676M26564L71498M57800M66488K72004R7705j65534n20009
$$ 8758766 9173724 9688400 10114964 10486462 10944262 11410750 11682754 11780459 11614925 11094916
6474A1094916l70997o14056p52979p12038n54521n32055l69285j63691k37235
$$ 11094916 10723919 10109863 9356884 8644846 8090325 7558270 7188985 7025294 6788059
6465F788059l42704j43689j12740r7961p1654Q6490j47523L7169J34899P1393
$$ 6788059 6445355 6301666 6188926 6090965 6019311 6105801 5958278 5995447 6130346 6201739
6455F201739M9819J86929Q6442K94314K74179k7684q006j67412j82131k36431
$$ 6201739 6251558 6438487 6524929 6819243 7093422 7065738 7057732 6890320 6708189 6471758
6445F471758k42447m56556j81797j96137k20909k20120o0950j55963k40728j58009
$$ 6471758 6229311 5772755 5590958 5394821 5173912 4953792 4892842 4736879 4496151 4338142
6435D338142j52586J06878p3012r9329m7308j14869J8223M8495m9528k0426J04884
$$ 4338142 4185556 4292434 4219422 4120093 4072785 3957916 3976139 4024634 3975106 3954680 4059564
6424D059564q9808O882l7024n1014J61127o7523j62969j07081P6921L8282o0064
$$ 4059564 3969756 3976638 3939614 3888600 4049727 3982204 3819235 3712154 3789075 3827357 3767293
6413C767293j33878r7628j19717o5041l4391j29232l5014L4544J80328k4242J54533
$$ 3767293 3633415 3535787 3416070 3351029 3316638 3187406 3152392 3186936 3367264 3343022 3497555
6402C497555j06987j68851o2255N5737j18928r8710O9012P2924J92163p0627j57010
$$ 3497555 3390568 3221717 3159462 3215199 3096271 2997561 3066573 3139497 3331660 3261033 3104023
6391C104023M2165o3650o7588O3408o3167j10985O8232J68608Q1795n7092q010
$$ 3104023 3146188 3082538 3014950 3078358 3015191 2904206 2972438 3141046 3222841 3165749 3157739
6380C157739m5260P670j67308j1274Q4802Q5470Q1195j82175l9918N8943Q3973
$$ 3157739 3112479 3120149 2952841 2941567 3026369 3111839 3193034 3010859 2970941 3029884 3113857
6369C113857M8433r0218M503o6534j666P124J12599J2531P6797N3452r8725m9371
$$ 3113857 3162290 3072072 3076575 3010041 3008375 3015499 3128098 3140629 3217426 3270878 3172153 3122782
6357C122782o7032n0080O6550N8927k3993J29755r3023n2448n3226L3984p5141
$$ 3122782 3055750 3005670 3072220 3131147 3107154 3236909 3143886 3091438 3038212 3072196 2997055
6346B997055Q8673L0158j07704l1270R084M5479p4274J23699p0363p9180J35389
$$ 2997055 3085728 3115886 3008182 2976912 2985996 3031475 2957201 3080900 3010537 2931357 3066746
6335C066746m96J08091l0574K0134o6537R9340o1858k3542N4087l481N1328K8748
$$ 3066746 3066250 3174341 3143767 3163901 3097364 3196704 3134846 3111304 3165391 3161910 3213238 3241986
6323C241986p6467Q2834j9131q9523k6767Q5526p9222j0086N0633m0834n5336
$$ 3241986 3165519 3248353 3229222 3139699 3112932 3198458 3119236 3109150 3159783 3118949 3063613
6312C063613J5946L563l9355j6738K4246J11441l603k5176j61J222j02385K04594
$$ 3063613 3079559 3083122 3043767 3027029 3051275 3162716 3159113 3133937 3133776 3134998 3032613 3237207
6300C237207O9069j20874O3461m497j22403j5405J3066R4741j7336j33608r8626
$$ 3237207 3306276 3185402 3248863 3244366 3121963 3106558 3119624 3214365 3197029 3063421 2964795
6289B964795J25424L7515L3792J12160J28023r5255p2580j01100O1426L5813Q3341
$$ 2964795 3090219 3127734 3161526 3273686 3401709 3306454 3233874 3132774 3194200 3230013 3313354
6278C313354q8822k7814l7926K53514j1145k6009M5121r1336K9970j70899l0678
$$ 3313354 3224532 3196718 3158792 3412306 3401161 3375152 3420273 3328937 3358907 3188008 3157330
6267C157330J68879J92471q6927J3877j69714l0788J23437K535l2615m8804Q1355
$$ 3157330 3326209 3518680 3431753 3445630 3275916 3245128 3368565 3371100 3338485 3289681 3371036
6256C371036Q6877o2174N8842J20812q1926j26371M3864P8755J41932j13983p7889
$$ 3371036 3457913 3395739 3454581 3575393 3493467 3367096 3410960 3489715 3631647 3517664 3439775
6245C439775P2639J15796j81829J09822P1671m7307l7333R2265Q4012j29883k0021
$$ 3439775 3512414 3628210 3446381 3556203 3627874 3580567 3543234 3635499 3719511 3589628 3569607
6234C569607Q521p5154R3769O3293j16730M1012P7148Q6896q0188k8533K08012
$$ 3569607 3578128 3502974 3596743 3660036 3543306 3584318 3661466 3748362 3668174 3639641 3847653
6223C847653o2790J29487M4578J35374j57519j21334J25159j3598q2442Q3695
$$ 3847653 3784863 3914350 3958928 4094302 3936783 3815449 3940608 3927010 3844568 3928263
6213C928263J18313j36466M860J13297l388k17766J07639L5289k8493m91P3889
$$ 3928263 4046576 3910110 3914970 4028267 4024879 3807113 3914752 3950041 3921548 3921057 3994946
6202C994946J3538N2413N1536J6780N8215k0602r4709J37622l5026j6125J2693
$$ 3994946 4008484 4060897 4112433 4129213 4187428 4166826 4072117 4209739 4174713 4158588 4171281
6191D171281N5226P2791J63751o3968K6598L0444P4330J3046j71840J52511Q0766
$$ 4171281 4226507 4299298 4463049 4399081 4425679 4456123 4530453 4543499 4371659 4524170 4604936
6180D604936l1797j20277P1003P0964Q5090K52255P3333j14975P5729J32479K37941
$$ 4604936 4573139 4452862 4523865 4594829 4679919 4932174 5005507 4890532 4966261 5098740 5336681
6169E336681J41120M656L2084J00545J92141J17483K53056K29820K35322K12844
$$ 5336681 5477801 5482457 5514541 5615086 5807227 5924710 6177766 6407586 6642908 6855752
6159F855752N24872M06534L76606L69071N72217O17178M55760K52822Q9433l11529
$$ 6855752 7380624 7787158 8163764 8532835 9105052 9722230 10177990 10430812 10520245 10208716
6149A0208716k22563l12468o68807n91311n43134m34354n63500m23278l328J743
$$ 10208716 9986153 9673685 9004878 8413567 7870433 7436079 6872579 6449301 6445973 6447716
6139F447716k18915j40580j39926j60133k58703o6119j14447O4159J2387r6360
$$ 6447716 6228801 6088221 5948295 5788162 5529459 5463340 5348893 5413052 5425439 5329079
6129E329079N6607j10872l9041j9953p3171N9949k01534k7537l071j49130j1137
$$ 5329079 5385686 5274814 5235773 5215820 5142649 5202598 5001064 4973527 4970456 4821326 4810189
6118D810189J28761Q4747p0916J8144j8858j70756m0139l8800N0236M6021o9254
$$ 4810189 4938950 5023697 4952781 4970925 4952067 4781311 4741172 4702372 4752608 4798629 4729375
6107D729375j12184J41199p709q6688l1081j54734J05691j0260R8504L6695K6365
$$ 4729375 4617191 4758390 4750681 4663993 4632912 4478178 4583869 4573609 4672113 4708808 4735173
6096D735173j25571j0026Q0015j14724j35799p6738Q5350Q4003P0390R9102j1050
$$ 4735173 4609602 4599576 4679591 4564867 4429068 4352330 4437680 4521683 4592073 4691175 4680125
6085D680125j10779l9300P8670J37575K5095j10449r4309J8283L5036J92834l7099
$$ 4680125 4569346 4530046 4608716 4746291 4771386 4660937 4566628 4584911 4619947 4812781 4775682
6074D775682o9753k03793Q0746N8533J69414O2370o9848j893m5456J4322j7249
$$ 4775682 4705929 4502136 4582882 4641415 4810829 4873199 4803351 4801458 4756002 4770324 4753075
6063D753075J21670N6563k4178R8416r68P3284n4279n2059J26716j15467k2262
$$ 4753075 4874745 4931308 4907130 5005546 5004578 5077862 5023583 4971524 5098240 4982773 4960511
6052D960511J52749J04933N6409R727j07668J8896K8971J44880J04932k07482
$$ 4960511 5113260 5218193 5274602 5284329 5176661 5195557 5224528 5369408 5474340 5266858
6042E266858o1199J37621O6110Q3290J10094n1247R6884q7350K3961M6144l3101
$$ 5266858 5205659 5343280 5409390 5492680 5602774 5551527 5648411 5561061 5585022 5631166 5598065
6031E598065N4330J45562K37092Q2320N260J629O8880l7677j55525q8382O3114
$$ 5598065 5652395 5797957 6035049 6117369 6122629 6124258 6193138 6155461 5999936 5911554 5974668
6020E974668o0057J79842j3350n5599n1325m489j08025L1792J29563K3109M7162
$$ 5974668 5914611 6094453 6081103 6025504 5974179 5969690 5861665 5893457 6023020 6046129 6093291
6009F093291R6979M6279M6731o6789L942j00808N9939J42293J49574N2905O7946
$$ 6093291 6190270 6236549 6283280 6216491 6220433 6119625 6179564 6321857 6471431 6524336 6592282
5998F592282K9336k9126j25373j7861K41715P5759o1821J84367J40314j0719Q8521
$$ 6592282 6621618 6592492 6467119 6449258 6690973 6766732 6704911 6889278 7029592 7018873 7107394
5987G107394K799n585K5459K20966K0849P3584J74839p3442R4976K27773J1912
$$ 7107394 7110193 7104608 7130067 7351033 7371882 7445466 7620305 7546863 7641839 7869612 7881524
5976G881524l3969J12542J24138J2032K02451J24178o4593J16729R3900l2770
$$ 7881524 7847555 7960097 8084235 8096267 8298718 8422896 8358303 8475032 8568932 8536162
5966H536162L63228J74114K5159R129J46741J52597J71146M4895n5702J42662
$$ 8536162 8899390 9073504 9098663 9107792 9254533 9407130 9578276 9623171 9567469 9710131
5956I710131J29056J29061K44049R2397J20828J18261L05496K35554N7151J56458
$$ 9710131 9839187 9968248 10212297 10304694 10425522 10543783 10849279 11084833 11141984 11298442
5946A1298442L10318K10415J19701L63251K17520K4958J46188K63798J99571K01634
$$ 11298442 11608760 11819175 11938876 12302127 12519647 12544605 12690793 12954591 13154162 13355796
5936A3355796L35485K87586K05297K76711L41682L98745L01359L99400K67829
$$ 13355796 13691281 13978867 14184164 14460875 14802557 15201302 15502661 15902061 16169890
5927A6169890M53224N15512N13125N22372O00975N92286O39190P67577P61449
$$ 16169890 16623114 17138626 17651751 18174123 18775098 19367384 20006574 20774151 21535600
5918B1535600R83857J167583R45771J291918J538554J497472J244361J349976
$$ 21535600 22519457 23687040 24632811 25924729 27463283 28960755 30205116 31555092
5910C1555092J174895N64886K97471j6685j96088j93600q8450n434P9898K99547
$$ 31555092 32729987 33294873 33592344 33575659 33379571 33185971 33097521 33092087 33171985 33471532
5900C3471532O46974P47036R36335J060644J038451Q94388Q96738R92134J034295
$$ 33471532 34118506 34865542 35801877 36862521 37900972 38795360 39692098 40684232 41718527
5891D1718527P31871N37720K92994Q2088k71813m55775m49235l71052n99967o39656
$$ 41718527 42450398 42988118 43281112 43363200 43091387 42635612 42186377 41815325 41215358 40575702
5881D0575702l40924m46997m07601l81719l15471j14939j18131N2370M16498N46774
$$ 40575702 40234778 39787781 39380180 38998461 38682990 38568051 38449920 38502290 38918788 39465562
5871C9465562O98889P07699O35919N38009j4585l81583p71065j192462j099090
$$ 39465562 40164451 40872150 41508069 42046078 42031493 41649910 40878845 39686383 38587293
5862C8587293j212197j343226j064618q06278p87625l80965l57043j08017J27696
$$ 38587293 37375096 36031870 34967252 34160974 33373349 32992384 32635341 32527324 32655020
5853C2655020K49936K77797K19338M33780N31574P05126O60169P26716P52522
$$ 32655020 32904956 33182753 33402091 33835871 34367445 35072571 35732740 36459456 37211978
5844C7211978J137798J239011J314955J642177J790419J741004K000760K310246
$$ 37211978 38349776 39588787 40903742 42545919 44336338 46077342 48078102 50388348
5836E0388348K592869K925232L103450L098073L353783L324917L030164K443155
$$ 50388348 52981217 55906449 59009899 62107972 65461755 68786672 71816836 74259991
5828G4259991J835236J198248O93722L17493p0019j5527J39999K29390N62926
$$ 74259991 76095227 77293475 77987197 78304690 78234671 78219144 78359143 78588533 79151459
5819G9151459J219564J544676J858054K303930K762510L273720L322005L291089
$$ 79151459 80371023 81915699 83773753 86077683 88840193 92113913 95435918 98727007
5811I8727007L166464K506880J670844O68558k48712j104585j847310k404352
$$ 98727007 101893471 104400351 106071195 106739753 106491041 105386456 103539146 101134794
5803A01134794k759478l078166l097726k928193k777085k328273j813082j149685
$$ 101134794 98375316 95297150 92199424 89271231 86494146 84165873 82352791 81203106
5795H1203106n28299j3683K62219O21845Q49072P60385M10353N2274q60063j933490
$$ 81203106 80674807 80661124 80923343 81545188 82394260 83154645 83564998 83617272 82757209 80823719
5785H0823719k724120l856314m346348m740644m786022m749399m338171m066476
$$ 80823719 78099599 74243285 69896937 65156293 60370271 55620872 51282701 47216225
5777D7216225l458489l037304k612526k349930k115777j942815j631759j445736
$$ 47216225 43757736 40720432 38107906 35757976 33642199 31699384 30067625 28621889
5769B8621889j248121j089877j158008j017606p72562p11360q49182p48452p05927
$$ 28621889 27373768 26283891 25125883 24108277 23335715 22624355 21775173 21026721 20320794
5760B0320794m40273n96948n59038m91237m55153k69739m10218m02983n73025
$$ 20320794 19880521 19283573 18724535 18233298 17778145 17508406 17098188 16695205 16122180
5751A6122180k42393j58650k92840k73995l13526j62282j36744l44165k86095
$$ 16122180 15879787 15721137 15428297 15154302 14840776 14678494 14541750 14197585 13911490
5742A3911490l4906j29924k39960l36714o0659j88665j49133q4471k06662k36464
$$ 13911490 13876584 13746660 13506700 13169986 13109327 12920662 12771529 12687058 12480396 12243932
5732A2243932r3960k41724k1557p0209K9801K8191n8749N8667j0304l8459k20485
$$ 12243932 12149972 11908248 11886691 11816482 11846283 11874474 11815725 11874392 11864088 11825629 11605144
5721A1605144r8264k0310k4888J56709r151J5966k6110n1753K4310R5118K28221
$$ 11605144 11506880 11486570 11461682 11618391 11609240 11625206 11599096 11547343 11571653 11666771 11894992
5710A1894992N365p425J05516j60340J39300J80550j02090k903K0295r938O7655
$$ 11894992 11900357 11892932 11998448 11838108 11977408 12157958 12055868 12052965 12073260 12063322 12130977
5699A2130977m1345q9640j8860q9525J46580j1191J52199J11735O2729n713J72227
$$ 12130977 12089632 11999992 11981132 11891607 12038187 12026996 12179195 12290930 12353659 12347946 12520173
5688A2520173J83139P5815o8733Q1960J54669J52168O2185p4216n2730L8244K65168
$$ 12520173 12703312 12779127 12710394 12792354 12947023 13099191 13161376 13087160 13034430 13072674 13337842
5677A3337842J43672Q8078K5446J99480K49742K09473P6735J16873K61004J63381
$$ 13337842 13481514 13569592 13595038 13794518 14044260 14253733 14330468 14447341 14708345 14871726
5667A4871726K18007O8105L28745K98416M6481M7469K720L65234L02475K10910
$$ 14871726 15089733 15157838 15486583 15784999 15831480 15878949 15881669 16246903 16549378 16760288
5657A6760288L18551K44235K97692K67775L53473K32471Q5829N12490M04186K23373
$$ 16760288 17078839 17323074 17620766 17888541 18242014 18474485 18560314 19072804 19476990 19700363
5647A9700363L58809L78010L65409K98241L85066M20905M77608N05002M99637
$$ 19700363 20059172 20437182 20802591 21100832 21485898 21906803 22384411 22889413 23389050
5638B3389050M67943N90617N93604M10797O36152O68330O89142O57479O13052
$$ 23389050 23856993 24447610 25041214 25452011 26088163 26756493 27445635 28103114 28716166
5629B8716166O41122Q47264O52473P75430Q81726Q66122R72970J023158J115586
$$ 28716166 29357288 30204552 30857025 31632455 32514181 33380303 34353273 35376431 36492017
5620C6492017J242077J300764J405102J477127J790735J840824J996105K232109
$$ 36492017 37734094 39034858 40439960 41917087 43707822 45548646 47544751 49776860
5612D9776860K335663K547552L009642L133137L404691L835943M089901M241591
$$ 49776860 52112523 54660075 57669717 60802854 64207545 68043488 72133389 76374980
5604G6374980M132821M194689L605388K965296K255385J215435L18447l96217
$$ 76374980 80507801 84702490 88307878 91273174 93528559 94743994 95062441 94666224
5596I4666224j059356j091545j165782r31448o42714j90914N89004R43058J362589
$$ 94666224 93606868 92515323 91349541 90418093 89775379 89584465 90173469 91116527 92479116
5587I2479116J823728K120555K464932K352118K262630J979731J575871J057903
$$ 92479116 94302844 96423399 98888331 101240449 103503079 105482810 107058681 108116584
5579A08116584K51163o09393j591184k525823l102814l733523l905177l735515
$$ 108116584 108367747 107758354 106167170 103641347 100538533 96805010 92899833 89164318
5571H9164318l410621k974207k708708k042371j311076j020695q02840m05643
$$ 89164318 85753697 82779490 80070782 78028411 76717335 75696640 74893800 74488157
5563G4488157j41995p0507j54465k34830n70767j278493j748157k329159k805651
$$ 74488157 74346162 74275655 74121190 73886360 73315593 72037100 70288943 67959784 65154133
5554F5154133l023496l189254k985602k603690k465456k053096j788001j458543
$$ 65154133 62130637 58941383 55955781 53352091 50886635 48833539 47045538 45586995
5546D5586995j115173p97762q02299m80894k3235P857K89509N58607O57213P01749
$$ 45586995 44471822 43674060 42871761 42390867 42367632 42375489 42664998 43223605 43880818 44582567
5536D4582567J067242Q72307R27845N74689Q8431k05503n15996r21817p61260
$$ 44582567 45649809 46522116 47449961 48024650 48113081 47907578 47391582 46469765 45708505
5527D5708505q00557m41192l47892m19204K2240l8621J37948M12343K39476L17098
$$ 45708505 44907948 44466756 44118864 43699660 43721900 43683279 43821227 44233570 44473046 44790144
5517D4790144M05500L38452K44419K39269M39767J65131k0886m84623o41409p37510
$$ 44790144 45195644 45534096 45778515 46017784 46457551 46622682 46601796 46117173 45475764 44738254
5507D4738254j169696j203552j108693j239308j167878j093553j022807q62813
$$ 44738254 43568558 42365006 41256313 40017005 38849127 37755574 36732767 35869954
5499C5869954o54857o19648l66494m8651J7109J76950Q5040k39394q5712l82683
$$ 35869954 35215097 34595449 34228955 34180304 34197413 34374363 34459403 34220009 34134297 33751614
5489C3751614q44866j117451j503230j441536j427702j377858j272486j221043
$$ 33751614 32906748 31789297 30286067 28844531 27416829 26038971 24766485 23545442
5481B3545442j085747p91075o94039o89005n25524m56781l66724l96386j93585
$$ 23545442 22459695 21668620 20974581 20285576 19760052 19303271 18936547 18540161 18346576
5472A8346576k88594l44797l49987j87165j71898l42914j77945j33311o3326r3383
$$ 18346576 18057982 17713185 17363198 17176033 17004135 16661221 16483276 16349965 16286639 16193256
5462A6193256k39787o0000k9710M9077J9916L4775M1435q6939P3561J43019J74645
$$ 16193256 15953469 15893469 15863759 15912836 15932752 15967527 16008962 15922023 15995584 16138603 16313248
5451A6313248N2229J4378O6759K370o4731j1946j54666o6167q6142n2604Q1293
$$ 16313248 16365477 16379855 16446614 16448984 16384253 16372307 16217641 16151474 16065332 16012728 16094021
5440A6094021J45367L3953J62067K91680J66593J24395J90040K13679L36473J44006
$$ 16094021 16239388 16273341 16435408 16727088 16893681 17018076 17208116 17421795 17758268 17902274
5430A7902274J52557L26212M54760K81682K51643L57012J04799J46351J57680
$$ 17902274 18054831 18381043 18835803 19117485 19369128 19726140 19830939 19977290 20134970
5421B0134970m5591j05932j09896n8267j09051j94170j358j28990j95778j30185
$$ 20134970 20089379 19983447 19873551 19815284 19706233 19512063 19510705 19381715 19185937 19055752
5411A9055752K6325j53956k31389o6281Q9070J20832j05236J7871m1917o6107
$$ 19055752 19082077 18928121 18696732 18630451 18719521 18840353 18735117 18752988 18711071 18644964
5401A8644964J17579K2268k6024K53712K25026k8314Q257k33640l58977j19851
$$ 18644964 18762543 18784811 18758787 19012499 19237525 19209211 19217468 18983828 18624851 18505000
5391A8505000j64245m68959l37419m83870m36497l24163m24967k17243k12263
$$ 18505000 18340755 17871796 17534377 17050507 16614010 16289847 15864880 15647637 15435374
5382A5435374k63861k38583j73280o0892j44540k25576j61867k44899j03716j37944
$$ 15435374 15171513 14932930 14759650 14698758 14554218 14328642 14166775 13921876 13818160 13680216
5372A3680216j66954j36364p1622p3917M4410O014j24708r0293J80851Q3789l1155
$$ 13680216 13513262 13376898 13305276 13231359 13275769 13281783 13157075 13066782 13247633 13331422 13300267
5361A3300267J39164j34708o6114o5399k36968k83429l42474j81805j10416k51466
$$ 13300267 13439431 13304723 13238609 13173210 12936242 12652813 12310339 12128534 12018118 11766652
5351A1766652k94152j51410o8375M9160j16034j83406L2012J10741k9700n5924
$$ 11766652 11472500 11321090 11252715 11301875 11185841 11002435 11034447 11145188 11115488 11059564
5341A1059564r6971J7774J09450j61967J35790K6776K2436O2828j49316l6481
$$ 11059564 10962593 10980367 11089817 10927850 11063640 11090416 11112852 11175680 11026364 10989883
5331A0989883J4416O1421L3107j92225L8816j93106K1345K97n0960k22659K0567
$$ 10989883 11004299 11065720 11098827 10906602 10945418 10752312 10773657 10773954 10722994 10500335 10520902
5320A0520902J2205p8785J39017q6532j55885Q8735q804q7306j74618j40802K23828
$$ 10520902 10533107 10454322 10593339 10506807 10350922 10439657 10430853 10343547 10168929 10028127 10251955
5309A0251955j18992q4543n9433k7803k10969m3893J2277R801L9176r2678K7055
$$ 10251955 10132963 10048420 9988987 9961184 9750215 9706322 9718599 9728400 9767576 9674898 9701953
5298I701953J02824J01552R4968J42277K9226r793M5839N9397K48873L9854K49457
$$ 9701953 9804777 9906329 10001297 10143574 10172800 10163007 10208846 10268243 10517116 10556970 10806427
5287A0806427o5721k0146j80860N1449L2306k8715l6869J00386J58788k1469q5726
$$ 10806427 10740706 10720560 10539700 10591149 10623455 10594740 10557871 10658257 10817045 10795576 10709850
5276A0709850j00939k3179k44070r6249N0818P0266j90970J66809k4129l1894
$$ 10709850 10608911 10585732 10341662 10245413 10296231 10366497 10175527 10342336 10318207 10286313
5266A0286313R0857N7179K793r829P7544O6063J81203N5532K09711k790n4529
$$ 10286313 10377170 10434349 10437142 10427313 10504857 10570920 10752123 10807655 11017366 11014576 10960047
5255A0960047j00938j77534j52962k43404j13005m04409j68428k7074o3620j30669
$$ 10960047 10859109 10681575 10528613 10285209 10172204 9767795 9599367 9572293 9508673 9378004
5245I378004j5665q3348p0534J44666o5033J9647j45607m7942k1702m7048L2446
$$ 9378004 9362339 9278991 9208457 9353123 9288090 9307737 9162130 9114188 9092486 9045438 9077884
5234I077884q8803q9167q2246j23908j18868n3165r1419p8039l9442J14002r4650
$$ 9077884 8989081 8899914 8817668 8693760 8574892 8521727 8430308 8352269 8312827 8426829 8332179
5223H332179r9051r3810K2974k2927n7681k02678O9329J560o8994o1552j40288
$$ 8332179 8233128 8139318 8162292 8139365 8081684 7879006 7948335 7949895 7880901 7819349 7679061
5212G679061j37973M7350J68880k25057k38866J28671J8160J7434r3425r9468
$$ 7679061 7541088 7588438 7757318 7532261 7293395 7422066 7440226 7457660 7364235 7264767
5202G264767K7858L066K576Q2757N3944j88421R0940N3439j27638j5627n8004
$$ 7264767 7292625 7295691 7298267 7381024 7434968 7246547 7337487 7390926 7263288 7247661 7189657
5191G189657j34072L409j1872j17606R6756j3597n1391R1084J4936m7892p5669
$$ 7189657 7055585 7058994 7047122 6929516 7026272 7012675 6961284 7052368 7067304 7019412 6943743
5180F943743P6575P393r635N9336j3496j372K18561j60051O3233N0492K27645
$$ 6943743 7020318 7027711 7018076 7077412 7063916 7062544 7281105 7121054 7184287 7234779 7462424
5169G462424P5808N6642j15069P4826J19251l6502l7699k023K97868J02856N1088
$$ 7462424 7538232 7594874 7479805 7554631 7673882 7637380 7599681 7597658 7895526 7998382 8049470
5158H049470j6617K9691o7367J6724j689K10508N2441J93458J02989k12525n0200
$$ 8049470 8032853 8062544 7995177 8011901 8010212 8220720 8273161 8466619 8569608 8357083 8306883
5147H306883J25270r2254j65951M7124J21982J17708J2385O3109k0734R7638o2727
$$ 8306883 8432153 8339899 8173948 8221072 8343054 8460762 8473147 8536256 8515522 8613160 8550433
5136H550433j78171k4448l7335J07001N4065j75052m8872j01972j88944n0974
$$ 8550433 8372262 8347814 8310479 8417480 8471545 8296493 8247621 8145649 7956705 7905731
5126G905731j01100j6160k15723l02295L1291j74778J8080q2070K0343Q3096j62165
$$ 7905731 7804631 7788471 7572748 7270453 7301744 7126966 7145046 7062976 7083319 7166415 7004250
5115G004250q4012j94273j31591J1349j59785r9030j10324k08787j77351j20696
$$ 7004250 6920238 6725965 6594374 6605723 6445938 6346908 6236584 6027797 5850446 5729750
5105E729750r3131L006j15072o4781k43335l9594n4555j53098R5724p7482q9276
$$ 5729750 5636619 5639625 5524553 5459772 5216437 5176843 5122288 4969190 5064914 4987432 4898156
5094D898156L3743j01075j77223N8372n2209r3415p1475O2924n1474k8166j39821
$$ 4898156 4931899 4830824 4653601 4711973 4659764 4566349 4494874 4557798 4506324 4478158 4338337
5083D338337J81741l8575k18330q1119j65727P4155p4583j6708O5713k5798j3876
$$ 4338337 4520078 4481503 4263173 4182054 4016327 4090482 4015899 3999191 4064904 4039106 4025230
5072D025230R3804l4085j87757k13288m9662k26425j0386P0187O736p6949j32667
$$ 4025230 4119034 4084949 3897192 3683904 3634242 3407817 3397431 3467618 3474354 3397405 3264738
5061C264738K0205k5515K29711q7241l26462j95898J46273L1191m6748J786R4815
$$ 3264738 3284943 3259428 3489139 3401898 3075436 2879538 3025811 3057002 3010254 3012040 3106855
5050C106855k20189j89611R6175J53843j03526r5615k2022p2975K5248r720L3496
$$ 3106855 2886666 2697055 2793230 2947073 2843547 2747932 2725910 2652935 2678183 2668463 2701959
5039B701959L5321k00664p035J39249m8060r8113O5072Q1930m0771j54121n6550
$$ 2701959 2737280 2536616 2529581 2668830 2620770 2522657 2587729 2669659 2628888 2474767 2418217
5028B418217p9053l1096L5484J02664K8996m7402j52042n1253P6250n1267q3263
$$ 2418217 2339164 2308068 2343552 2446216 2475212 2427810 2275768 2224515 2300765 2249498 2166235
5017B166235l9679J06214P506k38863K25564l3325n2774P968J6465J2593n1183
$$ 2166235 2126556 2232770 2240276 2001413 2226977 2193652 2140878 2148846 2165311 2177904 2126721
5006B126721K0546j52273N024O1057l7152n9680P7152j6694P7700p0353Q0974
$$ 2126721 2147267 1994994 2000018 2061075 2023923 1964243 2041395 2024701 2102401 2032048 2113022
4995B113022m8820m8062k0609J1053m8730J94354q0239m7392m8956J18341j24033
$$ 2113022 2064202 2016140 1995531 2006584 1957854 2152208 2071969 2024577 1975621 2093962 1969929
4984A969929j5371j220q552K3677j28147Q5618M8760R4799l41j33035r8422J11753
$$ 1969929 1954558 1953338 1944786 1968463 1840316 1925934 1974694 2069493 2069152 1936117 1837695 1949448
4972A949448Q0991J01885j19861N3132J07723L7413j21644q3321q8211j5418K4760
$$ 1949448 2030439 2132324 2012463 2065595 2173318 2210731 2089087 2005766 1917555 1902137 1926897
4961A926897N1113Q7403p5489N4551r3934O8466P0669j50809J860J14841m1766
$$ 1926897 1978010 2065413 1989924 2044475 1950541 2019007 2089676 1938867 1940727 2055568 2013802
4950B013802M7373r5757p5145M7654p354M3826J0974J29044j9559J2744l3239
$$ 2013802 2061175 1965418 1890273 1937927 1930573 1974399 1985373 2114417 2094858 2107602 2074363
4939B074363O8987j51257j40052n3101O867K8061M3465k5785j02570J35769J12930
$$ 2074363 2143350 1992093 1852041 1798940 1805807 1833868 1877333 1851548 1748978 1884747 1997677
4928A997677O3205j3633r1255n3138O412R8234L6397p8733J12444p1090P8183
$$ 1997677 2060882 2047249 1955994 1902856 1909268 2007502 2043899 1965166 2077610 2006520 2084703
4917B084703l0958N6283L1314M2398l0458M03J51593N9362J3442J3696J22985
$$ 2084703 2053745 2110028 2141342 2183740 2153282 2153685 2305278 2364640 2378082 2391778 2514763
4906B514763j71147j74188J27052p64M70M3614k7479q6997k1870j59671Q7474
$$ 2514763 2343616 2169428 2296480 2295716 2296186 2339800 2312321 2225324 2203454 2043783 2131257
4895B131257K8608J7470r1788j09866j7783j19160m3534R3389m2383l4820o6732
$$ 2131257 2159865 2177335 2085547 1975681 1957898 1838738 1795204 1888593 1846210 1811390 1744658
4884A744658k42852Q1915J87430N1671j89864L0492m0172N7667J5948k9843j8197
$$ 1744658 1501806 1583721 1771151 1822822 1632958 1663450 1623278 1680945 1696893 1667050 1648853
4873A648853O5472l0814n8991j93382L3020J98168j82652P0081R352K11995j16189
$$ 1648853 1714325 1683511 1624520 1431138 1464158 1662326 1479674 1549755 1559107 1771102 1654913
4862A654913q1657m7848k9867N9958J26610r1214j63890Q0650P333m1924l1551
$$ 1654913 1573256 1525408 1495541 1555499 1682109 1590895 1427005 1507655 1514988 1473064 1441513
4851A441513J06683r4561N2378K3575k0916j74221J45624J44034j0790j68135
$$ 1441513 1548196 1453635 1506013 1529588 1508672 1334451 1480075 1624109 1613319 1445184
4841A445184P7147M2635k5937j1953r79j3241L6054q3322J45021M5691j05684
$$ 1445184 1522331 1564966 1539029 1527076 1526097 1512856 1548910 1465588 1610609 1656300 1550616
4830A550616q6382l430K3274N074k1772M5094j6597K5540N1282n462o8850N0436
$$ 1550616 1464234 1460804 1484078 1489152 1467380 1512474 1495877 1521417 1572699 1567237 1498387 1548823
4818A548823n6479M7377q7543J9705J24470K3795l6326k0377n7269L3027L1723
$$ 1548823 1492344 1539721 1452178 1471883 1596353 1620148 1583822 1563445 1506176 1539203 1570926
4807A570926O4335p9313j29773N9446k1548j1206M8170P1328n5977o5117p7823
$$ 1570926 1635261 1555948 1426175 1485621 1464073 1452867 1501037 1572365 1516388 1451271 1373448
4796A373448L0383J14604M8618m0306Q7072j37660R104k7668P2406P4789q5320
$$ 1373448 1403831 1518435 1567053 1526747 1613819 1476159 1485263 1457595 1530001 1604790 1519470
4785A519470l1190K9440O4657p4296P5578J18036k00595q1507J19742j0568K20697
$$ 1519470 1488280 1517720 1582377 1508081 1583659 1701695 1501100 1419593 1539335 1528767 1749464
4774A749464J40329n7754o7161M1699K26960O1360J51105r3745O7014q09J54186
$$ 1749464 1889793 1832039 1764878 1806577 2033537 2094897 2246002 2152257 2219271 2218462 2372648
4763B372648Q6102O2210l39774j65151N0178n6406J0701K3604j64798L3161o8041
$$ 2372648 2458750 2520960 2181186 2016035 2066213 2009807 2020508 2044112 1879314 1912475 1844434
4752A844434O329j46897M6183j738R571j1904k41620K0220J22854P6254J2863
$$ 1844434 1850763 1703866 1750049 1748311 1757882 1745978 1504358 1524578 1647432 1723686 1736549
4741A736549Q6785j0586Q9953q3076N3668J83391n7630r5356K2580J19825j13036
$$ 1736549 1823334 1812748 1902701 1819625 1873293 2056684 1999054 1903698 1926278 2046103 1933067
4730A933067O5880J81022J63642K0541o3634J58758j54940K4677K12382q2302
$$ 1933067 1998947 2179969 2343611 2364152 2300518 2459276 2304336 2329013 2541395 2459093
4720B459093n2276n971j80854k1379j95773p1240P0289l5919n7116o5074j93522
$$ 2459093 2406817 2400846 2219992 2198613 2002840 1931600 2001889 1965970 1908854 1843780 1650258
4709A650258p9477J75135K6252N342k6788N7259m1371q7683j0738O7806L0231
$$ 1650258 1570781 1745916 1772168 1777510 1750722 1807981 1766610 1678927 1668189 1735995 1766226
4698A766226k54476K4792J63942N6795L6605n0508l1021m0877J08082O7580P9168
$$ 1766226 1511750 1536542 1700484 1757279 1793884 1743376 1712355 1671478 1779560 1847140 1926308
4687A926308p2564j46421K9544J13196Q4718j50969n3862r6706q7868J40603J19722
$$ 1926308 1853744 1707323 1736867 1850063 1934781 1783812 1729950 1633244 1545376 1685979 1805701
4676A805701R126L666m0153P5381o5961J2520j2741K06857l7010j52516J30241
$$ 1805701 1814827 1818493 1778340 1853721 1787760 1800280 1787539 1994396 1957386 1804870 1935111
4665A935111J00456j79987k03930L1282J39568m1587R0378k3179l5392P1703l2927
$$ 1935111 2035567 1855580 1651650 1682932 1822500 1780913 1871291 1848112 1812720 1884423 1851496
4654A851496o1909J6291Q5572j5746R839K3620N8664K137J8698o685o8811l7345
$$ 1851496 1789587 1805878 1891450 1875704 1885543 1909163 1967827 1969964 1988662 1981977 1913166 1875821
4642A875821J88110J05754m2470L883l5002Q9329J64652K47286o5261q4220J21344
$$ 1875821 2063931 2169685 2127215 2131098 2096096 2185425 2350077 2597363 2532102 2447882 2569226
4631B569226l4507M545N4013n265k2058p9921j17144j83013p9186L1841O3297
$$ 2569226 2534719 2539264 2593277 2588012 2565954 2486033 2368889 2185876 2106690 2138531 2201828
4620B201828q0311k2114k8142n4964O564n8814J3355M799o7949M0304R5424J9855
$$ 2201828 2121517 2099403 2071261 2016297 2022861 1964047 1977402 1982201 1914252 1954556 2049980 2069835
4608B069835k4532m8828L4725n8048M9960q8850j85607k1525J64658Q4786p8044
$$ 2069835 2045303 1996475 2031200 1973152 2023112 1934262 1748655 1727130 1891788 1976574 1898530
4597A898530m0949j10472J54440L1596m8468N2262J30401J35420q4926j19482
$$ 1898530 1857581 1747109 1901549 1933145 1884677 1936939 2067340 2202760 2117834 1998352
4587A998352o1322J38756O6898q6096P204j43998N4628J18627M5366p6962M2500
$$ 1998352 1937030 2075786 2142684 2056588 2063792 1919794 1974422 2093049 2138415 2061453 2103953
4576B103953O0965j46013o4778j3531O7760L8741K0328M8928K5331j2615N6753
$$ 2103953 2164918 2018905 1954127 1940596 2008356 2047097 2067425 2116353 2141684 2129069 2185822
4565B185822p1977m0730J26609j1876j35656r5227p4823J47817P0086j4502N9268
$$ 2185822 2113845 2073115 2199724 2187848 2052192 1956965 1882142 2029959 2100045 2085543 2144811
4554B144811K2968j32497p7278J4902m2716R6698J21657r3688J5190N3066l3771
$$ 2144811 2167779 2035282 1958004 1972906 1930190 2026888 2148545 2054857 2070047 2123113 2089342
4543B089342l2770J03014J7115J9552k265L9433m6557M8743M826J16461m3689
$$ 2089342 2056572 2159586 2176701 2196253 2193988 2233421 2186864 2235607 2240433 2356894 2313205
4532B313205n1495J1579J04059p3091r978M077N4498q7272m388J03249K2103J2920
$$ 2313205 2261710 2273289 2377348 2304257 2294279 2298356 2352854 2265582 2261194 2364443 2386546 2399466
4520B399466K8815j04778k0721K8635R7883M6217P80P5058j37233K9913N9304
$$ 2399466 2428281 2323503 2302782 2331417 2429300 2475517 2476297 2551355 2414122 2444035 2503339
4509B503339K7136N6932J4267j04094K4560K14661Q6133l9442J35731j11894O3813
$$ 2503339 2530475 2587407 2601674 2497580 2522140 2736801 2822934 2783492 2919223 2807329 2871142
4498B871142Q9457j3043j73253R9854J39063n3155J02199M8546K2424R3572M8752
$$ 2871142 2960599 2947556 2774303 2874157 3013220 2960065 3062264 3110810 3133234 3226806 3275558
4487C275558j9136n6296J67469J57363K412r6010k7427J76248K28675L9263m1558
$$ 3275558 3256422 3200126 3367595 3524958 3527370 3431360 3403933 3580181 3808856 3848119 3806561
4476C806561O0172Q3976O4870J05562J32634J15668J13058J08655K6251n1680
$$ 3806561 3866733 3950709 4015579 4121141 4253775 4369443 4482501 4591156 4617407 4565727
4466D565727J04556N1961o5413p6973o3074j23247Q9232O4748q0180N546q6082
$$ 4565727 4670283 4722244 4656831 4579858 4516784 4393537 4482769 4547517 4467337 4472883 4386801
4455D386801N7447n1238P2675J28340K25178M8106J31998J10054N7660J52872
$$ 4386801 4444248 4393010 4465685 4594025 4819203 4867309 4999307 5109361 5167021 5319893
4445E319893J82938k1451J56847J74913J37193K09497p5662N6843p6740l30554
$$ 5319893 5502831 5481380 5638227 5813140 5950333 6159830 6084168 6141011 6064271 5733717
4435E733717o1455j82975j19600p4880p3115m4874j03203o1101j97847n1339J3981
$$ 5733717 5672262 5489287 5369687 5294807 5221692 5176818 5073615 5012514 4814667 4763328 4777309
4424D777309N730p3248J09085r1626k3553N9478J1185Q5018M9638r619n6309Q7345
$$ 4777309 4783039 4709791 4818876 4727250 4703697 4763175 4774360 4859378 4909016 4899397 4843088 4930433
4412D930433K4241j20826K60501R1508j07904k15192p9353R2130j24593j41933
$$ 4930433 4954674 4833848 5094349 5185857 5077953 4862761 4783408 4875538 4750945 4609012
4402D609012j34818Q255n7618j33879K3264R36k7432J47833R7166l8715j45246
$$ 4609012 4474194 4482449 4424831 4290952 4314216 4315152 4287720 4435553 4532719 4494004 4348758
4391D348758J72924K6816O5345J55834m1364N1892K0990J16666J18169O6118K07727
$$ 4348758 4521682 4548498 4613843 4769677 4728313 4780205 4801195 4917861 5036030 5102148 5309875
4380E309875J76656J82742K64103K27918K38274L58244J56764R4366K20711o7630
$$ 5309875 5486531 5669273 5933376 6161294 6399568 6757812 6914576 7008942 7229653 7162023
4370G162023j54772k82309k49106l05775k61995k03466o2283k18249j71027n3921
$$ 7162023 7007251 6724942 6475836 6170061 5908066 5704600 5642317 5424068 5253041 5199120
4360E199120o2895j0969J4894n2048j44787n4062O4872M8135p4583j8550m9119
$$ 5199120 5136225 5125256 5140150 5088102 4943315 4889253 4954125 5002260 4927677 4909127 4860008
4349D860008j0890k5392R9417Q8133K6264j15148M4812N5955M0822m9065J40192
$$ 4860008 4849118 4823726 4923143 5011276 5037540 4922392 4967204 5023159 5063981 5014916 5155108
4338E155108K1474P129K55883P9580n1468J6843L2174J8213O2719j42473J71726
$$ 5155108 5176582 5183711 5439594 5519174 5467706 5484549 5516723 5534936 5597655 5455182 5626908
4327E626908J03358k3162k0281M8478J27642j07812l8970J28747J00290N3506
$$ 5626908 5730266 5707104 5686823 5735301 5862943 5755131 5716161 5844908 5945198 5998704
4317E998704K1644K7079j43143j0577M1273J59977l3482k87499m8714K06793M5753
$$ 5998704 6020348 6047427 5904284 5893707 5934980 6094957 6061475 5773976 5725262 5932055 5977808
4306E977808P0429J72895o5467J39M9183m109n0098N762O1637Q4630P8901o7879
$$ 5977808 6048237 6221132 6155665 6155804 6204987 6200878 6150780 6156542 6218179 6302809 6381710 6313831
4294F313831J71642J45351K7601P6462K6401k1871J06218J14080J19058n4405
$$ 6313831 6485473 6630824 6658425 6734887 6761288 6739417 6845635 6959715 7078773 7024368
4284G024368O8083K38225R4046Q5875K3663O5667N548J25608J37995J06380J81923
$$ 7024368 7092451 7330676 7424722 7510597 7534260 7599927 7605475 7731083 7869078 7975458 8157381
4273H157381J08292J60240m3139m7467J90425m1561Q9031J78557N3432l9460J5825
$$ 8157381 8265673 8425913 8382774 8335307 8525732 8484171 8573202 8751759 8805191 8765731 8781556
4262H781556n2523J4707J68627L39563J1028n4952J75502j2598L226J29544K30573
$$ 8781556 8729033 8743740 8912367 9251930 9262958 9208006 9383508 9370910 9374136 9503680 9734253
4251I734253J27883J04935J49232K12740J0678O766J30915K83119J74798J87301
$$ 9734253 9862136 9967071 10116303 10329043 10339721 10346487 10477402 10760521 10935319 11122620
4241A1122620J62502J15908O3739M5065L21987R9426M5611J58623J84452J75999
$$ 11122620 11285122 11401030 11464769 11509834 11831821 11931247 11976858 12135481 12319933 12495932
4231A2495932K23686J23227L323L50064L64857K05077K83727L98040L54009K57730
$$ 12495932 12719618 12842845 12846168 13196232 13561089 13766166 14049893 14447933 14801942 15059672
4221A5059672K27116L56916M23306K76371L94506L91051K69050K74154L89986
$$ 15059672 15286788 15643704 16067010 16343381 16737887 17128938 17397988 17672142 18062128
4212A8062128L89180L61547M45859L43563J90792M28924K86566K89008M14326
$$ 18062128 18451308 18812855 19258714 19602277 19793069 20221993 20508559 20797567 21211893
4203B1211893L07336L62143J59516K21135L50817K42481L5314j48341R8612P1073
$$ 21211893 21519229 21881372 22040888 22262023 22612840 22855321 22890635 22742294 22840906 22911979
4193B2911979K4208m4749j16194n1066l3139l4637k6015m1928R805J1010J9185
$$ 22911979 22936187 22891438 22775244 22724178 22691039 22656402 22630387 22588459 22598264 22609274 22628459
4182B2628459k713j36842l0411K8453k024J06508P0611J23549J85265L8540M1540
$$ 22628459 22625746 22488904 22458493 22486946 22484922 22591430 22662041 22785590 22970855 23009395 23050935
4171B3050935J18400P4879L09547L04833L47987L66630K95430L90477L57279M22890
$$ 23050935 23169335 23244214 23553761 23858594 24206581 24573211 24868641 25259118 25616397 26039287
4161B6039287K51370L76417M70533L84856M01426L54582M99151M95266M07261
$$ 26039287 26290657 26667074 27137607 27522463 27923889 28278471 28777622 29272888 29680149
4152B9680149M87906M43350N50905N68702N77256L93767M96503O35971N82608
$$ 29680149 30168055 30611405 31162310 31731012 32308268 32702035 33198538 33834509 34417117
4143C4417117O55039O72693O44671M83796N39492N64319O16129P37250Q19835
$$ 34417117 35072156 35744849 36389520 36873316 37412808 37977127 38593256 39330506 40150341
4134D0150341O92430R17089Q37348J051126J181505J228150J267300J222779J171915
$$ 40150341 40842771 41759860 42597208 43648334 44829839 46057989 47325289 48548068 49719983
4125D9719983J343806J341265J455180J484139J432369J513444J751118J631424
$$ 49719983 51063789 52405054 53860234 55344373 56776742 58290186 60041304 61672728
4117F1672728J573521J649471J728642J926015J934841K225886K379683K495886
$$ 61672728 63246249 64895720 66624362 68550377 70485218 72711104 75090787 77586673
4109G7586673K715589K924161L190316L503545L795021M303888M608232M980643
$$ 77586673 80302262 83226423 86416739 89920284 93715305 98019193 102627425 107608068
4101A07608068N827384O562632O960593P972773R041150J0192081J1634584J3392973
$$ 107608068 113435452 119998084 126958677 134931450 143972600 154164681 165799265 179192238
4093A79192238J5009268J7206172J9412231K1595679K2777042K2865990K0854042
$$ 179192238 194201506 211407678 230819909 252415588 275192630 298058620 318912662
4086C18912662J6423974R154263l27912j0172538j8540706k3841775k5942010
$$ 318912662 335336636 344490899 344162987 333990449 315449743 291607968 265665958
4079B65665958k5655207k3475125k0676236j7614910j5017141j2681050j0647403
$$ 265665958 240010751 216535626 195859390 178244480 163227339 150546289 139898886
4072A39898886r345201p909678o843420o148624n412716m591834m291938l943074
$$ 139898886 130553685 122644007 115800587 109651963 104239247 99647413 95355475 91412401
4064I1412401l657393l190750k804175k545562k409990k159001k207290j984552
$$ 91412401 87755008 84564258 81760083 79214521 76804531 74645530 72438240 70453688
4056G0453688j725641j677581j484812j581680j541816j301775j093185j258265
$$ 70453688 68728047 67050466 65565654 63983974 62442158 61140383 60047198 58788933
4048E8788933r63255o52891n93207n73142l67240l05431j77730k46289K1547J10559
$$ 58788933 57825678 57172787 56579580 56006438 55639198 55333767 55156037 54909748 54931295 55041854
4038E5041854n5133l25859m26652p35420j033238j182738j156963r86039j190033
$$ 55041854 54986721 54660862 54234210 53498790 52465552 51282814 50125851 49139812 47949779
4029D7949779q92672o42405n09466o43770l98305j17150j08892k66451k39258
$$ 47949779 47057107 46414702 45905236 45261466 44863161 44746011 44637119 44370668 44131410
4020D4131410k20092l02263k66618l33444m54650o47417m52536n35996n11731
$$ 44131410 43911318 43609055 43342437 43008993 42554343 41906926 41454390 40918394 40406663
4011D0406663m81551l76948l59693n98686n46371l90270j22598k45220k79858
$$ 40406663 39925112 39548164 39188471 38589785 38043414 37653144 37530546 37285326 37005468
4002C7005468j42916M1780j93053r1997o3213k2365k0697j55890J7645j14519
$$ 37005468 36862552 36904332 36711279 36619282 36556069 36533704 36513007 36357117 36374762 36260243
3992C6260243j73831k1568m8773K13885J00351J09538J22320R4609L23168L77594
$$ 36260243 36086412 36064844 36016071 36229956 36330307 36439845 36562165 36656774 36979942 37357536
3982C7357536K79349L52764L49690L45313L91794L81871L40749L28735L71673
$$ 37357536 37636885 37989649 38339339 38684652 39076446 39458317 39799066 40127801 40499474
3973D0499474K00193J75002P5695P5045K05375K3952M7371j78582j16832k50054
$$ 40499474 40699667 40874669 40950364 41025409 41230784 41254736 41302107 41123525 41006693 40756639
3963D0756639j10014j70262k01927p7701M8461j61336j71853n6966L93283L46660
$$ 40756639 40646625 40476363 40274436 40196735 40245196 40083860 39912007 39855041 40248324 40594984
3953D0594984L20545L50549M53747P47037Q64768O32624O18988M47171K25668
$$ 40594984 40915529 41266078 41719825 42466862 43331630 43964254 44583242 45030413 45256081
3944D5256081J29629k07449m50088o69381n07615p60211n74023n43717l88005
$$ 45256081 45385710 45178261 44728173 44058792 43551177 42790966 42216943 41673226 41285221
3935D1285221l32208k14456j39144N0031L8145N7978K23882J33447J88311K09604
$$ 41285221 40953013 40738557 40599413 40649444 40687589 40745567 40969449 41102896 41291207 41500811
3925D1500811K60837L63050N01080M59799M09289N08566M20588N14573N39396
$$ 41500811 41761648 42124698 42625778 43085577 43494866 44003432 44424020 44938593 45477989
3916D5477989O35217O33243O40155P50337J044461R14077J011048J081152J105831
$$ 45477989 46113206 46746449 47386604 48136941 49181402 50095479 51106527 52187679 53293510
3907E3293510J211526J368462J537667J588196J758601J957423K239028K567562
$$ 53293510 54505036 55873498 57411165 58999361 60757962 62715385 64954413 67521975
3899F7521975K631865K939483L156043L172259L220378L358565K897378K362130
$$ 67521975 70153840 73093323 76249366 79421625 82642003 86000568 88897946 91260076
3891I1260076J593403M47340q81292k264890l378714m041650m299010m344249
$$ 91260076 92853479 93300819 92419527 90154637 86775923 82734273 78435263 74091014
3883G4091014m117599l967699l475669k978295k583510k360794k102108j915346
$$ 74091014 69973415 66005716 62530047 59551752 56968242 54607448 52505340 50589994
3875E0589994j734155j350370j289726j092733r86920r20195q03544p36368n98468
$$ 50589994 48855839 47505469 46215743 45123010 44136090 43215895 42412351 41675983 41077515
3866D1077515n62716o21270m43425m19630k80103n37258l05469l52440l37915
$$ 41077515 40514799 39893529 39450104 39030474 38750371 38213113 37907644 37555204 37217289
3857C7217289k13551l61331l25925k33003k48949m64733m11603k49903l87320
$$ 37217289 37003738 36642407 36316482 36083479 35834530 35369797 34958194 34708291 34320971
3848C4320971o35536m67746l59630o07639m60497m09887l96466k08939m01919
$$ 34320971 33685435 33217689 32858059 32250420 31789923 31380036 30983570 30774631 30372712
3839C0372712l35379n16431l52311k89860k69503l12728m32763k00459j82239
$$ 30372712 30037333 29520902 29168591 28878731 28609228 28296500 27863737 27663278 27481039
3830B7481039l37753k76445l88593k26896k89941l86580m46803j90356k42009
$$ 27481039 27143286 26866841 26478248 26251352 25961411 25574831 25128028 24937672 24695663
3821B4695663k08980j65458k04676k16470k37304j07246q4680j55748j08725j09572
$$ 24695663 24486683 24321225 24116549 23900079 23662775 23555529 23470849 23315101 23206376 23096804
3811B3096804k30643p7370P3948M7474o7084Q4126Q9238J31985R3425Q5753J35158
$$ 23096804 22866161 22788791 22862739 22910213 22843129 22927255 23016493 23148478 23241903 23327656 23462814
3800B3462814P4439m9957J43420J07924J53299L61072K15993j3864j08486Q4137
$$ 23462814 23537253 23487296 23630716 23738640 23891939 24253011 24469004 24455140 24346654 24430791
3790B4430791O679J58771j4187J10846J14525M9966K04608L32779K91569L36130
$$ 24430791 24437470 24596241 24582054 24692900 24807425 24857391 25061999 25394778 25686347 26022477
3780B6022477M06317L09889K75856N84240L55203L69606L71957L45583N42184
$$ 26022477 26428794 26738683 27014539 27598779 27953982 28323588 28695545 29041128 29583312
3771B9583312O36848N77276O53059R39733Q39628J003070J189442J440443J568146
$$ 29583312 30220160 30797436 31450495 32390228 33229856 34232926 35422368 36862811 38430957
3762C8430957J658488J849126J909272K115758K267382K346583K467413K372961
$$ 38430957 40089445 41938571 43847843 45963601 48230983 50577566 53044979 55417940
3754E5417940K253876K018945J394494P63936O6519j080239j683992k309931k799837
$$ 55417940 57671816 59690761 61085255 61849191 61915710 60835471 59151479 56841548 54041711
3745E4041711l080887l153239l197663k792365k639744k637779k238098k097648
$$ 54041711 50960824 47807585 44609922 41817557 39177813 36540034 34301936 32204288
3737C2204288j797967j588628j527015j428417j380949j086358r88930j023020
$$ 32204288 30406321 28817693 27290678 25862261 24481312 23394954 22406024 21383004
3729B1383004p71882p48645n74962o68657p66116n61632n22372n55334o02910
$$ 21383004 20611122 19862477 19287515 18618858 17852742 17291110 16768738 16213404 15610494
3720A5610494l90909k65047l80298n34374k63182l34126l32444l11292m10330
$$ 15610494 15219585 14954538 14574240 14039866 13776684 13442558 13110114 12798822 12388492
3711A2388492k37631l17512l73784k53947k38441k00725j01548k33869l06149
$$ 12388492 12150861 11833349 11459565 11205618 10967177 10766452 10664904 10431035 10124886
3702A0124886k20471j53798k07535j46628l27102j79206r8096j51586j50317q677
$$ 10124886 9904415 9750617 9543082 9396454 9069352 8890146 8792050 8640464 8490147 8481470
3692H481470j84251k65280n7707n7382n9632n8785l85058j65727O8524r9088N3046
$$ 8481470 8297219 8031939 7974232 7916850 7857218 7798433 7413375 7247648 7316172 7217084 7270130
3681G270130k89412r7720J10123o9608j48377j35540n5876K6100j95411k17073
$$ 7270130 6980718 6882998 6993121 6923513 6775136 6639596 6583720 6609820 6414409 6197336
3671F197336N4436l2351j45916j33898j05636o1050n3754j3312j49787n4471j66519
$$ 6197336 6251772 6219421 6073505 5939607 5833971 5772921 5719167 5705855 5556068 5501597 5335078
3660E335078P6694r9214j72979Q6174j1667j33591k2209l0825m1177L3012l4496
$$ 5335078 5411772 5312558 5139579 5225753 5214086 5080495 5058286 5027461 4986284 5019296 4984800
3649D984800p7807o6640j04672j7574j4359m5373J0279n4867j03198L9970J88679
$$ 4984800 4906993 4840353 4735681 4718107 4703748 4658375 4668654 4613787 4510589 4550559 4739238
3638D739238j42896j07517j80739J145R9550k55908m9214K00550l1247m9253r96
$$ 4739238 4596342 4488825 4308086 4309231 4408781 4152873 4103659 4304209 4272962 4223709 4222713
3627D222713j21892j7357N3295n3167J369j42263L6698Q2489P660l8028k27302
$$ 4222713 4100821 4083464 4136759 4083592 4084961 3942698 3979396 4061885 4069545 4031517 3804215
3616C804215q1259j6056Q566R4456q1024q4256r5174r174J27449j12949l6830
$$ 3804215 3722956 3706900 3715466 3809922 3728898 3644642 3549468 3540294 3667743 3554794 3517964
3605C517964N9403o9692K8245J97548J6229j08136J5598n7796m6711J76493o9783
$$ 3517964 3577367 3507675 3535920 3733468 3749697 3641561 3657159 3599363 3552652 3729145 3659362
3594C659362n1873J14806k033k13310o8460O7780j07354m783K9023N067q7518
$$ 3659362 3607489 3722295 3720262 3506952 3438492 3506272 3398918 3394135 3423158 3428225 3340707
3583C340707r3931O9905P2948j33327K4242J7222N2453n1618k07330M2614J35459
$$ 3340707 3246776 3316681 3389629 3256302 3280544 3297766 3350219 3298601 3091271 3133885 3269344
3572C269344N4052j66111j21075J03276N3856J63853q835O7521K8254k3170p595
$$ 3269344 3323396 3157285 3036210 3139486 3193342 3357195 3348360 3415881 3444135 3420965 3413370
3561C413370k85K20105l5220m6309j83498r9614j1603n8688j30747J20929R8281
$$ 3413370 3413085 3633190 3597970 3551661 3368163 3268549 3256946 3198258 3067511 3188440 3286721
3550C286721J1736j1980j31083j6581j9348J5610O9772p5991O1042J22922Q0187
$$ 3286721 3298457 3286477 3155394 3138813 3119465 3135075 3204847 3128856 3189898 3312820 3393007
3539C393007N0616J4050o1293K960J68352l261j45507J25956J19985j46319j0214
$$ 3393007 3443623 3457673 3396380 3399340 3567692 3564431 3418924 3544880 3664865 3518546 3508332
3528C508332L9504m9761n8408j3272k4441l8345l9209Q832J71762O8072k64846
$$ 3508332 3547836 3498075 3439667 3426395 3401954 3363609 3324400 3333232 3504994 3573066 3308220
3517C308220p1442r2579J12943M294j55080N1517J20805J26723n7j93624N6629
$$ 3308220 3236778 3144199 3257142 3261436 3106356 3157873 3278678 3405401 3405344 3211720 3268349
3506C268349J17060q2119m8518o0444L9789O3449k42906J09956K9539R5003P5344
$$ 3268349 3385409 3303290 3254772 3194328 3234117 3297566 3054660 3164616 3194155 3289158 3364502
3495C364502j23577O314J7157l9704J95456P3271p054n6663j05552k4129p511
$$ 3364502 3240925 3247239 3264396 3224692 3420148 3493419 3486365 3429702 3324150 3300021 3292510
3484C292510K5426J04050m9777l3932l6218P9574J15L7658k8302Q7752J17592
$$ 3292510 3317936 3421986 3372209 3338277 3302059 3381633 3381748 3419406 3391104 3478856 3596448
3473C596448j37826P326K389K2597o2187O7888n2617K42145J21406j0894j54064
$$ 3596448 3458622 3465948 3468337 3490934 3428747 3496635 3444018 3686163 3807569 3796675 3642611
3462C642611P0597Q9609M956p8994Q0220J332j7338r8116j315L4970r6164O5418
$$ 3642611 3713208 3802817 3807773 3728779 3808999 3810331 3792993 3694877 3693562 3728532 3632368 3697786
3450C697786O6933j05601m9196m4625M6169N3024k50881J5873J76115j7515m4649
$$ 3697786 3764719 3659118 3609922 3565297 3611466 3664490 3413609 3429482 3605597 3588082 3543433
3439C543433K7871J00343j28058J2954M9499j3871j2079m9218Q7458J13562k64999
$$ 3543433 3571304 3671647 3543589 3556543 3606042 3592171 3580092 3530874 3618332 3731894 3466895
3428C466895k1355N7839O9838q7710m2596M7500r981j2276j026J4107r899L1653
$$ 3466895 3445540 3503379 3573217 3485507 3442911 3490411 3480430 3468154 3467128 3481235 3471336 3502989
3416C502989J08382R795K2853P2895N213r6154K3835R6184K9682R3977J32606
$$ 3502989 3611371 3621166 3644019 3716914 3722127 3625973 3649808 3745992 3775674 3869651 4002257
3405D002257J39970p1830j450L7763m6302r3164K12738R2264k1714q7012J10535
$$ 4002257 4142227 4070397 4068947 4106710 4060408 3967244 4179982 4272246 4250532 4163520 4274055
3394D274055J93459l0262j21312J11125O7676R3326l6497l8308J12248J20423
$$ 4274055 4467514 4437252 4315940 4427065 4494741 4588067 4551570 4513262 4625510 4745933
3384D745933m2188k3878J76117J19760k1044l9068N6116K14110m0646K5791K36354
$$ 4745933 4703745 4679867 4855984 4975744 4954700 4915632 4971748 5185858 5145212 5171003 5407357
3373E407357m7241M5428P7571J74857K03116n0509j05625O8575J66616L8600J19402
$$ 5407357 5360116 5405544 5483115 5657972 5861088 5810579 5704954 5773529 5940145 5978745 6098147
3362F098147J9933K0807J59068K19329J08653J25501J43039J80481K36131M0987
$$ 6098147 6118080 6138887 6297955 6517284 6625937 6751438 6894477 7074958 7311089 7352076
3352G352076k1001J24206J63969O6836Q4613L36535K68784J80073N0155J25607
$$ 7352076 7331075 7455281 7619250 7686086 7770699 8107234 8376018 8556091 8606246 8731853
3342H731853L15793L27003j2797k5104J69958K16832K28890K36494K02922J39874
$$ 8731853 9047646 9374649 9361852 9336748 9506706 9723538 9952428 10188922 10391844 10531718
3332A0531718K21653J63141J81394K01749K27050M03261J27547P3378K67613K61456
$$ 10531718 10753371 10916512 11097906 11299655 11526705 11929966 12057513 12130891 12398504 12659960
3322A2659960M01570M11660M96690L96834K86278L50181L09921N26046N10706
$$ 12659960 13061530 13473190 13969880 14366714 14652992 15003173 15313094 15839140 16349846
3313A6349846L69041N93476M87087M68397O15950N17825N09343N50230O05621
$$ 16349846 16718887 17312363 17799450 18267847 18883797 19401622 19910965 20461195 21066816
3304B1066816P01977O28017O98692O73324P60292Q52062Q37945P61481J060589
$$ 21066816 21768793 22396810 23095502 23768826 24529118 25381180 26219125 26980606 28041195
3295B8041195J157976J290504J427623J413454J467708J821907K185616K285791
$$ 28041195 29199171 30489675 31917298 33330752 34798460 36620367 38805983 41091774
3287D1091774K758860L051245L525406M119450M448042M857147N962937O873245
$$ 41091774 43850634 46901879 50427285 54546735 58994777 63851924 69814861 76688106
3279G6688106P827055Q816995Q779984Q323533O789614L672567n53915n024643
$$ 76688106 84515161 93332156 102112140 110435673 117225287 120897854 120343939 115319296
3271A15319296p998475r072342r102629q080095o800713n380402l965661l052317
$$ 115319296 107320821 98248479 89145850 81065755 74265042 68884640 64918979 61866662
3263F1866662k282814j521358r91726m71003L97093R63632J550528K101243K508405
$$ 61866662 59583848 58062490 57070764 56599761 56996854 57960486 59511014 61612257 64120662
3254F4120662L410342M214502N327741O194328P295856P717698P513892O544018
$$ 64120662 67531004 71745506 77073247 83267575 90563431 98281129 105795021 112339039
3246A12339039M000594O7262m334345p866572r604415j0130792r674333q296265
$$ 112339039 116339633 116406895 112072550 104205978 94601563 84470771 74796438 66500173
3238F6500173o977327n717877m829122l962559l357861l093424k818129k391602
$$ 66500173 59522846 53804969 48975847 45013288 41655427 38562003 35743874 33352272
3230C3352272k085759j997637j715143j334240j178232j228616j018795j126250
$$ 33352272 31266513 29268876 27553733 26219493 25041261 23812645 22793850 21667600
3222B1667600j111888o51802o75596p68745p56909o41268n76035n17848o02231
$$ 21667600 20555712 19903910 19228314 18459569 17702660 17061392 16485357 15967509 15365278
3213A5365278o70201n47578l96958m68943m22494l02742k99584l34008l45535
$$ 15365278 14695077 14147499 13750541 13281598 12859104 12556362 12256778 11922770 11577235
3204A1577235l15798j51082j3394j45521j73649j45341k31701m16315l55007k74538
$$ 11577235 11261437 11110355 11096961 10951440 10777791 10632450 10400749 9984434 9629427 9354889
3194I354889j98864j04704k42936k42765k10553j21294j63457k25420m0325J6928
$$ 9354889 9156025 9051321 8808385 8565620 8355067 8233773 8070316 7844896 7804571 7821499
3184G821499p4156L6344L72Q0593L6210l0203P8250J15611R7539K16237K03938
$$ 7821499 7747343 7783687 7784059 7864652 7900862 7870659 7948909 8064520 8162059 8378296 8582234
3173H582234J23838K9053n1692K3906k24350j30231j68691j68063k55325m74108
$$ 8582234 8706072 8735125 8683433 8707339 8482989 8352758 8184067 8016004 7760679 7286571
3163G286571l74889k46604q7086l03530n5886q7136m6825J10484N3006l8158m4119
$$ 7286571 6911682 6665078 6577992 6274462 6218576 6131440 6084615 6195099 6248105 6209947 6165828
3152F165828m8263J78798J69207K22401K76919K36423K73410L43250L69637P4500
$$ 6165828 6117565 6296363 6465570 6687971 6964890 7201313 7474723 7817973 8187610 8262110
3142H262110K8730J54430N0017k82466m15295k76347m61831n12132l71055l10498
$$ 8262110 8290840 8445270 8495287 8212821 7797526 7521179 7059348 6547216 6176161 5865663
3132E865663k69402k82548l77363j77286j79785j90044o8049l5874k2296m0845
$$ 5865663 5596261 5313713 4936350 4759064 4579279 4389235 4321186 4285312 4263016 4222171
3122D222171J91786l3916m9048O6537M2081j9232R2102J14658o1015j5927M5026
$$ 4222171 4413957 4380041 4330993 4397530 4439611 4420379 4512481 4627139 4566124 4550197 4595223
3111D595223j18072r7990p9661o3939j42784j20421l19201k56390k34915l48563
$$ 4595223 4477151 4379161 4299500 4235561 4092777 3972356 3653155 3396765 3161850 2813287
3101B813287j58139O2329j38923j10704j65643N7400J5407k33539j31775q1661
$$ 2813287 2655148 2717477 2578554 2467850 2302207 2359607 2375014 2141475 2009700 1928039
3091A928039r147r0678j03344M0049O938l7991r526j49599j10422K1383J29111
$$ 1928039 1918892 1828214 1724870 1764919 1771857 1733866 1724340 1574741 1464319 1485702 1614813
3080A614813o0340K7561p5280P1876J4617j11948j8686o5569l3654K5472O8691
$$ 1614813 1554473 1582034 1506754 1578630 1593247 1481299 1462613 1397044 1363390 1388862 1457553
3069A457553j60096P9092L8135k5949k15115O5809j13839L3480p099J1641J10555
$$ 1457553 1297457 1376549 1414684 1388735 1173620 1239429 1125590 1159070 1151971 1163612 1274167
3058A274167n7775k2376j32059J15134j9438m4016R1039j09279M4120Q3849j01229
$$ 1274167 1216392 1194016 1061957 1177091 1157653 1113637 1204676 1095397 1139517 1223366 1122137
3047A122137m6365j0671L5234l3034m6091o3224J23911m1085q9536j37765P1496
$$ 1122137 1075772 1065101 1100335 1067301 1021210 957986 1081897 1040812 951276 813511 885007
3036H85007L2731L9167O8102j9097j9988L3836j52690K8119j01777n5646J66951
$$ 885007 917738 956905 1025007 1005910 985922 1019758 867068 895187 793410 737764 904715
3025I04715J71274j98552k6706K0780l2236q65O5197j7737j01205J56227k2028
$$ 904715 1075989 877437 850731 871511 839275 838410 903607 885870 784665 940892 918864
3014I18864p4107p741P3862N280Q555o0354M7820j0275m2988l4163J03522M0881
$$ 918864 844757 837016 910878 916158 924713 864359 912179 901904 858916 824753 928275 969156
3002I69156K9001j8993o5189p4558N6889J48301m3961L642j4371N4646j05029
$$ 969156 998157 979164 913975 839417 896306 1044607 1000646 1004288 989917 1044563 939534
2991I39534K0615J24964Q4897O9176J35171R3571K862j19252J2070N2379j38238
$$ 939534 960149 1085113 1170010 1239186 1374357 1467928 1470790 1351538 1363608 1415987 1277749
2980A277749K9023o5208k5093r3851q2746K9783M0180P2543p2224n8875j00219
$$ 1277749 1306772 1241564 1216471 1122620 1039874 1069657 1109837 1182380 1110156 1051281 951062
2969I51062o074O9768R3298J06442N88r2725n6136J08348N706J21832L0201O9227
$$ 951062 944988 1014756 1108054 1214496 1215084 1122359 1066223 1174571 1180277 1302109 1332310 1401537
2957A401537q3613j00191j9507k0269R7484q7235j05828O6264P1392q6001q4579
$$ 1401537 1317924 1217733 1198226 1177957 1275441 1188206 1082378 1148642 1220034 1134033 1049454
2946A049454j30845n6446K6340J23799J3524j11901J96884l9127m7414n1395p7098
$$ 1049454 918609 862163 888503 1012302 1025826 913925 1110809 1071682 1024268 972873 895775
2935H95775J085P3729j5912Q7812J03323k7950p1895J29952M2753j79543j00139
$$ 895775 896860 970589 954677 1042489 1145812 1117862 1045967 1175919 1218672 1039129 938990
2924I38990N3132k5095j1225P6693R0523k2818p7571N6484q6004j41799K4617
$$ 938990 992122 967027 955802 1032495 1123018 1100200 1022629 1079113 993109 851310 875927
2913H75927J09928J12565O0998j02246j83954j15658J49167N3787l1439P1069
$$ 875927 985855 1098420 1159418 1057172 873218 757560 906727 960514 929075 1000144
2903A000144J59850j7110Q147M6684K8085q2885m5593P0046p6136K6949J89410
$$ 1000144 1159994 1142884 1151031 1197715 1225800 1142915 1097322 1167368 1091232 1118181 1307591
2892A307591K6067o6777j51339Q0247Q372j00611J8682o8944o9775r5769J08121
$$ 1307591 1333658 1266881 1115542 1195789 1204161 1103550 1122232 1053288 983513 887744 995865
2881I95865J18777M5590j61996j54318l0721K8669J43005L48r6971r9473j9218
$$ 995865 1114642 1160232 998236 843918 813197 841866 984871 985219 888248 788775 769557
2870G69557J44164q0175N7833k6238m4311J0861k170O1561r6254m2688K6410P0421
$$ 769557 913721 833546 891379 865141 820830 831691 829521 891082 794828 752140 778550 848971
2858H48971o4488j68587k1883J5271n8393Q455Q3723j32802m0092J23888r0896
$$ 848971 784483 615896 594013 609284 550891 559346 643069 510267 470175 594063 503167
2847E03167n4052K7075J94389k03934j799K5778K2316j25324p1648N9004p675
$$ 503167 449115 476190 670579 466645 464846 490624 512940 387616 315968 374972 367297
2836C67297O2018m783n7462M1875N4753j84369q2230J28162K7530J7388R136L3698
$$ 367297 429315 424532 367070 408945 463698 279329 197099 325261 352791 370179 379315 413013
2824D13013K8557N3631j28806n0664j421M6620m3432o9342p812j08066l0167k3235
$$ 413013 441570 495201 366395 315731 314310 360930 317498 248156 240344 132278 102111 78876
2812G8876p3391k5701J47788J64576K1290j62125k0138j38920J29064J8055r1764
$$ 78876 5485 -20216 127572 292148 313438 151313 131175 -7745 121319 139374 47610
2801D7610P966N6648J60573j0239j36905q0369J22681n0956q430J1148j22959
$$ 47610 55576 112224 272797 262558 125653 45284 167965 117009 108579 119727 -3232
2790c232Q0068N6841n0689P5009Q5726j15911o7394m4308q2865P6063J71098R875
$$ -3232 76836 133677 82988 157997 243723 127812 60418 16110 -66755 9308 180406 190281
2778A90281j1942m786N5119l7812j34670p5066J634k1524O77j928J07762l3996
$$ 190281 178339 173553 228672 190860 56190 -18876 -17242 -38766 -38089 -40017 67745 33749
2766C3749M3383J24645n9867j78957L4273o7116n0182J53322O0287o5078J7774
$$ 33749 77132 201777 141910 -37047 -2774 -69890 -120072 33250 93537 28459 46233
2755D6233N9373J1707P2410j92233r2723J41001L3264J7241n887k1245n4382j06460
$$ 46233 105606 117313 189723 -2510 -95233 45768 79032 96273 90386 69141 14759 -91701
2743i1701O6153J01650J2643j15983Q9831n5919L4793J19499k8291J5342q5892
$$ -91701 -25548 76102 88745 -27238 62593 6674 41467 160966 132675 148017 62125
2732F2125Q528K2919o1571m1274M4595o5150O107P1459j07384m7046J10491j9374
$$ 62125 70653 93572 32001 -9273 35322 -29828 -23721 47738 -59646 -106692 3799 -15575
2720a5575M640k6825r8536N3488P5066n1488j719M7325q9098j25762Q2104J01943
$$ -15575 -10935 -37760 -136296 -82808 -7742 -59230 -60949 -13624 -102722 -228484 -146380 -44437
2708d4437K3148J20123J01159k08574j28957L7168O0840k9850J6258J2382o7702
$$ -44437 -21289 98834 199993 -8581 -137538 -100370 -39530 -69380 -53122 -40740 -108442
2697a08442M8425J56003j46976o4034k7623q618M4850k369L8282o705J5113m3288
$$ -108442 -60017 95986 -50990 -115024 -142647 -151265 -106415 -108784 -70502 -77207 -62094 -105382
2685a05382j0219P531R8289l4518P3604M6317l6608l0943n2037n7081q7454J5207
$$ -105382 -115601 -108070 -9781 -44299 29305 75622 39014 8071 -43966 -101047 -188501 -173294
2673a73294L6814J9141K22450q6924j4551j0982r3201J39393n176q4960j9245
$$ -173294 -136480 -117339 105111 18187 3636 -7346 -100547 38846 33670 -51290 -70535
2662g0535q2048q5152P7625J25629q1240J82997j13783k17726K1449R9020Q8821
$$ -70535 -152583 -237735 -160110 -34481 -115721 67276 -46507 -264233 -242784 -143764 -54943
2651e4943M2221M4598m0215k2285r742q8447m2230r742l0820J54628P7544J5933
$$ -54943 -12722 31876 -8339 -30624 -40366 -128813 -171043 -180785 -211605 -56977 20567 36500
2639C6500j67339q9906J19447J113o7427J8110J20370N7142o9218j33769P7285
$$ 36500 -130839 -220745 -101298 -100185 -167612 -149502 -29132 28010 -41208 -174977 -97692
2628i7692m3116Q7099m2706j47306L4631L3457J5984R5407K9727J08151n4922
$$ -97692 -140808 -53709 -96415 -243721 -209090 -175633 -159649 -64242 -34515 73636 18714
2617A8714p7942K5439q9345l8736N3719n4526O0005K5378k0363o2368j12388M9902
$$ 18714 -59228 -33789 -123134 -161870 -108151 -162677 -102672 -77294 -97657 -160025 -272413 -222511
2605b22511J21503k9113K94K94516r7848j86596q0005k28J69529K14127n4802
$$ -222511 -101008 -130121 -129827 164689 66841 -119755 -199760 -199988 -30459 183668 128866
2594A28866j33928k3895J1268o4586K39o1810p757P9524J1951p5146K08859n5396
$$ 128866 -5062 -28957 -17689 -82275 -82036 -143846 -151603 -72079 -60128 -135274 73585 18189
2582A8189n2528J49767j69322j36818R93O3901J11464L1227M8340n8591j27189
$$ 18189 -34339 115428 -53894 -190712 -189719 -125818 -14354 16873 65213 6622 -120567
2571a20567o9191j277K464P5790j11301K7140K29967L1739o5569J2502j45770
$$ -120567 -189758 -191035 -188571 -112781 -224082 -196942 33025 64764 -805 11697 -134073
2560a34073J8807M6561L2903j2239r51N9638m3747k7253m7458q752q5967p4792
$$ -134073 -115266 -68705 -35802 -48041 -48992 10646 -33101 -60354 -107812 -116564 -202531 -277323
2548b77323L6984l4104q539j2M4161Q2492M0661j6854p0576R4482j32688l4994
$$ -277323 -240339 -274443 -282982 -282994 -238833 -156341 -115680 -132534 -203110 -108628 -241316 -276310
2536b76310J16234p0250l938m5490Q2064J21391J01204o8067q1656j21597R2447
$$ -276310 -160076 -230326 -234264 -279754 -197690 -76299 24905 -43162 -124818 -246415 -153968
2525a53968N9623j89182J33535J61768j23556j46898j5982J09533J5089K9878
$$ -153968 -94345 -283527 -149992 11776 -111780 -258678 -274660 -165127 -150038 -120160
2515a20160l0689J37865R2244k50834j561r2245R2967m0734q5408J80079o7337
$$ -120160 -150849 -12984 79260 -171574 -173135 -265380 -172413 -213147 -298555 -118476 -185813
2504a85813k4131J6283O3621N5192L7871r333k3887l3667k4796J66089m5028J2836
$$ -185813 -209944 -193661 -130040 -74848 -36977 -46310 -70197 -103864 -128660 37429 -7599 5237
2492E237j03480m3371m5619k7095Q5248J74401k21623P6070N6573j43056q5235
$$ 5237 -98243 -141614 -187233 -214328 -129080 45321 -176302 -100232 -43659 -186715 -271950
2481b71950l3863M6204J24744K2450N8913L3920N412n3979p7309J021j02743J0320
$$ -271950 -305813 -259609 -134865 -112415 -53502 -19582 -14170 -68149 -145458 -144437 -247180 -236860
2469b36860l6497K4993L5185J78291o4028j04048k5305K0141J95225J04208N618
$$ -236860 -273357 -248364 -213179 -34888 -98916 -202964 -228269 -208128 -12903 91305 96923
2458I6923r2889j44760j58783l4936K16303M3379n0165k1801J0919J6158k1630
$$ 96923 4034 -140726 -299509 -334445 -118142 -74763 -124928 -146729 -135810 -119652 -141282
2447a41282O7278r2184N7496O5561l4515m6386j5760M3702n0540j18848j4195
$$ -141282 -74004 -166188 -108692 -43131 -77646 -124032 -139792 -96090 -146630 -265478 -279673
2436b79673J25939J61981k3922j42717l103K7843O0234N0745l8721p346L7522
$$ -279673 -153734 8247 -15675 -158392 -161495 -133652 -73418 -22673 -61394 -68740 -31218
2425c1218K8779j51051j0911J6839J1355R0250R557j66016j6254M9761K0478L1694
$$ -31218 -2439 -153490 -164401 -147562 -136207 -45957 -36400 -202416 -218670 -168909 -148431 -116737
2413a16737l0347J00930L1007n8426R2912q428N9307J4737r7493p0223o6102P6432
$$ -116737 -147084 -46154 -15147 -73573 19339 10911 70218 84955 -12538 -82761 -148863 -72431
2401g2431n4661M3039M8451j3107R4854l3289m1427N3893j52368j4353k2255Q5423
$$ -72431 -127092 -84053 -35602 -48709 46145 12856 -28571 25322 -127046 -141399 -163654 -78231
2389g8231p0272j8656K4035K0821K6557K9766J10101P1595q2365Q1582j32919
$$ -78231 -148503 -167159 -143124 -122303 -95746 -65980 44121 115716 33351 114933 -17986
2378a7986j03032L704r6682N3580l017J27810N3318n6987m364K6259Q1450K5526
$$ -17986 -121018 -117314 -213996 -160416 -163433 -35623 17695 -39292 -43656 -17397 64053 89579
2366H9579J22974K3847q9750j9591j06829n5125J16427k1800M704Q4787p6480
$$ 89579 212553 236400 146650 127059 20230 -34895 81532 59732 64436 149223 72743
2355G2743L252P8608k35388N6923J01311j7727J1541j52210j8780J38068P186
$$ 72743 75995 154603 -80785 -23862 77449 59722 71263 -80947 -99727 38341 45527
2344D5527j25880j8028J21509n2582m8910q7926J45151n9144o3923J08974m1117
$$ 45527 -80353 -98381 23128 -29454 -78364 -166290 -21139 -80283 -144206 -35232 -76349
2333g6349Q9065J62716Q0197o4079k92069j62042J57805R3465j5402l9567O4044
$$ -76349 12716 175432 255629 191550 -100519 -262561 -104756 -11291 -26693 -66260 -2216
2322b216L9940j86423k3119J68884O7774k49j26272N9689n1502n2879K4015J16837
$$ -2216 37724 -148699 -171818 -2934 64840 64591 -61681 -1992 -53494 -106373 -82358 34479
2310C4479k2013r0417P418J3663L4083J22844j18362J46527n3996q8456K2699
$$ 34479 12466 -77951 -70533 -56870 -22787 100057 -18305 128222 74226 -14230 8469
2299H469k4946N4325j016K8911m799p4940J28482M1085p2103p2515m6118o205
$$ 8469 -16477 37848 36832 65743 60944 -13996 114486 155571 83468 10953 -35165 -41370
2287d1370N2290J61828M9234j03709p3451K9460Q3963r7112L8002o4343O4137
$$ -41370 10920 172748 221982 118273 44822 74282 158245 61133 99135 34792 98929
2276I8929m8071J04839J12526j45886P6068q6019k9234l2253k1743Q6088R1987
$$ 98929 50858 155697 268223 122337 198405 112386 83152 50899 29156 115244 207231
2265B07231j87484L6846L0464L9795J73503r7016j57081n267j5662Q538J57330
$$ 207231 19747 56593 87057 126852 300355 203339 46258 40991 25329 33867 191197
2254A91197M144j0676M9759J3013j29464K8614J32157n9219l9650m5600Q0220
$$ 191197 195341 184665 234424 247437 117973 146587 278744 219525 179875 134275 214495
2243B14495J824q9136Q4558q6760m4464l8239j553O7576k3284k0332J01398O0208
$$ 214495 216319 127183 211741 124981 80517 42278 40725 108301 85017 64685 166083 226291
2231B26291L273j22473J0560l0394k3760J34262K7980n4947J53040n7963j18898
$$ 226291 229564 107091 117651 87257 63497 197759 225739 170792 323832 265869 146971
2220A46971J14459J25083j05612j05954J41904J28898M0706m01077K9109J02629
$$ 146971 261430 386513 280901 174947 316851 445749 486455 85378 114487 217116
2210B17116J47844L8766j4885j3243k3347o0909K9942R1352L6875p7375o4239
$$ 217116 364960 403726 388841 375598 352251 291342 321284 412636 449511 372136 307897
2199C07897k7738R9792J29143J58044N5208o1875p3316p522q179L2576R2749j9917
$$ 307897 280159 379951 509094 667138 722346 660471 587155 579633 571454 604030 696779 676862
2187F76862l7830J11173N266q3768J57817L4388o4331m1909j3697k605K8993Q0582
$$ 676862 639032 750205 755471 671703 829520 863908 799577 757668 743971 741366 770359 850941
2175H50941J42078J35311k93354O9362K62676n4685N3199O8983k25710l6267J65564
$$ 850941 993019 1128330 834976 904338 1167014 1112329 1165528 1234511 1008801 972534 1138098
2164A138098J45058n7628J21124p674m6804O4007R809K9707J78276O5072J8211
$$ 1138098 1283156 1225528 1346652 1338978 1292174 1356181 1365990 1395697 1573973 1639045 1657256
2153A657256R8992n4592J07424j2160j06070J07865J51852N7729P3969J0498N3922
$$ 1657256 1756248 1701656 1809080 1796920 1690850 1798715 1950567 2008296 2082265 2092763 2146685
2142B146685Q6872O6858o2378M8125M9159K28626J15557J77303N4029Q5946P3331
$$ 2146685 2233557 2300415 2238037 2286162 2335321 2563947 2679504 2856807 2910836 2996782 3070113
2131C070113J44058r390J31407J79932J05443J46672R1500O9198J82264J20628
$$ 3070113 3214171 3204781 3336188 3516120 3621563 3768235 3859735 3928933 4111197 4231825
2121D231825K27196K03647K10047L12992K25109L33875K73527M01459N68712M31921
$$ 4231825 4459021 4662668 4872715 5185707 5410816 5744691 6018218 6419677 6988389 7420310
2111G420310M47707M33931N83908O39817P12857P02395Q32469J137044J167313
$$ 7420310 7868017 8301948 8885856 9525673 10238530 10940925 11773394 12910438 14077751
2102A4077751J629350J941224K243082K673159K692599K604767K375127J437304
$$ 14077751 15707101 17648325 19891407 22564566 25257165 27861932 30237059 31674363
2094C1674363k21335j946557l020469l257477l272973k884888k297226j985999
$$ 31674363 31453028 29506471 26486002 23228525 19955552 17070664 14773438 12787439
2086A2787439j448118j341435q99203p58092o89048o03797n52709o36242m46343
$$ 12787439 11339321 9997886 9098683 8340591 7651543 7047746 6495037 5858795 5412452
2077E412452l47297m18947j98732m35566l74685n8129j95808r2508j68002l09395
$$ 5412452 5065155 4646208 4447476 4011910 3637225 3579096 3383288 3290780 3122778 2813383
2067B813383r3534k79580m54q7338j75387j01102q2635j12694o3758k8263m9860
$$ 2813383 2719849 2440269 2439815 2352477 2177090 2075988 1993353 1880659 1816901 1788638 1738778
2056A738778J8671k05991j05285k2513o7139j71855P0648J18171j33787r0334
$$ 1738778 1757449 1551458 1446173 1423660 1356521 1184666 1255314 1373485 1239698 1149364
2046A149364o8898j334r2563o3663P0238r4106k02632o3724p1480L6452Q4699
$$ 1149364 1080466 1079132 986569 922906 993144 899038 696406 632682 561202 597654 682353
2035F82353n8580l9783M1251j36400k3031K2658J6632j269R2060r577k98011J24659
$$ 682353 623773 583990 625241 488841 465810 488468 505100 503831 595891 586314 288303 412962
2023D12962n7206l0965K5647j34984R6707J18072j52354n4879J52147J7163j06355
$$ 412962 355756 324791 350438 215454 312161 430233 277879 223000 375147 392310 285955
2012B85955k4497O8321L7402j22933O1926r0070J5230P4027J8897j47124q1613
$$ 285955 261458 329779 367181 244248 306174 216104 231334 305361 324258 177134 95521
2001I5521M5806K0248m3484q8685J55528m8606j71234P7822K79847n8601j12533
$$ 95521 141327 161575 118091 29406 184934 136328 -34906 42916 322763 264162 151629
1990A51629J2507P1098r0027j20038l3334J9613j4372J43241j2980o0297n407
$$ 151629 164136 235234 145207 25169 -8165 11448 -2924 140317 127337 67040 61633
1979F1633R3714k6138m4005J3152j10139K3309M2923L5120j33463L487M8685J13277
$$ 61633 155347 129209 85204 98356 -11783 11526 54449 89569 -43894 -40407 8278 121555
1967A21555k7439j55163O7558P9433L1708q7778O236N0242o826j03050j22091
$$ 121555 94116 -61047 6511 85944 117652 29874 36110 86352 79526 -23524 -145615
1956a45615j01490N0661m299J24090N094Q1679M1674j18821M1897p385J6805P797
$$ -145615 -247105 -196444 -200743 -76653 -71559 10120 51794 -67027 -25130 -32515 -15710 -7913
1944g913P2084j35660J02949n8826m5617P1033J67070j20004l9164k3071l440
$$ -7913 64171 -71489 31460 -27366 -72983 -1950 165120 45116 5952 -17119 -20559
1933b0559J08471j92064O8433J0438k4077r570J45211j6819p0388Q1990o2324
$$ -20559 87912 -104152 -35719 -25281 -49358 -58928 86283 69464 -924 81066 18742
1922A8742n0190P0533J23481m6290r2835p3786p4571J10671K5135l3163N8157
$$ 18742 -31448 39085 162566 116276 23441 -50345 -124916 -14245 10890 -22273 35884
1911C5884j23666R1194p874J12579j03735m6125k8926o7166K9161R9549J26405
$$ 35884 -87782 3412 -4462 108117 4382 -41743 -70669 -137835 -108674 -9125 117280
1900A17280j80125M9601m1578k3137J98325j14005q9890R544L2007M1800r2963
$$ 117280 -62845 -13244 -54822 -77959 120366 6361 -83529 -73985 -41978 -178 -93141
1889i3141J8284j6076J19530j35853l1166J43452J09555j00200K6998M141j39333
$$ -93141 -74857 -90933 28597 -107256 -138422 5030 114585 14385 41383 45524 -93809
1878i3809k30218J11990Q8077J2221Q1609l2504K048j1202O5344m3969M1515j4488
$$ -93809 -324027 -212037 -123960 -111739 -30130 -62634 -60586 -71788 -6444 -50413 -8898 -23386
1866b3386P058P8684l6970j14576J32575j2172q3777J05375n2960q6546M6796
$$ -23386 -16328 62356 25386 -89190 43385 31213 -52564 52811 -149 -86695 -39899
1855c9899L4029j37579K4397P5953L1286o1k2463k9975K4531O9524j08921K465
$$ -39899 -5870 -143449 -119052 -43099 -11813 -11874 -34337 -64312 -39781 29743 -79178 -76713
1843g6713L2990J45875j10384Q2181l8824m1350L6398J5465l7544j42243K24977
$$ -76713 -43723 102152 -8232 73949 35125 -6225 30173 45638 8094 -134149 90828
1832I0828R652N6258j24301J40322L0830j2045J5785j04018M52j30088q329o862
$$ 90828 100480 156738 32437 172759 203589 191544 207329 103311 103763 -26325 -34654 -41516
1820d1516L882n2124r451P6683j4325O8998o4360j2263r2383Q4534Q1698q2862
$$ -41516 -37634 -89758 -99209 -22526 -36851 32147 -32213 -44476 -136859 -52325 29373 -53489
1808e3489O1502p007m5642m305k8178n7481R010N5099Q2909o8511l2839Q446j10375
$$ -53489 8013 1006 -44636 -48941 -77119 -134600 -125590 -70491 12418 -56093 -88932 -80486 -190861
1795a90861J34894J00842l9520l1070l6455n2407N4727L9776p965K6356L9017
$$ -190861 -55967 44875 5355 -25715 -62170 -114577 -59850 -20074 -28039 -1683 37334
1784C7334j5171k20093J0565N2585q9243N4910J11217p8199l3330L3037Q0167
$$ 37334 22163 -197930 -187365 -134780 -224023 -169113 -57896 -136095 -169425 -136388 -56221
1773e6221m3006J21639m1008L471m3754l3244q5242M1421J57364q4886j08740
$$ -56221 -99227 22412 -18596 -15125 -58879 -92123 -177365 -135944 21420 -63466 -172206
1762a72206J88170J11032o6969j40725O2096J29307j08943o2694L2718o0339K9983
$$ -172206 15964 126996 60027 -80698 -18602 110705 1762 -60932 -28214 -88553 -58570
1751e8570L6090l2279m560J36981J7496K416j51815N6138J03741q7097j5242j39185
$$ -58570 -22480 -54759 -59319 77662 95158 97574 -54241 1897 105638 18541 3299 -135886
1739a35886R3959M8234r701m6071L2624l8168N0099L0496Q1521o0119j87976m504
$$ -135886 -41927 6307 -3394 -49465 -16841 -55009 -4910 25586 107107 46988 -140988 -145492
1727a45492J6421K3087P6686O8849m2861j27307K7918J3344o293Q3446O1527p8846
$$ -145492 -129071 -105984 -29298 39551 -3310 -130617 -102699 -89355 -95648 -12202 49325 -29521
1715b9521m2100q176j6511j04395O8604Q4551Q1116j80685K9083j7223j7596O703
$$ -29521 -71621 -79797 -96308 -200703 -132099 -47548 33568 -147117 -118034 -135257 -152853 -146150
1703a46150P9218K9204q7097J31881P4947R7155m8096j84345m8209n8422N3545
$$ -146150 -66932 -37728 -124825 7056 82003 179158 131062 -53283 -101492 -159914 -106369
1692a06369m3348J2010K3651M5133k2329m2901J05634N3632O9136N6183p9736
$$ -106369 -149717 -137707 -114056 -68923 -91252 -134153 -28519 25113 94249 150432 70696
1681G0696k34851N8916P6631k1995P7330l4179J4467J13453j19436r8300j07123
$$ 70696 -164155 -105239 -28608 -50603 26727 -7452 7015 120468 1032 -97268 -204391
1670b04391J28863q3655J67345L8528j3522j77201r7975J53863M8617J22604r779
$$ -204391 -75528 -159183 8162 46690 33168 -144033 -242008 -88145 -39528 83076 73297
1659G3297q6356P0871j0755j17826l7129J53070N9324O4284J2309q8637j43206
$$ 73297 -13059 57812 47057 -70769 -107898 45172 104496 168780 181089 92452 -50754
1648e0754j15275O4070m8001J11290l9764P1186L92j78471n7423O8254J8860N3921
$$ -50754 -166029 -101959 -149960 -38670 -78434 -7248 -6856 -185327 -242750 -174496 -155636 -101715
1636a01715o9429j75R4483P8192o2393p3183N0900J27964L754p6070P20m0616
$$ -101715 -171144 -171319 -76836 1356 -61037 -134220 -83320 44644 48398 -27672 -26952 -67568
1624f7568l9591J8686J6528J3724P0886j22873P659J14672p1444k7869j2238N2586
$$ -67568 -107159 -88473 -71945 -58221 12665 -110208 -102549 12123 -59321 -87190 -99428 -46842
1612d6842M6941l7260N1278k06599j693J11899O3386q2325j8703J53538M6588
$$ -46842 99 -37161 14117 -192482 -194175 -82276 -18890 -101215 -119918 33620 80208
1601H0208l0584j27946j188l2152J02820M5151J8732k3077o7896O64N171L5164
$$ 80208 49624 -78322 -79510 -111662 -8842 36309 55041 31964 -35932 -35268 -30097 5067
1589E067k0148J46407o0971j396J7203j73836k2172P8963q0862m3510J7325M2479
$$ 5067 -15081 131326 70355 68959 86162 -87674 -109846 -30883 -111745 -155255 -137930 -95451
1577i5451m7989k6849j42648J03307M8677n1409J30287n685J29040j6219q5151
$$ -95451 -143440 -170289 -312937 -209630 -160953 -212362 -82075 -87760 41280 25061 -60090
1566f0090j28653K2077R4506M6111J1878n9156p5257N4773l4430j0357O797J81516
$$ -60090 -188743 -166666 -72160 -26049 -14171 -73327 -148584 -93811 -128241 -138598 -131801 49715
1554D9715L1625p2541r7189m6230J47060n1501L7664l1661n8411o5234O8517Q6934
$$ 49715 81340 8799 -88390 -134620 12440 -39061 -1397 -33058 -91469 -156703 -88186 -1252
1542a252l5268L2847J11367j68763p6427r8834J6434R9727R8330J09493p4080
$$ -1252 -36520 -3673 107694 -61069 -137496 -236330 -219896 -120169 -21839 87654 13574
1531A3574J49188j11751o7099j14803J04220L8847j90413J23816l6708O9301P6250
$$ 13574 162762 51011 -16088 -130891 -26671 12176 -178237 -54421 -91129 -21828 54422
1520E4422j91968N8737j46458J9876J05815N3248q0251L1437J09700J8866j57178
$$ 54422 -137546 -78809 -225267 -205391 -99576 -46328 -126579 -95142 14558 33424 -123754
1509a23754Q9458O5879q0403j03576j24458J27455K37858j245j55473O673L0806
$$ -123754 -34296 31583 -48820 -152396 -276854 -149399 88459 87214 -68259 -61586 -30780
1498c0780l1186k6872N5408n42m6871r7740K7674J6250J1730l4555n6605J04639
$$ -30780 -61966 -88838 -33430 -33972 -80843 -178583 -150909 -134659 -122929 -157484 -214089 -109450
1486a09450N1719J0504K4624J29559j88853j16346J01996L8710N3412J3118Q2823
$$ -109450 -57731 -47227 -22603 106956 -81897 -198243 -96247 -57537 -4125 8993 91816
1475I1816k0429m2510Q732n2141N3298J2501k1230P2742j37855N0145m4745J2491
$$ 91816 71387 28877 37609 -14532 38766 51267 30037 102779 -35076 15069 -29676 -17185
1463a7185j26366O5546O9681k0052M2501L8201q3549q7994p3105P7262J04970
$$ -17185 -143551 -78005 -8324 -28376 14125 52326 -31223 -119217 -192322 -115060 -10090
1452a0090o0376o5453J82792l9692l4167k3111o0633M0297J17997p2560Q5743
$$ -10090 -70466 -135919 46873 7181 -26986 -50097 -110730 -70433 47564 -24996 60747
1441F0747l3209o9274k771k285Q6771L7604l520o6387o264n782K8917m8206o1100
$$ 60747 27538 -41736 -44507 -46792 39979 77583 74063 7676 1412 -4370 24547 -23659 -84759
1428h4759J19410j13537r2087N0758J09102N9035K7325l7569q7347l8804J16905
$$ -84759 34651 -78886 -170973 -120215 -11113 47922 75247 37678 -49669 -88473 28432
1417B8432j6534q3596R817j670L5805j37223k4932J31654Q4309o5956l0018J85557
$$ 28432 11898 -71698 -61881 -63551 -27746 -164969 -189901 -58247 26062 -39894 -69912 115645
1405A15645n401r8438J5479p0126J24221j20890L2046q8647J14660K1259K6369
$$ 115645 110244 11806 27285 -42841 81380 -39510 -7464 -96111 18549 39808 66177
1394F6177j18247j15537O2237J48469R6619p4520j25959J4023L5533l0904k1746
$$ 66177 -52070 -167607 -105370 43099 139718 65198 -60761 -46738 -11205 -42109 -63855
1383f3855o7154M3283J54016j06520m8702p6833J38485N7598L3136m4428j92482
$$ -63855 -131009 -87726 66290 -40230 -88932 -165765 -27280 30318 63454 19026 -173456
1372a73456j29788J22327R3551K2790m4800k684O168k6867N371n45N7545k1676
$$ -173456 -303244 -180917 -87366 -64576 -109376 -112060 -105892 -132759 -127388 -127933 -70388 -92064
1360i2064J47654o357J278m1522r8409m2618K07724K1390l668j659R301j17655
$$ -92064 55590 49233 50511 8989 -89420 -132038 75686 97076 93408 91749 101050 -16605
1348a6605n538N257m294l8499O1105R9436k3877o3507j72510Q3842m5262J22484
$$ -16605 -22143 -16886 -21180 -59679 1426 100862 76985 13478 -159032 -75190 -120452 2032
1336B032j3421K3394J7060L186q8510n5115R3531j7656L5039K50o4183q4872O6792
$$ 2032 -11389 12005 29065 32251 -56259 -111374 -17843 -35499 -460 -210 -64393 -149265 -82473
1323h2473N9567J08208M2019j20079Q0715L2783j45274p3809l3955n8398l6782
$$ -82473 -22906 85302 127321 7242 87957 120740 -24534 -98343 -132298 -190696 -227478
1312b27478J80150O9315j06915j12923O8754Q39N761M5700J32525k23146j75788
$$ -227478 -47328 21987 -84928 -197851 -129097 -128258 -122497 -76797 55728 -167418 -343206
1301c43206J76129R1551o8763l2226J607L7265N3324k9276r558n8463K0376J40373
$$ -343206 -167077 -75526 -144289 -176515 -174908 -137643 -84319 -113595 -123153 -181616 -161240 -20867
1289b0867q4209L3586j22552J20185m5201k6279l3993J04759J71094k46085N2273
$$ -20867 -105076 -71490 -194042 -73857 -119058 -145337 -179330 -74571 96523 -149562 -97289
1278i7289J32610j2511Q61R0746j28789p6332k8973J20874r0393l697M3835n1502
$$ -97289 35321 22810 23671 114417 -14372 -90704 -119677 1197 -89196 -92893 -49058 -100560
1266a00560M3452P4012K5181N6599N2694r6822p273O1948p6176k2702k9214j2298
$$ -100560 -57108 16904 42085 98684 151378 54556 47283 109231 33055 10353 -18861 -31159
1254c1159j30859P2159l2549L7183J33699K166p8195N5305p3339n6027J76375
$$ -31159 -162018 -89859 -122408 -85225 48474 50640 -27555 27750 -45589 -101616 74759
1243G4759K2279R5877q4777j70046J19150K4268m3500l4643j12302R4965K2279
$$ 74759 97038 192915 108138 -61908 57242 81510 38010 3367 -108935 -13970 8309
1232H309Q582j10611J26292j17386K298J03748J16485j18427j05386K8129J7919
$$ 8309 16891 -93720 32572 -84814 -82516 21232 137717 19290 -86096 -57967 -40048
1221d0048J20247j43988K6347M4872R4241J7340j38543l1977N1925O265j2048
$$ -40048 80199 -63789 -37442 7430 101671 119011 -19532 -51509 416 6681 -5367
1210e367j07756P7926K49855k21599n0745J62709J66030j16751l3422j36703p3153
$$ -5367 -113123 -35197 214658 -6941 -57686 105023 271053 154302 120880 -15823 -88976
1199h8976P7972K1858L8197K6380n2127j08724J57461j13106p9817J74192M3637
$$ -88976 -11004 10854 49051 75431 23304 -85420 72041 -41065 -120882 53310 96947
1188I6947j24845O7777N590k9594j9160K1198l0575j283j04026J2101j00161j10677
$$ 96947 -27898 39879 45469 15875 -3285 17913 -12662 -13945 -117971 -105870 -206031 -316708
1176c16708J18265J30525J32992q3519j09356J50818R2406j43056j62730P1403
$$ -316708 -198443 -67918 65074 -18445 -127801 23017 115423 -27633 -190363 -118960
1166a18960Q0391L5919k3369K4216N7593l7079P0319j6545O0592j59449p6840
$$ -118960 -38569 -2650 -26019 -1803 55790 18711 89030 72485 133077 -26372 -103212
1155a03212Q7758M1026r2928J80658N9267j41570j56011L2173P1809o7249R9671
$$ -103212 -15454 25572 -67356 113302 172569 30999 -125012 -92839 -21030 -88279 11392
1144A1392J00503K47m3935Q4806k5825L5796r6500q9351j8578M2021q5184O230
$$ 11392 111895 112142 68207 153013 127188 162984 66484 -22867 -41445 576 -84608 -78378
1132g8378j3193k3545k743K2080O4735J977j8630J05816j44055J42008k6069K1252
$$ -78378 -91571 -115116 -117859 -95779 -31044 -29067 -47697 58119 -85936 56072 30003 51255
1120E1255m691m0963J5520n964o511l4190p3638o2572J10072M1826K5578k3810
$$ 51255 46564 5601 21121 15157 8646 -25544 -99182 -161754 -51682 -9856 15722 -8088
1108h088N7120J4347r7646r2345M1403K1384j8140K0559n9900J76093m8766j6197
$$ -8088 49032 63379 -34267 -126612 -85209 -63825 -81965 -61406 -121306 54787 6021 -10176
1096a0176L6683m3981J7881p4193j31554J14529K43060j70763q6992O6956J59474
$$ -10176 26507 -17474 407 -73786 -205340 -90811 152249 -18514 -105506 -38550 120924
1085A20924j74725Q620J2475J06804p9341j00793J03219J00682j6800j9376p1578
$$ 120924 -53801 -45181 -32706 74098 -5243 -106036 -2817 97865 81065 61689 -9889
1074i889P1936J69362m8673n4792k9642L1039j13287p1248J42283q3366j9911
$$ -9889 62047 231409 182736 127944 98302 129341 16054 -55194 87089 3723 -16188
1063a6188K3078k2061L5809r2334n0648J76052r8780q8644J78794k7831M595l1407
$$ -16188 6890 -15171 20638 -71696 -122344 53708 -45072 -133716 45078 17247 21842 -9565
1051i565j13615J91206O3001p1966M5158J1299k13462M0105p7887l3372n2318
$$ -9565 -123180 68026 131027 59061 104219 115518 -97944 -57839 -135726 -169098 -221416
$$ [...]
##END NTUPLES=NMR SPECTRUM
##END=
