##TITLE=1H_CA-9025-2
 CDCl3
 8 sc, 
 29.06.2022
##JCAMPDX= 6.0         $$ Bruker NMR JCAMP-DX V2.0
##DATA TYPE= NMR SPECTRUM
##DATA CLASS= NTUPLES
##ORIGIN= UXNMR, Bruker Analytische Messtechnik GmbH
##OWNER= root
$$ XWIN-NMR		Version 3.5
$$ Wed Jun 29 14:05:01 2022 Russian Standard Time (UT+4h)  she@DPX200
##.OBSERVE FREQUENCY= 200.1313499994
##.OBSERVE NUCLEUS= ^1H
##.ACQUISITION MODE= SIMULTANEOUS
##.ACQUISITION SCHEME= undefined
##.AVERAGES= 8
##.DIGITISER RES= 18
##SPECTROMETER/DATA SYSTEM= spect
##.PULSE SEQUENCE= zg30
##.SOLVENT NAME= CDCl3
##.SHIFT REFERENCE= (INTERNAL, CDCl3, 0, 15.7326)
##AUDIT TRAIL= $$ (NUMBER, WHEN, WHO, WHERE, WHAT)
$$ ##TITLE= Audit trail, XWIN-NMR		Version 3.5
$$ ##JCAMPDX= 5.01
$$ ##ORIGIN= Bruker BioSpin GmbH
$$ ##OWNER= she
$$ F:/spectra/data/she/nmr/H-F/1/pdata/1/auditp.txt
$$ ##AUDIT TRAIL=  $$ (NUMBER, WHEN, WHO, WHERE, WHAT)
(   1,<2022-06-29 14:04:03.31 +0400>,<she>,<DPX200>,
      <created by zg, POWCHK disabled, PULCHK disabled
       configuration hash MD5:
       00 E9 B6 7A A2 85 ED C7 34 08 36 98 17 FE 4E 26
       data hash MD5: 16K
       52 60 22 A0 D1 BF 03 09 7E F7 87 38 BB 3D B9 D2>)
(   2,<2022-06-29 14:04:06.31 +0400>,<she>,<DPX200>,
      <Start of raw data processing
       efp BC_mod = 2 LB = 0.24 FT_mod = 6 PKNL = 1 PHC0 = -18050.98 PHC1 = 23.40069 SI = 16K 
       data hash MD5: 16K
       E5 6C B7 EF 49 7D 6D 80 4F 0F 46 96 A8 07 1C 14>)
(   3,<2022-06-29 14:04:21.96 +0400>,<she>,<DPX200>,
      <pk PHC0 = 3.746293 PHC1 = -8.6 
       data hash MD5: 16K
       19 13 6D 09 F9 52 91 6E 9F 86 E4 25 36 14 DB 4C>)
(   4,<2022-06-29 14:04:25.04 +0400>,<she>,<DPX200>,
      <abs ABSG = 5 
       data hash MD5: 16K
       13 72 6B E9 9E 32 F8 C9 85 43 7A CE BB 07 FB 2C>)
$$ ##END=
$$ 
$$ hash MD5
$$ 7A 59 A6 D2 9E B7 F5 2E 90 6D 72 4D BD 29 DB 9B
##$RELAX= 
##$RELAX= 
##$RELAX= 
##$RELAX= 
##$RELAX= 
##$RELAX= 
$$ Bruker specific parameters
$$ --------------------------
##$DU= <F:/spectra>
##$EXPNO= 1
##$NAME= <H-F>
##$PROCNO= 1
##$TYPE= <nmr>
##$USER= <she>
##$AMP= (0..31)
100 100 100 100 100 100 100 100 100 100 100 100 100 100 100 100 100 100 
100 100 100 100 100 100 100 100 100 100 100 100 100 100 
##$AQSEQ= 0
##$AQ_mod= 1
##$AUNM= <au_zg>
##$AUTOPOS= <>
##$BF1= 200.13
##$BF2= 200.13
##$BF3= 200.13
##$BF4= 200.13
##$BF5= 200.13
##$BF6= 200.13
##$BF7= 200.13
##$BF8= 200.13
##$BYTORDA= 1
##$CFDGTYP= 0
##$CFRGTYP= 5
##$CHEMSTR= <none>
##$CNST= (0..31)
1 1 145 1 1 1 1 1 1 1 1 1 1 1 1 1 1 1 1 1 1 1 1 1 1 1 1 1 1 1 1 1 
##$CPDPRG= <>
##$CPDPRG1= <>
##$CPDPRG2= <>
##$CPDPRG3= <>
##$CPDPRG4= <mlev>
##$CPDPRG5= <mlev>
##$CPDPRG6= <mlev>
##$CPDPRG7= <mlev>
##$CPDPRG8= <mlev>
##$CPDPRGB= <>
##$CPDPRGT= <>
##$D= (0..31)
0 1.2 0 0 0 0 0 0 0 0.06 0 0.03 0 0 0 0 0.0002 0 0 0 0 0 0 0 0 0 0 0 0 
0 0 0 
##$DATE= 1656497042
##$DBL= (0..7)
120 120 120 120 120 120 120 120 
##$DBP= (0..7)
150 150 150 150 150 150 150 150 
##$DBP07= 0
##$DBPNAM0= <>
##$DBPNAM1= <>
##$DBPNAM2= <>
##$DBPNAM3= <>
##$DBPNAM4= <>
$$ [...]
##$SUBNAM2= <"">
##$SUBNAM3= <"">
##$SUBNAM4= <"">
##$SUBNAM5= <"">
##$SUBNAM6= <"">
##$SUBNAM7= <"">
##$SUBNAM8= <"">
##$SUBNAM9= <"">
##$SW= 18.0517283424941
##$SWIBOX= (0..15)
0 0 2 0 0 0 0 0 0 0 0 0 0 0 0 0 
##$SW_h= 3612.71676300578
##$TD= 16384
##$TD0= 1
##$TE= 0
##$TE2= 300
##$TE3= 300
##$TEG= 300
##$TL= (0..7)
0 120 120 120 120 120 120 120 
##$TP= (0..7)
150 150 150 150 150 150 150 150 
##$TP07= 0
##$TPNAME0= <>
##$TPNAME1= <>
##$TPNAME2= <>
##$TPNAME3= <>
##$TPNAME4= <>
##$TPNAME5= <>
##$TPNAME6= <>
##$TPNAME7= <>
##$TPOAL= (0..7)
0.5 0.5 0.5 0.5 0.5 0.5 0.5 0.5 
##$TPOFFS= (0..7)
0 0 0 0 0 0 0 0 
##$TUNHIN= 0
##$TUNHOUT= 0
##$TUNXOUT= 0
##$USERA1= <user>
##$USERA2= <user>
##$USERA3= <user>
##$USERA4= <user>
##$USERA5= <user>
##$V9= 5
##$VALIST= <valist>
##$VCLIST= <CCCCCCCCCCCCCCC>
##$VD= 0
##$VDLIST= <DDDDDDDDDDDDDDD>
##$VPLIST= <PPPPPPPPPPPPPPP>
##$VTLIST= <TTTTTTTTTTTTTTT>
##$WBST= 1024
##$WBSW= 4
##$XGAIN= (0..3)
0 0 0 0 
##$XL= 0
##$YL= 0
##$YMAX_a= 202324
##$YMIN_a= -232234
##$ZGOPTNS= <>
##$ZL1= 120
##$ZL2= 120
##$ZL3= 120
##$ZL4= 120
##$ABSF1= 15.73257
##$ABSF2= -2.31928
##$ABSG= 5
##$ABSL= 3
##$ALPHA= 0
##$AQORDER= 0
##$ASSFAC= 0
##$ASSFACI= 0
##$ASSFACX= 0
##$ASSWID= 0
##$AUNMP= <proc_1d>
##$AZFE= 0.1
##$AZFW= 0.1
##$BCFW= 0
##$BC_mod= 2
##$BYTORDP= 0
##$COROFFS= 0
##$CY= -3
##$DATMOD= 1
##$DC= 0
##$DFILT= <>
##$DTYPP= 0
##$F1P= 0
##$F2P= 0
##$FCOR= 1
##$FTSIZE= 16384
##$FT_mod= 6
##$GAMMA= 0
##$GB= 0
##$INTBC= 1
##$INTSCL= 0
##$ISEN= 128
##$LB= 0.24
##$LEV0= 0
##$LPBIN= 0
##$MAXI= 10000
##$MC2= 0
##$MEAN= 0
##$ME_mod= 0
##$MI= 1.114404
##$NCOEF= 0
##$NC_proc= -7
##$NLEV= 6
##$NOISF1= 3.799351
##$NOISF2= 2.8
##$NSP= 0
##$NTH_PI= 0
##$NZP= 0
##$OFFSET= 15.73257
##$PC= 1
##$PHC0= -18047.23
##$PHC1= 14.80069
##$PH_mod= 1
##$PKNL= yes
##$PPARMOD= 0
##$PSCAL= 0
##$PSIGN= 0
##$REVERSE= no
##$SF= 200.130007799824
##$SI= 16384
##$SIGF1= 3
##$SIGF2= 2
##$SINO= 5.538805
##$SIOLD= 16384
##$SREGLST= <1H.CDCl3>
##$SSB= 0
##$STSI= 16384
##$STSR= 0
##$SW_p= 3612.71676300578
##$SYMM= 0
##$S_DEV= 0
##$TDeff= 16384
##$TDoff= 0
##$TI= <>
##$TILT= no
##$TM1= 0
##$TM2= 0
##$TOPLEV= 0
##$USERP1= <user>
##$USERP2= <user>
##$USERP3= <user>
##$USERP4= <user>
##$USERP5= <user>
##$WDW= 1
##$XDIM= 16384
##$YMAX_p= 399948546
##$YMIN_p= -2906769
$$ End of Bruker specific parameters
$$ ---------------------------------
##NTUPLES= NMR SPECTRUM
##VAR_NAME=  FREQUENCY,     SPECTRUM/REAL,   SPECTRUM/IMAG
##SYMBOL=    X,             R,               I
##VAR_TYPE=  INDEPENDENT,   DEPENDENT,       DEPENDENT
##VAR_FORM=  AFFN,          ASDF,            ASDF
##VAR_DIM=   16384,         16384,           16384
##UNITS=     HZ,            ARBITRARY UNITS, ARBITRARY UNITS
##FACTOR=    0.220516191357247, 1,           1
##FIRST=     3148.55929567537, 0,            0
##LAST=      -464.157467330409, 0,           0
##MIN=       -464.157467330409, -2906769,    0
##MAX=       3148.55929567537, 399948546,    0
$$ Real data points
##PAGE= N=1
##DATA TABLE= (X++(R..R)), XYDATA
$$ [...]
6486b12980j01950N66293L52547j26664J48917l40107k42677l99874R4324K59033
6476c138J90192J46890j84754K710L33688o23652k39726J27985M54958Q06162
6466A011315o54369m31005m63506O29774P25499J90123r09307n01443J83530l8183
6456b57572o457L22150R39998m28985n10000K63472J14301J1176l25224n2322
6446G0537L09184M25943l82980p45232M97756N45017l0742n69985N34560K37917
6436H91975j223321J66685J1578O84014l06292m01830k42176L69887L90126n73580
6426b32934K34121K96112J75474p82584k17189Q1465K03616M61859k81507m71645
6416e33212M6250J133884m02922p04954K52243J09610m63894J28029L83318k63676
$$ plain form
6486 -212980 -314930 251363 603910 477246 626163 286056 43379 -356495 -262171 -3138
6476 -3138 187054 333944 149190 151900 485588 -138064 -377790 -249805 205153 1011315
6466 1011315 356946 -74059 -537565 92209 817708 1007831 98524 -402919 -219389 -257572
6456 -257572 -264029 58121 998119 569134 59134 322606 436907 448083 122859 70537
6446 70537 379721 805664 422684 -322548 175208 720225 689483 119498 654058 891975
6436 891975 -331346 -164661 -153083 530931 224639 -177191 -419367 -49480 340646 -232934
6426 -232934 1187 297299 472773 -309811 -527000 -445535 -241919 219940 -61567 -533212
6416 -533212 -486962 646922 244000 -460954 -208711 -99101 -562995 -434966 -51648 -315324
6406c15324l48013O22692N20545J26457q36782R3582K19564J69830j43186J56031
6396B65396M35279p4143l63429p79757J44560o4794J62336N9751M35939m50584
6386b29446j6198K54687q3344o20683j72079Q8204L75219k5174n70027O46503
6376c52338L4665j22712J20666J60217M51305o82927k29318j188J19664L28210
6366a73756O45171n87627l28470O14689M71125j00403P5780J87812k01446m68573
6356A34302N3866K64084L42277j20354l22823K54747J75087o54788o84594N13584
6346d4612J94705L19149j31117K60351n85296n12984Q84594j59491p49966j62443
6336f87110J113054M67227o98969j94382M49933R732k38715Q2559r0072M25709
$$ plain form
6406 -315324 -663337 -40645 479900 606357 -230425 -136843 82721 252551 109365 265396
6396 265396 700675 626532 263103 -516654 -372094 -436888 -274552 -214801 221138 -229446
6386 -229446 -245644 9043 -74301 -694984 -867063 -778859 -403640 -428814 -998841 -352338
6376 -352338 -317673 -440385 -319719 -159502 291803 -391124 -620442 -621630 -501966 -173756
6366 -173756 471415 -116212 -444682 170007 641132 540729 616509 804321 602875 134302
6356 134302 188168 452252 794529 674175 351352 606099 781186 126398 -558196 -44612
6346 -44612 150093 469242 338125 598476 13180 -499804 384790 225299 -524667 -687110
6336 -687110 425944 893171 194202 -180 449753 459485 220770 303329 213257 638966
6326F38966J46174j028978l38231N43055R51134k93320p81592J81814j88123M42358
6316B73257K2148J33812J768j64717N4485l83012N77252K3355j25221o4796j86008
6305A62323L14210k471K6404p0379L87881j46573p52879J2765J10345L97079j30493
6294C08212L76833M0349k32116P0946Q8142O1072Q8321J17557p99151M14468M21915
6283I56548L00840Q1906l34486m79155m3907j21399R7654R3599r8824L08477m67931
6272B93322r3903k94338L30415R3279M2048m5162p74328O41042L97062P5331Q3123
6261G47891n526k88061Q33M84041p8888j50410J45358j83494O3157M67138O56718
6250A858757R7723l13263K80945L2107o10800J31374K25008m22783j15756M55204
$$ plain form
6326 638966 785140 -243838 -582069 -39014 912120 618800 -162792 19022 -169101 273257
6316 273257 295405 429217 430985 266268 320753 -62259 514993 538348 413127 348331 162323
6305 162323 476533 474062 500466 430087 817968 671395 -81484 -68719 41626 438705 308212
6294 308212 685045 725394 493278 564224 652366 713438 801759 919316 120165 534633 956548
6283 956548 1257388 1339294 1004808 525653 481746 360347 458001 551600 452776 761253 293322
6272 293322 199419 -94919 235496 328775 370823 325661 -448667 192375 589437 664768 747891
6261 747891 742365 454304 455137 939178 860290 709880 855238 671744 734901 1202039 1858757
6250 1858757 1956480 1643217 1924162 1956269 1345469 1476843 1701851 1279068 1163312 1618516
6240A618516k2520j73540O75731J82564p76630j18603O13077O47843l65899m61982
6230A818557N5849l43136N16567P3176k16780N83707j57897k54812j41851L87754
6220B321134K16622j10577L93291m50420j87051Q02149M02356m57205M00135J37236
6210C467670N1992k55760K43626J257729j71866l34200K49358K86768M63750J90656
6200E449723j66586Q11706R20306j29251J27709O12584J041002O07626k05171
6191I069648R01765P36551O32675J201714J460144Q11591J62085N28155J084480
6182A6588808k9446J117781J138616l89327J76188j0539o12481l83222M44329
6173A8040707J84726j388629j257668N4631o60793j266828q2003l05771p92107
$$ plain form
6240 1618516 1595996 1422456 2098187 2280751 1504121 1385518 1998595 2646438 2280539 1818557
6230 1818557 1874406 1531270 2047837 2121013 1904233 2487940 2330043 2075231 1933380 2321134
6220 2321134 2537756 2427179 2820470 2370050 2182999 2985148 3387504 2930299 3330434 3467670
6210 3467670 3519662 3263902 3507528 4765257 4593391 4259191 4508549 4795317 5259067 5449723
6200 5449723 5283137 6094843 7015149 6885898 7013607 7626191 8667193 9274819 9069648
6191 9069648 9971413 10707964 11340639 12542353 14002497 14814088 14976173 15504328 16588808
6182 16588808 16559362 17677143 18815759 18426432 18602620 18592081 17979600 17596378 18040707
6173 18040707 18225433 16836804 15579136 15633767 14972974 13706146 13624143 13318372 12526265
6164A2526265j36175o96830l60827r41789K88997N20637n24764k0237j45815O71503
6154A1180965K62127R6636L05814J11644R07599J120885N59167R8357O34586N87906
6144A5865686Q99832J84411R46846R68075Q85883m5799p32265j013616m72393
6135A7486660J99270n64004l43625q18557q95355j297044p46203j92196j484234
6126A1344712j919416m81030J16771q49576q81758L2947m44804j219133o91441
6117E007272l5523M75013J69267l06597r45044m68786J60355p62606L8813j89950
6107C142214N09251k87596o12074j52022k62335j03825K18213n0944n36122K07602
6097B072362K39108M28276K16403o11206j100413q3354J98644N97173j66887J29575
$$ plain form
6164 12526265 12390090 11693260 11332433 10390644 10679641 11200278 10675514 10655277 10509462 11180965
6154 11180965 11443092 11539728 11845542 11957186 12864785 13985670 14544837 14643194 15277780 15865686
6144 15865686 16765518 16949929 17896775 18864850 19750733 19704934 18972669 17959053 17486660
6135 17486660 17685930 17121926 16778301 15959744 15064389 13767345 13021142 12828946 11344712
6126 11344712 9425296 8944266 9061037 8211461 7329703 7362650 6917846 5698713 5007272
6117 5007272 4971749 5446762 5616029 5309432 4364388 3895602 4055957 3293351 3332164 3142214
6107 3142214 3651465 3363869 2751795 2599773 2337438 2233613 2451826 2400882 1864760 2072362
6097 2072362 2311470 2739746 2956149 2344943 1244530 1161176 1359820 1956993 1790106 1919681
6087A919681M12163K54311k25062p30964m42279l40376m02047L64962R85301M58814
6077B254504k2577j195009m25843N58077R5069m0265k57022M56704M66072m55289
6067A434421n37903j23536P8985j21189l79280L29081N73780l79848m63029l32029
6057G9453N46075L47712m8589j48056m0641L3740q36640L1533J90674l85868q8426
6046c19033Q18018P59238m79057k39215q1630L27250l14572k29878J00545p6776
6036B64890L82131P5280P5616J90876p42436m5419N71704K34564j84835j76062
6026F46309k5324J81113J86073m9939r88063N79068L15381n49708l74634M8261
6016c1463O37628n51189k9777j25188J8331J44407L66254L52204o78678k11148
$$ plain form
6087 1919681 2331844 2586155 2361093 1630129 1187850 847474 445427 810389 1795690 2254504
6077 2254504 2231927 1036918 611075 1169152 1264221 1223956 966934 1423638 1889710 1434421
6067 1434421 896518 772982 851967 730778 351498 680579 1254359 874511 411482 79453
6057 79453 625528 973240 924651 776595 735954 769694 -66946 -35413 155261 -230607 -319033
6046 -319033 498985 1258223 779166 539951 458321 785571 470999 241121 341666 264890
6036 264890 647021 722301 797917 988793 246357 200938 772642 1007206 822371 646309
6026 646309 620985 802098 988171 938232 -49831 529237 844618 294910 -79724 -31463
6016 -31463 606165 54976 25199 -99989 -81658 62749 429003 781207 102529 -108619
6006a08619o20241J57290O55707R84383j13744j102501j29805k41486O82086Q6287
5996B49357K13827m75263q51154M94945O30004l0670l5478k79727J70202j8357
5986F7686N21848O43479m51894N4168j62719m22495K4541j23979l21471L09113
5976A38277J35066L34661p4611k30610k60898n13608O8482M8865L62936L39245
5966C47805N8036n67978J52946k45472m39905J77457J64215J55752k87877L44952
5956a40069K89091J72035j45189k51909k58902J65647J19514n3285m48029l93815
5946i44911L24086Q67730O26965n82961k25915J18631P09938j14622J09987n73078
5936C15850j82210l51576l15910R83129M78316m43996m96357j1795j20944l36313
$$ plain form
6006 -108619 -728860 -571570 84137 1068520 954776 -147725 -277530 -519016 163070 249357
5996 249357 463184 -12079 -863233 -368288 261716 231046 195568 -84159 86043 67686
5986 67686 589534 1233013 781119 835287 672568 250073 274614 150635 -170836 138277
5976 138277 273343 608004 533393 302783 41885 -471723 -403241 -354376 8560 347805
5966 347805 405841 -162137 -9191 -254663 -694568 -517111 -352896 -197144 -485021 -140069
5956 -140069 149022 321057 175868 -76041 -334943 -169296 -49782 -103067 -551096 -944911
5946 -944911 -620825 246905 873870 290909 64994 183625 893563 778941 888928 315850
5936 315850 133640 -217936 -533846 449283 927599 483603 -12754 -24549 -145493 -481806
5926d81806j77312l88857P47297K60615p05611k1575Q08328J57145p61425k22240
5916g85441q59J6132k04701J106588N67062p10039q65182k52057L52426P65186
5906a0885k0020k85808k11166J43147J94913j00076N24462J41038L04183k69707
5896D10081p54012m68792J4667O48850N77101M61364j64415m70881p75038K3718
5886d97357K88014J97227L23130L3214k44967j99749O17964m9347r10312K45899
5876a96284M63351l35523l77174k4143K23645L08361N28299n97563j028520L29462
5866g06089l05800L75493J93878j0526m8122O31087L32342m19615l94196J77308
5856a74240l74643n32992P80823p1584l47348O20650L48940p68318k63140K71495
$$ plain form
5926 -481806 -659118 -1047975 -300678 -40063 -745674 -767249 41079 198224 -563201 -785441
5916 -785441 -786300 -770168 -974869 131719 698781 -11258 -876440 -1128497 -776071 -10885
5906 -10885 -30905 -316713 -527879 -384732 -189819 -289895 234567 375605 679788 410081
5896 410081 -343931 -812723 -798056 -149206 427895 889259 724844 253963 -521075 -497357
5886 -497357 -209343 -12116 311014 344228 99261 -100488 517476 468129 -442183 -196284
5876 -196284 267067 -68456 -445630 -469773 -246128 62233 590532 -7031 -1035551 -706089
5866 -706089 -1011889 -636396 -442518 -453044 -501166 129921 462263 42648 -351548 -174240
5856 -174240 -548883 -1081875 -301052 -372636 -719984 -99334 249606 -518712 -781852 -510357
5846e10357O38583N81585q48433l51233j1736L33770N82366j74913O5603o0789
5836B44446O3530n26215q1939N0593P15554K66643k14478l76022N6698j13064
5826H5746k69573M46020o0277k13452j69232j55542l13M9534M25239O21295n38672
5815B20773m75476j62568k64569L18565R33642O52479r66250o39293J2043K92400
5805g8254L32406o72204L56463M36530l938j45822k61074L44108L4737l6084k33585
5794G3283K4823m73538o42756J58906O23550R52329N78594j2215o46567m55382
5784A81027J37380m13656j12309O9506J106013R328j88012k4437n54313j14041
5774I6486k44156N29845L4585J2028k29593R8073N98208j42788p95532J67141
$$ plain form
5846 -510357 128226 709811 -138622 -489855 -501591 -167821 414545 239632 305235 244446
5836 244446 307976 -218239 -300178 -249585 465969 732612 518134 142112 198810 85746
5826 85746 -183827 262193 201916 -11536 -180768 -336310 -336623 -287089 138150 759445 220773
5815 220773 -254703 -417271 -681840 -363275 570367 1222846 256596 -382697 -370654 -78254
5805 -78254 254152 -418052 -61589 374941 371003 225181 -35893 308215 342952 306868 73283
5794 73283 98106 -375432 -1018188 -859282 -235732 716597 1295191 1282976 636409 181027
5784 181027 318407 -95249 -207558 -138052 967961 977289 789277 764840 210527 96486
5774 96486 -147670 382175 416760 428788 199195 297268 895476 752688 -42844 124297
5764A24297j31916p94670P2188J106956J83620p71305k03499o6669K98192l46042
5754e28848J23558L20394k82208l06979J84933L15014J2609l54748J12690O81992
5744B78407J7544m49057M9191O40689k81877r53927m06654O30450L90914k00745
5734b85065j24930J8390m37509j31010N53253M17805n76871M97825K58241k76473
5724h6344l78527m986L50128n09472n3233N70684L98612K03986K45862n49239
5714A87471L26473M7340n11869J05212J92108L90874q29845j53629j70233p5388
5704d91486N28241j56333N22458l94889j56532p3824j09287K6059k69187j59183
5694g33963L62230P17033K07602p3496m04191l4910j94534K65953M23671o7992
$$ plain form
5764 124297 -7619 -802289 -730101 376855 560475 -210830 -414329 -480998 -182806 -528848
5754 -528848 -405290 -84896 -367104 -674083 -489150 -174136 -161527 -516275 -403585 278407
5744 278407 295951 -153106 -103915 536774 254897 -699030 -1105684 -475234 -84320 -285065
5734 -285065 -409995 -391605 -829114 -960124 -406871 10934 -565937 -68112 190129 -86344
5724 -86344 -464871 -469857 -119729 -629201 -682434 -111750 286862 490848 736710 187471
5714 187471 513944 561284 49415 154627 346735 737609 -92236 -245865 -416098 -491486
5704 -491486 36755 -119578 402880 7991 -148541 -222365 -331652 -305593 -574780 -733963
5694 -733963 -371733 345300 552902 479406 75215 40305 -154229 111724 535395 467403
5684D67403J29396l67792j13713k25242p4956L1367J38765j4396K50858p597J7430
5673B31523N67964l42807p6213J20039J1456o3201k91281k67046N75194J29199
5663E94827l21746n61638o7601O09623N7062o6002N84022K89146o57537n76980
5653a16824M33796N66132L39622q693k22594j258895k15053R61245O7340K90938
5643H37014K16425k04920p19112j66354M99987Q5383L91147O29421r06750j171569
5633e09328K63183K20000L1032r7052L09131m9585k54279M08294r04564K49082
5623c34086k17042K39079M54823Q64159q5958q60245j38500n33376N01795J70560
5613F1209J2268P15920k86845n13079J58679P01384m29632l87143L02392j85421
$$ plain form
5684 467403 596799 229007 115294 -109948 -184904 -153537 -14772 -29168 221690 214093 231523
5673 231523 799487 456680 380467 500506 511962 448761 157480 -109566 465628 594827
5663 594827 273081 -288557 -356158 253465 310527 244525 828547 1117693 460156 -116824
5653 -116824 316972 883104 1222726 1214033 991439 -267456 -482509 478736 546076 837014
5643 837014 1053439 848519 129407 -36947 463040 548423 939570 1568991 662241 -509328
5633 -509328 -246145 -26145 4887 -92165 216966 167381 -86898 321396 -583168 -334086
5623 -334086 -551128 -312049 142774 1006933 920975 60730 -77770 -611146 -109351 61209
5613 61209 73477 789397 502552 -10527 148152 849536 419904 32761 335153 149732
5603A49732j47987L34075M69957m73467k15627l41536L04935j60999K20572O0597
5593B00252p48251L93580m0636L16067J2516k02706L1002M5206j47171n28084
5583f68225M81352j3154J45647J04950O25716K15819o88927J1859P0539P17515
5573A003091m63017k84303M49453q9006J82584k34155M45334r08669K36510P85650
5563A123472L73954p05985j174577O29143J56289n0366k70086K38625j45855k979
5553A71635N19793k29533n11131o04180M85412K00219L14952N26025m55837J85297
5543F02652m65494J32820k3406n45577p8124K39124P62015J90672N3707l80440
5533D87949j68934L30588K0302M91933j83647o20727N2730L34923O2535K82419
$$ plain form
5603 149732 1745 335820 805777 332310 116683 -224853 80082 -80917 139655 200252
5593 200252 -547999 -154419 -195055 121012 133528 -69178 -38176 7030 -140141 -668225
5583 -668225 -186873 -200027 -54380 50570 676286 892105 203178 215037 285576 1003091
5573 1003091 540074 255771 705224 616218 798802 564647 1009981 101312 337822 1123472
5563 1123472 1497426 791441 -383136 246007 402296 351930 81844 320469 174614 171635
5553 171635 691428 461895 -49236 -653416 -168004 32215 347167 873192 417355 602652
5543 602652 137158 269978 246572 -299005 -377129 -138005 624010 814682 868389 487949
5533 487949 319015 649603 669905 1161838 978191 357464 410194 745117 807652 1090071
5523A090071j44283Q5267o07246o95909N53276j3898M14298M13511L84301o11038
5513H68350j72825O40438m32285r66135J92908J56438P77958J6554j85217j19129
5503G77055J54901J38719j87563q8198N117R17901J7501L8309k3p00137m54150
5492F19432k16940P8426N81188L03565n58139n94224j20081L12181M28692m99799
5482C34301J41429K89640N23870Q131m77254m91931l35912Q46943J18163j14523
5472H42857p5499j4808M3906m61359J099167N37599J99892r20422k78593O07485
5462A580225N7312n04041q60423N85303K83816k15558J43396P7006L6053n04209
5452F78880j70294l38249J14494J27586M16674k26578n97747O22203J7064l31147
$$ plain form
5523 1090071 945788 1031055 423809 -272100 281176 267278 681576 1095087 1479388 868350
5513 868350 695525 1335963 903678 -62457 130451 286889 1064847 1081401 896184 777055
5503 777055 931956 1070675 883112 794914 800031 1717932 1735433 1773742 1773719 1073582 619432
5492 619432 402492 480918 1062106 1365671 807532 213308 93227 405408 834100 334301
5482 334301 475730 765370 1289240 1297371 820117 328186 -7726 839217 957380 842857
5472 842857 767358 752550 796456 335097 1434264 1971863 2171755 1251333 972740 1580225
5462 1580225 1637537 1133496 273073 858376 1142192 926634 1070030 1147036 1183089 678880
5452 678880 508586 170337 284831 412417 829091 602513 4766 626969 644033 312886
5442C12886p09750M33730N63391m58130j84332J09789J031390O0205m51371k07126
5432E00682l5556k22841p38517R48354M45589j50547k59114J92738l13739j12610
5422B54439M70588L71178l47521p10304k64947L97277N35387K86161L6239m06248
5412F22249j45215m50799J43300K55155k09297l60871O65273K67286m83482p882
5402B95717M14312j024516j28660P68499L03015k11356r73127M03733K95674N30019
5392F73310j05956K32214k77990j63415p9387l10570R56417l51183o92722L09341
5382A90059N15119n18966q08907J354040K00358p59840r80315J29928P25123k60450
5372b13851P25990l1778l33962K41662j12673l54671q84224L06609R62653L34710
$$ plain form
5442 312886 -396864 36866 600257 142127 -42205 67584 1098974 1159179 707808 500682
5432 500682 465126 242285 -496232 452122 897711 747164 488050 680788 367049 254439
5422 254439 725027 1096205 748684 38380 -226567 170710 706097 992258 1028497 622249
5412 622249 477034 26235 169535 424690 215393 -145478 519795 787081 303599 295717
5402 295717 710029 -314487 -443147 325352 628367 417011 -556116 -152383 143291 673310
5392 673310 567354 799568 521578 358163 278776 -31794 924623 573440 -119282 190059
5382 190059 705178 186212 -622695 731345 931703 171863 -808452 -678524 46599 -213851
5372 -213851 512139 480361 146399 388061 275388 -79283 -963507 -656898 305755 640465
5362F40465n20456o76545L64673J80154m100l5699J36659K67707L18199K6134
5352F97191q06724j72500K04538M4915n8083j24684M31015J12003m45577N188
5342a12718J17105M80409R75451K19193m92092k57210j99546r16601J7302Q491
5332a60216J66316J134q9989L54959j43318L75838j60657m89071J33336j90274
5322b01942j69624J12498O09504m97686p07073J299334J17646p28612Q0756l8626
5312a23825j20844j90747J377798m78819q04237o6518M60983N77096j85046L72633
5302H18474n79185k01441p8450J29254j7407J92552J120225q07153m09799p6694
5292I0376j85750K30085K72968M43330m06024K37947K3733r66045q19932O58969
$$ plain form
5362 640465 120009 -556536 -191863 -11709 -15809 -51508 85151 352858 671057 697191
5352 697191 -109533 -282033 -77495 -32580 -90663 -215347 215668 327671 -117906 -112718
5342 -112718 4387 484796 1460247 1679440 1187348 930138 730592 -186009 -168707 -160216
5332 -160216 6100 7234 -82755 272204 128886 504724 344067 -145004 -11668 -201942
5322 -201942 -371566 -259068 350436 -147250 -854323 445011 562657 -165955 -85199 -123825
5312 -123825 -244669 -435416 942382 463563 -340674 -407192 53791 630887 445841 818474
5302 818474 239289 37848 -40602 88652 71245 263797 1384022 576869 167070 90376
5292 90376 -95374 134711 407679 851009 444985 682932 706665 -259380 -1079312 -420343
5282d20343Q10496m4327l09601l95724M06090O45188l56051m21057m92271J320227
5272G42627j627k94000L73901m5147j024239n94633J014073N80153J83687n50840
5262C83955k96133j00657J00529P05971J08574m86453l70731J15892R00285k82385
5252G78847o49934j54445k9447K63429p2183J99155N57466j07982o4391l95077
5242C25438J06276J93815m44657k64119r9515N03123J049270n62119n18727K36468
5232E25253r9425n79528N08149L38726M4056m53313j21455M83353l23791N63639
5222H85664k56852K63578N3661O8044J02722l85009O48970j69939l60212J33286
5212I83913R0851J89294k39410m29039N6100l60143o22374N95921O67013r0313
$$ plain form
5282 -420343 390153 345826 36225 -359499 46591 691779 335728 -85329 -577600 742627
5272 742627 741000 447000 820901 775754 -248485 -843118 170955 751108 934795 383955
5262 383955 87822 -12835 87694 793665 902239 415786 45055 160947 1061232 778847
5252 778847 128913 -25532 -54979 208450 136267 335422 892888 784906 720515 325438
5242 325438 431714 625529 180872 -83247 -182762 320361 1369631 807512 288785 525253
5232 525253 425828 -153700 354449 693175 737231 283918 162463 645816 322025 885664
5222 885664 628812 892390 946051 1014095 1116817 731808 1380778 1210839 850627 983913
5212 983913 1074764 1264058 1024648 595609 651709 291566 -330808 265113 932126 841813
5202H41813k22572k39564r0707k86964J68411N86789j50906j89350m76037J057026
5192I97939K59869q30527P4791J09534L64399n45610K60676K92905k4735j17560
5182H41681k83666j56281p3465M90899l24029K13526k63701J98584P58645l62578
5172A039615k09806q06247L75091j14373r5663P90993J5691m71831m23184N15299
5162F15585J25351j39575j37402J88129j3906m941r9302p05734K81548R8251n0544
5151A57460K25909J67148M07705l85813J48965l6357L80120l37279K71331j25899
5141H73290p20863j24338l67978O32264J66607K3177k26254K16176J21282n35181
5131E8182p2777P22260j71256j043598J88969J381763K91511m85600O5800j000381
$$ plain form
5202 841813 619241 379677 288970 2006 170417 757206 606300 416950 -59087 997939
5192 997939 1257808 427281 502072 611606 976005 430395 691071 983976 959241 841681
5182 841681 558015 401734 328269 819168 495139 708665 444964 643548 1402193 1039615
5172 1039615 829809 23562 398653 284280 188617 979610 995301 523470 100286 615585
5162 615585 740936 601361 463959 652088 638182 633241 533939 -171795 109753 208004 157460
5151 157460 383369 550517 958222 572409 721374 685017 1065137 727858 999189 873290
5141 873290 152427 28089 -339889 292375 458982 482159 255905 472081 593363 58182
5131 58182 -14595 707665 536409 -507189 -318220 1063543 1355054 869454 935254 -65127
5121f5127l73911O76034M76173k57638L60380O27591l18413p39884p4870K02473
5111E12808J46657L00583j33276Q8669p9831K69774J91881M54543n22505q8178
5101A141125j14334O413N1991l89396N0624m83468J67505P90541L3602j70676
5091A083927l62307j03669q40804N5990J000771K89360m24394o01781O15447L4652
5081G47192k68416L15521J61960L80679l92546L40628k26865L08395Q53154j9646
5071B200056k77871o88444j56507k12314N70634m82558o5046K30803R26053k56958
5061A787848k33673N67213n21512j86073R7167M87817J65240j68260r4007q5359
5051A816401J58758L27259N69135q07673m5289k31209j75545N03005M39932M50263
$$ plain form
5121 -65127 -439038 236996 713169 455531 815911 1443502 1125089 385205 310335 512808
5111 512808 659465 960048 826772 915441 835610 1105384 1297265 1751808 1229303 1141125
5101 1141125 1026791 1033204 1085195 695799 746423 262955 430460 1221001 1254603 1083927
5091 1083927 721620 617951 -222853 -166863 833908 1123268 698874 97093 712540 747192
5081 747192 478776 794297 956257 1336936 944390 1285018 1058153 1366548 2219702 2200056
5071 2200056 1922185 1233741 1077234 864920 1435554 952996 887950 1118753 2044806 1787848
5061 1787848 1554175 2121388 1599876 1413803 1510970 1998787 2164027 1995767 1901760 1816401
5051 1816401 1975159 2302418 2871553 2063880 2018591 1787382 1611837 2114842 2554774 3005037
5041C005037j22048m989P6336M0283j46418L39084o83383P58413M01715m10758
5031C253272j19733k70478O98932L85640p02856k15539Q21239L43452J8305o21213
5021C591021R3296L10084j96713R42889N3852l30054l63672k15380j0895N23734
5011D398162N09260L32737O48609m20957K47456k83006k84548J25111R7384J080386
5001F450594m23716J40227O85779l835j53884J033572J513172n69868K42225J85300
4991I099566N98911m64167L56607J271324R10425M42994J22048J424737Q28064
4982A4590509P22550O69131J950551J962445J523325J893907J567707K662212
4974B7542337K198382K265563K150124J913030J587541Q80442M41354o59104O59398
$$ plain form
5041 3005037 2882989 2878000 2954336 2994619 2848201 3187285 2503902 3262315 3664030 3253272
5031 3253272 3133539 2863061 3561993 3947633 3244777 3029238 3850477 4193929 4212234 3591021
5021 3591021 3684317 3994401 3797688 4740577 4794429 4464375 4100703 3885323 3874428 4398162
5011 4398162 4907422 5240159 5888768 5467811 5715267 5432261 5147713 5272824 5370208 6450594
5001 6450594 6026878 6167105 6852884 6849049 6695165 7728737 9241909 8672041 8914266 9099566
4991 9099566 9698477 9234310 9590917 10862241 11772666 12215660 12337708 13762445 14590509
4982 14590509 15313059 15982190 17932741 19895186 21418511 23312418 24880125 27542337
4974 27542337 29740719 32006282 34156406 36069436 37656977 38537419 38978773 38319669 38979067
4965C8979067q0022l50265j976519j620900j184326k314821j742541k127205k252927
4956B5329541j476342j413686j749132j605882l53585j098705q11585j59555j92811
4947A6468258k63421n19460O84788j127124j4208M0597m14026L37630J163280
4938A6356314Q83397j21902j18430J85575J251206M89413J225144J429425J006925
4929B2587067J720381J779245K108510K675197K395401K208087K431649K624219
4921D0529756K730157J480110J424943N18265l12249l12649n98067j158505j462811
4912D2838950j435172k261383k615677k690040k199292l806327k897123j206922
4904B3727014j866954k000117r97376j001916j840508j281096j273741n22081
$$ plain form
4965 38979067 38899045 38548780 36572261 34951361 33767035 31452214 29709673 27582468 25329541
4956 25329541 23853199 22439513 20690381 19084499 18730914 17632209 16820624 16661069 16468258
4947 16468258 16204837 15685377 16370165 15243041 15228833 15269430 14855404 15193034 16356314
4938 16356314 17239711 17117809 16999379 17184954 18436160 18925573 20150717 21580142 22587067
4929 22587067 24307448 26086693 28195203 30870400 33265801 35473888 37905537 40529756
4921 40529756 43259913 44740023 46164966 46683231 46370982 46058333 45460266 44301761 42838950
4912 42838950 41403778 39142395 36526718 33836678 31637386 27831059 24933936 23727014
4904 23727014 21860060 19859943 18862567 17860651 16020143 14739047 13465306 12943225
4896A2943225n69761q62381o21495j186036p01021k41547m6199k53494R9898j53649
4886H407540q83235q12334J21555M23523m61441l47059l47912P9471L1095n18531
4876E692672m10694n57824K56746K62469p04023L2571J60854K40187m29761m58977
4866D084220j90978K10102m19429l68320Q17474K41645k18822n28741l19881N9127
4856C366397R4646K91324l12790j24014K83170K60198k36258J88425R7223J48465
4846D056786o79142l81359J2044R7914O10423J71722l37248l55607N96488j64974
4836C627047K14889l95240O04634L39106p47261k43353l49871K00328r9078r6750
4826C054451k76044O50622L01899Q8746M72691j94786p32607k44718R14526O3224
$$ plain form
4896 12943225 12373464 11511083 10889588 9703552 9002531 8760984 8714785 8461291 8561189 8407540
4886 8407540 7524305 6711971 6833526 7257049 6795608 6448549 6100637 6180108 6211203 5692672
4876 5692672 5281978 4724154 4980900 5243369 4539346 4571917 4732771 4972958 4543197 4084220
4866 4084220 3893242 4103344 3683915 3315595 4133069 4374714 4155892 3627151 3307270 3366397
4856 3366397 3461043 3752367 3439577 3315563 3598733 3858931 3622673 3811098 3908321 4056786
4846 4056786 3377644 2996285 3008329 3106243 3716666 3888388 3551140 3195533 3792021 3627047
4836 3627047 3841936 3446696 4051330 4390436 3643175 3399822 3049951 3250279 3151201 3054451
4826 3054451 2778407 3429029 3730928 3819674 4292365 4097579 3364972 3120254 4034780 4098004
4816D098004n5023k51425J92263k52699J78328N70231j79036L82138k26565o15186
4806C841030L51268Q10423L87230p44387J90606O70692j56747k71054Q4604j77687
4796D985978m02031K93390L47125M01831l38649k34977Q45884m02158m99551J65513
4786E162355J165926J20502o30027M11299O18693p5476l24368n9700M82122J053614
4776G924940k58305P10882M02044M89418M10940N56471P78619N12900O92786R47339
4766A3168034Q71772R98608K072648J556380K087548K650582K485324J541682
4758B7432578P86650Q80145r64319n37466j272937k572119k187853j915817p91928
4749A8856934j694226j369004j134992q2532m69005m95421j251729p45705Q67433
$$ plain form
4816 4098004 4042981 3791556 3983819 3731120 3909448 4479679 4300643 4682781 4456216 3841030
4806 3841030 4192298 5002721 5389951 4645564 4836170 5506862 5350115 5079061 5163665 4985978
4796 4985978 4583947 4877337 5224462 5626293 5287644 5052667 5898551 5496393 4996842 5162355
4786 5162355 6328281 6448783 5818756 6230055 6848748 6773272 6448904 6389204 6871326 7924940
4776 7924940 7666635 8377517 8779561 9268979 9679919 10236390 11015009 11527909 12220695 13168034
4766 13168034 14039806 15038414 17111062 18667442 20754990 23405572 25890896 27432578
4758 27432578 28219228 29099373 28135054 27597588 26324651 23752532 21564679 19648862 18856934
4749 18856934 17162708 15793704 14658712 14576180 14107175 13611754 12360025 11614320 12481753
4740A2481753o22159n43443N7773k64538n00489n70113M68630J150422k03664
4731A1454172m07020M90483J648294R98288M5416M17305J129399J857510J663302
4722A9297149P81171J571478J971259J574446Q49320K37550R1058j274026k416713
4713B2682692k049479k142365k516575j574597j056930j552955r21248n07646
4705A0360897l89850j101505m72945j90461o93160j109595J22327N94744o88727
4696F431725n35259n16804k03706J53595o495n80955l58688K46819M74448k38994
4686D865686o39494O01583J8912n28419m23671p8512L81241l11755L62450l4682
4676D213339q28536m47197R12093J71178J23624o7872j67062k42196k1220Q1968
$$ plain form
4740 12481753 11859594 11316151 11373924 11109386 10608897 10038784 10507414 11657836 11454172
4731 11454172 11047152 11537635 13185929 14184217 14229633 14646938 15776337 17633847 19297149
4722 19297149 20078320 21649798 23621057 25195503 26044823 26282373 26373431 25099405 22682692
4713 22682692 20633213 18490848 15974273 14399676 13342746 11789791 10868543 10360897
4705 10360897 9971047 8869542 8396597 8206136 7512976 6403381 6525708 7120452 6431725
4696 6431725 5896466 5379662 5175956 5329551 5323056 4742101 4383413 4630232 5104680 4865686
4686 4865686 4226192 4827775 4846687 4318268 3894597 3816085 4197326 3885571 4248021 4213339
4676 4213339 3384803 2937606 3849699 4020877 4144501 4076629 3909567 3667371 3646151 3728119
4666C728119j77068j14021Q8941j47094q0045L22555j6971N59946K59376p0308
4656D353430l43694L78898j0072J69260n28069N05766N71083n86207k09184k97513
4646D003698Q14568n68415o29444j15637M60044J05883J39971m5044j124225K9195
4636C070594L77784O62417o89484j26461M51178o06886n5947L67998O65269Q8476
4626D204938j02810r75196k45788j98978O01894P83919L70416L17023j331784
4617C423634m2430J58803J168847L3011k22313m13102j64590M84575J98795L04543
4607D929773m41476O98536L41120m15743N13720M18051M0920l17799N09928J60691
4597F437721l92365L06962J87253k53838j041069M0267k57825L90700Q3281n73240
$$ plain form
4666 3728119 3551051 3437030 3525971 3378877 3298832 3621387 3604416 4164362 4423738 4353430
4656 4353430 4009736 4388634 4378562 4547822 4019753 4525519 5096602 4510395 4301211 4003698
4646 4003698 4818266 4249851 3620407 3504770 3964814 4070697 4210668 4165624 3041399 3070594
4636 3070594 3448378 4110795 3421311 3294850 3746028 3139142 3083195 3451193 4116462 4204938
4626 4204938 4102128 3126932 2881144 2682166 3284060 4067979 4438395 4755418 3423634
4617 3423634 3381204 3540007 4708854 4741865 4519552 4106450 3941860 4426435 4625230 4929773
4607 4929773 4488297 5186833 5527953 5112210 5625930 6043981 6084901 5767102 6277030 6437721
4597 6437721 6045356 6352318 6539571 6285733 5244664 5284931 5027106 5417806 5501087 4927847
4587D927847O77642O94976k76582q40357q4892R45717L26108k05081m7224M50885
4577F569039L45931O57326k40734p18861K54740P54400M40982K06534P58158K1756
4567I049271m20002K66674L88726L97965J044153N86684J64770K02437M97108
4558A2177786J213612N42844L08216N44457J178751J575015L96297P20609R58017
4549A9615604K493177J873300J435818K771404L291233L685299M139156N163140
4541D4468131M787053L883196L141876J777140L8833k054866k882569m261867
4533D8896927m979375l806817l266843l048810l466394l020954k350973j874369
4525B3082392j328897j886099r39642k42486j137044q45892j015524m62613K4588
$$ plain form
4587 4927847 5605489 6300465 6023883 5183526 5098634 6044351 6370459 6165378 6118154 6569039
4577 6569039 6914970 7572296 7331562 6612701 6867441 7621841 8062823 8269357 9027515 9049271
4567 9049271 8629269 8895943 9284669 9682634 10726787 11313471 11478241 11680678 12177786
4558 12177786 13391398 13934242 14242458 14786915 15965666 17540681 17936978 18657587 19615604
4549 19615604 22108781 23982081 25417899 28189303 31480536 35165835 39304991 44468131
4541 44468131 49255184 53138380 56280256 58057396 58096229 56041363 53158794 48896927
4533 48896927 43917552 40110735 36843892 33795082 30328688 27307734 24956761 23082392
4525 23082392 21753495 19867396 18927754 18685268 17548224 16702332 15686808 15224195 15248783
4516A5248783K76431k20896m95482J64847k13023j24113j18598j09528R78166
4507A5386587j7770P92428r0432L23652P24448Q94584R14199M93531J113880J404929
4497B1940036J826803J495536K484569K968697K600461K935195L133442K815442
4489D2200181K651300K301030R67853j683148k650002l398483l799635m310417
4481C2278679m055706l189604k529889k063701k210108j416262j578138j081756
4473A4153515n28334q07405m71934j542767j39597n4543k32700m52373j49661
4464I774201k40758k00687L87131m69417k62664l47070m33984m679k448j24910
4454H074715M78080N36264p46049j199771m92813J69571J10117l41757n96183
$$ plain form
4516 15248783 15525214 15304318 14808836 14973683 14760660 14636547 14517949 14408421 15386587
4507 15386587 15368817 16161245 16070813 16394465 17118913 18013497 18927696 19421227 20535107 21940036
4497 21940036 23766839 25262375 27746944 30715641 33316102 36251297 39384739 42200181
4489 42200181 44851481 47152511 48120364 46437216 43787214 40388731 36589096 32278679
4481 32278679 28222973 25033369 22503480 20439779 18229671 16813409 15235271 14153515
4473 14153515 13625181 12817776 12345842 10803075 10663478 10608935 10376235 9923862 9774201
4464 9774201 9533443 9332756 9719887 9250470 8987806 8640736 8206752 8202073 8199625 8074715
4454 8074715 8552795 9089059 8343010 7143239 6650426 6819997 6930114 6588357 5992174
4445E992174l39701m60827r3085k7518j20021l29747j12073j5119n26754L17407
4435D284736K82115R2016K07660r84518R3594J95370L92701o7237j59958O21704
4425D958183j87372m68615j113526M11710P16351q8066P58259o5209j0094k02907
4415D708714o81018K93086K06000K90542k89012L19535L67050M2208l52338K14449
4405E119216K98688j44549k21275j32430k56180M21413M04791J74418l60107J78469
4395E482454M49445o51566p6117N02925N63111l24231p4447N65428M4829L1334
4385F513165N57918P73597m48571j59832O14753K41556O9348j236179p2903L67454
4375G220306M20095O52985j72093K53517l32410n425j12952K99278P30119j14045
$$ plain form
4445 5992174 5652473 5191646 5098561 5071043 4951022 4621275 4509202 4494083 3967329 4284736
4435 4284736 4566851 4658867 4866527 3882009 3975603 4170973 4563674 4496437 4336479 4958183
4425 4958183 4770811 4302196 3188670 3600380 4316731 4228665 4986924 4921715 4911621 4708714
4415 4708714 4027696 4320782 4526782 4817324 4528312 4847847 5214897 5257105 4904767 5119216
4405 5119216 5417904 5273355 5052080 4919650 4663470 5084883 5489674 5664092 5303985 5482454
4395 5482454 5931899 5280333 5204216 5707141 6270252 5946021 5871574 6437002 6481831 6513165
4385 6513165 7071083 7844680 7396109 7236277 7851030 8092586 8161934 6925755 6852852 7220306
4375 7220306 7640401 8293386 8121293 8374810 8042400 8036975 7924023 8223301 8953420 8839375
4365H839375M57970l86148l39760j04501K02637J00331m6824L76695L75806M20230
4355I895811l83865k569j83806J033169R84857J04092o0590M08935R16509l38476
4345A2374067Q16083J289459L10850m8920P98318Q38704K91360M31365P21972
4336A7823258J060706J087210J210536J270413J075308J275111R21030P10329
4328B6433901J564885R11789J258933J055926J420355J713468J578128K032566
4320C7969951K562977K976964K902877M175308N232133P329359Q102572R967364
4312H1219505J2329330J4188201J7246491J9632858K2975405K4258800J2060346
4305B03910936r089122k2409109k7774273k5534306k0692724j4992517j1332913
$$ plain form
4365 8839375 9297345 8911197 8571437 8466936 8669573 8769904 8723080 9099775 9475581 9895811
4355 9895811 9511946 9509377 9325571 10358740 11343597 11447689 11387099 11796034 12712543 12374067
4345 12374067 13190150 14479609 14790459 14741539 15539857 16378561 16669921 17101286 17823258
4336 17823258 18883964 19971174 21181710 22452123 23527431 24802542 25723572 26433901
4328 26433901 27998786 28910575 30169508 31225434 32645789 34359257 35937385 37969951
4320 37969951 40532928 43509892 46412769 50588077 55820210 63149569 71252141 81219505
4312 81219505 93548835 107737036 124983527 144616385 167591790 191850590 203910936
4305 203910936 194821814 172412705 144638432 119104126 98411402 83418885 72085972
4298G2085972r594067o703450n047284m758418m188121l434728l417723k056910
4290C2885271j990040j397400j838880j675131j504628j413891l48694j266580
4282B1450027n09405p07800r21589j143592m56793o40707j409829r37776l35993
4273A4386543J38036n93850p49168o62343n67488j61303k58866j077888n76484
4264I877189J03090k28962p92430l4464j36392l14466l7017L96647r5940r01471
4254G835784J0785j59951k53936M72920O00832m531n27062J41555k57742j187860
4244F670794L93026J118849r22674J55127J99208P34486m76564o51378P5215q83713
4234F412376L09316l5025M08213l00151m60800L41338l94183q4370p05464K65248
$$ plain form
4298 72085972 62491905 55788455 50741171 45982753 41794632 38359904 34942181 32885271
4290 32885271 30895231 29497831 27658951 25983820 24479192 23065301 22716607 21450027
4282 21450027 20940622 20232822 19311233 18167641 17710848 17070141 15660312 14722536 14386543
4273 14386543 14524579 13930729 13181561 12519218 11951730 11790427 11531561 10453673 9877189
4264 9877189 9980279 9751317 8958887 8924423 8788031 8473565 8436548 8833195 8737255 7835784
4254 7835784 7846569 7686618 7432682 7905602 8506434 8501903 7974841 8116396 7858654 6670794
4244 6670794 7063820 8182669 7259995 7415122 7614330 8348816 7872252 7220874 7296089 6412376
4234 6412376 6721692 6686667 7094880 6794729 6333929 6675267 6281084 6196714 5491250 5756498
4224E756498K53845o96925l3629K14456j61254l96980k76695J52907k34418K38814
4214D816619O60513p68642p16113N91716J29942l23552P7231M23158l76156j192131
4204C322585O50767Q26203k76217K72185L09050j27577r01028n55960p2169k84900
4194C162939Q47091Q79172J77205k62716K8583j42108J18972q7481r9598L60024
4184D982083R6411n77857O83807N0228N78417q79271l54409K94828n59817N22623
4174D837043k88080J035403P3499k04089n44118q85917k51348N92736N81369M34566
4164E381064m58494p74131M36637O29623q11349j24526J108325o49494J56318
4155D893973l82338J187634k28057j159997J84621l3744j12263R55125N32700
$$ plain form
4224 5756498 6010343 5313418 5279789 5494245 5332991 4936011 4659316 4812223 4577805 4816619
4214 4816619 5477132 4708490 3992377 4584093 4714035 4390483 4467714 4890872 4514716 3322585
4204 3322585 3973352 4799555 4523338 4795523 5104573 4976996 4075968 3520008 3447839 3162939
4194 3162939 4010030 4889202 5066407 4803691 4832274 4690166 4809138 4721657 4622059 4982083
4184 4982083 5078494 4500637 5184444 5234672 5813089 4933818 4579409 4874237 4314420 4837043
4174 4837043 4548963 5584366 5657865 5453776 4909658 4023741 3772393 4365129 4946498 5381064
4164 5381064 4922570 4148439 4585076 5214699 4403350 4278824 5387149 4737655 4893973
4155 4893973 4511635 5699269 5471212 4311215 4495836 4462092 4349829 5304954 5837654
4146E837654l60775o66888M19056L62789o84266M9403j46511L33688J3391O33292
4136E790833l26479L67034N32603m73564o10654P26565O71678m71348o15719O00481
4126F191430R10378n91201n1743o72297L12985O58664m60782K16421L08310K32777
4116G054942N60016P28785m89507k03152Q8157j81757m85814J6724R35970l24996
4106G699368k34194J164243R50463n62659l18993O18469k4169o11748J57486J015739
4096I854005Q26297J57328n3924p563K27006q5298L59808O36338j73171Q64267
4086A2605093P60314k24674M33616O85273m1225M79270M24083M26381P15924Q72340
4076A7136395R40012l24177J57612Q75711Q66980P97578N39616L33872J62560
$$ plain form
4146 5837654 5476879 4809991 5229047 5591836 4907570 4956973 4810462 5144150 5157541 5790833
4136 5790833 5464354 5831388 6363991 5890427 5279773 6006338 6678016 6206668 5590949 6191430
4126 6191430 7101808 6510607 6458864 5786567 6099552 6758216 6297434 6513855 6822165 7054942
4116 7054942 7614958 8343743 7854236 7651084 7739241 7557484 7071670 7088394 8024364 7699368
4106 7699368 7465174 8629417 9579880 9017221 8698228 9316697 9292528 8680780 8838266 9854005
4096 9854005 10680302 10837630 10783706 10776143 11003149 10917851 11277659 11913997 11740826 12605093
4086 12605093 13365407 13140733 13574349 14259622 14218397 14697667 15121750 15548131 16264055 17136395
4076 17136395 18076407 17752230 17909842 18785553 19652533 20450111 20989727 21323599 21486159
4067B1486159P00900J282957R82184m4048L09947J256346K291897J434222J104428
4058C0804992J763668J212130J438686J044028O76989q52800p41255N9018j097269
4049C4308187p90861Q7299P16832M36319j2283O42490K25178J43258N68832P74963
4039C7100214M26800N28585L44640J128372J796413M09660Q41336J202901J765478
4030D5544399J515898J423510P51552R89072K442950J976178J329249J776241
4022E7749049K467227K123886J615818K795651L396289K563337K650845K396280
4014G7758382K692067L376192L429670L242993K566975L380246K669585K490857
4006A01606967L248552K272246L226584L438684K742790K613398J802554J798446
$$ plain form
4067 21486159 22187059 23470016 24452200 24408152 24718099 25974445 28266342 29700564 30804992
4058 30804992 32568660 33780790 35219476 36263504 36940493 36087693 35346438 35405456 34308187
4049 34308187 33517326 33604625 34321457 34757776 34745493 35387983 35613161 35756419 36325251 37100214
4039 37100214 37527014 38055599 38400239 39528611 41325024 41734684 42576020 43778921 45544399
4030 45544399 47060297 48483807 49235359 50224431 52667381 54643559 55972808 57749049
4022 57749049 60216276 62340162 63955980 66751631 70147920 72711257 75362102 77758382
4014 77758382 80450449 83826641 87256311 90499304 93066279 96446525 99116110 101606967
4006 101606967 104855519 107127765 110354349 113793033 116535823 119149221 120951775 122750221
3998A22750221J991223K079626J702012J583801J679552J380953L42557Q10517
3990A34320462M06776m40702J4219L18058q98627j536779j585799j294532j931202
3981A27371874k204077j811093l226371k009883j843367k830933l455272l394771
3973A06596107l079511l412789k794639l032400l409676l885902l651337l022593
3965H0307260k944474k715290k574422k513203l297970k738614k776462k296343
3957E8450482k231114j963591k882506j209657r99866j304971q57692n22888j4160
3948D6464037k477094j909507k156288k374738k222074k089046j221627j918389
3940C0095274j015993j235334j219753q36324j038306r62352k54794l35856j073229
$$ plain form
3998 122750221 124741444 126821070 128523082 130106883 131786435 133167388 133509945 134320462
3990 134320462 134727238 134286536 134300755 134618813 133720186 132183407 130597608 129303076 127371874
3981 127371874 125167797 123356704 120130333 118120450 116277083 113446150 109990878 106596107
3973 106596107 103516596 100103807 97309168 94276768 90867092 86981190 83329853 80307260
3965 80307260 77362786 74647496 72073074 69559871 66261901 63523287 60746825 58450482
3957 58450482 56219368 54255777 51373271 50163614 49163748 47858777 47001085 46478197 46464037
3948 46464037 43986943 42077436 39921148 37546410 35324336 33235290 32013663 30095274
3940 30095274 29079281 27843947 26624194 25787870 24749564 23787212 23532418 23196562 22123333
3931B2123333q89631P441o36852m99738m49132k11418o48261p69915j59146l83747
3921A7482934j08023m67994l40478j34168K96272j102397q73335k44167P77830
3912A5286474K76659j339819q18485J75906J18437o12875r0185J81431o06948
3903A2570595l47910p9335j61685l5651J34348m24184m66730q9827M00353k49786
3893A1250188p68281k09525O71743L1707l75863m88076Q4022K14844k94001J37717
3883A0254475k61145K23894K39450m09621o49548O31891P19399j88447m83783
3874A0076565N37317j85668o22030M83640M8064m83717m03062L57317J36008j18178
3864I826256J08907j73942o0762L57202L51715o40872o12103M01639p4419M21638
$$ plain form
3931 22123333 21233702 21241143 20604291 20104553 19655421 19444003 18795742 18025827 17866681 17482934
3921 17482934 17374911 16906917 16566439 16432271 16728543 15626146 14752811 14508644 15286474
3912 15286474 15563133 14223314 13404829 13580735 13699172 13086297 12996112 13177543 12570595
3903 12570595 12222685 12143350 11981665 11946014 12080362 11656178 11189448 11099621 11499974 11250188
3893 11250188 10481907 10272382 10944125 10975832 10599969 10111893 10195915 10410759 10116758 10254475
3883 10254475 9993330 10217224 10456674 10047053 9397505 10029396 10748795 10560348 10076565
3874 10076565 10613882 10428214 9806184 10289824 10337888 9854171 9451109 9808426 9944434 9826256
3864 9826256 9935163 9761221 9700459 10057661 10409376 9768504 9156401 9558040 9483621 9905259
3854I905259n093o0545j62729j8652K10723O162K55028l49888j1788K39055O17087
3843A0624619o41813k67766N65413L76019J60375q34663J37669m06221n6707J06064
3833I762989L70274L75585O0886m752l14388O24371J22027m93977j91594M06073
3823A0717494P40653l13611l14331o66750n99742K85536M76210L41575K03299
3814A0870333j29036m34749N54646L41150R92631p37305p91649J19167J50381
3805A0935569N57329j14657M41400l78485J20849k40146P59363r2594P5417M90884
3795A2554929j025311J18486J06424R66474n14558k1464O91341R66058M69559
3786A4311938o57267k61026R1415J038540J06315p2085j11354J34744M19079k77676
$$ plain form
3854 9905259 9900166 9839621 9676892 9658240 9868963 9875125 10130153 9780265 9768477 10007532 10624619
3843 10624619 9982806 9715040 10280453 10656472 10816847 9982184 10119853 9713632 9656925 9762989
3833 9762989 10133263 10508848 10569734 10564982 10250594 10874965 10996992 10503015 10311421 10717494
3823 10717494 11458147 11144536 10830205 10163455 9563713 9849249 10325459 10667034 10870333
3814 10870333 10741297 10306548 10861194 11202344 12194975 11457670 10666021 10785188 10935569
3805 10935569 11492898 11378241 11819641 11441156 11562005 11321859 12081222 11988628 12064045 12554929
3795 12554929 11529618 11648104 11754528 12721002 12206444 12184980 12876321 13842379 14311938
3786 14311938 13654671 13393645 13485060 14523600 14629915 14557830 14446476 14581220 15000299 14722623
3776A4722623K55351K338k04768M54358N57036R43580q30897O9537O70632M2035
3766A6681825m24382o93083M94838n0213R05622K77318M32721r072r2204n76272
3756A6947098K97425J438496o89205l35825n07800L67686P89627K29653K43617
3747A8780772k91455L21031N68720P69785O6928Q05247J067271M57123l06764
3738B2238658L7368Q85183L94182N88083M98468O82317J350313Q72194R11545
3729B8458311P2580J636917J379629k27252O72813J816047R24465M92571J545080
3720C6771161J471332J577143R50947J318728P40164J291156J350583J044376
3712D6515590J471492J357457J318185J534542O72135L14459R84057J972829J200434
$$ plain form
3776 14722623 14977974 14980312 14775544 15229902 15786938 16730518 15899621 15969158 16639790 16681825
3766 16681825 16257443 15564360 16059198 16008985 16914607 17191925 17624646 17615574 17523370 16947098
3756 16947098 17244523 18683019 17993814 17657989 17150189 17517875 18307502 18537155 18780772
3747 18780772 18489317 18810348 19379068 20148853 20215781 21021028 22088299 22545422 22238658
3738 22238658 22276026 23161209 23555391 24143474 24641942 25324259 26674572 27546766 28458311
3729 28458311 28530891 30167808 31547437 31320185 31992998 33809045 34733510 35226081 36771161
3720 36771161 38242493 39819636 40770583 42089311 42829475 44120631 45471214 46515590
3712 46515590 47987082 49344539 50662724 52197266 52869401 53183860 54167917 56140746 57341180
3703E7341180K70201N41501J537650J516649R08524O09327K37547Q95065J122585
3694F4980229J050485J221145J068356J523691J188431J231255J150746J139669
3686G4554007Q86714J879332J043560K043949K769572J697335K319984K051299
3678H9245752L391206L001426L494157M278328M053124M079595M737874N413892
3670A21695354N072510O391936P103736O897180P238001Q082334Q865071R394725
3662A80740847J0654934J0860742J1600180J2592753J2406678J3721796J4759756
3655B67337686J5014539J4295966J3690107J4379548J3126912J2084111J0825853
3648C60754722R913260P613554O647675O244939M764376K886921J097905K5194
$$ plain form
3703 57341180 57611381 58152882 59690532 61207181 62115705 62725032 62962579 63857644 64980229
3694 64980229 66030714 67251859 68320215 69843906 71032337 72263592 73414338 74554007
3686 74554007 75440721 77320053 78363613 80407562 83177134 84874469 87194453 89245752
3678 89245752 92636958 95638384 99132541 103410869 107463993 111543588 116281462 121695354
3670 121695354 126767864 133159800 140263536 147160716 154398717 162481051 171346122 180740847
3662 180740847 191395781 202256523 213856703 226449456 238856134 252577930 267337686
3655 267337686 282352225 296648191 310338298 324717846 337844758 349928869 360754722
3648 360754722 370667982 378281536 384929211 391174150 395938526 398825447 399923352 399948546
3640C99948546o51163j175934l202205m321475n197626o650491q075559r107286
3632C61566807j0416197j1348797j2512704j2207854j2060754j1554680j1894578
3625B79571243j1271151j0835079r472386q395634r097799p694177p010705n480750
3617B10313562m838270l182155k425111k652100j479989p71958n98364M3137J522531
3608A95931283J466458J389487J553018K551766K749704J767395L496491L847925
3600B14753527M111296L960647L450753L522471L214132L426855L287955L270208
3592B42997844L053121K292687J306258J194499J397748J304963Q32209m51805
3584B53927524M67845n60200o52067q02825j623714j041435k065210k245271k442312
$$ plain form
3640 399948546 399297383 398121449 394919244 390597769 385400143 378749652 370674093 361566807
3632 361566807 351150610 339801813 327289109 315081255 303020501 291465821 279571243
3625 279571243 268300092 257465013 247992627 239596993 230499194 222805017 215794312 210313562
3617 210313562 205475292 202293137 199868026 197215926 195735937 194963979 194365615 194408752 195931283
3608 195931283 197397741 198787228 200340246 202892012 205641716 207409111 210905602 214753527
3600 214753527 218864823 222825470 226276223 229798694 233012826 236439681 239727636 242997844
3592 242997844 246050965 248343652 249649910 250844409 252242157 253547120 254379329 253927524
3584 253927524 254395369 253835169 253183102 252380277 250756563 249715128 247649918 245404647 242962335
3575B42962335k555721l158958k628846k517476l345946l570658l913856l661869
3567B17609005m280247n697195n471046n734476n854691n398976n713495o655123
3559A72803756o309935n829885o358537n389208n891824m933196n277579n366695
3551A27446897n371337n821972m704399m580580n248697n530274l957925m267705
3543H7964008m441919m234734k858630k840442l176197j417996k726849j999388
3535F4267853j434958j153883r50557k042079L62648p68231j978546o46452N37492
3526E6193287O9857q26162k44350r11038m18148r68350j94757M257j51943j75469
3516E2377184r1429M63436m08702r80372j206571l8553q08091j017734j052742
$$ plain form
3575 242962335 240406614 237247656 234618810 232101334 228755388 225184730 221270874 217609005
3567 217609005 213328758 207631563 202160517 196426041 190571350 185172374 179458879 172803756
3559 172803756 166493821 160663936 154305399 148916191 143024367 138091171 132813592 127446897
3551 127446897 122075560 116253588 111549189 106968609 101719912 96189638 92231713 87964008
3543 87964008 83522089 79287355 76428725 73588283 70412086 68994090 66267241 64267853
3535 64267853 62832895 61679012 60728455 58686376 59049024 58280793 56302247 55655795 56193287
3526 56193287 56263144 55436982 55192632 54281594 53863446 52895096 52700339 52704596 52552653 52377184
3516 52377184 52285755 52749191 52340489 51360117 50153546 50114993 49306902 48289168 47236426
3507D7236426j006898j523486j175334r42462j358821r31795k84547p01036j829430
3498C7482617j079543j562838j221259n51044j259419j026131j735310j045486
3490B8001587n09545j352232j527045p16627k82073n13483j106739j231058r78256
3481A9784529m51106o16283k17329n46575p69349r89188k35146K81550j11450
3472A6129653n68693o83768k01860k15759O48090m22494r43789r30132j34674
3463A2676574J66723k31473r8772M41302k92239o49421p04063j63455N61530m59386
3453A1247320J38718M55294q6812p09032n98800J71138K46257L87825K33515k4808
3443A1460615j158454n12990j57504o18708K44895p4908P35104k41610l13049
$$ plain form
3507 47236426 46229528 44706042 43530708 42588246 41229425 40297630 40013083 39312047 37482617
3498 37482617 36403074 34840236 33618977 33067933 31808514 30782383 29047073 28001587
3490 28001587 27492042 26139810 24612765 23896138 23614065 23100582 21993843 20762785 19784529
3481 19784529 19333423 18717140 18499811 17953236 17183887 16194699 15959553 16241103 16129653
3472 16129653 15560960 14877192 14675332 14459573 15107663 14685169 13741380 12811248 12676574
3463 12676574 12843297 12611824 12513052 12954354 12662115 12012694 11308631 11145176 11706706 11247320
3453 11247320 11386038 11841332 11754520 11045488 10446688 10617826 10864083 11251908 11485423 11460615
3443 11460615 10302161 9789171 9631667 9012959 9257854 9182946 9918050 9676440 9363391
3434I363391k46607m60198m6956j48534O53532q73099q4716L29389K5694n85811
3424G926085j33546K90285l85594m72924m59783j80328J7890J64986N94223J11837
3414G473131n96877j100356p03637M71937O18204j88476o75163m9010L33392j21285
3404E461860j55937K73313j75457m44734j71365N35995k47941n25833Q27995J34713
3394E512609o14234k90806P55857m75135n47747K48925L31646m2608n09399O75281
3384E044389m64201j22303L58525N66777q5221n39142m33512p87315K11052O33920
3374D382969L80988O18182P52274j59984q57615p710R58135q38826n39143m4604
3364D644666P00599N42782n71348l07283k36174J216306n701n86042l43417L31301
$$ plain form
3434 9363391 9116784 8656586 8609630 8461096 9114628 8241529 8156813 8486202 8511896 7926085
3424 7926085 7792539 8082824 7697230 7224306 6764523 6584195 6602085 6767071 7361294 7473131
3414 7473131 6876254 5775898 5072261 5544198 6162402 5973926 5298763 5249753 5583145 5461860
3404 5461860 5305923 5579236 5403779 4959045 4787680 5323675 5075734 4549901 5377896 5512609
3394 5512609 4898375 4607569 5363426 4888291 4340544 4589469 4921115 4878507 4369108 5044389
3384 5044389 4580188 4457885 4816410 5383187 5297966 4758824 4325312 3537997 3749049 4382969
3374 4382969 4763957 5382139 6134413 5974429 5116814 5109104 6067239 5228413 4689270 4644666
3364 4644666 5345265 5888047 5316699 5009416 4773242 5989548 5983847 5397805 5054388 5385689
3354E385689j22402m12174M56564j96495K65163n16245j34460j03766n28672L38451
3344D431653O05349k84280m53341J03707k03149m38092j73675K07408p9874m69040
3334C246666K00004K22582M48945L20795j79783K4820m13697O81881k82313o060
3324D263840j64993p5423l36705J65396J98005k43352M13862j046N96858m48537
3314D367905p08502j28850K38212K17663J36444N48703r23589N0961L7694n26356
3304C310285K30626Q2627K30761O1227K56590j05023k81768K11957J99870J44862
3294D342014k80655J52914J09870m46807L63614L25672k01905j90088O76615j31751
3284D719493m8835l74013K60959J11817m15931M41216r8998K29245j275364K83303
$$ plain form
3354 5385689 5263287 4851113 5307677 5111182 5376345 4860100 4725640 4621874 4093202 4431653
3344 4431653 5037002 4752722 4299381 4403088 4199939 3761847 3588172 3795580 3715706 3246666
3334 3246666 3446670 3669252 4118197 4438992 4259209 4284029 3870332 4552213 4269900 4263840
3324 4263840 4098847 4023424 3686719 3852115 4050120 3806768 4220630 4219584 4816442 4367905
3314 4367905 3659403 3530553 3768765 3986428 4122872 4671575 3747986 3798947 3836641 3310285
3304 3310285 3540911 3623538 3854299 3915526 4172116 4067093 3785325 3997282 4197152 4342014
3294 4342014 4061359 4214273 4324143 3877336 4240950 4566622 4364717 4174629 4851244 4719493
3284 4719493 4670658 4296645 4557604 4669421 4253490 4694706 4595708 4824953 3549589 3832892
3274C832892R72279J73061l51104J86232O88336m65169M2536j85420M57465J00862
3264E451970p270j50994j90072P12192m0466n13312l70390m8328J232088K90429
3254F365847L68092m45476L69132J588468l02040n78083k54600J223328N25224
3245H859892J96277O1639J50609k09234j469127m70400k04504O71858m42277m57205
3235F687528l56887j87184K67066j93674J45238l71678k78865l75863p56512p63594
3225C815575L13429M10497m01470p23231k51660j3112j06797J40258L46241L52432
3215C882162l16136m90668J61373K35017l34546p48943o22000O67636j01860q05339
3205A526696O45996P43373N20164q81389j37215L51721o97456M66332k85639n91052
$$ plain form
3274 3832892 4805171 4978232 4627128 4813360 5501696 5036527 5079063 4893643 5351108 5451970
3264 5451970 5444700 5293706 5103634 5815826 5775360 5262048 4891658 4843330 6075418 6365847
3254 6365847 6733939 6288463 6657595 8246063 7944023 7365940 7111340 8334668 8859892
3245 8859892 9056169 9117808 9268417 9059183 7590056 7119656 6915152 7587010 7144733 6687528
3235 6687528 6330641 6143457 6410523 6216849 6362087 5990409 5711544 5335681 4579169 3815575
3225 3815575 4129004 4539501 4138031 3414800 3163140 3150028 3043231 3183489 3529730 3882162
3215 3882162 3566026 3075358 3236731 3471748 3137202 2388259 1766259 2433895 2332035 1526696
3205 1526696 2172692 2916065 3436229 2554840 2417625 2769346 2071890 2538222 2252583 1661531
3195A661531l99200N43644M02826j67188l14688L36067r0275m00646Q41815k34931
3185B178955m21951o11490J16170Q64411o3605k20367j35237j16876K58708K6057
3175A874775k11046j41313M46715k94480n53100O198M52378J43351p25518L25700
3165A323660j53244L89150k95347j44705L68486J2255J78342p22575j69947j89718
3155E96357L78906k12561R8865J13058n3853M29201m04009l32214J48068O12564
3145A374382n24027m75820L99446M90340L72014p76091M8036l45962m01710L7644
3135A98252K95855N45815J04577j51889l75277J50879l9062M13040m22408j28585
3125E91197O8941k72169N18994L5348O85614l00691m19682K72688K00191J25976
$$ plain form
3195 1661531 1262331 1805975 2208801 2041613 1726925 2062992 1972717 1572071 2413886 2178955
3185 2178955 1757004 1145514 1261684 2126095 2062490 1842123 1706886 1590010 1848718 1874775
3175 1874775 1663729 1522416 1969131 1674651 1121551 1127749 1580127 1723478 997960 1323660
3165 1323660 1170416 1559566 1264219 1119514 1488000 1500255 1678597 956022 786075 596357
3155 596357 975263 762702 861567 974625 920772 1349973 945964 613750 761818 1374382
3145 1374382 850355 374535 773981 1264321 1636335 860244 908280 562318 160608 198252
3135 198252 494107 1039922 1144499 992610 617333 768212 729150 1142190 719782 591197
3125 591197 660138 387969 906963 942311 1627925 1327234 907552 1180240 1380431 1506407
3115A506407q52102k84285k998N54191K85212M29131l24292k42104k18271n08345
3105C42544N64737l22432N02640k88354j55736L52462p74971J47410j89864J96384
3095C74820l08290J52952N35279l25184K32720q23447J28628L86034N5515k91032
3085A17995O8510R24358k96423m53954p21036M32258K87719k02636M7217K30616
3075D34624m859l42939J88005m72760M06887j96233L88837m27220L10813L98922
3065F84077K00712l20242l34125K68437j75415N59139M7114n75343l63149O15560
3055F06765j52678L23081K88737l49982n6430m76675R8874K96346L52547R942
3045I40527J17583J56564j85895j43810k71303N3218o04977k13584J35435L89414
$$ plain form
3115 1506407 654305 370020 367022 921213 1206425 1635556 1311264 1069160 850889 342544
3105 342544 907281 584849 1087489 799135 643399 995861 220890 368300 178436 374820
3095 374820 66530 219482 754761 429577 662297 -161150 -32522 353512 409027 117995
3085 117995 186505 1110863 814440 360486 -360550 71708 359427 156791 204008 434624
3075 434624 429765 86826 274831 -197929 208958 12725 401562 -25658 285155 684077
3065 684077 884789 564547 230422 498859 323444 882583 929697 354354 -8795 606765
3055 606765 454087 777168 1065905 715923 659493 182818 281692 578038 930585 940527
3045 940527 1058110 1214674 1028779 884969 613666 666884 61907 -151677 -16242 373172
3035C73172j04198j6281N53192n99720k06649K71273l603O28224m02714j80341
3025C12355n1397k56731l51401L57712M41349L36161j06913p50041m53923j50077
3015f72906L89873P37052K93958n51557j07249o6187n52914P94123L28962m74820
3005A18335j062007K30274N07038L9864M03186K14164j9646o59452L09595K66542
2995C47893l05862j13765L08951j1354n1408j1180K17421L32961m22783k39977
2985E0897j51093j8023M52173L16892J54276l07479j35131j73928N52956J33366
2975H74906o09910k92423L85390k18582J99779l02277k77018k09374N06786O09937
2965F67214o45732L45158k04874m38617J29373K49572l38296k12490Q89671k24249
$$ plain form
3035 373172 268974 252693 805885 206165 -484 270789 267186 895410 492696 312355
3025 312355 260958 4227 -347174 10538 451887 788048 681135 -68906 -522829 -672906
3015 -672906 -283033 454019 747977 196420 89171 22984 -529930 264193 593155 118335
3005 118335 -943672 -713398 -206360 -166496 236690 450854 431208 -228244 81351 347893
2995 347893 42031 -71734 237217 225863 174455 163275 380696 713657 290874 50897
2985 50897 -100196 -118219 333954 650846 805122 497643 362512 188584 741540 874906
2975 874906 264996 -27427 357963 139381 339160 36883 -240135 -449509 57277 667214
2965 667214 21482 366640 161766 -276851 -147478 102094 -236202 -448692 440979 216730
2955B16730q36060L79373O74300J68597m27625M55507l05976j20613J40375J93918
2945E38526J46880o23285k15249L14554L99532O11350J05531l20489r73352n2805
2935f8807L39962P38189J35205k43427K1385k85229J76263m73623l08038M21440
2925D53320K5979N78446K51509j67539l61973k63465k40875m20680K36929K53076
2915C44727P99267l30167M07408m01998l4733O17240o9109j21838k07829J9571
2905A022539m69487Q8154O74030k10433k64563k6950M75465l19373o65654Q0732
2895C84460K24951l54022k40965O88676L24738N7848k49757j63100r7130P12498
2885A288197J79479n00253K72030J34241j4878p63059N29346Q5563m5080J45434
$$ plain form
2955 216730 -619330 -239957 434343 602940 175315 630822 324846 204233 344608 538526
2945 538526 685406 62121 -153128 161426 560958 1172308 1277839 957350 -16002 -68807
2935 -68807 271155 1009344 1144549 901122 922507 637278 813541 339918 31880 453320
2925 453320 479299 1057745 1309254 1141715 779742 516277 275402 -145278 91651 344727
2915 344727 1143994 813827 1221235 819237 784504 1401744 1332635 1210797 1002968 1022539
2905 1022539 553052 641206 1315236 1104803 840240 813290 1288755 969382 303728 384460
2895 384460 609411 255389 14424 703100 1027838 1085686 835929 672829 575699 1288197
2885 1288197 1467676 967423 1239453 1373694 1358816 595757 1125103 1210666 1165586 1311020
2875A311020m4881j44552m24005N09666k78256j32065j31392J44965N59813l63315
2865A006998O47384p15964n46248M5742L14209O944l06144N19031K7987O86211
2855A686150m12774k11655k29537j12546K37093p19380J54049Q5088N52450J80385
2845A209323r9722K7121J72837L50982p93300l98783K28697M38000j25952J65207
2835A174410m15141j85515n64556m08934K81501k43796P34530m80553m19179O55412
2825A28179M97637k5500j074191N7387P2727M16287l7111N2218m79586J54286
2815b37667J12840L2624o34113j57555R47143m1488K56107j2864k97326J9614
2805a2685m82424k79892M08525O20754p0042J20883Q7219q62609J96423J08761
$$ plain form
2875 1311020 1266139 1121587 697582 1207248 928992 796927 665535 810500 1370313 1006998
2865 1006998 1654382 938418 392170 437912 752121 759065 452921 971952 999939 1686150
2855 1686150 1273376 1061721 832184 719638 956731 237351 391400 476488 1028938 1209323
2845 1209323 1109601 1136722 1309559 1660541 867241 468458 697155 1135155 1009203 1174410
2835 1174410 759269 573754 9198 -399736 -118235 -362031 372499 -108054 -527233 128179
2825 128179 625816 600316 -473875 -416488 -343761 72526 35415 87633 -391953 -237667
2815 -237667 -124827 -92203 -726316 -883871 63272 21784 277891 265027 -32299 -12685
2805 -12685 -495109 -775001 -366476 254278 184236 305119 392338 -470271 -273848 -165087
2795a65087k20629K33419k24228N40382j12001n3179J68008q0704K95717n71341
2785a89643j92961N3044J420532l41801r95427k8651M48296m11003N2348P36386
2775E51120j89748q8740j7054k31974m48850m78860L24089R68311J82305m4239
2765E26360r10780o31168M98810P40762p91314r07923Q60264M33172M51788N44991
2755H14962r59211n75919K59266R5564K01548j38415J35727j89425Q110R15658
2745E67865J16239n71549k13571L84660J85695p5700n5858m08213p7719P3435
2735g4716L64961L74100j63935j46638N643j87619n22461P0733P63103j39051
2725C44120q34294R913N38375l58345q50540K92404L11922K72403n16572K67849
$$ plain form
2795 -165087 -385716 -152297 -376525 163857 51856 -1323 166685 85981 381698 -189643
2785 -189643 -382604 -329560 1090972 749171 -246256 -274907 173389 -237614 -185266 551120
2775 551120 361372 272632 255578 23604 -425246 -904106 -580017 388294 570599 526360
2765 526360 -384420 -1015588 -516778 223984 -567330 -1475253 -614989 -181817 269971 814962
2755 814962 -144249 -720168 -460902 -365338 -163790 -302205 -166478 -355903 -347793 567865
2745 567865 684104 112555 -101016 283644 469339 393639 337781 -70432 -148151 -74716
2735 -74716 290245 664345 500410 353772 359415 171796 -350665 -279932 483171 344120
2725 344120 -490174 -480261 58114 -300231 -1150771 -858367 -546445 -274042 -790614 -522765
2715e22765K4687j86472P67096m14489K1997J27691O088O4003m39359O27101m82859
2704d07281j24979J94516j32200L13690Q2443Q89995r31823r9891K7421L24158
2694A36049M18536K65821k57342o95830K73099J32705j99477p5000M286m79242
2684d76395L00060R00987k46806p59356j14749M79472j0554J43678m22485j5534
2674b21682l76414R8555P53674k32887j2034j27883P8961q1543l3061K20204J25598
2663A91488j56146l75260k96883R55549k4188o78903j41129J08508O37448j33139
2653H7345n1884m17401K21480M85262J2910l91270q47444M60561P31769L03067
2643E94395n34797k12689n93302L23981L64815j05975j31775k51724L66845p633
$$ plain form
2715 -522765 -498078 -684550 82546 -331943 -309946 -182255 -176167 -112164 -551523 75578 -407281
2704 -407281 -532260 -337744 -469944 -156254 -73811 816184 -115639 -215530 -188109 136049
2694 136049 554585 820406 563064 -132766 140333 273038 73561 -1439 2847 -476395
2684 -476395 -176335 724652 477846 -281510 -396259 83213 72659 216337 -206148 -221682
2674 -221682 -598096 -499541 254133 21246 9212 -118671 -39710 -121253 -154314 65890 191488
2663 191488 35342 -339918 -636801 318748 294560 -384343 -525472 -416964 220484 87345
2653 87345 35461 -381940 -160460 324802 337712 -53558 -901002 -440441 291328 594395
2643 594395 59598 -153091 -746393 -422412 -57597 -163572 -295347 -547071 -180226 -187859
2633a87859J00824L89978j92918j66303n10405j62865P4052L53552N24966r8099
2623A24923n12864K04240P66091j92557n70751k74766k7149L22626j58157j4772
2613c33136k09295J90472O47527k81311j3389J53781j7884m48740N7927J7193
2603b36855j17389J38240J16419K98345J06634N4156m58953j33628L37813p16332
2593f11550K10788Q13437j27136m25141J37687m2230q95154N4413O98199l89719
2583e76406n20223L78815L08904J36222J51328p434k12526j12140P59772l46545
2573d0233k21397K09586j18207n24720r6207P25192J8941O6896K80045l11545
2563a1649o80224K44262J188001l58611o74879O83903K88055l79911P8076K11492
$$ plain form
2633 -187859 -87035 302943 110025 -56278 -566683 -729548 -655496 -301944 223022 124923
2623 124923 -387941 -183701 582390 389833 -180918 -455684 -482833 -160207 -318364 -333136
2613 -333136 -542431 -351959 295568 14257 868 154649 136765 -311975 -254048 -236855
2603 -236855 -354244 -216004 -99585 198760 305394 359550 -99403 -233031 104782 -611550
2593 -611550 -400762 412675 285539 -139602 -1915 -44145 -939299 -884886 -186687 -576406
2583 -576406 -1096629 -717814 -408910 -272688 -121360 -128794 -341320 -453460 306312 -40233
2573 -40233 -261630 -52044 -170251 -694971 -791178 -65986 -47045 19851 299896 -11649
2563 -11649 -691873 -447611 740390 381779 -293100 390803 678858 298947 377023 588515
2553E88515m68741n55497K82346k02969j81425L27069M04405J79682j8141M41714
2543G96958q54905L1497K96433q4948L7757n27562K31545m10323k79299P93942
2533C1095K49572o7045o27738k26219J68228l4645J3762K08540k3623L13681q944
2522c336l78797L40609L93157o44738l86309k16697M97695Q24011j96900o18962
2512c90267J11546O23340K01417j56778n7566p54576m63602M51306P9692J30297
2502b25191P4735O08138n45100m23543J32872P21008o8711l40593j8947l88581
2492d73913J76966q6374L92159j41348m02610J38182L28163O25985m64083n33265
2482d40138k76379J09799j44181L77080N53510J67853j014943m9097Q74760K6176
$$ plain form
2553 588515 119774 -435723 -153377 -356346 -537771 -210702 193703 373385 355244 796958
2543 796958 -57947 -26450 269983 185035 222792 -304770 -73225 -483548 -762847 31095
2533 31095 280667 213622 -414116 -640335 -472107 -506752 -492990 -284450 -308073 5608 -3336
2522 -3336 -382133 -41524 351633 -293105 -679414 -896111 -398416 425595 228695 -390267
2512 -390267 -278721 344619 546036 389258 331692 -422884 -886486 -435180 -355488 -225191
2502 -225191 -150456 457682 -87418 -510961 -378089 342919 274208 -66385 -85332 -473913
2492 -473913 -296947 -383321 8838 -132510 -535120 -396938 -68775 557210 93127 -440138
2482 -440138 -716517 -606718 -750899 -373819 179691 347544 -667399 -716496 158264 184440
2472A84440o29020R699L48101n04886m00173K97486N26545N41554n38298p48625
2462i13177N25792K71818O93914q10683j50804K45028O03215j63642o22859K95525
2452b5873o0089J9641l50541P3722r0812k53929N55908P38679L13459j106435
2442a86270m3219J87698L47062k19056n34548J57317j47061j19875n8202O83310
2432F7156L09697J51064j6578l96888l65064j80663N63742J17680j18479k34424
2422a02757n79431J02955k88786O7078J92831Q3942N77036n57805J71049O71424
2412C37536m73320r201k72340M97545K67069k35201j28885m05723O07656j57025
2402B8111k95675O16927M36598k90723o12280J47713K1249k82613J33708M93851
$$ plain form
2472 184440 -444580 -434881 -86780 -591666 -991839 -694353 -167808 373746 -164552 -913177
2462 -913177 -387385 -115567 578347 -232336 -383140 -138112 465103 301461 -321398 -25873
2452 -25873 -85962 -66321 -416862 -343140 -433952 -687881 -131973 606706 920165 -186270
2442 -186270 -229489 -41791 305271 86215 -448333 -291016 -438077 -557952 -616154 67156
2432 67156 376853 527917 511339 114451 -250613 -431276 132466 250146 131667 -102757
2422 -102757 -682188 -579233 -868019 -800941 -608110 -524168 52868 -504937 -333888 337536
2412 337536 -135784 -144985 -417325 80220 347289 112088 -16797 -422520 185136 28111
2402 28111 -267564 349363 785961 495238 -117042 30671 51920 -230693 -96985 396866
2392C96866M5631k74123m2920k16747L07779p0028r77742J24681N98146K12228
2382A03771n09662R1404M16842J97149Q9292k46811J29436K16546n30895k02218
2372b45146k05842O15605O06510q4642O1653k50288n86368o08603K51087N24174
2362G8140L38046J08238j58287J18945k92692m5840N50155j63464m04789j08642
2352A9810K09746P70780l33010k39513j79674m30834j71255l5964J219564q21906
2342G744p91431L25544P93964l779l46586K54137l27880J28293J42959L22769
2332E05734o21080j03890O83369o69985J84489L93776l48507j51110L50517N51468
2322G74781l18602k84163n8019k18749J92539K86398o8087n68462K45130K07239
$$ plain form
2392 396866 442497 168374 125454 -91293 216486 146458 -831284 -706603 -108457 103771
2382 103771 -405891 -314487 102355 299504 388796 141985 271421 487967 -42928 -245146
2372 -245146 -450988 164617 771127 686485 748138 497850 -88518 -697121 -446034 78140
2362 78140 416186 524424 366137 485082 192390 146550 696705 533241 128452 19810
2352 19810 229556 1000336 667326 427813 248139 -182695 -353950 -389914 829650 7744
2342 7744 -783687 -458143 335821 332042 -14544 239593 -88287 40006 182965 505734
2332 505734 -115346 -219236 464133 -205852 -21363 372413 23906 -127204 223313 774781
2322 774781 456179 172016 113997 -104752 87787 374185 306098 -262364 -17234 190005
2312A90005q1733K56457o236r6246m33073K27385O93323k06696l10557k67757
2302c5128J10419P3141M35280q0575j59033j19026m28547l51768L00684N82421
2292C27868J20228l14108o43393m9156L15776J97137j48222j20647J5771K05411
2282i3335k98865K72684P03722o6380m65676j53894k89832j85659L79709L14536
2272A17010q1292J24135p47716k16568N54560K31035J22682j94806k90190P24762
2262C43612M75950l28167p0485m03842n252j26269j35985J024462M35643n22171
2252F87496q88065j73646O59149N1260N11950q3827k1852J02221n33065j5693
2242B95928q16951O00376N91351L22744k92271k89321J86842j149712P02314j1616
$$ plain form
2312 190005 108272 364729 358493 262247 -170826 56559 749882 543186 232629 -35128
2302 -35128 75291 148432 583712 503137 344104 225078 -203469 -555237 -254553 327868
2292 327868 448096 133988 -509405 -558561 -242785 -45648 -193870 -314517 -298746 -93335
2282 -93335 -392200 -119516 584206 517826 52150 -101744 -391576 -577235 -197526 117010
2272 117010 35718 159853 -587863 -804431 -249871 -18836 103846 -90960 -381150 343612
2262 343612 819562 491395 420910 17068 11816 -114453 -250438 774024 1209667 687496
2252 687496 -200569 -374215 284934 336194 848144 764317 742465 844686 311621 295928
2242 295928 -521023 79353 670704 993448 701177 411856 598698 -551014 151300 139684
2232A39684J12353o7387N66221l53270j32140J41701J94925l18977l76436N90920
2222D97594n1902L09798J97986K38688p44158l60199K47307O69063R0972k01613
2212H93536j98345r995O05381q4860J63655l92502J21633L62652l07515L0685
2202A184325n90698J33181K89832J92968o41206L66888O60957m94518o36547N73921
2192A039103Q4782l1757L07341n08982J63052K32069Q95626N190j118610K22453
2182A290267J75799K30243m4809J57727l35770j59076N14157L38238N03627k91320
2172B379083m28874L9760O28811K06114j5944l21911l01458J91170J14253j20562
2162B370442l74458K36999Q1442L01508J47757m24303k1874O5944k81780J29998
$$ plain form
2232 139684 252037 184650 750871 397601 265461 407162 602087 283110 -93326 497594
2222 497594 445692 755490 953476 1192164 448006 87807 335114 1004177 1095149 893536
2212 893536 695191 685196 1290577 1205717 1369372 976870 1098503 1461155 1153640 1184325
2202 1184325 593627 726808 1016640 1209608 568402 935290 1596247 1101729 465182 1039103
2192 1039103 1123885 1092128 1399469 890487 1053539 1285608 2181234 2186424 1067814 1290267
2182 1290267 1466066 1696309 1651500 1809227 1473457 1314381 1828538 2166776 2670403 2379083
2172 2379083 1950209 1989969 2618780 2824894 2808950 2487039 2185581 2376751 2491004 2370442
2162 2370442 1995984 2232983 2314425 2615933 2763690 2339387 2317513 2383457 2101677 2231675
2152B231675R62348M51741m70017m27942M0896K33197Q63178K77307l76393N74409
2142D360399N83814n18765j74602R12450O01134l07311J60055O11672K90056R9607
2132F618509Q69918J350647K4893K15835Q6811R84531P28345L99099Q36216J006113
2122A3120917J702332J012561O27124R34761J085497P34089R36292K477880L307992
2113B5939445M582906N889998O703539P947690R317884J2559648J8317357J5579036
2105A06837503n667429j7300666j8860804j5044843r498173o986942n165343l025444
2097B5287859k312046k984051j623586j947490q21830o56914j011338q15849j137046
2088A1977709j031226p19707j39107p50202j241988j597777k48419N63125J03581
$$ plain form
2152 2231675 3194023 3645764 3175747 2747805 2788701 3021898 3885076 4162383 3785990 4360399
2142 4360399 4944213 4425448 4250846 5163296 5764430 5457119 5617174 6228846 6518902 6618509
2132 6618509 7488427 8839074 8863967 9079802 9166613 10151144 10879489 11278588 12114804 13120917
2122 13120917 14823249 15835810 16462934 17397695 18483192 19217281 20153573 22631453 25939445
2113 25939445 30522351 36412349 43115888 51063578 60381462 72941110 91258467 106837503
2105 106837503 101170074 83869408 65008604 49963761 40465588 33478646 28313303 25287859
2097 25287859 22975813 19991762 18368176 16420686 15598856 14941942 13930604 13114755 11977709
2088 11977709 10946483 10226776 10087669 9337467 8095479 6497702 6249283 6812408 6915989
2079F915989K06465l28940p05346r05452k0215k41257P0532m57013q42328J14239
2069C806674L5178J4733l19265n82039j4516r0605k16256p85778M28149M89827
2059B766102N38329k17062n12699m03048k21218P25070j16797j42359o07839L64555
2049B173034J71544K12967K726k64375P9251M36255K82657r35473k40612p02543
2039A215431L91210k26789K19481J15329l17901K8612m22726J16215J24577N481
2029A248920J98090L40852J0354m45576l10394j12603j10763P0538j88269K47572
2019I48721j27013o43580N36623k36404J2626k00414p16779L04201L71567M21102
2009F70650j39969L87009j38024m75400l29995O3549L207N64942P34967k24086
$$ plain form
2079 6915989 7122454 6793514 6088168 5182716 5162501 4921244 4991776 4534763 3692435 3806674
2069 3806674 3841852 3856585 3537320 2955281 2940765 2850160 2633904 1848126 2276275 2766102
2059 2766102 3304431 3087369 2574670 2171622 1950404 2675474 2558677 2416318 1808479 2173034
2049 2173034 2344578 2557545 2560271 2295896 2375147 2811402 3094059 2158586 1917974 1215431
2039 1215431 1606641 1379852 1599333 1714662 1396761 1425373 1002647 1118862 1243439 1248920
2029 1248920 1447010 1787862 1798216 1352640 1042246 929643 818880 889418 701149 948721
2019 948721 821708 178128 714751 478347 490973 290559 -426220 -122019 249548 670650
2009 670650 530681 917690 779666 304266 -25729 37820 41027 605969 1340936 1116850
1999A116850p20076o02956J27051j33476m2313K01724J9741K93171L6075o01844
1989c06053l05175P39722N47871k77876K17249O41751q85182q57903j55970L94288
1979b47278J61370m22860m3952p5317K91628J051087M82839n47786o35196l48494
1969c33959k59022j21324J06044k03661K42300N88546m56145N0880O58577L49836
1959F22072j25757o22409J05721l62898L74338L96733J49866m35404p1307n88506
1949e57551o96154Q80968O59734J18767o28278L49337l95923m71630M70789m3779
1939c13720j79493n58458m79199N55772N38451M42643n69983M192M01176K26882
1929F8263P7702l38681M79070o79590K3222R9054j28507j82164M21865M67457
$$ plain form
1999 1116850 396774 -206182 -79131 -212607 -254920 -53196 -33455 259716 295791 -306053
1989 -306053 -611228 128494 676365 398489 615738 1257489 372307 -485596 -641566 -247278
1979 -247278 -85908 -508768 -552720 -628037 -336409 714678 1197517 649731 14535 -333959
1969 -333959 -592981 -714305 -608261 -811922 -569622 18924 -437221 -386341 272236 622072
1959 622072 496315 -126094 -20373 -383271 -8933 387800 537666 102262 30955 -557551
1949 -557551 -1253705 -372737 286997 405764 -222514 126823 -269100 -740730 -269941 -313720
1939 -313720 -493213 -1051671 -1530870 -975098 -436647 5996 -563987 -559795 -158619 68263
1929 68263 145965 -192716 286354 -393236 -370014 -270960 -399467 -581631 -159766 307691
1919C07691l274o8607k96583K85804K9079J44243m01630q488p3583L15029m14165
1908a84484j86952L75478l86407l23480j77756N28226n73735O06708M77063m95169
1898c40508n51162n28334M29551P27693Q5181m12918m54389J59235o3671L19549
1888f29773J02273M92140J4182m01660K64236l59415Q254o45229L16360L15636
1878e22996N35082j82785r8700p393L57996m7999j31658N9083l62618J68571k14798
1867d48215m71898Q14610M19207j003074k37813J73218L26487n60479j84033J27714
1857a044276P95738M08018j23555k43524q23931J41849M51999K70362j4079m30777
1847f12176K19105K70200l05102K29883K1000m0139M5516q6357k64785m1113P35346
$$ plain form
1919 307691 304417 235810 -60773 225031 254110 398353 -3277 -11765 -85348 229681 -184484
1908 -184484 -371436 4042 -382365 -705845 -883601 -355375 -929110 -322402 154661 -340508
1898 -340508 -891670 -1420004 -990453 -262760 -177579 -590497 -1044886 -885651 -949322 -629773
1888 -629773 -527500 -35360 -21178 -422838 -158602 -518017 -509763 -1154992 -838632 -522996
1878 -522996 12086 -170699 -269399 -276792 81204 33205 -98453 -39370 -401988 -233417 -448215
1867 -448215 -920113 -105503 313704 -689370 -927183 -753965 -427478 -987957 -1171990 -1044276
1857 -1044276 -248538 159480 35925 -207599 -1031530 -889681 -437682 -167320 -181399 -612176
1847 -612176 -393071 -122871 -427973 -198090 -177090 -217229 -171713 -258070 -522855 -563968 171378
1836A71378L46591l56911N2405J43162m8495k38947J30493J87444j963l22678
1826F2479k28220M33383k58329j13109k01021J89525P97622L72076k31889q19318
1816C199l01571J41952k82612k40327M90745O005o45517J10470O24900M1386K13384
1805A62014N68956j032325r25527m7466O94198Q07098j63419L390l91592o2026
1795c86699m7610q264K97492o2003k99747L10603N86017J4175o7565J257n15243
1784a77587n90817R97274L58783j26753J15623J80820j88771l55320M61555N9106
1774G33913m00419n29975j7225M82485k88419J53967L3239L52579P9539q31972
1764b32288j46773M59804O80096p02520p3120p7991p995J93340k05989Q2792k69032
$$ plain form
1836 171378 517969 161058 213463 356625 308130 69183 199676 387120 385157 62479
1826 62479 -165741 267642 9313 -103796 -304817 -115292 682330 1054406 822517 3199
1816 3199 -298372 -156420 -439032 -679359 -188614 -182609 -828126 -717656 -92756 -51370 162014
1805 162014 730970 -301355 -1226882 -1274348 -580150 226948 63529 66919 -324673 -386699
1795 -386699 -434309 -442573 -145081 -207084 -506831 -196228 389789 403964 336399 337656 -177587
1784 -177587 -768404 228870 587653 460900 576523 757343 568572 213252 674807 733913
1774 733913 333494 -196481 -213706 268779 -19640 134327 167566 520145 599684 -232288
1764 -232288 -379061 80743 760839 58319 -14801 -92792 -100787 92553 -113436 -30644 -299676
1753b99676Q70593L24838l50511q98519l03641M83461L23201j56739l43238P4482
1743b75749J10628K67830n92354J97298P98264L31432o82667q75392P15081M53501
1733D47872j79186r99118l09672O6511r2027M34670N07525O04477l4306q71503
1723d24757l18269J77145J69346J348374n70622p21181n52044N95902P74062p21977
1713b44021J87994j8943l39444K2430L44817M91464k73159K63162L74141q11806
1703c365j83232L55588L83497m66443O1660l82541J73717J41286m75624K97826
1693i7631L85843J02436n12211k53263r0037n5354j27119N22881N32845l90481
1683A7909R023J77219n72039M62600K0846k03402m34194l89095P66015Q5534L68901
$$ plain form
1753 -299676 570917 895755 545244 -353275 -656916 -173455 149746 -6993 -350231 -275749
1743 -275749 -165121 102709 -489645 -292347 505917 837349 154682 -720710 -5629 447872
1733 447872 268686 -730432 -1040104 -973593 -1065620 -630950 -123425 481052 446746 -424757
1723 -424757 -743026 -565881 -396535 951839 381217 -339964 -892008 -296106 477956 -244021
1713 -244021 -56027 -74970 -414414 -391984 -47167 444297 171138 434300 808441 -3365
1703 -3365 -186597 168991 552488 86045 147705 -234836 -61119 80167 -395457 -97631
1693 -97631 288212 390648 -121563 -374826 -464863 -520217 -647336 -124455 408390 17909
1683 17909 26932 204151 -367888 94712 115558 -87844 -522038 -911133 -145118 -59584 309317
1672C09317p58858r35567Q69970j01557N94874k37724k17957J60447j16797J08793
1662c25059k34826N19557j03577m2769n68031M35446P58208m22157o586N12301
1652E22507K4732q07789J97567j55466L25723Q08252l97708m5345p41254O22626
1642C53845M9031l80520L43840m12722k28980o76443j2511M37310K62865L22184
1632E7899J0983J646J5558K35645o24954p6307Q8475k43902r449m59684N03014
1621e01076J47001j48563k34646O17708j38134l21450K97463j57885o4961j47823
1611f52366J10382J47791k6299m20927o6051j65559J017086R7063n26580k59806
1601g45266O2479L75114n34845Q03370M10848l23656j9796k90833m27059O853
$$ plain form
1672 309317 -449541 -1385108 -515138 -616695 -21821 -259545 -477502 -317055 -433852 -325059
1662 -325059 -559885 -40328 -143905 -186674 -754705 -319259 438949 16792 10206 522507
1652 522507 547239 -260550 -62983 -218449 107274 915526 517818 472473 -268781 353845
1642 353845 402876 22356 366196 -46526 -275506 -951949 -964460 -527150 -264285 57899
1632 57899 68882 70528 86086 321731 -303223 -379530 -291055 -534957 -544406 -1004090 -501076
1621 -501076 -354075 -502638 -737284 -119576 -257710 -579160 -281697 -439582 -504543 -652366
1611 -652366 -541984 -394193 -420492 -841419 -907470 -1073029 -55943 41120 -485460 -745266
1601 -745266 -682787 -307673 -842518 -39148 371700 48044 28248 -262585 -689644 -682791
1591f82791J30308L09000Q6092O18801K36618k94204J21176k71197m86640l61909
1581e94746N91671P5401l44962K58692Q3721Q1057m54295k3914m0376J51825l5176
1570b51102K81538O14651j62225o50053j160889J01578J132662M07499m69879
1561a56220k16733N60393K55041l02588l02088J86028M92689o78999J9014M40693
1551B97230r24470l46081M70714Q95299q9822j06060M90574M9979j65344k48295
1541C23724L51778j79710l32381k68514j9537p15352P42791O50802m0788k76866
1531B35947j63265K81361K49830l38114j31715o115l78936J18875K5990K41840
1521A35698r03571p09546L91793J476610M86955J57670j90115m58989j63840o30275
$$ plain form
1591 -682791 -552483 -243483 -157391 461410 698028 403824 525000 253803 -232837 -594746
1581 -594746 -3075 72326 -272636 -13944 69777 150834 -303461 -327375 -367751 -215926 -251102
1570 -251102 30436 645087 482862 -167191 -1328080 -1226502 -93840 313659 -156220
1561 -156220 -372953 187440 442481 139893 -162195 23833 516522 -162477 -143463 297230
1551 297230 -627240 -973321 -502607 392692 302870 196810 687384 737363 572019 323724
1541 323724 675502 495792 163411 -105103 -124640 -839992 -97201 553601 512813 235947
1531 235947 72682 354043 603873 265759 134044 127929 -251007 -132132 -106142 135698
1521 135698 -767873 -1477419 -1085626 390984 877939 1035609 845494 386505 222665 -407610
1511d07610J66751m40206L48688K87595J30263M40717l77717R3160Q3211j57469
1501A67383l4428K02748L27796q5134R8628l57672j006608l82507J58013J030668
1491A18887L45576K60667p02066o62598K23799L34241L76275k40857J14939k61116
1481i2253m72133J51197K27619j28667K20343j63527O21801L72493j84080M78832
1471A031625q16711j511528l66977O99354Q28967J0644j6454N50062n12264J43638
1461D0356P2367l36247j16870L66221J94450p08748J63048j96618r2754J62390
1451d52405P53955k67465k31055j40203k65365M17004n60832J95591K20298P89159
1441D58682k52954o19640k73549l49061O86775M59491R2774l90619k6188K48736
$$ plain form
1511 -407610 -240859 -681065 -332377 -44782 85481 526198 148481 241641 324852 167383
1501 167383 132955 335703 663499 578365 676993 319321 -687287 -1069794 -911781 118887
1491 118887 464463 725130 23064 -639534 -415735 -81494 294781 53924 168863 -92253
1481 -92253 -564386 -413189 -185570 -314237 -93894 -257421 364380 736873 552793 1031625
1471 1031625 214914 -1296614 -1663591 -964237 -135270 -124626 -141080 408982 -103282 40356
1461 40356 112723 -223524 -340394 25827 220277 -488471 -325423 -522041 -614795 -452405
1451 -452405 301550 34085 -196970 -337173 -602538 -185534 -746366 -550775 -330477 458682
1441 458682 205728 -413912 -687461 -1036522 -349747 109744 202518 -188101 -214289 34447
1431C4447j27337M7174K0062J17492o44942L52179N28485O4870m91637j08554
1421b07761J83421r745p0820J32228M67539m86141n38567K0402J97763L34606
1411B2925K14704Q8908O3980l42877L80696L46513j15273m07010n48365N5486
1401b40313K57595j29564K24400K44405l0620j31299L17400J05594m18125p45136
1391e45663J26445M82815R14894o7419q04997o1609l22500R9337J7241n5809K78827
1380F1562j94771M47773J10538k9944j131595J29955k12368n92196Q89572N4158
1370d67316J143509o12244n36396J71080Q98473K28396q13656J19478r7790j80644
1360a47110o14865L65096J186110j9387j125542j19096R76564p74369j13728K37534
$$ plain form
1431 34447 -92890 -45716 -25654 91838 -553104 -200925 327560 392430 -99207 -207761
1421 -207761 -24340 -34085 -104905 27323 494862 8721 -529846 -509444 -311681 22925
1411 22925 237629 326537 390517 47640 428336 774849 659576 252566 -295799 -240313
1401 -240313 17282 -112282 112118 356523 325903 194604 512004 617598 199473 -545663
1391 -545663 -419218 63597 978491 911072 106075 44466 -278034 -178697 -161456 -217265 61562
1380 61562 -133209 314564 425102 395158 -736437 -606482 -818850 -1411046 -521474 -467316
1370 -467316 676193 63949 -472447 -301367 597106 825502 11846 131324 33534 -147110
1360 -147110 -761975 -396879 789231 769844 -355698 -474794 501770 -272599 -386327 -148793
1350a48793L77792k57700J10582J50338l95061k97275K49207O66815j522468M25963
1340f40600L53672O0468L41463K08174k96237o24059L77673K30664o1361m81058
1330e31201N5969m12565j57537P89324J61615k4187j009599M84456N14485j58290
1320b87530k5655k3716O99287k36566m39110j81504J83507M54026K18844N2322
1310D13905p93076j65026m7736O08747L073m11470j52070L4934N86919n96363
1300e18163K01672J92969m50798l73839N64907L07074l04694L81530M78585j53918
1290C25325l5958o1356m48179p60229J17784M89021L32152M6667N75619o45729
1280f4883m37505m5668P935P58838j05792l1021O6499N25584l45534n68129J16172
$$ plain form
1350 -148793 228999 -28701 81881 232219 -162842 -460117 -210910 455905 -1066563 -640600
1340 -640600 -286928 -226460 115003 323177 26940 -597119 -219446 11218 -50143 -531201
1330 -531201 -475232 -887797 -1045334 -256010 -94395 -118582 -1128181 -643725 -129240 -287530
1320 -287530 -313185 -336901 362386 125820 -313290 -494794 -311287 142739 361583 413905
1310 413905 -379171 -544197 -591933 16814 19887 -391583 -543653 -508719 78200 -518163
1300 -518163 -316491 -123522 -574320 -948159 -383252 -76178 -380872 658 479243 325325
1290 325325 289367 228011 -220168 -980397 -862613 -373592 -41440 5227 580846 -64883
1280 -64883 -502388 -548056 -540121 218717 112925 81904 148403 673987 328453 -239676 -123504
1269a23504k90974j27722L54210P63448j80961m01956L62869m675l41745K14680
1259B23670M14520n84153n04557M18787K42560j94713k48638O30393q0850o64687
1249c47668k13445L70480P80167j005146j78589L93688j32073K84789o19845M37349
1239b30293l72473K55427J284029L77557q13676j151738K41303K99954J79370
1230F9460l59482P52335j36434o36888J76545K01531R7941o90685j50102M08208
1220b67571k34595l01406J95386J26897J72239r6220r431R34140J23459j088235
1210d45337R8733O31110m68621j83416K83532K29671m61471K43469Q6204n18706
1200e04832K28854j7778L28302l31007p2707M35663o64271K79237O04707k42312
$$ plain form
1269 -123504 -414478 -542200 -187990 575458 394497 -7459 355410 350735 8990 223670
1259 223670 638190 54037 -450520 -31733 210827 16114 -232524 397869 317019 -347668
1249 -347668 -561113 -190633 589534 -415612 -594201 -200513 -332586 -47797 -667642 -230293
1239 -230293 -602766 -347339 936690 1314247 500571 -651167 -409864 -109910 69460
1230 69460 -290022 462313 325879 -311009 -134464 67067 165008 -525677 -675779 -267571
1220 -267571 -502166 -803572 -608186 -481289 -309050 -405270 -414701 519439 642898 -445337
1210 -445337 -346604 284506 -184115 -367531 -83999 145672 -315799 -72330 13874 -504832
1200 -504832 -275978 -293756 34546 -296461 -369168 66495 -597776 -318539 286168 43856
1190D3856r10783N66676k46371M12992K32272r170O62749o05214M60813m59445
1180A48375j11459j34236J94483N30568n43227J78200k53223m32526K20655J59158
1170d3232L39414K87395m67945n8137N56620j59998n87800j49954L94823J45758
1160B56944O3011q0917q19531K30363L18101K78353k38612k77082K28796l82600
1150d23174M09156p3978l49456N0771L59121k9476n22604L20748N03165K06040
1140D50313k21167o9137k37755K29893M25537n58905o8116m18183L26653j34382
1130b75249K0L55698K92645p2272l53417M94046O0965J88630k17807q44809K47768
1119a23782p3931Q54789m8818o18764k5122m76356j81468j03898J013097J04281
$$ plain form
1190 43856 -866927 -300251 -546622 -133630 98642 89472 752221 147007 607820 148375
1180 148375 36916 -97320 97163 627731 84504 262704 9481 -423045 -202390 -43232
1170 -43232 296182 583577 115632 57495 614115 454117 -133683 -283637 111186 256944
1160 256944 319955 239038 -580493 -350130 -32029 246324 7712 -269370 -40574 -423174
1150 -423174 -14018 -87996 -437452 -386681 -27560 -57036 -579640 -258892 244273 450313
1140 450313 229146 160009 -77746 152147 577684 18779 -49337 -467520 -140867 -275249
1130 -275249 -275229 80469 373114 300842 -52575 441471 502436 691066 473259 -371550 -123782
1119 -123782 -197713 657076 608258 -10506 -35628 -511984 -693452 -797350 215747 320028
1109C20028q28634P9495R10896J42752p20671l28828o88301L12258L80929M76168
1099E6092P3854l29198J145217r6074k64509n60343J92391M7954j5249K36677
1089D86812q6984l4894q67871M11829J61165L84000l73968m39559Q55054L83208
1079H78792L80638r84794K29916j86273m98730o2800j59708K78702Q9832M05128
1069C70703j64004p8331m68962n55583K31036M00188P56450k5946p86111P1911
1059b48649l40541j55010k28312M12129M48136p0162l09281m46720O84778m93000
1049g46632O77363m9030j60246l66350l07956P6344j30608J297203P8393k39062
1039A29419j91424O3323o16005P47254J65368j3309L67609p3970K17906o64024
$$ plain form
1109 320028 -508606 -429111 481785 624537 -96134 -424962 -1113263 -801005 -420076 56092
1099 56092 129946 -199252 945965 849891 585382 25039 217430 265384 250135 486812
1089 486812 399828 364934 -502937 -91108 70057 454057 80089 -359470 495584 878792
1079 878792 1259430 274636 504552 318279 -180451 -243251 -402959 -124257 -34425 370703
1069 370703 206699 128368 -340594 -896177 -665141 -264953 491497 465551 -320560 -248649
1059 -248649 -589190 -744200 -972512 -560383 -112247 -182409 -491690 -938410 -253632 -746632
1049 -746632 -69269 -118299 -278545 -644895 -952851 -876507 -1007115 290088 368481 129419
1039 129419 -62005 1318 -614687 132567 297935 284626 652235 578265 796171 132147
1029A32147K06136m91643o93324P08794L47887k12113o0156P43727K90744n38944
1019D33255P132M9411l33202l1448r3670n50891J36077N94920K41647j82692k13735
1008E6804K47145j83978L981J06406J85175N655r40939J69244K88441L39882m48054
997a70238q5550K45862L38390j26877o29830Q7276N6072O87859r6670J66160j41949
986C30505j43712n90553l89462M60286R22873k00436l38551Q26023j002008o3224
976a88259J90145L83237l86823j50669J51235k16810l61052M96058P04089q17233
966a96082J93855N585O9662O6478K26964L23611l54242m81088l38127l83880M17400
955d49864R01330n72629r963L52072L80195k6488o88815J35756K73567n85599
$$ plain form
1029 132147 338283 -153360 -846684 -137890 209997 -2116 -62272 681455 972199 433255
1019 433255 440387 489798 156596 125148 31478 -519413 -383336 211584 453231 270539 56804
1008 56804 303949 119971 123952 230358 415533 421188 -519751 -350507 -62066 277816 -170238
997 -170238 -255788 -9926 328464 201587 -428243 -340967 -284895 402964 306294 472454 330505
986 330505 186793 -403760 -793222 -332936 589937 389501 50950 876973 -125035 -188259
976 -188259 1886 385123 -1700 -152369 -1134 -217944 -578996 -82938 621151 -196082
966 -196082 -2227 3358 73020 139498 366462 690073 335831 -145257 -483384 -867264 -449864
955 -449864 451466 -121163 -131126 220946 601141 574653 -114162 21594 295161 -290438
945b90438l66401Q85015M16797k72876p39621k7404J30123J15688Q0008M58445
935C89336n02660o77197N06873L0401k0454k05135Q38307m32223l81527N27299
925G3020l14719L59457L06587J49976l22534j45601l25259M91552K42124N5211
915E69814o03336o82972M35421l19670m36089J244572N28074o66448m73253L08586
905i5301K81151M62856J69116n33631K6504R0466j61163l03574J53115k41389
895a51850j9008O47211J58125o3152J0795k14778k15441o26623N9396L79102o1261
884i7484J49279O0469m01397M48365j2800K32685k25077n06578O6312J3704L91190
873A18668K78941m24999j88180L12742j96943k19384O12702J94712q83947M13059
$$ plain form
945 -290438 -656839 228176 644973 372097 -367524 -394928 -264805 -149117 -69109 389336
935 389336 -113324 -790521 -283648 -253247 -273701 -478836 359471 -72752 -454279 73020
925 73020 -241699 117758 424345 574321 251787 106186 -219073 272479 514603 569814
915 569814 -33522 -716494 -281073 -600743 -1036832 207740 735814 69366 -403887 -95301
905 -95301 185850 648706 817822 284191 310695 401161 239998 -63576 89539 -151850
895 -151850 -170858 476353 634478 571326 582121 367343 151902 -474721 -415325 -36223 -97484
884 -97484 51795 112264 -289133 159232 146432 379117 154040 -352538 -286226 -272522 118668
873 118668 397609 -27390 -215570 97172 -99771 -319155 293547 488259 -395688 17371
863A7371O07787K85846j62377l30008n34678n57374N73105N80321m49919j87601
853a57527M79066n35597L80372J95389K79856k34649m97594R8504o9767j8469
843h0416j26916K92022Q1605Q5996n0491L90203n03672j75228R72597n50847p63211
832d28358k32097J052895j39982l32725M83586k57321j51669r25041l86929J018977
822b98664N87333J42788J05574m12839M96064K5827l81002k47513L69088q2925
812C03731k95158P02145k8722j97564j06163M12857m15455k29557M77522P340
802F30976n42998l48982O51186n45130K2939P90398j41582n08425m15161o61858
792a068637L01883J165944P2971Q6442q0546l11351m78295m8091K37650o06833
$$ plain form
863 17371 625158 911004 748627 418619 -116059 -673433 -100328 479993 30074 -157527
853 -157527 321539 -214058 166314 361703 641559 406910 -90684 7820 -61947 -80416
843 -80416 -207332 84690 166295 252291 201800 592003 88331 -86897 885700 334853 -428358
832 -428358 -660455 392440 252458 -80267 403319 145998 -5671 -930712 -1317641 -298664
822 -298664 288669 431457 537031 124192 620256 646083 265081 17568 386656 303731
812 303731 8573 710718 681996 484432 378269 791126 375671 146114 623636 630976
802 630976 87978 -261004 390182 -154948 -132009 658389 516807 8382 -406779 -1068637
792 -1068637 -766754 399190 472161 558603 478057 166706 -311589 -359680 -122030 -728863
782g28863L85971l5646j65762k890K98131L85350n26123K04081N61001m43967
772f8717l14483Q6707P50623j60330n72949L21516P2481J20226l98555P66096
762F02615k35941m39416K62222K10477Q2132l48562M00097j537o0657m62552j22015
751a13137K62735N2597n03684M81950k22656L80103j62307n57374J113267k05180
741E26314J30144q40177J47041K82506j94840K09159l6812J11444J57286K34542
731G26607r38822j58971P11607k94482l38874l8389R47994M13500j063393l20801
721c54024m44219O61186L94494M4372l2607r06945L37804K88610M54853l98511
711D5013k4411l14034k25582J13992k53293J199704L41391j35493j139391L21227
$$ plain form
782 -728863 -342892 -378538 -544300 -547190 -249059 136291 -389832 -185751 375250 -68717
772 -68717 -383200 -296493 454130 293800 -279149 42367 114848 235074 -163481 602615
762 602615 366674 -72742 189480 399957 482089 133527 533624 532087 471430 8878 -113137
751 -113137 149598 202195 -301489 180461 -42195 337908 175601 -381773 731494 526314
741 526314 656458 -183719 -36678 245828 50988 260147 223335 334779 492065 726607
731 726607 -212215 -371186 340421 45939 -292935 -331324 616670 1030170 -33223 -354024
721 -354024 -798243 -137057 257437 301809 269202 -637743 -299939 -11329 443524 45013
711 45013 20602 -293432 -519014 -405022 -658315 541389 882780 747287 -392104 -70877
701g0877N68291k64188K26456J22134K25422k50376n22006p76535K19919Q06395
$$ plain form
701 -70877 497414 233226 459682 581816 807238 556862 34856 -741679 -521760 284635
$$ [...]
##END NTUPLES=NMR SPECTRUM
##END=
