##TITLE=1H_CA-9025-1
 CDCl3
 8 sc, 
 27.06.2022
##JCAMPDX= 6.0         $$ Bruker NMR JCAMP-DX V2.0
##DATA TYPE= NMR SPECTRUM
##DATA CLASS= NTUPLES
##ORIGIN= UXNMR, Bruker Analytische Messtechnik GmbH
##OWNER= root
$$ XWIN-NMR		Version 3.5
$$ Mon Jun 27 13:58:56 2022 Russian Standard Time (UT+4h)  she@DPX200
##.OBSERVE FREQUENCY= 200.13135
##.OBSERVE NUCLEUS= ^1H
##.ACQUISITION MODE= SIMULTANEOUS
##.ACQUISITION SCHEME= undefined
##.AVERAGES= 8
##.DIGITISER RES= 18
##SPECTROMETER/DATA SYSTEM= spect
##.PULSE SEQUENCE= zg30
##.SOLVENT NAME= CDCl3
##.SHIFT REFERENCE= (INTERNAL, CDCl3, 0, 15.7348)
##AUDIT TRAIL= $$ (NUMBER, WHEN, WHO, WHERE, WHAT)
$$ ##TITLE= Audit trail, XWIN-NMR		Version 3.5
$$ ##JCAMPDX= 5.01
$$ ##ORIGIN= Bruker BioSpin GmbH
$$ ##OWNER= she
$$ F:/spectra/data/she/nmr/H-F/1/pdata/1/auditp.txt
$$ ##AUDIT TRAIL=  $$ (NUMBER, WHEN, WHO, WHERE, WHAT)
(   1,<2022-06-27 13:56:57.14 +0400>,<she>,<DPX200>,
      <created by zg, POWCHK disabled, PULCHK disabled
       configuration hash MD5:
       00 E9 B6 7A A2 85 ED C7 34 08 36 98 17 FE 4E 26
       data hash MD5: 16K
       06 B7 F1 AB C2 02 33 BB 45 41 BA 9F D0 C8 6E 4D>)
(   2,<2022-06-27 13:57:00.85 +0400>,<she>,<DPX200>,
      <Start of raw data processing
       efp BC_mod = 2 LB = 0.24 FT_mod = 6 PKNL = 1 PHC0 = -18046.62 PHC1 = 17.60069 SI = 16K 
       data hash MD5: 16K
       9C DB 24 AA 59 96 20 8A 4C 7F 2E B0 8A C1 E7 54>)
(   3,<2022-06-27 13:57:29.34 +0400>,<she>,<DPX200>,
      <pk PHC0 = -4.873355 PHC1 = 1.8 
       data hash MD5: 16K
       60 B6 1F AC CE 45 F9 87 76 44 BF E1 2F 9D 33 C6>)
(   4,<2022-06-27 13:57:35.89 +0400>,<she>,<DPX200>,
      <abs ABSG = 5 
       data hash MD5: 16K
       D1 71 62 6A 02 88 5A 09 5C 2A 03 41 7D 61 57 32>)
$$ ##END=
$$ 
$$ hash MD5
$$ 74 16 EA 33 C8 A0 0C 7D 7B 48 03 6D 77 35 F2 84
##$RELAX= 
##$RELAX= 
##$RELAX= 
##$RELAX= 
##$RELAX= 
##$RELAX= 
$$ Bruker specific parameters
$$ --------------------------
##$DU= <F:/spectra>
##$EXPNO= 1
##$NAME= <H-F>
##$PROCNO= 1
##$TYPE= <nmr>
##$USER= <she>
##$AMP= (0..31)
100 100 100 100 100 100 100 100 100 100 100 100 100 100 100 100 100 100 
100 100 100 100 100 100 100 100 100 100 100 100 100 100 
##$AQSEQ= 0
##$AQ_mod= 1
##$AUNM= <au_zg>
##$AUTOPOS= <>
##$BF1= 200.13
##$BF2= 200.13
##$BF3= 200.13
##$BF4= 200.13
##$BF5= 200.13
##$BF6= 200.13
##$BF7= 200.13
##$BF8= 200.13
##$BYTORDA= 1
##$CFDGTYP= 0
##$CFRGTYP= 5
##$CHEMSTR= <none>
##$CNST= (0..31)
1 1 145 1 1 1 1 1 1 1 1 1 1 1 1 1 1 1 1 1 1 1 1 1 1 1 1 1 1 1 1 1 
##$CPDPRG= <>
##$CPDPRG1= <>
##$CPDPRG2= <>
##$CPDPRG3= <>
##$CPDPRG4= <mlev>
##$CPDPRG5= <mlev>
##$CPDPRG6= <mlev>
##$CPDPRG7= <mlev>
##$CPDPRG8= <mlev>
##$CPDPRGB= <>
##$CPDPRGT= <>
##$D= (0..31)
0 1.2 0 0 0 0 0 0 0 0.06 0 0.03 0 0 0 0 0.0002 0 0 0 0 0 0 0 0 0 0 0 0 
0 0 0 
##$DATE= 1656323816
##$DBL= (0..7)
120 120 120 120 120 120 120 120 
##$DBP= (0..7)
150 150 150 150 150 150 150 150 
##$DBP07= 0
##$DBPNAM0= <>
##$DBPNAM1= <>
##$DBPNAM2= <>
##$DBPNAM3= <>
##$DBPNAM4= <>
$$ [...]
##$SUBNAM2= <"">
##$SUBNAM3= <"">
##$SUBNAM4= <"">
##$SUBNAM5= <"">
##$SUBNAM6= <"">
##$SUBNAM7= <"">
##$SUBNAM8= <"">
##$SUBNAM9= <"">
##$SW= 18.05172834244
##$SWIBOX= (0..15)
0 0 2 0 0 0 0 0 0 0 0 0 0 0 0 0 
##$SW_h= 3612.71676300578
##$TD= 16384
##$TD0= 1
##$TE= 0
##$TE2= 300
##$TE3= 300
##$TEG= 300
##$TL= (0..7)
0 120 120 120 120 120 120 120 
##$TP= (0..7)
150 150 150 150 150 150 150 150 
##$TP07= 0
##$TPNAME0= <>
##$TPNAME1= <>
##$TPNAME2= <>
##$TPNAME3= <>
##$TPNAME4= <>
##$TPNAME5= <>
##$TPNAME6= <>
##$TPNAME7= <>
##$TPOAL= (0..7)
0.5 0.5 0.5 0.5 0.5 0.5 0.5 0.5 
##$TPOFFS= (0..7)
0 0 0 0 0 0 0 0 
##$TUNHIN= 0
##$TUNHOUT= 0
##$TUNXOUT= 0
##$USERA1= <user>
##$USERA2= <user>
##$USERA3= <user>
##$USERA4= <user>
##$USERA5= <user>
##$V9= 5
##$VALIST= <valist>
##$VCLIST= <CCCCCCCCCCCCCCC>
##$VD= 0
##$VDLIST= <DDDDDDDDDDDDDDD>
##$VPLIST= <PPPPPPPPPPPPPPP>
##$VTLIST= <TTTTTTTTTTTTTTT>
##$WBST= 1024
##$WBSW= 4
##$XGAIN= (0..3)
0 0 0 0 
##$XL= 0
##$YL= 0
##$YMAX_a= 84810
##$YMIN_a= -112600
##$ZGOPTNS= <>
##$ZL1= 120
##$ZL2= 120
##$ZL3= 120
##$ZL4= 120
##$ABSF1= 15.74799
##$ABSF2= -2.30386
##$ABSG= 5
##$ABSL= 3
##$ALPHA= 0
##$AQORDER= 0
##$ASSFAC= 0
##$ASSFACI= 0
##$ASSFACX= 0
##$ASSWID= 0
##$AUNMP= <proc_1d>
##$AZFE= 0.1
##$AZFW= 0.1
##$BCFW= 0
##$BC_mod= 2
##$BYTORDP= 0
##$COROFFS= 0
##$CY= -3
##$DATMOD= 1
##$DC= 0
##$DFILT= <>
##$DTYPP= 0
##$F1P= 0
##$F2P= 0
##$FCOR= 1
##$FTSIZE= 16384
##$FT_mod= 6
##$GAMMA= 0
##$GB= 0
##$INTBC= 1
##$INTSCL= 0
##$ISEN= 128
##$LB= 0.24
##$LEV0= 0
##$LPBIN= 0
##$MAXI= 10000
##$MC2= 0
##$MEAN= 0
##$ME_mod= 0
##$MI= 1.114404
##$NCOEF= 0
##$NC_proc= -9
##$NLEV= 6
##$NOISF1= 3.799351
##$NOISF2= 2.8
##$NSP= 0
##$NTH_PI= 0
##$NZP= 0
##$OFFSET= 15.73477
##$PC= 1
##$PHC0= -18051.49
##$PHC1= 19.40069
##$PH_mod= 1
##$PKNL= yes
##$PPARMOD= 0
##$PSCAL= 0
##$PSIGN= 0
##$REVERSE= no
##$SF= 200.13000735915
##$SI= 16384
##$SIGF1= 3
##$SIGF2= 2
##$SINO= 5.538805
##$SIOLD= 16384
##$SREGLST= <1H.CDCl3>
##$SSB= 0
##$STSI= 16384
##$STSR= 0
##$SW_p= 3612.71676300578
##$SYMM= 0
##$S_DEV= 0
##$TDeff= 16384
##$TDoff= 0
##$TI= <>
##$TILT= no
##$TM1= 0
##$TM2= 0
##$TOPLEV= 0
##$USERP1= <user>
##$USERP2= <user>
##$USERP3= <user>
##$USERP4= <user>
##$USERP5= <user>
##$WDW= 1
##$XDIM= 16384
##$YMAX_p= 418685016
##$YMIN_p= -4303668
$$ End of Bruker specific parameters
$$ ---------------------------------
##NTUPLES= NMR SPECTRUM
##VAR_NAME=  FREQUENCY,     SPECTRUM/REAL,   SPECTRUM/IMAG
##SYMBOL=    X,             R,               I
##VAR_TYPE=  INDEPENDENT,   DEPENDENT,       DEPENDENT
##VAR_FORM=  AFFN,          ASDF,            ASDF
##VAR_DIM=   16384,         16384,           16384
##UNITS=     HZ,            ARBITRARY UNITS, ARBITRARY UNITS
##FACTOR=    0.220516191357247, 1,           1
##FIRST=     3148.99960010468, 0,            0
##LAST=      -463.717162901099, 0,           0
##MIN=       -463.717162901099, -4303668,    0
##MAX=       3148.99960010468, 418685016,    0
$$ Real data points
##PAGE= N=1
##DATA TABLE= (X++(R..R)), XYDATA
$$ [...]
$$ plain form
6215 2849655 3317908 3368122 2854073 3023293 3717706 3934426 3435594 2689057 2822712 3261277
6205 3261277 2832916 3383370 2947499 3052194 2915752 2334836 2736657 2997291 3430324 3263282
6195 3263282 3426269 3206304 3036191 3577420 4096025 4282477 3796700 3380800 2702056 2278451
6185 2278451 3156753 4078465 3467128 3487553 3215174 2765494 2455080 2800963 3402232 3613002
6175 3613002 3366602 3232438 3363629 3302370 2839024 3445165 4364998 4396150 3863228 3675187
6165 3675187 4184213 4344127 3522444 3312647 3444266 3678500 3656647 3231621 3544806 4126525
6155 4126525 3687905 3772305 3341941 2828664 2910246 3276569 3342363 2917509 2871307 3231422
6145 3231422 3871172 4808333 4586056 4496704 4454725 3729937 3633421 4026375 4378154 3711064
$$ packed form
6215B849655M68253N0214n14049J69220O94413K16720m98832p46537J33655M38565
6205C261277m28361N50454m35871J04695j36442n80916M01821K60634M33033j67042
6195C263282J62987k19965j70113N41229N18605J86452m85777m15900o78744m23605
6185B278451Q78302R21712o11337K0425k72379m49680l10414L45883O01269K10770
6175C613002k46400j34164J31191o1259m63346O06141R19833L1152n32922j88041
6165C675187N09026J59914q21683k09797J31619K34234k1853m25026L13185N81719
6155D126525m38620Q4400m30364n13277Q1582L66323O5794m24854m6202L60115
6145C231422O39750R37161k22277q9352m1979p24788r6516L92954L51779o67090
$$ plain form
6135 3711064 3915301 3322342 4083546 4106043 3594521 3882078 3898485 3852214 3425722 3587328
6125 3587328 3404001 3488522 3976297 4345587 3286279 3419459 4558595 4040940 4028449 3453995
6115 3453995 3549859 3498615 3529455 4271989 4335607 3875583 4496784 4077103 4023575 4498393
6105 4498393 4736603 5428229 4113072 3822291 4233667 3822598 3553306 4236462 3704321
6096 3704321 4078760 4380614 4596602 5305832 4549683 4343420 4477786 4406495 5116516 4449956
6086 4449956 4304485 4616811 4134752 4345303 5204066 4766918 4478019 4575790 3854123 4308663
6076 4308663 4361723 3937531 4151824 3747010 3731071 4215498 4562490 4629619 5030022 4683482
6066 4683482 4108670 4706163 4175731 4682736 4479711 4120169 3156249 3807091 4581957 5520174
$$ packed form
6135C711064K04237n92959P61204K2497n11522K87557J6407m6271m26492J61606
6125C587328j83327Q4521M87775L69290j059308J33180J139136n17655j2491n74454
6115C453995R5864n1244L0840P42534O3618m60024O21201m19681n3528M74818
6105D498393K38210O91626j315157k90781M11376m11069k69292O83156n32141
6096C704321L74439L01854K15988P09230p56149k06263J34366p1291P10021o66560
6086D449956j45471L12326m82059K10551Q58763m37148k88899R7771p21667M54540
6076D308663N3060m24192K14293m04814j5939M84427L46992O7129M00403l46540
6066D683482n74812N97493n30432N07005k03025l59542r63920O50842P74866R38217
$$ plain form
6056 5520174 5415177 4580122 4908334 4052123 4622435 4491155 4563878 4306732 4404590 5055287
6046 5055287 4854665 5281599 5897739 5506600 4452462 5375513 5328509 5219395 5069168 4649929
6036 4649929 5017331 4478234 4774844 5436759 5026527 4755321 5262806 4828976 4469712 4376691
6026 4376691 4636707 5576123 5960925 4471923 4352972 5636646 6265381 5878011 5763052
6017 5763052 6251013 5687143 5880252 5206103 5272049 5812709 6249892 5919662 5964799 5827055
6007 5827055 5373041 4364223 4532971 5273431 5391801 5113278 5484454 5659800 5331969
5998 5331969 5801667 6102728 5947929 5731389 5133552 4284537 4826444 4291513 4692135 4872925
5988 4872925 4828532 5564555 5716595 4952742 4554824 4997512 5075404 5244207 5928965 6988436
$$ packed form
6056E520174j04997q35055L28212q56211N70312j31280P2723k57146R7858O50697
6046E055287k00622M26934O16140l91139j054138R23051m7004j09114j50227m19239
6036D649929L67402n39097K96610O61915m10232k71206N07485m33830l59264r3021
6026D376691K60016R39416L84802j489002j18951J283674O28735l87370j14959
6017E763052M87961n63870J93109o74149O5946N40660M37183l30230M5137j37744
6007E827055m54014j008818J68748P40460J18370k78523L71176J75346l27831
5998E331969M69698L01061j54799k16540n97837q49015N41907n34931M00622J80790
5988D872925m4393P36023J52040p63853l97918M42688P7892J68803O84758J059471
$$ plain form
5978 6988436 6767315 6250251 6422728 6079181 5444210 5302531 5106998 5491681 6109354 5329691
5968 5329691 5673784 5779876 5450874 5672815 6051012 6156985 6763698 7255637 7064945 6146273
5958 6146273 6661416 6518762 6123729 6276186 6866379 7476163 6966242 7041388 7029716 7659201
5948 7659201 6954482 6627545 7671722 8122427 8050732 8224706 7358559 7376015 7237207 7611051
5938 7611051 6659253 5768470 5908985 5878023 6625654 6766601 7150854 6682044 6631946 6689743
5928 6689743 6944590 7763502 7653152 6870553 7645575 7888117 7747955 7281204 6871006 7537374
5918 7537374 7266563 6531072 7672332 7869680 7759086 8372933 7498704 7355425 7404629 8369781
5908 8369781 9657164 9250682 8961060 9840859 9567932 9793370 10126573 9099399 8657272
$$ packed form
5978F988436k21121n17064J72477l43547o34971j41679j95533L84683O17673p79663
5968E329691L44093J06092l29002K21941L78197J05973O06713M91939j90692r18672
5958F146273N15143j42654l95033J52457N90193O09784n09921P5146j1672O29485
5948G659201p04719l26937J044177M50705p1695J73974q66147J7456j38808L73844
5938G611051r51798q90783J40515l0962P47631J40947L84253m68810n0098N7797
5928F689743K54847Q18912j10350p82599P75022K42542j40162m66751m10198O66368
5918G537374k70811p35491J141260J97348j10594O13847q74229j43279M9204R65152
5908H369781J287383m06482k89622Q79799k72927K25438L33203j027174m42127
$$ plain form
5899 8657272 8415139 8589861 7968624 8008238 8154798 8127889 8786068 9186050 9338421 9561014
5889 9561014 9711136 9373776 9505336 10015138 10296341 10349716 10348010 10702835 10733908 10985058
5879 10985058 11488516 11381630 11820619 12507825 12262770 13591511 14168903 15085889 15610173
5870 15610173 14799219 13124702 12309492 11658686 11083382 11311397 10612431 10344713 10940110
5861 10940110 10595075 10234325 9694713 9307039 9728071 10172019 10352375 10348887 10225596 9984008
5851 9984008 11481704 11113855 11038453 11136322 11075928 11393308 12252955 13169499 14108941 14548795
5841 14548795 15164075 15682883 16179129 15693111 14805388 14177447 12800307 12119523 11304989
5832 11304989 10882097 10670671 10125180 10304772 9731764 9599304 9575680 10322687 10479964 10105150
$$ packed form
5899H657272k42133J74722o21237L9614J46560k6909O58179L99982J52371K22593
5889I561014J50122l37360J31560N09802K81203N3375j706L54825L1073K51150
5879A0985058N03458j06886M38989O87206k45055J328741N77392R16986N24284
5870A5610173q10954j674517q15210o50806n75304K28015o98966k67718N95397
5861A0940110l45035l60750n39612l87674M21032M43948J80356l488j23291k41588
5851I984008J497696l67849p5402R7869o0394L17380Q59647R16544R39442M39854
5841A4548795O15280N18808M96246m86018q87723o27941j377140o80784q14534
5832A1304989m22892k11426n45491J79592n73008j32460k3624P47007J57277l74814
$$ plain form
5822 10105150 10183535 9338169 9749516 9611039 9440220 9885550 9903257 9907677 11147758 10293664
5812 10293664 9842117 10628534 11807408 11485194 11403414 11903477 11265462 10859179 10099573
5803 10099573 10149058 9851675 11038358 10138497 9202215 9778285 9490504 9590271 9870494 10342810
5793 10342810 9968299 9991349 10543572 10628649 9481601 8785820 8728455 9596933 8962310 8672761
5783 8672761 10080545 10761404 9864232 9339673 9453570 9115631 9803029 10050861 10326524
5774 10326524 9429480 9501552 9599893 9495572 9445097 9978655 10276793 10338128 10632335 10951185
5764 10951185 10354256 9697460 9735236 9482301 9549303 9863673 10315347 11211209 10681516 9535313
5754 9535313 10386878 10567242 10032889 9423999 9058954 9968277 10276221 10752255 11201725 10944529
$$ packed form
5822A0105150P8385q45366M11347j38477j70819M45330J7707M420J240081q54094
5812A0293664m51547P86417J178874l22214q1780N00063o38015m06283p59606
5803A0099573M9485k97383J186683q99861r36282N76070k87781R9767K80223M72316
5793A0342810l74511K3050N52223Q5077j147048o95781n7365Q68478o34623k89549
5783H672761J407784O80859q97172n24559J13897l37939O87398K47832K75663
5774A0326524q97044P2072R8341j04321n0475N33558K98138O1335K94207L18850
5764A0951185n96929o56796L7776k52935O7002L14370M51674Q95862n29693j146203
5754I535313Q51565J80364n34353o08890l65045R09323L07944M76034M49470k57196
$$ plain form
5744 10944529 10634830 10571899 10269547 10831021 10396653 10446476 10031730 9822398 9804267 10479852
5734 10479852 11060425 11238193 11647396 10732266 10361304 11425766 11280798 11598058 11135322
5725 11135322 10439367 11024227 11261754 10627709 10547209 10564369 10660945 10862024 11023576 11426062
5715 11426062 10531906 11611417 11281702 11069393 11305278 10983226 10561784 11153488 10870223
5706 10870223 10244508 11461298 10746889 10369600 10812702 10774224 11324663 11593847 11683595 11915272
5696 11915272 11748078 10876885 11260438 10092266 10583118 10588635 11315898 11959395 11792658 11811611
5686 11811611 11523994 11682087 11308762 11253861 12270379 11911599 11988159 11603465 11698832 12363655
5676 12363655 12704436 12014436 11727225 12076688 12872923 13087974 12701416 12775994 12486181 13014128
$$ packed form
5744A0944529l09699o2931l02352N61474m34368M9823m14746k09332j8131O75585
5734A0479852N80573J77768M09203r15130l70962J064462j44968L17260m62736
5725A1135322o95955N84860K37527o34045q0500J7160R6576K01079J61552M02486
5715A1426062q94156J079511l29715k12309K35885l22052m21442N91704k83265
5706A0870223o25715J216790p14409l77289M43102l8478N50439K69184Q9748K31677
5696A1915272j67194q71193L83553j168172M90852N517P27263O43497j66737J8953
5686A1811611k87617J58093l73325n4901J016518l58780P6560l84694R5367O64823
5676A2363655L40781o90000k87211L49463P96235K15051l86558P4578k89813N27947
$$ plain form
5666 13014128 13215820 12649222 12272444 12180392 12150549 12328953 12291476 11834184 11622658 11974849
5656 11974849 11696050 11022469 11690580 11603231 11709712 12146717 12214001 13209978 13696847 13468242
5646 13468242 13082718 12392636 12211870 12918111 12944932 13304084 13423263 13544712 12765844 12458962
5636 12458962 12019287 12028180 12530464 12683198 11586634 11271501 12007656 12114505 11676074 11856230
5626 11856230 12222098 12864603 13417912 13203501 13629061 13333290 13636790 12533564 12910110
5617 12910110 12674406 12458576 13232432 13454525 13271458 12687994 13228914 13119251 12732341
5608 12732341 12725275 13648450 13086728 12912375 13434147 13500129 13374627 12215888 12672332 13473857
5598 13473857 13190958 13276922 13581922 13525794 12894621 13403106 13866054 14118172 14029435 14073300
$$ packed form
5666A3014128K01692n66598l76778r2052k9843J78404l7477m57292k11526L52191
5656A1974849k78799o73581O68111q7349J06481M37005O7284R95977M86869k28605
5646A3468242l85524o90082j80766P06241K6821L59152J19179J21449p78868l06882
5636A2458962m39675Q893N02284J52734j096564l15133P36155J06849m38431J80156
5626A1856230L65868O42505N53309k14411M25560k95771L03500j103226L76546
5617A2910110k35704k15830P73856K22093j83067n83464N40920j09663l86910
5608A2732341p066R23175n61722j74353N21772O5982j25502j158739M56444Q01525
5598A3473857k82899Q5964L05000n6128o31173N08485M62948K52118q8737M3865
$$ plain form
5588 14073300 13960915 14141058 14230555 14189432 13560844 13556753 13581729 13636386 13602865 14830108
5578 14830108 14239115 13579552 14005961 14267707 14330164 14249562 14320825 14264121 13965096 14618664
5568 14618664 15079744 14141248 14462684 15190750 14907397 13966805 13474606 13925506 14348614
5559 14348614 14611792 14568041 14145463 13584232 14574718 14107854 14547779 14952145 14353675 13890229
5549 13890229 14096977 15134107 15311289 15083458 14658788 14907049 15041981 15061581 14318305
5540 14318305 14027810 13987643 14156141 14501724 14447901 14648889 14395430 14863363 14852728 14942313
5530 14942313 15464742 15693029 15510050 15802070 16611776 16440102 15818525 15658673 14949533
5521 14949533 16022237 16991980 16400569 15904846 15105519 16087148 16412698 15529062 15499137
$$ packed form
5588A4073300j12385J80143Q9497m1123o28588m091K4976N4657l3521J227243
5578A4830108n90993o59563M26409K61746O2457q0602P1263n6704k99025O53568
5568A4618664M61080r38496L21436P28066k83353r40592m92199M50900M23108
5559A4348614K63178m3751m22578n61231R90486m66864M39925M04366n98470m63446
5549A3890229K06748J037130J77182k27831m24670K48261J34932J9600p43276
5540A4318305k90495m0167J68498L45583n3823K00988k53459M67933j0635Q9585
5530A4942313N22429K28287j82979K92020Q09706j71674o21577j59852p09140
5521A4949533J072704R69743n91411m95723p99327R81629L25550q83636k9925
$$ plain form
5512 15499137 15855458 16024479 16445295 15772996 16041215 15459064 15411607 15701342 16150008 16158653
5502 16158653 15996470 16569571 16055103 15827304 16707834 17040932 17139452 17099132 17908992 18812626
5492 18812626 19521602 19220669 19785232 20389651 20415714 19957542 19308591 17986937 17886136
5483 17886136 17082468 16975227 16867950 16721086 17020920 17363473 16769136 15945952 16030534 15896709
5473 15896709 16352496 16591864 16779788 16497555 15875600 15463945 16279832 16373966 16513104 17099132
5463 17099132 17209566 17764992 18384335 19392287 19425909 19610339 20233605 20074155 20357565
5454 20357565 19653725 17649706 17155597 16826830 16740485 15560122 16010674 15516782 15561690
5445 15561690 16861923 16170969 15945406 15768440 15594805 15947816 15922439 15590932 15793361
$$ packed form
5512A5499137L56321J69021M20816o72299K68219n82151m7457K89735M48666Q645
5502A6158653j62183N73101n14468k27799Q80530L33098R8520m0320Q09860R03634
5492A8812626P08976l00933N64563O04419K6063m58172o48951j321654j00801
5483A7886136q03668j07241j07277j46864K99834L42553n94337q23184Q4582j33825
5473A5896709M55787K39368J87924k82233o21955m11655Q15887R4134J39138N86028
5463A7099132J10434N55426O19343J007952L3622J84430O23266j59450K83410
5454B0357565p03840k004019m94109l28767q6345j180363M50552m93892M4908
5445A5561690J300233o90954k25563j76966j73635L53011k5377l31507K02429
$$ plain form
5436 15793361 15135567 15022808 15642250 15819264 15897673 16575250 16301227 16721310 16488033 16220979
5426 16220979 17338381 16683841 16357568 16881566 16044133 16671437 16556323 15380612 15844633
5417 15844633 16735948 15694437 15052199 15066533 14505636 14306926 13901323 15189666 15226967
5408 15226967 14671322 15058235 14958670 14757877 14520411 15159590 15489575 15432182 14952995 14812682
5398 14812682 15070622 15433276 15768533 15853083 15662848 15390571 15660878 16043393 15419764 15119047
5388 15119047 15158104 15796545 14979610 15083399 15662255 15426803 14791556 15006638 14700897 14306833
5378 14306833 14301168 14615422 14783299 15154749 15370053 15797942 15941741 15199209 15115795 15116033
5368 15116033 15123489 15419936 14369786 14376878 15007540 15536157 16433803 15982820 14938067 15241381
$$ packed form
5436A5793361o57794j12759O19442J77014P8409O77577k74023M20083k33277k67054
5426A6220979J117402o54540l26273N23998q37433O27304j15114j175711M64021
5417A5844633Q91315j041511o42238J4334n60897j98710m05603J288343L7301
5408A5226967n55645L86913r9565k00793k37466O39179L29985n7393m79187j40313
5398A4812682K57940L62654L35257Q4550j90235k72277K70307L82515o23629l00717
5388A5119047L9057O38441q16935J03789N78856k35452o35247K15082l05741l94064
5378A4306833n665L14254J67877L71450K15304M27889J43799p42532q3414K38
5368A5116033P456K96447j050150P092O30662N28617Q97646m50983j044753L03314
$$ plain form
5358 15241381 15005890 14074678 14825531 15234744 15239366 15211814 14810806 14794737 14271593 14831795
5348 14831795 14717023 14856737 14723610 15005768 15078048 14638093 14877579 14396203 15041933 14778314
5338 14778314 14977856 15335973 14694940 14811508 14366018 13797602 13747728 13972558 14107002 14802470
5328 14802470 14147982 14467524 14557821 14719168 14785217 14499675 13825246 14123584 13891011 14143274
5318 14143274 14597393 14714238 14657551 14349187 14459698 13867113 13711575 13502264 14688135
5309 14688135 15003363 14341714 14434590 14795742 14691828 15303351 14005356 14514441 15001234
5300 15001234 15105453 14965024 14894778 15043347 14853409 14210075 14482642 13967176 14034679 14339609
5290 14339609 14674361 14893844 14850233 13872142 14477033 14889277 15110090 14712538 14578395 13836659
$$ packed form
5358A5241381k35491r31212P50853M09213M622k7552m01008j6069n23144N60202
5348A4831795j14772J39714j33127K82158P2280m39955K39486m81376O45730k63619
5338A4778314J99542L58117o41033J16568m45490n68416m9874K24830J34444O95468
5328A4802470o54488L19542R0297J61347O6049k85542o74429K98338k32573K52263
5318A4143274M54119J16845n6687l08364J10511n92585j55538k09311J185871
5309A4688135L15228o61649R2876L61152j03914O11523j297995N09085M86793
5300A5001234J04219j40429p0246J48569j89938o43334K72567n15466O7503L04930
5290A4339609L34752K19483m3611r78091O04891M12244K20813l97552j34143p41736
$$ plain form
5280 13836659 13382192 13092272 13727596 13888922 14039670 13895654 14199820 13874957 13680327
5271 13680327 13839949 14029858 14303225 13646566 13071672 13258861 14159209 13762154 13370941
5262 13370941 13406541 13383450 13905134 14168667 14421084 13798570 14190950 13786009 13828044 13584299
5252 13584299 13132083 13775828 14105243 13775918 13265270 13805663 14141653 14002620 12650376
5243 12650376 13439684 13597263 13158607 12884635 12480654 12024248 12933669 13390744 13194246
5234 13194246 12847476 13288894 13218578 12882366 12669724 12571426 13142081 12994215 12951647 12949170
5224 12949170 12013225 12367480 12611181 12912541 12400343 12834325 12707279 13486838 14223070
5215 14223070 13602006 13884377 14332092 13685077 12269955 12820551 12941449 12859125 13507292
$$ packed form
5280A3836659m54467k89920O35324J61326J50748j44016L04166l24863j94630
5271A3680327J59622J89909K73367o56659n74894J87189R00348l97055l91213
5262A3370941L5600k3091N21684K63533K52417o22514L92380m04941M2035k43745
5252A3584299m52216O43745L29415l29325n10648N40393L35990j39033j352244
5243A2650376P89308J57579m38656k73972m03981m56406R09421M57075j96498
5234A3194246l46770M41418p0316l36212k12642r8298N70655j47866m2568k477
5224A2949170r35945L54255K43701L01360n12198M33982j27046P79559P36232
5215A4223070o21064K82371M47715o47015j415122N50596J20898q2324O48167
$$ plain form
5206 13507292 12444149 12742868 13257781 13330676 13136201 13532832 13005384 12825356 11983139
5197 11983139 12632109 13303691 13011021 13304491 13360343 13544742 12780033 12678508 13283729 12897612
5187 12897612 12539630 12355886 11751990 11239353 12061855 12163093 12460813 13245275 13176580 12905975
5177 12905975 11994946 12187489 12373447 13198678 13270008 12741171 12282468 11445632 11536841 11827202
5167 11827202 11940604 12038453 12524403 13554692 13310123 13033231 12726383 12071986 10702177
5158 10702177 11380394 11674118 11446491 11597756 11505569 11923372 11656581 11361074 10809425 11113722
5148 11113722 11350664 11555680 11590752 12381613 12128190 11857701 11999346 11667292 11017555 11554965
5138 11554965 10462981 11308547 11513020 11021765 11733626 11515524 10787993 10429451 10832422
$$ packed form
5206A3507292j063143K98719N14913P2895j94475L96631n27448j80028q42217
5197A1983139O48970O71582k92670K93470N5852J84399p64709j01525O05221l86117
5187A2897612l57982j83744o03896n12637Q22502J01238K97720P84462o8695k70605
5177A2905975r11029J92543J85958Q25231P1330n28837m58703q36836R1209K90361
5167A1827202J13402R7849M85950J030289k44569k76892l06848o54397j369809
5158A0702177O78217K93724k27627J51265r2187M17803k66791k95507n51649L04297
5148A1113722K36942K05016L5072P90861k53423k70489J41645l32054o49737N37410
5138A1554965j091984Q45566K04473m91255P11861k18102p27531l58542M02971
$$ plain form
5129 10832422 10851879 11402109 11668934 11162174 10833766 11561863 10677912 11194371 10895332 10687882
5119 10687882 10737166 11951140 11197680 11574134 12677204 11994916 11510126 11111638 11110902 11322657
5109 11322657 10734717 10970570 11103474 10788141 10854791 10488337 10526870 10917569 10048586 9465637
5099 9465637 9315546 9994556 10296271 10755885 11348612 11549483 11199460 10757303 11363940 11591135
5089 11591135 10694494 10458885 10912005 10222098 10672263 10998477 10617089 10612375 9922724 10386354
5079 10386354 10334567 9691772 9357659 9131727 9533665 10158451 10317383 10064215 9933771 10161075
5069 10161075 10580520 10851244 11074188 10855601 11227665 10283521 10155942 11049133 10114351
5060 10114351 9775848 10629626 10629295 10415898 9644966 9274168 10022968 10752971 10777851 10633784
$$ packed form
5129A0832422J9457N50230K66825n06760l28408P28097q83951N16459k99039k07450
5119A0687882M9284J213974p53460L76454J103070o82288m84790l98488p36K11755
5109A1322657n87940K35853J32904l15333O6650l66454L8533L90699q68983n82949
5099I465637j50091O79010L01715M59614N92727K00871l50023m42157O06637K27195
5089A1591135q96641k35609M53120o89907M50165L26214l81388m714o89651M63630
5079A0386354n1787o42795l34113k25932M01938O24786J58932k53168j30444K27304
5069A0161075M19445K70724K22944k18587L72064r44144j27579Q93191r34782
5060A0114351l38503Q53778l31k13397p70932l70798P48800P30003K4880j44067
$$ plain form
5050 10633784 10179535 10594915 11151079 10809904 11161270 10459935 10509786 10489698 11094747 12223766
5040 12223766 11677937 10477537 10478057 10968666 10234614 11033411 11423526 11162943 11006076 10284568
5030 10284568 10464949 10996860 10952555 11726976 11325707 11269425 11876312 11258231 11131623 11502349
5020 11502349 11184770 11223146 11061072 11343733 12143235 13049732 11872429 11465491 11905720
5011 11905720 10995745 11125190 11089619 11884857 11931707 11599478 11801494 11953221 12693857 12259707
5001 12259707 12638480 12862759 13247210 13027238 12960518 13242323 13290535 12659672 13481748 14316525
4991 14316525 14305815 14556895 14309136 14936202 15757899 16400843 16827327 16871074 17191257 18123849
4981 18123849 18362152 19876787 20605446 22804527 23898558 25843132 27696937 29272998
$$ packed form
5050A0633784m54249M15380N56164l41175L51366p01335M9851k0088O05049J129019
5040A2223766n45829j200400N20M90609p34052P98797L90115k60583j56867p21508
5030A0284568J80381N31911m4305P74421m01269n6282O06887o18081j26608L70726
5020A1502349l17579L8376j62074K82661P99502R06497j177303m06938M40229
5011A1905720r09975J29445l5571P95238M6850l32229K02016J51727P40636m34150
5001A2259707L78773K24279L84451k19972o6720K81805M8212o30863Q22076Q34777
4991A4316525j0710K51080k47759O27066Q21697O42944M26484M3747L20183R32592
4981A8123849K38303J514635P28659K199081J094031J944574J853805J576061
$$ plain form
4973 29272998 31259968 33396228 36165074 38642840 41417222 42949724 42788008 42177457
4965 42177457 39596489 35394259 33019591 29990774 27316642 25276063 23847538 21598685
4957 21598685 21175304 19878453 19165976 18484009 18083288 17682661 16678462 16193079 15853310
4948 15853310 16291063 16502507 15694206 15402806 15152674 14657763 14786816 14879726 14521885 15148088
4938 15148088 14579522 14840040 15086023 14571247 15864021 15393178 15944516 15172851 15670811
4929 15670811 15548291 14825798 14412689 14798018 15477169 15580147 16882767 16705778 16582730
4920 16582730 16027993 17148263 18094207 18729961 19275938 19021296 19091552 19685631 21356448
4911 21356448 22607633 24089319 24170224 25839714 27936339 29711090 31773551 34008995
$$ packed form
4973B9272998J986970K136260K768846K477766K774382J532502j61716o10551
4965D2177457k580968m202230k374668l028817k674132k040579j428525k248853
4957B1598685m23381j296851p12477o81967m00721m00627j004199m85383l39769
4948A5853310M37753K11444q08301k91400k50132m94911J29053R2910l57841O26203
4938A5148088n68566K60518K45983n14776J292774m70843N51338p71665M97960
4929A5670811j22520p22493m13109L85329O79151J02978J302620j76989j23048
4920A6582730n54737J120270R45944O35754N45977k54642P0256N94079J670817
4911B1356448J251185J481686Q0905J669490K096625J774751K062461K235444
$$ plain form
4903 34008995 35928121 38857164 42863777 46247946 49368294 52335012 53182894 52685063
4895 52685063 50064754 45754987 42614436 38793299 34891996 31463820 28449197 27033272
4887 27033272 24840567 23881816 23390569 22203124 20994695 20410031 19690207 18554281 18205239
4878 18205239 17424642 16493549 16134867 15714805 15960027 15445707 15327178 14910259 14703724
4869 14703724 14643649 13710995 13312230 12657751 12622400 12565987 12766538 13151150 12513285 12261636
4859 12261636 11909716 11829767 11749166 11631467 12772883 12433014 11952207 11674456 11608340 11813543
4849 11813543 12337969 11945926 11928587 11911340 12573133 12644933 12068903 12317124 11741429 12287998
4839 12287998 13021559 12564587 12059349 12296429 12379288 13347562 13889800 13506780 13987949 13368219
$$ packed form
4903C4008995J919126K929043M006613L384169L120348K966718Q47882m97831
4895E2685063k620309m309767l140551l821137l901303l428176l014623j415925
4887B7033272k192705r58751m91247j187445j208429n84664p19824j135926l49042
4878A8205239p80597r31093l58682m20062K45222n14320j18529m16919k06535
4869A4703724o0075r32654l98765o54479l5351n6413K00551L84612o37865k51649
4859A2261636l51920p9949q0601j17699J141416l39869m80807k77751o6116K05203
4849A1813543N24426l92043j7339j7247O61793P1800n76030K48221n75695N46569
4839A2287998P33561m56972n05238K37080Q2859R68274N42238l83020M81169o19730
$$ plain form
4829 13368219 13784536 14558354 15603432 15228525 16384695 16717109 16401084 16583472 16118003
4820 16118003 17522544 18482763 18376421 18015548 19568101 20908679 21536828 21133158 21478353
4811 21478353 22545902 23957942 24528369 26102806 27674540 27699483 29604827 30856577 32065911
4802 32065911 33398572 33256471 34374392 33501111 32304451 31225587 29388803 29375342 27630074
4793 27630074 25578730 23227311 21797207 21207546 21280637 20525817 19974851 19243907 18997342
4784 18997342 18911114 19223060 18429221 17468927 16909569 16799507 17037579 16382415 16795819 17786755
4774 17786755 17990097 17745197 18554953 19505635 19499754 19788665 19929393 20772289 21536407 21915580
4764 21915580 23377098 23698386 23952542 25373397 27003406 28907843 30693620 31352635 33464403
$$ packed form
4829A3368219M16317P73818J045078l74907J156170L32414l16025J82388m65469
4820A6118003J404541R60219j06342l60873J552553J340578O28149m03670L45195
4811B1478353J067549J412040N70427J574437J571734K4943J905344J251750J209334
4802C2065911J332661j42101J117921q73281j196660j078864j836784j3461j745268
4793B7630074k051344k351419j430104n89661P3091p54820n50966p30944k46565
4784A8997342q6228L11946p93839r60294n59358j10062K38072o55164M13404R90936
4774A7786755K03342k44900Q09756R50682n881K88911J40728Q42896P64118L79173
4764B1915580J461518L21288K54156J420855J630009J904437J785777O59015K111768
$$ plain form
4755 33464403 35444802 37783265 41044847 42660037 45428163 47369947 48346289 49002997
4747 49002997 48728718 47770019 45363228 42827270 39873966 36122749 32665326 30991157
4739 30991157 28927666 26814342 25221600 22982919 21897312 21112400 20292486 19587251 17126060
4730 17126060 17444759 16834515 15956231 15978781 15473052 15346124 15849168 15688185 14839718 14211148
4720 14211148 13888854 12899690 12983468 12213136 11274420 11651295 12408674 13606366 13113859
4711 13113859 12502879 12578445 12279882 11504737 10766654 11130612 11284780 10906234 11748571 11896288
4701 11896288 11871570 11757930 11663993 11915050 11862594 11837886 12116569 13244268 13026492 12634886
4691 12634886 12968650 12688253 12640344 12869527 12379722 12944964 13233879 13927345 13793122 14083764
$$ packed form
4755C3464403J980399K338463L261582J615190K768126J941784R76342O56708
4747D9002997k74279r58699k406791k535958k953304l751217l457423j674169
4739C0991157k063491k113324j592742k238681j085607p84912q19914p05235k461191
4730A7126060L18699o10244q78284K2550n05729j26928N03044j60983q48467o28570
4720A4211148l22294r89164Q3778p70332r38716L76875P57379J197692m92507
4711A3113859o10980P5566k98563p75145p38083L63958J54168l78546Q42337J47717
4701A1896288k4718j13640r3937K51057n2456k4708K78683J127699k17776l91606
4691A2634886L33764k80397m7909K29183m89805N65242K88915O93466j34223K90642
$$ plain form
4681 14083764 14060041 14434479 15864870 15679299 15759106 15960179 16152160 16820284 17528871 17406182
4671 17406182 18622840 18917101 19300910 19756745 20678499 22686179 24856483 25192149 26641426
4662 26641426 29441737 31101925 33325207 36014181 38518487 41611234 45076024 47844866
4654 47844866 49612833 51571137 52201125 51439590 49776474 47091631 43906812 40812757
4646 40812757 37396256 34298113 32216877 29761868 27416313 25044253 23884144 22872785
4638 22872785 22272459 21497349 20319877 18800985 18637605 18555611 18242124 17786947 17920036
4629 17920036 17543024 17005022 17301465 17384173 17916732 17242861 17005527 17177093 17621256 17586288
4619 17586288 18221638 17897789 17607242 18454399 19634070 19658182 19341736 20192024 21624178
$$ packed form
4681A4083764k3723L74438J430391j85571P9807K01073J91981O68124P08587j22689
4671A7406182J216658K94261L83809M55835R21754K007680K170304L35666J449277
4662B6641426K800311J660188K223282K688974K504306L092747L464790K768842
4654D7844866J767967J958304O29988p61535j663116k684843l184819l094055
4646D0812757l416501l098143k081236k455009k345555k372060j160109j011359
4638B2872785o00326p75110j177472j518892j63380q1994l13487m55177J33089
4629A7920036l77012n38002K96443Q2708N32559o73871k37334J71566M44163l4968
4619A7586288O35350l23849k90547Q47157J179671K4112l16446Q50288J432154
$$ plain form
4610 21624178 22317731 22783816 23084755 25109023 26830757 27622592 28974743 30767570 31669105
4601 31669105 31711601 31826246 31011975 29647856 28153032 26502739 24181402 21954123 20801268
4592 20801268 19686789 17991207 16932217 15543177 14233446 13445784 14049967 14631645 13350041
4583 13350041 13693874 13491986 12016835 11487892 11222362 10738710 10901041 11876824 11491837
4574 11491837 10666305 9894217 9836507 9647467 8591464 9048126 9872461 9389535 8401725
4565 8401725 8640381 8388493 8917081 9241330 8623564 8303099 9262560 9770279 9079741 8900891
4555 8900891 8837788 8817707 9172919 9701434 9223576 8938201 8540406 9193499 9708861 9195336
4545 9195336 8872303 7994526 7622951 7169151 7739067 7988844 7645190 8389125 8057449 8442916
$$ packed form
4610B1624178O93553M66085L00939K024268J721734P91835J352151J792827R01535
4601C1669105M2496J14645q14271j364119j494824j650293k321337k227279j152855
4592B0801268j114479j695582j058990j389040j309731p87662O04183N81678j281604
4583A3350041L43833k01888j475151n28943k65530m83652J62331R75783l84987
4574A1491837q25532p72088n7710j89040j056003M56662Q24335m82926r87810
4565H401725K38656k51888N28588L24249o17766l20465R59461N07719o90538j78850
4555H900891o3103k0081L55212N28515m77858k85375l97795O53093N15362n13525
4545I195336l23033q77777l71575m53800N69916K49777l43654P43935l31676L85467
$$ plain form
4535 8442916 7848099 8125690 8304981 8141489 8072070 7640690 7803705 7298946 6928420 7096579
4525 7096579 7124680 7462916 6850453 6679000 6750155 7134582 7194264 7381753 7233767 6994024
4515 6994024 6798939 6326173 6372129 7018487 6980695 8207432 7755223 6932479 6513540 6088223
4505 6088223 6347131 7028666 7674195 7953680 8196680 8112005 8230832 7299638 7172081 7845673
4495 7845673 8525522 8444394 9045286 8656951 8495987 9879592 8894775 8456589 8907535 8756791
4485 8756791 9263241 9915217 10094529 9873799 10360528 10066165 10234087 11649768 11810679
4476 11810679 11997508 12059541 12238000 13016739 13026813 13783781 15307050 15323881 16250513 17205633
4466 17205633 17841434 19768253 20403628 21798491 23900418 25681652 28138610 30701441
$$ packed form
4535H442916n94817K77591J79291j63492o9419m31380J63015n04759l70526J68159
4525G096579K8101L38236o12463j71453P1155L84427N9682J87489j47986k39743
4515F994024j95085m72766M5956O46358l7792J226737m52209q22744m18939m25317
4505F088223K58908O81535O45529K79485K43000q4675J18827r31194j27557O73592
4495G845673O79849q1128O00892l88335j60964J383605r84817m38186M50946j50744
4485H756791N06450O51976J79312k20730M86729k94363J67922J415681J60911
4476A1810679J86829O2033J78459P78739J0074P56968J523269J6831R26632R55120
4466A7205633O35801J926819O35375J394863K101927J781234K456958K562831
$$ plain form
4458 30701441 33993872 37150019 39800885 43752953 47634948 49371882 48625765 46288277
4450 46288277 43285134 39774693 35440388 31391870 28175261 25500042 22756079 21570253
4442 21570253 19576224 18602371 17549740 16204681 15892972 15177724 13654599 12905850 12935906
4433 12935906 12325239 12186375 12324112 12086669 11427566 10552684 10929148 11768553 11367040
4424 11367040 10950607 11291737 10596105 10380701 10184683 11125038 11069714 9975642 10744517
4415 10744517 10501813 10380847 11356940 12039384 11185163 11229728 11557198 11193808 11409214 11599507
4405 11599507 11430747 11283840 11172182 12033901 12715388 12574524 12666606 13507168 14649661
4396 14649661 14938479 15763903 16395436 17499964 18842158 20307131 22146790 23893474 26387523
$$ packed form
4458C0701441L292431L156147K650866L952068L881995J736934p46117k337488
4450D6288277l003143l510441m334305m048518l216609k675219k743963j185826
4442B1570253j994029r73853j052631j345059l11709p15248j523125p48749L0056
4433A2935906o10667j38864J37737k37443o59103q74882L76464Q39405m01513
4424A1367040m16433L41130o95632k15404j96018R40355n5324j094072P68875
4415A0744517k42704j20966R76093O82444q54221M4565L27470l63390K15406J90293
4405A1599507j68760j46907j11658Q61719O81487j40864R2082Q40562J142493
4396A4649661K88818Q25424O31533J104528J342194J464973J839659J746684K494049
$$ plain form
4387 26387523 28673271 30762050 34194526 36276183 38589268 39225239 37511859 35831009
4379 35831009 33736578 31065360 27349063 24672183 22163783 19825606 18366916 16897974
4371 16897974 16428594 14991563 14565740 13725221 12384620 12545460 12279662 11730873 10654958
4362 10654958 10911811 11595411 10564947 9850427 10489306 9452645 9749417 10069876 9237803
4353 9237803 8842699 8556946 7964371 8477328 8148174 8891370 9590671 9480138 9534458 8963305
4343 8963305 9109569 9253984 9171276 9228457 9414962 9197666 8675369 8963595 10158399 10623299
4333 10623299 10496707 10605623 11223512 12742222 12141380 10741898 10178620 9833917 9275096
4324 9275096 8838041 7829699 7503735 7566165 7953275 7625133 7367638 7535323 7086945 7442877
$$ packed form
4387B6387523K285748K088779L432476K081657K313085O35971j713380j680850
4379C5831009k094431k671218l716297k676880k508400k338177j458690j468942
4371A6897974m69380j437031m25823q40519j340601J60840k65798n48789j075915
4362A0654958K56853O83600j030464p14520O38879j036661K96772L20459q32073
4353I237803l95104k85753n92575N12957l29154P43196O99301j10533N4320n71153
4343H963305J46264J44415q2708N7181J86505k17296n22297K88226J194804M64900
4333A0623299j26592J08916O17889J518710o00842j399482n63278l44703n58821
4324I275096m37055j008342l25964O2430L87110l28142k57495J67685m48378L55932
$$ plain form
4314 7442877 7203429 7236391 6764335 6880114 7494618 7807479 7297343 7157047 7849498 8049232
4304 8049232 8016644 7395774 6612518 5588040 6344564 7518062 7085408 6976656 7445383
4295 7445383 6756184 6490766 6770753 6649820 6950024 7040872 7620766 8061353 8183881 7347577
4285 7347577 7280862 6435759 6340331 6197937 6880841 6348807 6321632 7218125 7816894 8162748
4275 8162748 7223202 7402511 8033806 8386945 8726827 9156034 9681595 10581032 10631529 11019293
4265 11019293 11359609 12711795 13435771 14633054 15136476 16343820 14713429 13118629 12791004
4256 12791004 11809732 11025680 11274287 11571647 10817888 10519466 10632239 10881562 11315528
4247 11315528 11538032 11246117 11255289 9911462 9104684 8583320 9239718 9727987 9608065 9899746
$$ packed form
4314G442877k39448L2962m72056J15779O14504L12861n10136j40296O92451J99734
4304H049232l2588o20870p83256j024478P56524J173498m32654j08752M68727
4295G445383o89199k65418K79987j20933L00204R0848N79894M40587J22528q36304
4285G347577o6715q45103r5428j42394O82904n32034k7175Q96493N98769L45854
4275H162748r39546J79309O31295L53139L39882M29207N25561Q99437N0497L87764
4265A1019293L40316J352186P23976J197283N03422J207344j630391j594800l27625
4256A2791004r81272p84052K48607K97360p53759k98422J12773K49323M33966
4247A1315528K22504k91915R172j343827q06778n21364O56398M88269j19922K91681
$$ plain form
4237 9899746 9664387 9323531 8669535 8718872 8842061 9209695 9164857 8649572 8222037 8316040
4227 8316040 8507935 8341205 7964104 7811839 8477878 8351352 8356797 8384724 8144264 8814027
4217 8814027 8990831 7805814 7378990 7621364 7747023 8596209 9494418 9180958 8903280
4208 8903280 9135891 9371996 9551554 9308354 9905500 10294082 10238007 10072917 9967421 9721464
4198 9721464 9526227 10816423 10726275 11063801 10381263 10237356 11334871 11026427 9710484
4189 9710484 10371901 10616286 11249995 11341655 12243452 12079541 11764254 11851303 12100727 12745346
4179 12745346 12361929 12549967 12696874 13019592 13050998 14023565 14605330 14638472 14763589 15421983
4169 15421983 15899948 17070940 18076430 18143276 19466956 21064060 21673494 23030721 25469439
$$ packed form
4237I899746k35359l40856o53996M9337J23189L67634m4838n15285m27535R4003
4227H316040J91895j66730l77101j52265O66039j26526N445K7927k40460O69763
4217H814027J76804j185017m26824K42374J25659Q49186Q98209l13460k77678
4208H903280K32611K36105J79558k43200N97146L88582n6075j65090j05496k45957
4198I721464j95237J290196r0148L37526o82538j43907J097515l08444j315943
4189I710484O61417K44385O33709R1660R01797j63911l15287Q7049K49424O44619
4179A2745346l83417J88038J46907L22718L1406R72567N81765L3142J25117O58394
4169A5421983M77965J170992J005490O6846J323680J597104O09434J357227K438718
$$ plain form
4160 25469439 27515010 30298274 32049348 34996174 38414135 41404560 42767808 40626728
4152 40626728 36460620 31659492 28490975 26589016 25399332 24335570 23604546 23138733
4144 23138733 21881512 22202958 22183470 21855398 22107560 21778438 22361707 21982663 22583660
4135 22583660 22583647 23257507 24768193 25084216 25181010 25210991 25674963 25692800 25394159 26381291
4125 26381291 26423243 26310999 27318855 27449749 27282314 28969312 29428146 30204897 29928023
4116 29928023 30355853 31063095 31815242 32840326 33765837 35159005 36759792 37076789 38170544
4107 38170544 39530914 39744711 41193973 42134793 44441390 45625310 47157092 49155040
4099 49155040 50963626 52096906 53603723 56203754 57634594 60103607 62236531 64463006
$$ packed form
4160B5469439K045571K783264J751074K946826L417961K990425J363248k141080
4152D0626728m166108m801128l168517j901959j189684j063762p31024m65813
4144B3138733j257221L21446j9488l28072K52162l29122N83269l79044O00997
4135B2583660j3O73860J510686L16023R6794K9981M63972J7837k98641R87132
4125B6381291M1952j12244J007856J30894j67435J686998M58834P76751k76874
4116B9928023M27830P07242P52147J025084R25511J393168J600787L16997J093755
4107C8170544J360370K13797J449262R40820K306597J183920J531782J997948
4099D9155040J808586J133280J506817K600031J430840K469013K132924K226475
$$ plain form
4091 64463006 67690734 70079453 72508793 75381584 77957844 81050079 84542234 87438164
4083 87438164 90294102 95104108 98370466 101676197 105297081 108934683 112798003 116744584
4075 116744584 121062958 124709746 128266909 132957943 137995803 142749644 147269317 152182541
4067 152182541 157641466 163210686 170767455 177666527 186236498 195769309 205791462 218350718
4059 218350718 233178981 249686133 268593784 289189540 312923707 338738174 365528402
4052 365528402 387691630 390532242 366501454 326694311 288504492 256126039 230382458
4045 230382458 210376121 193267588 178653574 167633353 156981146 147323047 140197170
4038 140197170 133541754 127826352 123043748 118518977 113996903 109504660 105345281 102003095
$$ packed form
4091F4463006L227728K388719K429340K872791K576260L092235L492155K895930
4083H7438164K855938M810006L266358L305731L620884L637602L863320L946581
4075A16744584M318374L646788L557163M691034N037860M753841M519673M913224
4067A52182541N458925N569220P556769O899072Q569971R532811J0022153J2559256
4059B18350718J4828263J6507152J8907651K0595756K3734167K5814467K6790228
4052C65528402K2163228K840612k4030788l9807143l8189819l2378453k5743581
4045B30382458k0006337j7108533j4614014j1020221j0652207r658099p125877
4038A40197170o655416n715402m782604m524771m522074m492243m159379l342186
$$ plain form
4030 102003095 98784149 95740624 92581796 90360191 88289463 86279193 84295091 82399121
4022 82399121 81099703 79934871 78250193 76259414 76570227 76261695 76340529 74906269 74095584
4013 74095584 72491056 71252858 70695856 69585080 69445868 68660867 68310812 68085229 68835322
4004 68835322 68050949 68386869 69670644 70489281 71671132 72319303 72915138 74452686 75657243
3995 75657243 77178258 79519094 81242362 83339919 85781430 87868933 90175742 92160528
3987 92160528 93493016 94508411 97451814 99872414 102169641 105084504 107677016 111267845
3979 111267845 114503532 117155462 120348944 122058561 125206437 128027757 130366927 133343089
3971 133343089 136379217 139525956 142549605 145388020 148692044 152248339 155087114 159533862
$$ packed form
4030A02003095l218946l043525l158828k221605k070728k010270j984102j895970
4022H2399121j299418j164832j684678j990779L10813l08532P8834j434260q10685
4013G4095584j604528j238198n57002j110776j39212p85001l50055k25583P50093
4004F8835322p84373L35920J283775Q18637J181851O48171N95835J537548J204557
3995G5657243J521015K340836J723268K097557K441511K087503K306809J984786
3987I2160528J332488J015395K943403K420600K297227K914863K592512L590829
3979A11267845L235687K651930L193482J709617L147876K821320K339170K976162
3971A33343089L036128L146739L023649K838415L304024L556295K838775M446748
$$ plain form
3963 159533862 163213287 167124109 171296531 176245206 181298311 186823761 193770969 202216279
3955 202216279 213866386 225716334 240926836 258268012 277836915 299695843 324801626
3948 324801626 351541825 374183017 378487816 354526018 313072299 272227044 238626520
3941 238626520 212856951 190489678 172886356 159180454 147209430 137675719 129158819
3934 129158819 122029586 114710004 109461166 103824920 99003033 95059974 91088115 87324967
3926 87324967 83725527 79814385 77683508 75557397 73303987 71533374 70479526 68975463
3918 68975463 66651173 65244661 65165498 64895204 64945541 63154437 62803851 63281870 62559395
3909 62559395 61529279 59731412 58660178 56389858 54831313 52650861 49954606 48077772
$$ packed form
3963A59533862L679425L910822M172422M948675N053105N525450O947208Q445310
3955B02216279J1650107J1849948J5210502J7341176J9568903K1858928K5105783
3948C24801626K6740199K2641192M304799k3961798m1453719m0845255l3600524
3941B38626520k5769569k2367273j7603322j3705902j1971024r533711q516900
3934A29158819p129233p319582n248838n636246m821887l943059l971859l763148
3926H7324967l599440l911142k130877k126111k253410j770613j053848j504063
3918F8975463k324290j406512p9163k70294N0337j791104l50586M78019p22475
3909F2559395j030116j797867j071234k270320j558545k180452k696255j876834
$$ plain form
3901 48077772 46147864 43583485 42098202 41229648 40706253 39534750 37879967 36710180
3893 36710180 35773244 35272959 34316062 34577113 34293373 33837147 32686165 32424147 32084878
3884 32084878 31764586 31828355 31771693 31605886 31122631 30584969 30572163 30791406 30792887 30784586 30518113
3873 30518113 30173999 30129989 30113990 29854340 29942917 29281413 29383139 30327154 30645299 30865190
3863 30865190 31284480 31424009 31048124 31155439 31252035 32109483 32880063 33600432 34414496 35972175
3853 35972175 36484089 36794379 38285343 39183797 40046815 41427561 42809782 44455339 46320971
3844 46320971 47012667 48749715 50746026 51598776 52448273 53614299 55276902 56548033 57472772
3835 57472772 59019622 60816572 61403509 61910397 62795386 62785125 63832577 64514789 63652112
$$ packed form
3901D8077772j929908k564379j485283q68554n23395j171503j654783j169787
3893C6710180r36936n00285r56897K61051k83740m56226j150982k62018l39269
3884C2084878l20292O3769n6662j65807m83255n37662j2806K19243J481q301k66473
3873C0518113l44114m4010j5999k59650Q8577o61504J01726R44015L18145K19891
3863C0865190M19290J39529l75885J07315R6596Q57448P70580P20369Q14064J557679
3853C5972175N11914L10290J490964Q98454Q63018J380746J382221J645557J865632
3844D6320971O91696J737048J996311Q52750Q49497J166026J662603J271131R24739
3835E7472772J546850J796950N86937N06888Q84989j0261J047452O82212q62677
$$ plain form
3826 63652112 63118024 63040904 62901968 62304219 60515308 60203111 59726861 58582794 58374330
3817 58374330 57515447 57059670 55851191 55815771 55257365 53974098 53827138 52750977 52031083
3808 52031083 51790054 51841973 52082844 52407059 52676911 52600583 53560688 54605283 55543565 56477289
3798 56477289 57904569 60497474 62202986 64356071 66670004 69084690 71949500 74253622
3790 74253622 76792717 79033980 81019747 83407095 86429682 88084958 90203756 92838787
3782 92838787 94810981 95527439 97808371 100512472 101263992 101749914 101713300 101402132 100698653
3773 100698653 99667538 98589702 97605036 97215531 96233310 93784362 91821816 89713726
3765 89713726 88139144 85204593 83283182 81760394 79451336 76679365 73402914 70389836
$$ packed form
3826F3652112n34088p7120j38936n97749j788911l12197m76250j144067k08464
3817E8374330q58883m55777j208479l5420n58406j283267j46960j076161p19894
3808E2031083k41029N1919K40871L24215K69852p6328R60105J044595R38282R33724
3798E6477289J427280K592905J705512K153085K313933K414686K864810K304122
3790G4253622K539095K241263J985767K387348L022587J655276K118798K635031
3782I2838787J972194P16458K280932K704101P51520M85922l6614l11168p03479
3773A00698653j031115j077836r84666l89505r82221k448948j962546k108090
3765H9713726j574582k934551j921411j522788k309058k771971l276451l013078
$$ plain form
3757 70389836 67975300 64307504 62066717 59917050 57602826 56445965 54491279 51985966
3749 51985966 51383965 50313009 48418983 47179866 46700291 47175052 46778844 45450064 46066815
3740 46066815 45593445 46440883 45583330 45927259 46291716 46650644 47065408 47903825 47841464 48353625
3730 48353625 49178557 49561406 50952591 52861315 53979535 54253241 55761175 56414189 58173100
3721 58173100 59096900 60922507 62533266 63977718 66453000 68450033 69586406 71695548
3713 71695548 73046468 75174906 76958841 78576919 80510102 83659464 85640109 88081596
3705 88081596 90596105 93308106 95536743 98198538 100683334 104502099 107526270 111431681
3697 111431681 114059430 115693631 117642900 120928687 124283668 127388806 129988198 131702277
$$ packed form
3757G0389836k414536l667796k240787k149667k314224j156861j954686k505313
3749E1985966o02001j070956j894026j239117m79575M74761l96208j328780O16751
3740D6066815m73370Q47438q57553L43929L64457L58928M14764Q38417o2361N12161
3730D8353625Q24932L82849J391185J908724J118220K73706J507934O53014J758911
3721E8173100R23800J825607J610759J444452K475282J997033J136373K109142
3713G1695548J350920K128438J783935J618078J933183L149362J980645K441487
3705H8081596K514509K712001K228637K661795K484796L818765L024171L905411
3697A11431681K627749J634201J949269L285787L354981L105138K599392J714079
$$ plain form
3689 131702277 134018180 136383456 138589101 141121427 143943903 145110780 146973307 147928920
3681 147928920 149392031 150922994 151721852 151999845 153461496 154444243 155300928 155869078 155837319
3672 155837319 156684285 158234458 159432024 160990559 163065745 164337335 165822222 167941817
3664 167941817 170221196 172298320 173414284 174967659 177747649 180536593 183578673 185760326
3656 185760326 189593001 193231081 196366874 199173147 202094332 204307859 208277613 211080751
3648 211080751 213693359 216600935 219299141 221697398 224016654 226713810 229166966 231061887
3640 231061887 232252604 233319769 235906149 237976359 238747509 240119375 240555469 240714393
3632 240714393 240289602 239740597 238522355 237877618 236602779 235170076 233221859 231991933
$$ packed form
3689A31702277K315903K365276K205645K532326K822476J166877J862527R55613
3681A47928920J463111J530963P98858K77993J461651R82747Q56685N68150l1759
3672A55837319Q46966J550173J197566J558535K075186J271590J484887K119595
3664A67941817K279379K077124J115964J553375K779990K788944L042080K181653
3656A85760326L832675L638080L135793K806273K921185K213527L969754K803138
3648B11080751K612608K907576K698206K398257K319256K697156K453156J894921
3640B31061887J190717J067165K586380K070210P71150J371866M36094J58924
3632B40714393m24791n49005j218242o44737j274839j432703j948217j229926
$$ plain form
3624 231991933 229936525 227210594 225632536 224600891 221020206 218473320 215625168 212579133
3616 212579133 207654982 203059289 198809481 195627859 191835426 188125736 185219397 182130252
3608 182130252 179054194 177309218 174977817 173385886 171548791 169759232 170645073 170064100
3600 170064100 170673666 170594892 170081411 171557426 172775023 173897943 176042619 177814656 180683607
3591 180683607 182386256 184841110 187525020 190194882 192648792 194910095 197956624 202021428
3583 202021428 205788818 209093573 211439140 214436719 217227562 219829283 221689169 223430056
3575 223430056 224689966 226221393 228422161 231250398 234759346 237953417 240954849 244868956
3567 244868956 249195828 253653674 258748965 263244206 269300742 273873813 279401846 286629506
$$ packed form
3624B31991933k055408k725931j578058j031645l580685k546886k848152l046035
3616B12579133m924151m595693m249808l181622l792433l709690k906339l089145
3608A82130252l076058j744976k331401j591931j837095j789559Q85841n80973
3600A70064100O09566p8774n13481J476015J217597J122920K144676J772037K868951
3591A80683607J702649K454854K683910K669862K453910K261303L046529M064804
3583B02021428L767390L304755K345567K997579K790843K601721J859886J740887
3575B23430056J259910J531427K200768K828237L508948L194071L001432L914107
3567B44868956M326872M457846N095291M495241O056536M573071N528033P227660
$$ plain form
3559 286629506 294367505 302924008 311842860 321849136 332676748 344764495 357198575
3552 357198575 368680978 379575748 389556418 396907998 402173868 404294018 404580431 402848679
3544 402848679 399675111 394985619 388852297 382966919 377860217 372209361 366256438 359705120
3536 359705120 351294857 341897791 331120217 318252270 302761446 287377741 270334626
3529 270334626 253149914 236055790 219067994 202827469 188249177 174384807 161890490
3522 161890490 151517137 142810041 133910333 125715384 119296377 114604697 109079051 104525183
3514 104525183 101092784 97789150 94619419 90606627 87997890 86730812 84117617 81970477
3506 81970477 79832647 78195323 77016420 75684844 74030054 72549203 71252222 70509321
$$ packed form
3559B86629506P737999Q556503Q918852J0006276J0827612J2087747J2434080
3552C57198575J1482403J0894770R980670P351580N265870K120150K86413j731752
3544D02848679l173568m689492o133322n885378n106702n650856n952923o551318
3536C59705120q410263r397066j0777574j2867947j5490824j5383705j7043115
3529B70334626j7184712j7094124j6987796j6240525j4578292j3864370j2494317
3522A61890490j0373353q707096q899708q194949o419007m691680n525646m553868
3514A04525183l432399l303634l169731m012792k608737j267078k613195k147140
3506H1970477k137830j637324j178903j331576j654790j480851j296981p42901
$$ plain form
3498 70509321 69934603 69000702 67870858 67171801 66501110 64855758 63724286 62767725 62644935
3489 62644935 61343380 59700637 57978657 56281626 55468627 54145423 53020737 51862679
3481 51862679 50054926 49204187 47775661 46472677 44758971 43299136 41834715 40586796
3473 40586796 39664086 38730693 37604702 36314122 35308871 34131005 32538687 32048353 30824290
3464 30824290 29490577 28730294 28105630 26939146 26928795 26292332 26315729 25381625 24633382
3455 24633382 24538511 24765145 24260582 23556244 22764454 22338425 22507537 21598007 22219655 22417866
3445 22417866 21551773 21243817 21938118 22370788 23178666 23564502 23363820 23930291 25498033
3436 25498033 26013236 24798535 23410736 21445389 19994149 19250215 18462678 18008197 17714567
$$ packed form
3498G0509321n74718r33901j129844o99057o70691j645352j131472r56561j22790
3489F2644935j301555j642743j721980j697031q12999j323204j124686j158058
3481E1862679j807753q50739j428526j302984j713706j459835j464421j247919
3473D0586796r22710r33393j125991j290580j005251j177866j592318m90334j224063
3464C0824290j333713p60283o24664j166484j0351o36463K3397r34104p48243
3455B4633382r4871K26634n04563p04338p91790m26029J69112r09530O21648J98211
3445B2417866q66093l07956O94301M32670Q07878L85836k00682N66471J567742
3436B5498033N15203j214701j387799j965347j451240p43934p87537m54481k93630
$$ plain form
3427 17714567 17306527 17317522 16700993 16384494 16512299 16021943 16463144 16466288 16662523 15835263
3417 15835263 15938432 15866166 16195220 16386458 16439356 17303961 18196434 19252699 19739397 20542541
3407 20542541 21849478 24505735 25811065 26445004 23708081 20089739 18576318 16941577
3399 16941577 15128637 14545078 13440559 13126717 12521426 11906175 11983772 11871641 11952359
3390 11952359 11685285 11596764 11707055 11378737 10447964 10849530 10964042 10991829 10339333 10383569
3380 10383569 11433156 11241140 11494023 12078418 11403701 13389659 14935204 14971107 14765304
3371 14765304 13684212 12926183 11968609 10420733 10167075 9820387 10058561 9373105 9352797
3362 9352797 9746612 9089191 8771030 7897803 7311958 8068462 8094948 7526541 7233916 7106240
$$ packed form
3427A7714567m08040J0995o16529l16499J27805m90356M41201L144J96235q27260
3417A5835263J03169p2266L29054J91238N2898Q64605Q92473J056265M86698Q03144
3407B0542541J306937K656257J305330O33939k736923l618342j513421j634741
3399A6941577j812940n83559j104519l13842o05291o15251P7597j12131Q0718
3390A1952359k67074q8521J10291l28318r30773M01566J14512K7787o52496M4236
3380A0383569J049587j92016K52883N84395o74717J985958J545545L5903k05803
3371A4765304j081092p58029r57574j547876k53658l46688K38174o85456k0308
3362I352797L93815o57421l18161q73227n85845P56504K6486n68407k92625j27676
$$ plain form
3352 7106240 7451939 7065715 7296185 8140499 7158382 6238925 5967973 6148392 6249266 7154838
3342 7154838 7386565 6412491 6114150 6907987 6872329 6957476 7067240 7081084 6705591 6008210
3332 6008210 5826525 5653886 5824799 5904989 7333503 7279473 6340460 6330654 5700247 5961276
3322 5961276 6253872 5605552 5918688 6549357 5867564 5408432 5665244 5746999 5521535 5434527
3312 5434527 5316186 4596059 4723790 4409467 4009168 4946600 5400792 6504074 6302982
3303 6302982 5437072 5031092 4892034 5226474 5347725 4837062 4114334 4784587 4735072 4979847
3293 4979847 4189337 4769351 5010731 5188670 5004929 5323364 5934689 6932937 6454324 5975355
3283 5975355 5684753 5699469 5747635 6274625 6421735 6331185 6073304 6026246 5887377 5805078
$$ packed form
3352G106240L45699l86224K30470Q44314r82117r19457k70952J80419J00874R05572
3342G154838K31727r74074k98341P93837l5658Q5147J09764J3844l75493o97381
3332F008210j81685j72639J70913Q0190J428514n4030r39013r806o30407K61029
3322E961276K92596o48320L13136O30669o81793m59132K56812Q1755k25464q7008
3312E434527j18341p20127J27731l14323m00299R37432M54192J103282k01092
3303F302982q65910m05980j39058L34440J21251n10663p22728O70253m9515K44775
3293D979847p90510N80014K41380J77939j83741L18435O11325R98248m78613m78969
3283E975355k90602J4716M8166N26990J47110r0550k57881m7058j38869q2299
$$ plain form
3273 5805078 6065024 6201084 6378021 6443196 5804106 5420543 6359663 7015763 7513969 7290898
3263 7290898 8249864 8311341 8123950 8776344 9281270 10910677 11964742 11318659 10103953
3254 10103953 9164300 8405695 8683953 8310484 7743864 7275069 6779731 6962664 6549074
3245 6549074 7097051 7278976 7641980 7974361 7796866 7852592 8200260 8332475 8374628 7701516
3235 7701516 7879251 8003825 8982337 8609585 8883873 9597941 10169457 11100946 11929615 13865787
3225 13865787 14943258 12548571 10700930 9611145 8373251 6985260 5321527 5291168
3217 5291168 5938409 5441246 5746965 5261108 4383857 4959345 4590546 3960299 4232852 4364390
3207 4364390 4143235 4352248 4183571 4263461 4003125 3840348 4047251 3966659 4327483 5433930
$$ packed form
3273E805078K59946J36060J76937O5175o39090l83563R39120O56100M98206k23071
3263G290898R58966O1477j87391O52394N04926J629407J054065o46083j214706
3254A0103953r39653p58605K78258l73469n66620m68795m95338J82933m13590
3245F549074N47977J81925L63004L32381j77495N5726L47668J32215M2153o73112
3235G701516J77735J24574R78512l72752K74288P14068N71516R31489Q28669J936172
3225A3865787J077471k394687j847641j089785j237894j387991j663733l0359
3217E291168O47241m97163L05719m85857q77251N75488l68799o30247K72553J31538
3207D364390k21155K09013j68677P9890k60336j62777K06903q0592L60824J106447
$$ plain form
3197 5433930 7115203 7666624 8469117 8203476 7577671 6895870 5957737 5383206 4465045
3188 4465045 3969824 4209041 3869585 3202734 3751865 3808244 3993384 2743814 2829168 3150738
3178 3150738 3051325 2291946 1508624 1721459 2392449 2649197 2876969 3193500 2537187 3041669
3168 3041669 2233293 2381821 2069548 1764186 1679626 1340562 1654181 1412316 1902820 1999238
3158 1999238 1672064 2083255 2469624 1677021 2489613 1562987 1171345 1414489 1581112 880094
3148 880094 1550305 2320557 1827437 2103662 2225125 2026794 2191928 1995422 2022298 1608091
3138 1608091 1205068 1476641 2036592 2579017 2667528 2788090 2562168 1563815 1781654 1668251
3128 1668251 2023314 1675479 1727906 2417814 1817336 1086005 343116 592197 1465695 1224960
$$ packed form
3197E433930J681273N51421Q02493k65641o25805o81801r38133n74531r18161
3188D465045m95221K39217l39456o66851N49131N6379J85140j249570Q5354L21570
3178C150738r9413p59379p83322K12835O70990K56748K27772L16531o56313N04482
3168C041669q08376J48528l12273l05362q4560l39064L13619k41865M90504R6418
3158A999238l27174M11191L86369p92603Q12592r26626l91642K43144J66623p01018
3148H80094O70211P70252m93120K76225J21463j98331J65134j96506K6876m14207
3138A608091m03023K71573N59951N42425Q8511J20562k25922r98353K17839j13403
3128A668251L55063l47835N2427O89908o00478p31331p42889K49081Q73498k40735
$$ plain form
3118 1224960 1369505 1426614 1236898 1116211 975426 1355019 1430197 2517712 2780160 2013926
3108 2013926 1322497 1397014 1214823 1911421 993254 1059744 931948 1544017 1386996 693773
3098 693773 628725 514030 1054434 1618279 2010708 990787 927390 1007275 1632930 1480937
3088 1480937 238517 783430 1702786 1853550 1126715 1051943 1123218 1045375 1794503 1704121
3078 1704121 1257588 1723379 1681665 1253926 1419604 1112210 928511 1317789 1605492 407948
3068 407948 76862 1059057 1260081 1638793 1623848 1522543 1449633 1779142 1434215 960104
3058 960104 693010 1399575 1245957 1642664 1025547 1478960 1763069 1903077 1313763 950360
3048 950360 1106314 844407 867823 225357 890443 1620378 881456 626097 1077078 621299
$$ packed form
3118A224960J44545N7109j89716j20687j40785L79593P5178J087515K62448p66234
3108B013926o91429P4517j82191O96598r18167O6490j27796O12069j57021o93223
3098F93773o5048j14695N40404N63845L92429j019921o3397P9885O25655j51993
3088A480937j242420N44913R19356J50764p26835p4772P1275p7843P49128r0382
3078A704121m46533M65791m1714m27739J65678l07394j83699L89278K87703j197544
3068D07948l31086R82195K01024L78712j4945j01305p2910L29509l44927m74111
3058I60104k67094P06565j53618L96707o17117M53413K84109J40008n89314l63403
3048I50360J55954k61907K3416o42466O65086P29935p38922k55359M50981m55779
$$ plain form
3038 621299 -13613 -334975 -110622 196530 228180 647884 537538 743623 1001858 894517
3028 894517 1269630 1396832 1861372 1148926 639985 1366333 989405 173047 525658 138093
3018 138093 544376 1300348 1830579 1390420 692109 713492 697206 352330 722545 828291
3008 828291 507272 531364 509465 124128 883657 603796 412161 346040 280529 241195 124172
2997 124172 149874 421374 1004867 1368002 1386351 527612 -455308 199061 567531 -93251
2987 -93251 923 86189 741247 457307 -20867 254434 264664 481907 560951 619098 522669
2976 522669 201070 -304078 225937 511474 821480 692034 931058 1083804 -20509 -884495
2966 -884495 -546477 -475490 -229625 246031 -101112 61785 361246 1146680 31899 -347294
$$ packed form
3038F21299o34912l21362K24353L07152L1650M19704j10346K06085K58235j07341
3028H94517L75113J27202M64540p12446n08941P26348l76928q16358L52611l87565
3018A38093M06283P55972N30231m40159o98311K1383j6286l44876L70215J05746
3008H28291l21019K4092k1899l85337P59529k79861j91635o6121o5511l9334j17023
2997A24172K5702K71500N83493L63135J8349q58739r82920O54369L68470o60782
2987i3251R4174Q5266O55058k83940m78174K75301J0230K17243P9044N8147r6429
2976E22669l21599n05148N30015K85537L10006j29446K39024J52746j104313q63986
2966h84495L38018P0987K45865M75656l47143J62897K99461P85434j114781l79193
$$ plain form
2956 -347294 -444696 -651292 -208008 -465340 304934 98891 -340334 -539892 -604688 231079
2946 231079 836457 552359 761173 182515 237427 948741 1051189 1343723 1778086 457558
2936 457558 213912 472101 85617 590656 686824 991546 1105672 424873 903836 1456127
2926 1456127 751567 535888 370261 693181 452985 508967 608470 -634670 -821434 203831
2916 203831 -176229 -332876 -278287 -190632 -96117 111336 296137 73420 447627 179081
2906 179081 596015 692261 521589 487629 479967 942240 221021 375814 695633 196146
2896 196146 342750 129538 154695 370968 308514 1020105 731209 641510 428999 713489
2886 713489 809717 143836 175170 992375 575503 1121500 665674 662746 799718 1071543
$$ packed form
2956c47294r7402k06596M43284k57332P70274k06043m39225j99558o4796Q35767
2946B31079O05378k84098K08814n78658N4912P11314J02448K92534M34363j320528
2936D57558k43646K58189l86484N05039R6168L04722J14126o80799M78963N52291
2926A456127p04560k15679j65627L22920k40196N5982R9503j243140j86764J025265
2916B03831l80060j56647N4589Q7655R4515K07453J84801k22717L74207k68546
2906A79081M16934R6246j70672l3960p662M62273p21219J54793L19819m99487
2896A96146J46604k13212K5157K16273o2454P11591k88896q9699k12511K84490
2886G13489R6228o65881L1334Q17205m16872N45997m55826k928J36972K71825
$$ plain form
2876 1071543 -315288 157249 860883 508362 928907 791516 831442 1052199 627460 1125625
2866 1125625 836678 534860 543479 50315 297602 -116318 512497 667628 -196341 -283645
2856 -283645 294743 192760 125881 -9211 843291 124806 103402 -824269 -380382 -98855
2846 -98855 586409 95187 -618255 925240 652783 1231167 1001126 534568 166520 -103293
2836 -103293 437516 419089 215209 144058 635354 621534 232222 410319 564973 810533
2826 810533 709173 -595193 211653 632075 903804 674181 33368 109393 -743994 -1125562
2816 -1125562 -352694 -383 -621328 -655472 -816330 -233069 -613191 128835 652670 -34801
2806 -34801 -695565 -593793 -139414 -137171 -242095 -501683 -767678 -1233954 -68928 743943
$$ packed form
2876A071543j386831M72537P03634l52521M20545j37391L9926K20757m24739M98165
2866A125625k88947l01818Q619m93164K47287m13920O28815J55131q63969q7304
2856b83645N78388j01983o6879j35092Q52502p18485k1404r27671M43887K81527
2846i8855O85264m91222p13442J543495k72457N78384k30041m66558l68048k69813
2836a03293N40809j8427k03880p1151M91296j3820l89312J78097J54654K45560
2826H10533j01360j304366Q06846M20422K71729k29623o40813P6025q53387l81568
2816a125562P72868L52311o20945l4144j60858N83261l80122P42026N23835o87471
2806c4801o60764J01772M54379K243j04924k59588k65995m66276J165026Q12871
$$ plain form
2796 743943 364190 -193823 -262926 23240 6287 465255 -82566 -1560 622991 653843
2786 653843 622830 533794 509862 412975 880716 500005 403772 -305732 139107 -116716 -1152353
2775 -1152353 -630966 -275529 -364377 262818 165317 112119 361968 295668 -627549 19218
2765 19218 122526 -693071 -520359 -367687 192524 457015 -438988 -51584 -123296 -377629
2755 -377629 707071 921957 332506 -142733 174632 -93108 411812 76660 -47987 110793
2745 110793 545065 439107 -819142 -634837 -30245 -170676 -48739 38226 552989 -940283
2735 -940283 -1058208 306475 753467 216655 -573577 -471976 -618421 360220 -107423 -712247
2725 -712247 -958586 43407 535035 676054 1021029 -9407 -704192 -411603 -366324 -462533
$$ packed form
2796G43943l79753n58013o9103K86166j6953M58968n47821Q1006O24551L0852
2786F53843l1013q9036k3932r6887M67741l80711r6233p09504M44839k55823j035637
2775a152353N21387L55437q8848O27195r7501n3198K49849o6300r23217O46767
2765A9218J03308q15597J72712J52672N60211K64491q96003L87404p1712k54333
2755c77629J084700K14886n89451m75239L17365k67740N04920l35152j24647J58780
2745A10793M34272j05958j258249J84305O04592j40431J21937Q6965N14763j493272
2735i40283j17925J364683M46992n36812p90232J01601j46445R78641m67643o04824
2725g12247k46339J001993M91628J41019L44975j030436o94785K92589M5279r6209
$$ plain form
2715 -462533 -499801 -122051 541240 -55251 16686 163767 -279274 -601523 101904 -340895
2705 -340895 -658023 -510626 17188 -195266 -566163 -511490 299064 -542189 -609796 -726388
2695 -726388 -519727 -618435 -182980 -79822 -464969 -1015365 -862988 -12060 -143151 -351746
2685 -351746 -430777 -592077 -198814 -36070 -913176 -308172 13309 417538 -640534 176135
2675 176135 371525 -237734 -654425 -19440 299311 -136172 -1332977 -857551 -17039 334348
2665 334348 568252 61443 1030086 227050 -901652 -909645 329471 135207 -662432 212101
2655 212101 507327 411459 -174030 -329333 171983 214697 540944 -78831 -908874 -45981
2645 -45981 586724 151225 -440384 -574060 -461514 -256489 -849991 -496963 -248288 -421141
$$ packed form
2715d62533l7268L77750O63291n96491P1937J47081m43041l22249P03427m42799
2705c40895l17128J47397N27814k12454l70897N4673Q10554q41253o7607j16592
2695g26388K06661r8708M35455J03158l85147n50396J52377Q50928j31091k08595
2685c51746p9031j61300L93263J62744q77106O05004L21481M04229j058072Q16669
2675A76135J95390o09259m16691O34985L18751m35483j196805M75426Q40512L51387
2665C34348K33904n06809R68643q03036j128702p993J239116j94264p97639Q74533
2655B12101K95226r5868n85489j55303N01316M2714L26247o19775q30043Q62893
2645d5981O32705m35499n91609j33676J12546K05025n93502L53028K48675j72853
$$ plain form
2635 -421141 231589 147944 -321590 -217165 -69516 175654 -666829 -591671 178017 319653
2625 319653 -320091 -656971 -475800 -937765 -619159 -726040 -1075236 -1149498 -975505 -854546
2615 -854546 -377713 -462013 -720436 -428788 -252617 580176 127691 739504 940676 338526
2605 338526 140902 -71377 245805 -245113 -638637 324880 755180 377888 719325 722396
2595 722396 -595128 -784750 -58289 6013 76774 -128544 -26199 -313627 -58024 220337
2585 220337 825148 506817 -310625 -395651 -388035 -333984 73969 -478551 -891205 -938399 -472454
2574 -472454 -419348 -558664 -1222301 -415240 -357790 -118737 -322744 -809574 -1075728 -1023073
2564 -1023073 -388676 135159 -640482 -1071728 -626537 -1416151 -624180 109778 406849 426896
$$ packed form
2635d21141O52730q3645m69534J04425J47649K45170q42483P5158P69688J41636
2625C19653o39744l36880J81171m61965L18606j06881l49196p4262J73993J20959
2615h54546M76833q4300k58423K91648J76171Q32793m52485O11813K01172o02150
2605C38526j97624k12279L17182m90918l93524R63517M30300l77292L41437L071
2595G22396j317524j89622P26461O4302P0761k05318J02345k87428K55603K78361
2585B20337O04811l18331q17442q5026P616N4051M07953n52520m12654m7194M65945
2574d72454N3106j39316o63637Q07061N7450K39053k04007m86830k66154N2655
2564a023073O34397N23835p75641m31246M45191p89614P91971P33958K97071K0047
$$ plain form
2554 426896 520047 535703 -272874 -68656 49188 -949198 -609972 -344409 -293841 -315384
2544 -315384 -16697 255907 458761 671913 -580800 -695466 -904573 -1052245 -754735 -1691577
2534 -1691577 -847612 474992 247543 88835 -233054 -69728 -357636 -1268938 -220874
2525 -220874 -81749 -72849 -145004 -624614 -570383 -172070 -446059 266521 610166 582820 379142
2514 379142 878154 1024695 1150592 301534 -209034 -95147 -355956 -443855 -449648 -566419
2504 -566419 -281703 -149011 192650 430742 24144 1126217 1023554 61812 575383 361350
2494 361350 -334481 -531940 -309264 -93713 103970 -73305 -519793 -519049 -688604 -1143923
2484 -1143923 -1641601 -1019169 -167087 -759860 -1056374 104060 204524 105592 90821 174468
$$ packed form
2554D26896R3151J5656q08577K04218J17844r98386L39226K65563N0568k1543
2544c15384K98687K72604K02854K13152j252713j14666k09107j47672K97510r36842
2534a691577Q43965J322604k27449j58708l21889J63326k87908r11302J048064
2525b20874J39125Q900p2155m79610N4231L98313k73989P12580L43645k7346k03678
2514C79142M99012J46541J25897q49058n10568J13887k60809q7899n793j16771
2504e66419K84716J32692L41661K38092m06598J102073j02663r61742N13571k14033
2494C61350o95831j97459K22676K15551J97683j77275m46488P44j69555m55319
2484a143923m97678O22432Q52082n92773k96514J160434J00464r8932j4771Q3647
$$ plain form
2474 174468 537865 388605 140272 199833 305213 99691 56201 -47099 -721256 -443963
2464 -443963 23925 473790 51740 56285 89935 521249 93982 395037 170116 48478
2454 48478 133078 190786 -80967 -522504 -599222 -1329952 -568946 -207237 -575579 -34474
2444 -34474 148445 -71967 -956295 -1551858 -1554537 -1598842 -1331688 -1019871 -314891 -742194
2434 -742194 230923 64101 97306 -1373010 -1488935 -601009 316446 -147768 -1027330 -1227185
2424 -1227185 -948783 -680537 -262649 446512 474430 62768 -590745 -695388 -567822 -292508
2414 -292508 -1184803 -649609 205423 929499 458621 377215 49405 545364 942602 171927
2404 171927 22657 -142096 244050 -755732 -1272986 -275731 -349167 -416919 -1385386 -915522
$$ packed form
2474A74468L63397j49260k48333N9561J05380k05522m3490j03300o74157K77293
2464d43963M67888M49865m22050M545L3650M31314m27267L01055k24921j21638
2454D8478Q4600N7708k71753m41537p6718p30730P61006L61709l68342N41105
2444c4474J82919k20412q84328n95563k679m4305K67154L11817P04980m27303
2434g42194R73117j66822L3205j470316j15925Q87926R17455m64214q79562j99855
2424a227185K78402K68246M17888P09161K7918m11662o53513j04643J27566K75314
2414b92508q92295N35194Q55032P24076m70878q1406l27810M95959L97238p70675
2404A71927j49270j64753L86146r99782n17254R97255p3436o7752r68467M69864
$$ plain form
2394 -915522 -238231 -109655 -352766 -622458 -571414 -99754 -519164 283306 88601 118402
2384 118402 267611 1176397 1968204 835891 322524 1038272 1359219 1551468 1823077 1227909
2374 1227909 1348411 1486100 1366755 2389603 3129241 2508044 1317314 1713861 1464778
2365 1464778 1127269 235847 613089 965437 165535 704948 137356 865655 575794 493067
2355 493067 984194 817030 188163 840235 816557 1090745 337344 166626 75702 -256456
2345 -256456 -54521 965980 422548 409594 295924 256929 410833 178990 554820 -68705
2335 -68705 -870612 -314924 287 -656428 -321375 -295699 223956 296418 240638 501714
2325 501714 218993 297850 96572 -3310 623917 588343 757453 1041151 1237667 878150
$$ packed form
2394i15522O77291J28576k43111k69692N1044M71660m19410Q02470j94705K9801
2384A18402J49209R08786P91807j132313n13367P15748L20947J92249K71609n95168
2374A227909J20502J37689j19345J022848P39638o21197j190730L96547k49083
2365A464778l37509q91422L77242L52348p99902N39413n67592P28299k89861q2727
2355D93067M91127j67164o28867O52072k3678K74188p53401j70718r0924l32158
2345b56456K01935J020501n43432j2954j13670l8995J53904k31843L75830o23525
2335f8705q01907N55688L15211o56715L35053K5676N19655P2462n5780K61076
2325E01714k82721P8857k01278r9882O27227l5574J69110K83698J96516l59517
$$ plain form
2315 878150 -128026 22891 349457 1093190 1305721 472343 -158456 -103693 -179227 559757
2305 559757 794897 398072 645296 776736 968952 459665 294930 571461 974921 1679164
2295 1679164 1483645 1248963 538625 329017 350106 296010 596311 661526 308199 358145
2285 358145 1028862 1012680 561893 213209 77492 803494 1237028 381875 121605 -336635
2275 -336635 11790 107764 -386228 -315285 457299 365926 1355605 1137952 510725 13182
2265 13182 189580 1183060 951358 767185 80793 212888 227511 284110 1524705 1552318
2255 1552318 951425 1605402 1982325 1433877 1823565 1184820 789745 1164869 1355540 758171
2245 758171 1113542 1150026 392606 627875 802855 690566 1342124 1250707 1690945 2040648
$$ packed form
2315H78150j006176J50917L26566P43733K12531q33378o30799N4763p5534P38984
2305E59757K35140l96825K47224J31440J92216n09287j64735K76531M03460P04243
2295A679164j95519k34682p10338k09608K1089n4096L00301O5215l53327M9946
2285C58145O70717j6182m50787l48684j35717P26002M33534q55153k60270m58240
2275c36635L48425R5974m93992P0943P72584r1373R89679k17653o27227m97543
2265A3182J76398R93480k31702j84173o86392J32095J4623N6599J240595K7613
2255A552318o00893O53977L76923n48448L89688o38745l95075L75124J90671n97369
2245G58171L55371L6484p57420K35269J74980j12289O51558r1417M40238L49703
$$ plain form
2235 2040648 1595296 1573149 1299899 1474242 1385402 1787581 1533712 1925824 2044280 1716262
2225 1716262 1693074 1586712 2118534 2457811 1686216 1985437 2444779 3021571 2633060 2701972
2215 2701972 2281444 2381773 3600471 3245140 2593138 2947076 2903333 2569385 2461839 2036333
2205 2036333 2569985 2360580 2206998 3626513 3953913 3207424 3461915 4014427 3632138
2196 3632138 3283468 3049598 4049757 4310476 4122839 4815506 4893124 5704034 5356158 5582430
2186 5582430 5713235 5666685 5447915 5109121 5189314 6099213 6164179 6186005 6308872 6565210
2176 6565210 6994123 6795743 7745912 7968756 8104327 9536677 9218415 9170918 10275081
2167 10275081 10863560 10739492 9887772 10285414 9943574 9303686 10785530 10728987 11117678
$$ packed form
2235B040648m45352k2147k73250J74343q8840M02179k53869L92112J18456l28018
2225A716262k3188j06362N31822L39277p71595K99221M59342N76792l88511O8912
2215B701972m20528J00329J218698l55331o52002L53938m3743l33948j07546m25506
2205B036333N33652k09405j53582J419515L27400p46489K54491N52512l82289
2196C632138l48670k33870J000159K60719j87637O92667P7618Q10910l47876K26272
2186E582430J30805m6550k18770l38794Q0193R09899O4966K1826J22867K56338
2176F565210M28913j98380R50169K22844J35571J432350l18262m7497J104163
2167A0275081N88479j24068q51720L97642l41840o39888J481844n6543L88691
$$ plain form
2158 11117678 12291472 13074184 13902798 13497785 13881593 14498958 15678118 16168418 17298419
2149 17298419 17433722 17443633 17970751 18799296 19867900 20396275 20692665 21409680 22143073 21928251
2139 21928251 23372430 24871064 25410473 26786803 28174205 28573769 29693747 31234561
2131 31234561 32118310 33577391 35362365 37150040 38478868 42121158 43977802 45690379
2123 45690379 49234906 52574335 57198593 62873682 67880232 72854023 77485528 82654869
2115 82654869 89312828 98059279 109799389 125210615 144941846 168718761 194010291
2108 194010291 224111041 260845147 303520039 361125392 418440408 418685016 343934743
2101 343934743 263752914 209261961 171708743 145206545 123645295 106921902 93559233
$$ packed form
2158A1117678J173794P82712Q28614m05013L83808O17365J179160M90300J130001
2149A7298419J35303R911N27118Q28545J068604N28375K96390P17015P33393k14822
2139B1928251J444179J498634N39409J376330J387402L99564J119978J540814
2131C1234561Q83749J459081J784974J787675J328828L642290J856644J712577
2123D5690379L544527L339429M624258N675089N006550M973791M631505N169341
2115H2654869O657959Q746451J1740110J5411226J9731231K3776915K5291530
2108A94010291L0100750L6734106M2674892N7605353N7315016K44608p4750273
2101C43934743q0181829n4490953l7553218k6502198k1561250j6723393j3362669
$$ plain form
2094 93559233 82994957 74877075 69457452 65313790 62646410 59942210 57142734 52328823
2086 52328823 47201005 43873529 40775451 37765189 35713490 33894555 31604741 30044014
2078 30044014 29727005 28238768 26462953 25439479 24663616 23759122 21931709 21452112 20482023
2069 20482023 19310617 19227381 19133328 17968487 16434816 15648956 14439531 14339955 14415619
2060 14415619 13792779 12970101 12451600 11769877 11932926 12110744 11435956 11610447 11697607 11637816
2050 11637816 10590317 9726796 10178909 10104400 8922554 8926778 9249758 8725109 8543890 8399665
2040 8399665 8691428 7956564 7132934 7557002 7421125 6962086 6669781 7031842 7324898 7955048
2030 7955048 7639237 6584046 6091776 6936830 6524360 5930974 6138532 6044082 5950930 6167943
$$ packed form
2094I3559233j0564276q117882n419623m143662k667380k704200k799476m813911
2086E2328823n127818l327476l098078l010262k051699j818935k289814j560727
2078C0044014l17009j488237j775815j023474p75863r04494j827413m79597r70089
2069B0482023j171406q3236r4053j164841j533671p85860j209425r9576P5664
2060A4415619o22840q22678n18501o81723J63049J77818o74788J74491Q7160n9791
2050A1637816j047499q63521M52113p4509j181846M224L22980n24649j81219j44225
2040H399665K91763p34864q23630M24068j35877m59039k92305L62061K93056O30150
2030G955048l15811j055191m92270Q45054m12470n93386K07558r4450r3152K17013
$$ plain form
2020 6167943 5766479 6139814 5372333 5846678 5909190 5483076 5254418 4618272 5185165 5076056
2010 5076056 4616823 4141172 4613862 4555402 3799445 3845343 3916447 3485554 3478251 3338068
2000 3338068 4163313 3863937 3933287 3423328 3355167 3240159 3633593 2975105 2502520 2713248
1990 2713248 2380562 2439129 2547927 2552818 3118197 2078281 2423154 2850460 2372427 1886232
1980 1886232 2692116 2368104 1624744 2002073 1923666 2308197 2704115 2916207 2974601 2858552
1970 2858552 2652662 1701495 2235450 1982115 1677181 2065303 1223731 1438282 1855213 1892364
1960 1892364 1725183 1277200 1440106 1423929 501741 1041470 1022543 990048 1127512 1347546
1950 1347546 729451 256699 -383151 188898 472180 1041939 1139642 783041 1045124 622608
$$ packed form
2020F167943m01464L73335p67481M74345O2512m26114k28658o36146N66893j09109
2010E076056m59233m75651M72690n8460p55957M5898P1104m30893p303j40183
2000C338068Q25245k99376O9350n09959o8161j15008L93434o58488m72585K10728
1990B713248l32686N8567J08798M891N65379j039916L44873M27306m78033m86195
1980A886232Q05884l24012p43360L77329p8407L84531L95918K12092N8394j16049
1970B858552k05890r51167N33955k53335l04934L88122q41572K14551M16931L7151
1960A892364j67181m47983J62906j6177r22188N39729j8927l2495J37464K20034
1950A347546o18095m72752o39850N72049K83282N69759R7703l56601K62083m22516
$$ plain form
1940 622608 731990 209543 971878 825519 435332 446861 490904 467982 1117861 620626
1930 620626 146875 1271597 2260203 1781696 1695075 1556050 896021 1076139 770825 228068
1920 228068 -160999 1165978 508125 809394 642098 1133215 817682 150580 674826 1002044
1910 1002044 1043121 410775 902706 2052670 1408060 1506344 1357937 1196637 1154423 813170
1900 813170 267899 497948 -11120 -968730 -640036 299804 263748 404705 494140 11378
1890 11378 600283 1006719 714180 -295114 598338 1143905 636032 1091766 365659 669025
1880 669025 835506 611626 706631 468251 491109 850075 1148490 641249 241606 510798
1870 510798 -43738 198086 516385 -298892 -312895 1131805 1701786 813036 997565 920398
$$ packed form
1940F22608J09382n22447P62335j46359l90187J1529M4043k2922O49879m97235
1930F20626m73751J124722R88606m78507q6621j39025o60029J80118l05314n42757
1920B28068l89067J326977o57853L01269j67296M91117l15533o67102N24246L27218
1910A002044M1077o32346M91931J149964o44610R8284j48407j61300m2214l41253
1900H13170n45271K30049n09068r57610L28694R39840l6056J40957Q9435m82762
1890A1378N88905M06436k92539j009294Q93452N45567n07873M55734p26107L03366
1880F69025J66481k23880R5005k38380K2858L58966K98415n07241l99643K69192
1870E10798n54536K41824L18299q15277j4003J444700N69981q88750J84529p7167
$$ plain form
1860 920398 630764 922822 -83660 -438112 -180004 793435 1780989 1304094 1302546 779360
1850 779360 1009941 1148007 1171881 1087338 1279905 1003074 621582 689634 942206 1045599
1840 1045599 838432 671241 1317641 1793141 1923127 2213898 2431688 2345296 2155326 1263517
1830 1263517 1753852 1364248 1362172 1614262 1467035 374120 697052 1036107 194475 -123127
1820 -123127 -318539 1141649 821520 -360415 325011 -115029 -287878 458374 425260 191289
1810 191289 344887 183568 -401006 467518 390815 -393500 276417 -531934 -224720 408410
1800 408410 308469 923445 1532936 1442498 1721148 949775 1106160 767029 3427 -243728
1790 -243728 192530 604780 719216 470557 477247 327736 -167077 483010 431076 720175
$$ packed form
1860I20398k89634K92058j006482l54452K58108R73439R87554m76895j548n23186
1850G79360K30581J38066K3874q4543J92567k76831l81492O8052K52572J03393
1840A045599k07167j67191O46400M75500J29986K90771K17790q6392j89970q91809
1830A263517M90335l89604k076K52090j47227j092915L22932L39055q41632l17602
1820a23127j95412J460188l20129j181935O85426m40040j72849P46252l3114k33971
1810A91289J53598j61319n84574Q68524p6703p84315O69917q08351L07214O33130
1800D08410r9941O14976O09491r0438K78650p71373J56385l39131p63602k47155
1790b43728M36258M12250J14436k48659O690j49511m94813O50087n1934K89099
$$ plain form
1780 720175 815084 -10243 -63502 -880155 -244634 275692 -961283 -272387 -484 -211724
1770 -211724 162450 196020 17881 817577 661528 983944 559362 -380318 -805153 -454427
1760 -454427 -461346 -410819 250678 376263 465514 1007096 -485979 76629 672528 153620
1750 153620 -360153 -778404 404772 500817 -866964 -897938 -259705 -526849 -706856 -1023373
1740 -1023373 -406903 339922 287214 18876 -645044 -723417 -619739 -383585 -116331 -318131
1730 -318131 -26302 -367557 -481712 1072865 541609 507611 274121 -753513 -1064174 -807228
1720 -807228 -529955 -331076 -315209 -482938 -141479 -65795 -135427 -527538 -644148 120800
1710 120800 43917 -899758 -1039998 -145743 -200856 56192 -3281 -61455 -808282 -440409
$$ packed form
1780G20175R4909q25327n3259q16653O35521N20326j236975O88896K71903k11240
1770b11724L74174L3570j78139P99696j56049L22416m24582r39680m24835L50726
1760d54427o919N0527O61497J25585Q9251N41582j493075N62608N95899n18908
1750A53620n13773m18251J183176R6045j367781l0974O38233k67144j80007l16517
1740a023373O16470P46825n2708k68338o63920p8373J03678K36154K67254k01800
1730c18131K91829l41255j14155J554577n31256l3998k33490j027634l10661K56946
1720h07228K77273J98879J5867j67729L41459P5684o9632l92111j16610P64948
1710A20800p6883r43675j40240Q94255n5113K57048n9473n8174p46827L67873
$$ plain form
1700 -440409 234949 -474759 -193952 -764366 -612314 -574158 -430133 141911 504252 658294
1690 658294 501700 516709 33793 -560278 93896 881407 345561 -557182 -601250 46590
1680 46590 830526 -132914 -535487 105349 -57835 218721 339283 950618 828367 559577
1670 559577 251629 -394258 -742352 -230376 -509443 -1185522 -1337448 -843822 -311907 -334317
1660 -334317 -711146 -478301 -311991 -104927 280268 -118998 -147174 -629211 -294924 -1015020
1650 -1015020 -125428 695595 654575 68491 367739 -59598 -57469 148827 -292388 -636134
1640 -636134 -833584 -550401 -475961 -479082 -997854 -55611 -492243 -496519 -358033 -671155 -506358
1629 -506358 -179770 25170 161739 762157 574362 1287904 1147215 425545 -19030 38958
$$ packed form
1700d40409O75358p09708K80807n70414J52052L8156J44025N72044L62341J54042
1690F58294j56594J5009m82916n94071O54174P87511n35846r02743m4068O47840
1680D6590P83936r63440m02573O40836j63184K76556J20562O11335j22251k68790
1670E59577l07948o45887l48094N11976k79067o76079j51926M93626N31915k2410
1660c34317l76829K32845J66310K07064L85195l99266k8176m82037L34287p20096
1650a015020Q89592Q21023m1020n86084K99248m27337K129K06296m41215l43746
1640f36134j97450K83183P4440l121n18772R42243m36632m276J38486l13122J64797
1629e06358L26588K04940J36569O00418j87795P13542j40689p21670m44575N7988
$$ plain form
1619 38958 -112866 -755486 -1111899 -1523807 -631091 -426413 -521947 156457 -406806 -316185
1609 -316185 -799723 -625162 -468100 17763 -277684 -1623828 -842165 -15794 1205196
1600 1205196 933133 816935 735424 755318 1051336 432345 1210640 742630 103744 138129
1590 138129 -444248 -93119 615447 661401 -130857 -1527344 -1247002 145021 851606 15554
1580 15554 -849152 -455449 384604 243516 493803 128637 105081 657771 423598 459945
1570 459945 15577 -300780 -50461 495621 -457285 -871092 -1451201 -962244 -429087 -735224
1560 -735224 -526409 -670253 -449085 -243281 170843 -453588 -920445 -1221394 -763840 -645874
1550 -645874 -1004085 -1046190 -1151398 -553934 423279 -130461 -591821 209425 469004 680453
$$ packed form
1619C8958j51824o42620l56413m11908Q92716K04678r5534O78404n63263R0621
1609c16185m83538J74561J57062M85863k95447j346144P81663Q26371J220990
1600A205196k72063j16198q1511J9894K96018o18991P78295m68010o38886L4385
1590A38129n82377L51129P08566M5954p92258j396487K80342J392023P06585q36052
1580A5554q64706L93703Q40053j41088K50287l65166k3556N52690k34173L6347
1570D59945m44368l16357K50319N46082r52906m13807n80109M88957N33157l06137
1560g35224K08815j43844K21168K05804M14124o24431m66857l00949M57554J17966
1550f45874l58211m2105j05208N97464R77213n53740m61360Q01246K59579K11449
$$ plain form
1540 680453 489892 852510 561322 -464121 -450986 -259603 -759276 -86766 865840 1271756
1530 1271756 4035 -1025196 -466600 -97714 -941380 -1305583 -94057 -644340 -100297
1521 -100297 172528 -22729 -875817 -1139470 -308967 15489 15005 -361436 34268 425203
1511 425203 461270 545510 557521 -417283 -287514 651938 770072 -157120 -492330 -131015
1501 -131015 286770 -109834 319753 178721 489151 -193572 -294018 -173118 -228326 285535
1491 285535 798392 1078847 972638 349747 637666 930776 868672 825851 715117 740379
1481 740379 389406 -495853 -393197 30561 470417 499580 -361931 -525863 73479 670669
1471 670669 33064 326269 725579 822214 532989 36239 709429 524415 972468 517298
$$ packed form
1540F80453j90561L62618k91188j025443J3135J91383m99673O72510R52606M05916
1530A271756j267721j029231N58596L68886q43666l64203J211526n50283N44043
1521a00297K72825j95257q53088k63653Q30503L24456m84l76441L95704L90935
1511D25203L6067Q4240J2011r74804J29769R39452J18134r27192l35210L61315
1501a31015M17785l96604M29587j41032L10430o82723j00446J20900n5208N13861
1491B85535N12857K80455j06209o22891K87919K93110o2104m2821j10734K5262
1481G40379l50973q85259J02656M23758M39856K9163q61511j63932N99342N97190
1471F70669o37605K93205L99310R6635k89225m96750O73190j85014M48053m55170
$$ plain form
1461 517298 -715958 -891629 -349695 618431 969088 -146957 39544 148530 -422655
1452 -422655 -658601 -530154 -484689 -781380 8527 -521188 -772261 3326 28725 356628
1442 356628 144106 -618498 -939329 -202475 515957 -61033 600817 396515 24255 59416
1432 59416 339449 -364533 -157832 -300928 -465899 -210192 473362 498958 3204 -1209573
1422 -1209573 -573734 -123353 -17553 -357300 -676986 -368886 -403792 -966121 -819153 -554086
1412 -554086 -739080 270913 128233 203344 304559 -196131 -8576 610269 312911 -31873
1402 -31873 -281855 -386743 -445419 -435458 -789856 -876928 -411256 614505 668083 -264945 -367692
1391 -367692 156176 -353635 210603 257302 -82017 155375 -239849 -303534 -494839 -430913
$$ packed form
1461E17298j233256j75671N41934R68126L50657j116045J86501J08986n71185
1452d22655k35946J28447M5465k96691P89907n29715k51073P75587K5399L27903
1442C56628k12522p62604l20831P36854P18432n76990O61850k04302l72260L5161
1432E9416K80033p03982K06701j43096j64971K55707O83554K5596m95754j212777
1422a209573O35839M50381J05800l39747l19686L08100l4906n62329J46968K65067
1412e54086j84994J009993j42680P5111J01215n00690J87555O18845k97358l44784
1402c1873k49982j04888n8676R961l54398q7072M65672J025761N3578r33028j02747
1391c67692N23868n09811N64238M6699l39319K37392l95224o3685j91305O3926
$$ plain form
1381 -430913 -767722 58809 -265193 -468937 -28044 319175 -469946 -502770 -590061 -1102786
1371 -1102786 -915769 -903684 -919759 291828 289333 478601 475209 -76381 -368918 -299378 -714202
1360 -714202 -1056858 148540 702538 688305 732125 350948 403168 441894 -232817 -621076
1350 -621076 -282979 874085 423799 364979 90947 -1246547 -631805 -424644 -910138 -736200
1340 -736200 -330376 -97212 -145663 360958 600556 790673 -323502 -578869 -606994 -657072
1330 -657072 -348427 -450522 199203 193231 -402393 -247997 -335766 86226 -407522 -993240
1320 -993240 -1126627 436744 895919 860488 729216 369382 -220405 19561 -537968 -869709
1310 -869709 -826141 -466131 -568187 -221872 -534 656711 1234915 360951 330184 18004
$$ packed form
1381d30913l36809Q26531l24002k03744M40893L47219p89121l2824q7291n12725
1371a102786J87017J2085j6075J211587k495J89268l392n51590k92537O9540m14824
1360g14202l42656J205398N53998j4233M3820l81177N2220L8726o74711l88259
1350f21076L38097J157064m50286n8820k74032j337494O14742K07161m85494J73938
1340g36200M05824K33164m8451N06621K39598J90117j114175k55367k8125n0078
1330f57072L08645j02095O49725n972n95624J54396q7769M21992m93748n85718
1320i93240j33387J563371M59175l5431j31272l59834n89787K39966n57529l31741
1310h69709M3568L60010j02056L46315K21338O57245N78204q73964l0767l12180
$$ plain form
1300 18004 -443389 -40983 46531 -780001 -896616 -399522 -153966 -972816 4460 347749
1290 347749 250560 218009 144185 37303 -510507 225671 -487586 -1172324 -826594 -324859
1280 -324859 276316 619041 527136 206686 -1239947 -1600568 -452940 136153 -115764 -86967
1270 -86967 -144266 -265258 -51772 546711 139353 -73694 290402 517636 507032 -142227
1260 -142227 478892 484227 677126 779539 744522 100840 24753 32765 266828 -360789 -164635
1249 -164635 72708 -717554 -711399 -235125 113004 -108998 -643208 -138383 421900 -22085
1239 -22085 381828 228178 -45558 -358860 -485725 -327461 -437466 -406669 61749 416507
1229 416507 51330 -127312 26628 272049 771062 1262288 -208970 -284650 301018 246733
$$ packed form
1300A8004m61393M02406Q7514q26532j16615M97094K45556q18850R77276L43289
1290C47749r7189l2551p3824j06882n47810P36178p13257o84738L45730N01735
1280c24859O01175L42725r1905l20450j446633l60621J147628N89093k51917K8797
1270h6967n7299j20992K13486N98483m07358k13047L64096K27234j0604o49259
1260a42227O21119N335J92899J02413l5017o43682p6087Q012K34063o27617J96154
1249a64635K37343p90262O155M76274L48129k22002n34210N04825N60283m43985
1239b2085M03913j53650k73736l13302j26865J58264j10005L0797M68418L54758
1229D16507l65177j78642J53940K45421M99013M91226j471258p5680N85668n4285
$$ plain form
1219 246733 272307 -103746 -136877 -1001040 -448009 144057 -31099 -433341 -543942 154152
1209 154152 -93661 -499010 -703603 -365917 -197531 -590467 -426329 -31444 -141416 -1108700
1199 -1108700 -640874 -705999 -673479 -388319 -291049 -348547 -29118 26436 -1240431 -251794
1189 -251794 -200829 7301 160556 78690 32179 526408 40429 351105 -91199 238252
1179 238252 354027 172045 268188 110552 -695276 -1016894 -848660 -418373 214151 -146675
1169 -146675 43507 -230729 -642595 -678739 -376297 280556 353514 -107393 -337904 -286524
1159 -286524 -323802 -306419 55669 243612 -452439 -709500 -881810 -512191 -414221 -1036782
1149 -1036782 -690189 -933899 -479549 -751658 -78627 820939 905246 282843 -1080331 -1051383
$$ packed form
1219B46733K5574l76053l3131q64163N53031N92066j75156m02242j10601O98094
1209A54152k47813m05349k04593L37686J68386l92936J64138L94885j09972r67284
1199a108700M67826o5125L2520K85160R7270n7498L19429N5554j266867R88637
1189b51794N0965K08130J53255q1866m6511M94229m85979L10676m42304L29451
1179B38252J15775j81982R6143j57636q05828l21618J68234M30287O32524l60826
1169a46675J90182k74236m11866l6144L02442O56853P2958m60907k30511N1380
1159b86524l7278J7383L62088J87943o96051k57061j72310L69619R7970o22561
1149a036782L46593k43710M54350k72109O73031Q99566Q4307o22403j363174K8948
$$ plain form
1139 -1051383 -71065 -241400 -253707 -286100 -319952 -81819 833885 573796 -628282 -560789
1129 -560789 -169225 -1098403 -490545 -978557 -878230 530051 176980 -473914 -309111 545917
1119 545917 -386702 -506957 257496 -20218 207775 -304477 -244919 306129 193151 -743012
1109 -743012 -1332049 -1289728 -469657 -330130 13941 467613 5647 122973 -19539 -185929
1099 -185929 -300435 -835786 -378479 -85343 907024 403424 -278251 -454887 -962479 -798058
1089 -798058 -900585 -347288 -215982 234867 -29216 -381066 -367476 -1518064 -1260580 -412393
1079 -412393 -286228 -594026 -870479 -1151599 -2023901 -1327981 -1202072 -1122365 -225314 -540127
1069 -540127 -1029273 -246686 -553593 -510195 3311 101174 -221742 -851295 -344423 336288
$$ packed form
1139a051383R80318j70335j2307l2393l3852K38133R15704k60089j202078O7493
1129e60789L91564r29178O07858m88012J00327J408281l53071o50894J64803Q55028
1119E45917r32619j20255P64453k77714K27993n12252N9558N51048j12978r36163
1109g43012n89037M2321Q20071J39527L44071M53672m61966J17326j42512j66390
1099a85929j14506n35351M57307K93136R92367n03600o81675j76636n07592J64421
1089g98058j02527N53297J31306M50849k64083l51850J3590j150588K57484Q48187
1079d12393J26165l07798k76453k81120q72302O95920J25909P9707Q97051l14813
1069e40127m89146P82587l06907M3398N13506R7863l22916o29553N06872O80711
$$ plain form
1059 336288 212492 274467 197931 830759 110707 -679836 -589325 57024 52477 -473728 -120104
1048 -120104 -203838 -214811 -659615 -461661 -67688 -412374 155691 531646 689261 478495
1038 478495 -609866 -577633 -474838 -390752 149295 580115 -299493 -146899 -290190 -681805
1028 -681805 -1012911 -980798 -366923 148244 407907 282655 -124843 -718005 -268808 274904
1018 274904 176903 -403574 451344 590080 491269 78858 -176983 -565645 -217116 8684
1008 8684 -150629 111812 566319 415729 -13408 468855 292084 -93281 -639017 -565584
998 -565584 255880 122332 -401809 -426216 330697 365020 -114654 -755641 -783092 358521
988 358521 382860 723427 654513 315440 95336 36447 -37653 145488 691108 750594 114373
$$ packed form
1059C36288j23796O1975p6536O32828p20052p90543R0511O46349m547n26205L53624
1048a20104q3734j0973m44804J97954L93973l44686N68065L75955J57615k10766
1038D78495j088361L2233J02795Q4086N40047M30820q79608J52594j43291l91615
1028f81805l31106L2113O13875N15167K59663j25252m07498n93162M49197N43712
1018B74904r8001n80477Q54918J38736r8811m12411k55841l88662L48529K25800
1008H684j59313K62441M54507j50590m29137M82263j76771l85365n45736P3433
998e65584Q21464j33548n24141k4407P56913L4323m79674o40987k7451J141613
988C58521K4339L40567o8914l39073k20104n8889p4100J83141N45620N9486o36221
$$ plain form
977 114373 39551 -964987 -1095489 -678370 -635840 -924346 -580354 81496 80208 -429093
967 -429093 -87891 762582 651602 801351 262283 -41540 -264112 -444756 -245453 145942
957 145942 -347452 -555918 -314832 930166 1013475 863775 5718 -589948 -760488 -608178
947 -608178 461203 858299 -67834 -464070 -558221 -1083276 -426310 91370 124140 278062
937 278062 -302159 -435621 23146 -102060 -366300 -678320 -816592 260803 808885 553376
927 553376 377138 -192503 -227299 833425 133268 -9224 -17146 -839324 -918077 -947439 -469452
916 -469452 -209075 394634 640440 947033 607738 155544 124731 72058 258775 193297
906 193297 473053 169977 211824 127526 107102 249509 -295739 -530553 -382839 146417
$$ packed form
977A14373p4822j004538j30502M17119M2530k88506L43992O61850j288n09301
967d29093L41202Q50473j10980J49749n39068l03823k22572j80644J99303L91395
957A45942m93394k08466K41086J244998Q3309j49700q58057n95666j70540J52310
947f08178J069381L97096r26133l96236r4151n25055O56966N17680L2770J53922
937B78062n80221j33462M58767j25206k64240l12020j38272J077395N48082k55509
927E53376j76238n69641l4796J060724p00157j42492p922q22178p8753k9362M77987
916d69452K60377O03709K45806L06593l39295m52194l0813n2673J86717o5478
906A93297K79756l03076M1847q4298k0424J42407n45248k34814J47714N29256
$$ plain form
896 146417 -186384 -349535 -428687 101869 -634696 -493624 -276387 -791680 -968521 142421
886 142421 574842 450422 -298704 741656 290134 -51405 -683721 -1355325 -1227409 -938490
876 -938490 366443 132082 -723427 -836796 -613648 -40945 -119158 -17728 186833 -394025
866 -394025 -44413 427952 605850 1111349 736625 151043 616026 32060 409361 -200771
856 -200771 -327587 -127030 -152287 -249367 -784851 -1102272 -611414 -425713 -1129419 -893004
846 -893004 -441184 -254847 280270 694493 84274 302577 -811239 -1640402 -579063 -888385
836 -888385 -857496 301222 995196 549464 463017 -7179 694513 172487 115070 22159
826 22159 454652 309957 -681683 -553021 -563485 -430953 -650936 -475124 -39698 145594
$$ packed form
896A46417l32801j63151p9152N30556p36565J41072K17237n15293j76841J110942
886A42421M32421j24420p49126J040360m51522l41539o32316o71604J27916K88919
876i38490J304933k34361q55509j13369K23148N72703p8213J01430K04561n80858
866c94025L49612M72365J77898N05499l74724n85582M64983n83966L77301o10132
856b00771j26816K00557k5257r7080n35484l17421M90858J85701p03706K36415
846h93004M51820J86337N35117M14223o10219K18303j113816q29163J061339l09322
836h88385L0889J158718O93974m45732q6447m70196P01692n22026n7417r2911
826B2159M32493j44695r91640J28662j0464J32532k19983J75812M35426J85292
$$ plain form
816 145594 -471945 -235228 -113869 347678 -1104042 -1794444 -850137 -670886 149752 -32452
806 -32452 334249 192417 -626833 -442475 -198990 -250727 428386 -59981 -168245 81665
796 81665 -455357 -498421 -95645 -513007 -246133 66338 282149 405574 71145 5047
786 5047 363923 543479 63279 -96715 -85594 -424286 -352458 -349132 -126673 175115 262573
775 262573 1123214 842797 575455 263886 -2580 126669 -72313 -808517 -523372 760549
765 760549 1184243 39147 -977081 -679849 -297765 -45529 304937 -766016 -393632
756 -393632 -79994 2539 22208 -1012930 -435827 -449745 -64114 -41714 -111514 -149608 -346643
745 -346643 -687742 -581676 -105324 -185103 323323 949463 571451 204989 192492 -566763
$$ packed form
816A45594o17539K36717J21359M61547j451720o90402R44307J79251Q20638j82204
806c2452L66701j41832q19250J84358K43485n1737O79113m88367j08264K49910
796H1665n37022m3064M02776m17362K66874L12471K15811J23425l34429o6098
786E047L58876J79556m80200j59994J1121l38692P1828L326K22459L01788Q7458
775B62573Q60641k80417k67342l11569k66466J29249j98982p36204K85145J283921
765G60549M23694j145096j016228K97232L82084K52236L50466j070953L72384
756c93632L13638Q2533J9669j035138N77103j3918L85631K2400o9800l8094j97035
745c46643l41099J06066M76352p9779N08426O26140l78012l66462j2497p59255
$$ plain form
735 -566763 -768136 123309 88604 -217380 -118745 -329775 -624739 -833423 -1197068 -567677
725 -567677 415961 360031 -294666 -1156806 -134046 712227 140803 -104741 469369 1023684
715 1023684 1492068 1351851 1344014 96482 137737 348885 -316162 -487145 -205367 -87493
705 -87493 79603 90606 614933 480969 -58709 316244 -209081 -154422 -418891 -845898
695 -845898 95085 -133708 -457490 -336216 -676426 -487139 -273904 -144938 93689 -256859
685 -256859 -256928 -636770 -269166 -615264 -983664 -606318 -35280 529659 119749 335149 436115
$$ packed form
735e66763k01373Q91445l4705l05984R8635k11030k94964k08684l63645O29391
725e67677R83638n5930o54697q62140J022760Q46273n71424k45544N74110N54315
715A023684M68384j40217p837j247532M1255K11148o65047j70983K81778J17874
705h7493J67096J1003N24327j33964n39678L74953n25325N4659k64469m27007
695h45898R40983k28793l23782J21274l40210J89287K13235J28966K38627l50548
685b56859o9l79842L67604l46098l68400L77346N71038N64939m09910K15400J00966
$$ [...]
##END NTUPLES=NMR SPECTRUM
##END=
