##TITLE=1H_CA-9024-1
 CDCl3
 8 sc, 
 27.06.2022
##JCAMPDX= 6.0         $$ Bruker NMR JCAMP-DX V2.0
##DATA TYPE= NMR SPECTRUM
##DATA CLASS= NTUPLES
##ORIGIN= UXNMR, Bruker Analytische Messtechnik GmbH
##OWNER= root
$$ XWIN-NMR		Version 3.5
$$ Mon Jun 27 14:07:05 2022 Russian Standard Time (UT+4h)  she@DPX200
##.OBSERVE FREQUENCY= 200.13135
##.OBSERVE NUCLEUS= ^1H
##.ACQUISITION MODE= SIMULTANEOUS
##.ACQUISITION SCHEME= undefined
##.AVERAGES= 8
##.DIGITISER RES= 18
##SPECTROMETER/DATA SYSTEM= spect
##.PULSE SEQUENCE= zg30
##.SOLVENT NAME= CDCl3
##.SHIFT REFERENCE= (INTERNAL, CDCl3, 0, 15.7436)
##AUDIT TRAIL= $$ (NUMBER, WHEN, WHO, WHERE, WHAT)
$$ ##TITLE= Audit trail, XWIN-NMR		Version 3.5
$$ ##JCAMPDX= 5.01
$$ ##ORIGIN= Bruker BioSpin GmbH
$$ ##OWNER= she
$$ F:/spectra/data/she/nmr/H-F/1/pdata/1/auditp.txt
$$ ##AUDIT TRAIL=  $$ (NUMBER, WHEN, WHO, WHERE, WHAT)
(   1,<2022-06-27 14:03:52.76 +0400>,<she>,<DPX200>,
      <created by zg, POWCHK disabled, PULCHK disabled
       configuration hash MD5:
       00 E9 B6 7A A2 85 ED C7 34 08 36 98 17 FE 4E 26
       data hash MD5: 16K
       B4 B5 9D B1 78 35 1E 92 D8 DF 63 39 32 46 23 49>)
(   2,<2022-06-27 14:03:55.73 +0400>,<she>,<DPX200>,
      <Start of raw data processing
       efp BC_mod = 2 LB = 0.24 FT_mod = 6 PKNL = 1 PHC0 = -18051.49 PHC1 = 19.40069 SI = 16K 
       data hash MD5: 16K
       B6 62 D2 72 3F 81 FA E3 56 2E 52 2E 59 76 A1 3E>)
(   3,<2022-06-27 14:04:19.70 +0400>,<she>,<DPX200>,
      <pk PHC0 = 2.884096 PHC1 = -5 
       data hash MD5: 16K
       DB 44 66 16 28 BB CD 45 67 84 17 47 CE 44 38 B8>)
(   4,<2022-06-27 14:04:23.51 +0400>,<she>,<DPX200>,
      <abs ABSG = 5 
       data hash MD5: 16K
       FA 9E C6 83 CD 3B A6 7C DB 86 A4 72 C4 49 65 63>)
$$ ##END=
$$ 
$$ hash MD5
$$ F2 ED B4 F4 32 E4 04 27 46 A8 8D 9B 96 E2 E1 F5
##$RELAX= 
##$RELAX= 
##$RELAX= 
##$RELAX= 
##$RELAX= 
##$RELAX= 
$$ Bruker specific parameters
$$ --------------------------
##$DU= <F:/spectra>
##$EXPNO= 1
##$NAME= <H-F>
##$PROCNO= 1
##$TYPE= <nmr>
##$USER= <she>
##$AMP= (0..31)
100 100 100 100 100 100 100 100 100 100 100 100 100 100 100 100 100 100 
100 100 100 100 100 100 100 100 100 100 100 100 100 100 
##$AQSEQ= 0
##$AQ_mod= 1
##$AUNM= <au_zg>
##$AUTOPOS= <>
##$BF1= 200.13
##$BF2= 200.13
##$BF3= 200.13
##$BF4= 200.13
##$BF5= 200.13
##$BF6= 200.13
##$BF7= 200.13
##$BF8= 200.13
##$BYTORDA= 1
##$CFDGTYP= 0
##$CFRGTYP= 5
##$CHEMSTR= <none>
##$CNST= (0..31)
1 1 145 1 1 1 1 1 1 1 1 1 1 1 1 1 1 1 1 1 1 1 1 1 1 1 1 1 1 1 1 1 
##$CPDPRG= <>
##$CPDPRG1= <>
##$CPDPRG2= <>
##$CPDPRG3= <>
##$CPDPRG4= <mlev>
##$CPDPRG5= <mlev>
##$CPDPRG6= <mlev>
##$CPDPRG7= <mlev>
##$CPDPRG8= <mlev>
##$CPDPRGB= <>
##$CPDPRGT= <>
##$D= (0..31)
0 1.2 0 0 0 0 0 0 0 0.06 0 0.03 0 0 0 0 0.0002 0 0 0 0 0 0 0 0 0 0 0 0 
0 0 0 
##$DATE= 1656324232
##$DBL= (0..7)
120 120 120 120 120 120 120 120 
##$DBP= (0..7)
150 150 150 150 150 150 150 150 
##$DBP07= 0
##$DBPNAM0= <>
##$DBPNAM1= <>
##$DBPNAM2= <>
##$DBPNAM3= <>
##$DBPNAM4= <>
$$ [...]
##$SUBNAM2= <"">
##$SUBNAM3= <"">
##$SUBNAM4= <"">
##$SUBNAM5= <"">
##$SUBNAM6= <"">
##$SUBNAM7= <"">
##$SUBNAM8= <"">
##$SUBNAM9= <"">
##$SW= 18.05172834244
##$SWIBOX= (0..15)
0 0 2 0 0 0 0 0 0 0 0 0 0 0 0 0 
##$SW_h= 3612.71676300578
##$TD= 16384
##$TD0= 1
##$TE= 0
##$TE2= 300
##$TE3= 300
##$TEG= 300
##$TL= (0..7)
0 120 120 120 120 120 120 120 
##$TP= (0..7)
150 150 150 150 150 150 150 150 
##$TP07= 0
##$TPNAME0= <>
##$TPNAME1= <>
##$TPNAME2= <>
##$TPNAME3= <>
##$TPNAME4= <>
##$TPNAME5= <>
##$TPNAME6= <>
##$TPNAME7= <>
##$TPOAL= (0..7)
0.5 0.5 0.5 0.5 0.5 0.5 0.5 0.5 
##$TPOFFS= (0..7)
0 0 0 0 0 0 0 0 
##$TUNHIN= 0
##$TUNHOUT= 0
##$TUNXOUT= 0
##$USERA1= <user>
##$USERA2= <user>
##$USERA3= <user>
##$USERA4= <user>
##$USERA5= <user>
##$V9= 5
##$VALIST= <valist>
##$VCLIST= <CCCCCCCCCCCCCCC>
##$VD= 0
##$VDLIST= <DDDDDDDDDDDDDDD>
##$VPLIST= <PPPPPPPPPPPPPPP>
##$VTLIST= <TTTTTTTTTTTTTTT>
##$WBST= 1024
##$WBSW= 4
##$XGAIN= (0..3)
0 0 0 0 
##$XL= 0
##$YL= 0
##$YMAX_a= 371501
##$YMIN_a= -562143
##$ZGOPTNS= <>
##$ZL1= 120
##$ZL2= 120
##$ZL3= 120
##$ZL4= 120
##$ABSF1= 15.73477
##$ABSF2= -2.31708
##$ABSG= 5
##$ABSL= 3
##$ALPHA= 0
##$AQORDER= 0
##$ASSFAC= 0
##$ASSFACI= 0
##$ASSFACX= 0
##$ASSWID= 0
##$AUNMP= <proc_1d>
##$AZFE= 0.1
##$AZFW= 0.1
##$BCFW= 0
##$BC_mod= 2
##$BYTORDP= 0
##$COROFFS= 0
##$CY= -3
##$DATMOD= 1
##$DC= 0
##$DFILT= <>
##$DTYPP= 0
##$F1P= 0
##$F2P= 0
##$FCOR= 1
##$FTSIZE= 16384
##$FT_mod= 6
##$GAMMA= 0
##$GB= 0
##$INTBC= 1
##$INTSCL= 0
##$ISEN= 128
##$LB= 0.24
##$LEV0= 0
##$LPBIN= 0
##$MAXI= 10000
##$MC2= 0
##$MEAN= 0
##$ME_mod= 0
##$MI= 1.114404
##$NCOEF= 0
##$NC_proc= -6
##$NLEV= 6
##$NOISF1= 3.799351
##$NOISF2= 2.8
##$NSP= 0
##$NTH_PI= 0
##$NZP= 0
##$OFFSET= 15.74358
##$PC= 1
##$PHC0= -18048.61
##$PHC1= 14.40069
##$PH_mod= 1
##$PKNL= yes
##$PPARMOD= 0
##$PSCAL= 0
##$PSIGN= 0
##$REVERSE= no
##$SF= 200.130005595211
##$SI= 16384
##$SIGF1= 3
##$SIGF2= 2
##$SINO= 5.538805
##$SIOLD= 16384
##$SREGLST= <1H.CDCl3>
##$SSB= 0
##$STSI= 16384
##$STSR= 0
##$SW_p= 3612.71676300578
##$SYMM= 0
##$S_DEV= 0
##$TDeff= 16384
##$TDoff= 0
##$TI= <>
##$TILT= no
##$TM1= 0
##$TM2= 0
##$TOPLEV= 0
##$USERP1= <user>
##$USERP2= <user>
##$USERP3= <user>
##$USERP4= <user>
##$USERP5= <user>
##$WDW= 1
##$XDIM= 16384
##$YMAX_p= 309541986
##$YMIN_p= -292129
$$ End of Bruker specific parameters
$$ ---------------------------------
##NTUPLES= NMR SPECTRUM
##VAR_NAME=  FREQUENCY,     SPECTRUM/REAL,   SPECTRUM/IMAG
##SYMBOL=    X,             R,               I
##VAR_TYPE=  INDEPENDENT,   DEPENDENT,       DEPENDENT
##VAR_FORM=  AFFN,          ASDF,            ASDF
##VAR_DIM=   16384,         16384,           16384
##UNITS=     HZ,            ARBITRARY UNITS, ARBITRARY UNITS
##FACTOR=    0.220516191357247, 1,           1
##FIRST=     3150.76272637143, 0,            0
##LAST=      -461.954036634353, 0,           0
##MIN=       -461.954036634353, -292129,     0
##MAX=       3150.76272637143, 309541986,    0
$$ Real data points
##PAGE= N=1
##DATA TABLE= (X++(R..R)), XYDATA
$$ [...]
$$ plain form
6481 684798 749574 766853 786355 833034 748690 781874 834183 822699 768592 824906 866912 777118
6469 777118 701866 829562 775712 741480 839197 879977 892131 848897 841578 758691 819851 839084
6457 839084 814780 862741 818843 676351 729377 907842 884332 859607 738993 780076 901621
6446 901621 877551 828443 846146 960445 1001055 773577 769225 915038 812031 841571 808930
6435 808930 884061 917311 879529 868224 935728 916623 887830 880627 860522 881376 937478 873441
6423 873441 855276 849164 956552 997417 817793 843104 935865 985962 890320 880400 954537 969713
6411 969713 986498 888721 978672 1108970 1028148 987736 902433 997957 1139745 974302 896086
6400 896086 1080696 1127058 1083569 996793 989848 1021005 1050242 1020723 994193 1057111 1086643 990317
$$ packed form
6481F84798O4776J7279J9502M6679q4344L3184N2309j1484n4107N6314M2006q9794
6469G77118p5252J27696n3850l4232R7717M0780J2154m3234p319q2887O1160J9233
6457H39084k4304M7961m3898j42492N3026J78465k3510k4725j20614M1083J21545
6446I01621k4070m9108J7703J14299M0610k27478m352J45813j03007K9540l2641
6435H08930P5131L3250l7782j1305O7504j9105k8793p203k0105K0854N6102o4037
6423H73441j8165o112J07388M0865j79624K5311R2761N0097r5642r920P4137J5176
6411I69713J6785r7777Q9951J30298q0822m0412q5303R5524J41788j65443p8216
6400H96086J84610M6362m3489q6776o945L1157K9237k9519k6530O2918K9532r6326
$$ plain form
6388 990317 938181 911362 913112 1012127 1048360 1043773 846548 917248 1026443 1075223 1038154 1058356
6376 1058356 996675 896702 959415 913922 1038859 1104233 1025166 1112668 1123226 1056942 1036610
6365 1036610 1013892 1003969 970123 982350 1033276 1123488 1087375 1177616 1109980 986048 997591
6354 997591 1078653 1137277 1082784 1005009 1047250 1131900 1080548 1108742 1103288 1049070 1067846 1134244
6342 1134244 1187077 1198322 1207521 1170363 1167379 1218508 1158035 1065736 1116188 1163212 1257990 1277396
6330 1277396 1254464 1174063 1177448 1112594 1124285 1130121 1117523 1194975 1207912 1204245 1196066 1255113
6318 1255113 1198603 1264094 1199825 1122398 1204687 1217032 1279740 1331331 1176100 1163235 1170555
6307 1170555 1165567 1165510 1183216 1179447 1192819 1206944 1218099 1311987 1364220 1291308 1245443 1280095
$$ packed form
6388I90317n2136k6819J750R9015L6233m587j97225P0700J09195M8780l7069K0202
6376A058356o1681r9973O2713m5493J24937O5374p9067Q7502J0558o6284k0332
6365A036610k2718r923l3846J2227N0926R0212l6113R0241o7636j23932J1543
6354I97591Q1062N8624n4493p7775M2241Q4650n1352K8194n454n4218J8776O6398
6342A134244N2833J1245R199l7158k984N1129o0473r2299N0452M7024R4778J9406
6330A277396k2932q0401L385o4854J1691N836j2598P7452J2937l667q179N9047
6318A255113n6510O5491o4269p7427Q2289J2345O2708N1591j55231j2865P320
6307A170555m988n7J7706l769J3372J4125J1155R3888N2233p2912m5865L4652
$$ plain form
6295 1280095 1348602 1319384 1236713 1225838 1291958 1264229 1287758 1326199 1369776 1415429 1328580
6284 1328580 1373997 1382253 1303879 1234387 1279019 1247931 1238508 1284846 1308995 1381578 1350906 1300919
6272 1300919 1371458 1389117 1332062 1285826 1343954 1425676 1503577 1329923 1299312 1407513 1322459
6261 1322459 1362400 1335533 1357426 1405629 1415133 1426572 1326325 1390397 1441212 1507717 1457963
6250 1457963 1454069 1437870 1434938 1465989 1450961 1532362 1492852 1476008 1462814 1490228 1437993 1475353
6238 1475353 1583698 1606977 1666920 1619427 1530198 1614285 1655961 1588920 1532541 1616263 1700782
6227 1700782 1645289 1574980 1614783 1631022 1619304 1678634 1787051 1683745 1576913 1615444 1707196
6216 1707196 1693158 1749835 1667186 1682154 1719537 1664513 1714536 1681291 1737017 1655672 1728564
$$ packed form
6295A280095O8507k9218q2671j0875O6120k7729K3529L8441M3577M5653q6849
6284A328580M5417Q256p8374o9492M4632l1088r423M6338K4149P2583l0672m9987
6272A300919P0539J7659n7055m6236N8128Q1722P7901j73654l0611J08201q5054
6261A322459L9941k6867K1893M8203R504J1439j00247O4072N0815O6505m9754
6250A457963l894j6199k932L1051j5028Q1401l9510j6844j3194K7414n2235L7360
6238A475353J08345K3279N9943m7493q9229Q4087M1676o7041n6379Q3722Q4519
6227A700782n5493p0309L9803J6239j1718N9330J08417j03306j06832L8531R1752
6216A707196j4038N6677q2649J4968L7383n5024N0023l3245N5726q1345P2892
$$ plain form
6205 1728564 1750917 1768349 1800588 1789667 1761687 1782107 1828929 1768570 1785188 1761391 1754836 1858660
6193 1858660 1903984 1929678 1898650 1813222 1819150 1761736 1796411 1927609 1949737 1879337 1808670
6182 1808670 1802900 1816783 1808698 1789335 1850654 1911981 1897882 1850798 1852105 1963632 1969484 1956842
6170 1956842 1933686 1929459 1955367 2017513 2040149 2042882 2037989 2043296 2050564 2064376 2121216 2113556 2130246
6157 2130246 2121396 2141790 2159275 2196536 2143997 2113412 2205943 2305386 2238705 2135850 2150063
6146 2150063 2187310 2159857 2174456 2236386 2284184 2371278 2239551 2210600 2311341 2304517 2190334
6135 2190334 2125516 2254429 2188107 2197205 2343533 2451929 2433964 2324778 2476426 2449380 2479653
6124 2479653 2487567 2379343 2364141 2342576 2415115 2448159 2506737 2474058 2520420 2549975 2523726
$$ packed form
6205A728564K2353J7432L2239j0921k7980K0420M6822o0359J6618k3797o555J03824
6193A858660M5324K5694l1028q5428N928n7414L4675J31198K2128p0400p0667
6182A808670n770J3883q085j9363O1319O1327j4099m7084J307J11527N852j2642
6170A956842k3156m227K5908O2146K2636K733m893N307P268J3812N6840p660J6690
6157B130246q850K0394J7485L7261n2539l0585R2531R9443o6681j02855J4213
6146B150063L7247k7453J4599O1930M7798Q7094j31727k8951J00741o824j14183
6135B190334o4818J28913o6322R098J46328J08396j7965j09186J51648k7046L0273
6124B479653P914j08224j5202k1565P2539L3044N8578l2679M6362K9555k6249
$$ plain form
6113 2523726 2565588 2582272 2538525 2571032 2526215 2767843 2634719 2514834 2510961 2560544 2627516
6102 2627516 2621936 2686912 2600567 2625006 2682337 2723337 2737505 2723215 2771165 2859576 2767947 2693900
6090 2693900 2767944 2765295 2723325 2819630 2808849 2834975 2830354 2850392 2839485 2831950 2797005 2921392
6078 2921392 2856999 2859130 2844815 2856951 2941546 2964442 2972133 2990775 3054789 3014792 2917055 2936252
6066 2936252 2979689 2875581 2838084 2989173 3007022 3014565 2884395 2894979 2914739 2941927 2920702
6055 2920702 2990708 3061163 3043077 3099977 3013129 3032635 3004914 3140643 3080924 3006471 2951439
6044 2951439 2959789 2946795 3067210 3063090 3076144 3188588 3177773 3094573 3145656 3125870 3173801
6033 3173801 3178144 3151641 3175806 3072520 3088722 3178030 3238178 3156315 3173232 3166868 3203879 3114222
$$ packed form
6113B523726M1862J6684m3747L2507m4817K41628j33124j19885l873M9583O6972
6102B627516n580O4976q6345K4439N7331M1000J4168j4290M7950Q8411r1629p4047
6090B693900P4044k649m1970R6305j0781K6126m621K0038j0907p535l4945J24387
6078B921392o4393K131j4315J2136Q4595K2896P691J8642O4014l9997r7737J9197
6066B936252M3437j04108l7497J51089J7849P543j30170J0584J9760K7188k1225
6055B920702P0006P0455j8086N6900q6848J9506k7721J35729n9719p4453n5032
6044B951439Q350j2994J20415m120J3054J12444j0815q3200N1083j9786M7931
6033C173801M343k6503K4165j03286J6202Q9308O0148q1863J6917o364L7011q9657
$$ plain form
6021 3114222 3167514 3282294 3251423 3215290 3306262 3294477 3349357 3381592 3339559 3279905 3107272
6010 3107272 3211149 3222304 3246142 3296045 3329812 3414687 3557303 3368766 3285594 3291857 3364693
5999 3364693 3414443 3340199 3370531 3314359 3381698 3381927 3468448 3564839 3494028 3472046 3581891 3593337
5987 3593337 3564981 3584466 3631763 3591391 3564529 3575535 3671796 3676910 3684387 3670025 3627490 3661207
5975 3661207 3626189 3581466 3593491 3616539 3604651 3561916 3603126 3681017 3652327 3757514 3832934
5964 3832934 3837884 3667012 3665186 3734681 3775599 3792656 3814316 3827946 3742156 3753494 3787273 3813898
5952 3813898 3903509 3968070 3855665 3843846 3838195 3815714 3885219 3850891 3853771 3880510 3928373 3946463
5940 3946463 3909612 3987257 3943125 4015934 4052590 4052420 4090574 4097610 4096835 4123171 4184059 4162594
$$ packed form
6021C114222N3292J14780l0871l6133R0972j1785N4880L2235m2033n9654j72633
6010C107272J03877J1155K3838M9903L3767Q4875J42616j88537q3172O263P2836
5999C364693M9750p4244L0332n6172O7339K29Q6521R6391p0811k1982J09845J1446
5987C593337k8356J9485M7297m0372k6862J1006R6261N114P477j4362m2535L3717
5975C661207l5018m4723J2025K3048j1888m2735M1210P7891k8690J05187P5420
5964C832934M950j70872j826O9495M0918J7057K1660J3630q5790J1338L3779K6625
5952C813898Q9611O4561j12405j1819n651k2481O9505l4328K880K6739M7863J8090
5940C946463l6851P7645m4132P2809L6656j70L8154P036p75K6336O0888k1465
$$ plain form
5928 4162594 4104806 4182219 4190898 4216293 4093191 4177856 4250400 4114661 4143524 4234561 4254306
5917 4254306 4269617 4184598 4166696 4252694 4220811 4294158 4252570 4326516 4341998 4401189 4464421
5906 4464421 4483491 4419427 4402547 4391512 4390935 4464340 4540587 4502400 4606450 4688748 4582450
5895 4582450 4579935 4625508 4678632 4741070 4811916 4829013 4706030 4642736 4523357 4614631 4748792
5884 4748792 4761602 4813621 4815214 4840905 4839104 4918992 5001793 4872133 4932728 5018934 5014505 5049487
5872 5049487 5026152 5119144 5106457 5212080 5243293 5205849 5148772 5267139 5322887 5309228 5365834
5861 5365834 5367211 5366647 5438553 5356494 5430068 5502863 5447314 5333980 5376513 5425043 5472920 5522508
5849 5522508 5436022 5559270 5640783 5655512 5606187 5619968 5588456 5597738 5606774 5594460 5664073 5633218
$$ packed form
5928D162594n7788P7413Q679K5395j23102Q4665P2544j35739K8863R1037J9745
5917D254306J5311q5019j7902Q5998l1883P3347m1588P3946J5482N9191O3232
5906D464421J9070o4064j6880j1035n77P3405P6247l8187J04050Q2298j06298
5895D582450k515M5573N3124O2438P0846J7097j22983o3294j19379R1274J34161
5884D748792J2810N2019J593K5691j801P9888Q2801j29660O0595Q6206m429L4982
5872E049487k3335R2992j2687J05623L1213l7444n7077J18367N5748j3659N6606
5861E365834J377n64P1906q2059P3574P2795n5549j13334M2533M8530M7877M9588
5849E522508q6486J23248Q1513J4729m9325J3781l1512R282R036j2314O9613l0855
$$ plain form
5837 5633218 5601527 5695157 5728959 5804734 5932622 5899273 5873056 6009140 5990677 6090694 6165136
5826 6165136 6150702 6050353 6062482 6050843 5917656 5961381 5947469 5981474 6064160 6137536 6200969
5815 6200969 6154041 6081723 6153950 6221843 6229090 6241115 6347344 6455373 6421428 6475031 6486994
5804 6486994 6578090 6578282 6441583 6502052 6563768 6587647 6689014 6751535 6786840 6689464 6687101 6749059
5792 6749059 6751977 6831539 6853430 6926860 6866031 6867436 6930210 6994069 7123559 7095576 7097049 7072117
5780 7072117 7099937 7046934 7107319 7217592 7204790 7177979 7228236 7489278 7449183 7447947 7511522
5769 7511522 7518463 7456805 7490644 7596540 7527710 7591760 7628312 7610062 7591283 7616091 7800278
5758 7800278 7896559 7846033 7815178 7804953 7867517 8043094 8033436 8120003 8166762 8242895 8226326
$$ packed form
5837E633218l1691R3630L3802P5775J27888l3349k6217J36084j8463J00017P4442
5826F165136j4434j00349J2129j1639j33187M3725j3912L4005Q2686P3376O3433
5815F200969m6928p2318P2227O7893P247J2025J06229J08029l3945N3603J1963
5804F486994R1096J92j36699O0469O1716K3879J01367O2521L5305r7376k363O1958
5792F749059K918P9562K1891P3430o0829J405O2774O3859J29490k7983J473k4932
5780G072117K7820n3003O0385J10273j2802k6811N0257K61042m0095j236O3575
5769G511522O941o1658L3839J05896o8830O4050L6552j8250j8779K4808J84187
5758G800278R6281n0526l0855j0225O2564J75577r658Q6567M6759P6133j6569
$$ plain form
5747 8226326 8254347 8322217 8318717 8368097 8367682 8404535 8422470 8401063 8456402 8525396 8595060 8586911
5735 8586911 8649429 8721842 8738566 8829503 8929555 8894268 8863112 8870253 8961978 9134746 9112458
5724 9112458 9150537 9231580 9194739 9247845 9256127 9309120 9330293 9308009 9344846 9384648 9462384 9508662
5712 9508662 9574185 9710097 9792215 9833498 9887718 9958320 10038053 9998246 10063361 10051268 10196679
5701 10196679 10276152 10295807 10337593 10415684 10402431 10410354 10521002 10549321 10585501 10630013 10712741
5690 10712741 10848152 10868097 10902446 10949402 10950070 10985732 11161110 11216862 11198552 11313093 11443644
5679 11443644 11383433 11412020 11504443 11555397 11678419 11697946 11709225 11844854 11950315 12064592
5669 12064592 12133874 12116197 12228690 12300243 12366433 12484784 12578253 12548418 12555741 12628004 12662754
$$ packed form
5747H226326K8021O7870l500M9380m15L6853J7935k1407N5339O8994O9664q149
5735H586911O2518P2413J6724R0937J00052l5287l1156P141R1725J72768k2288
5724I112458L8079Q1043l6841N3106Q282N2993K1173k2284L6837L9802P7736M6278
5712I508662O5523J35912Q2118M1283N4220P0602P9733l9807O5115j2093J45411
5701A0196679P9473J9655M1786P8091j3253P923J10648K8319L6180M4512Q2728
5690A0712741J35411J9945L4349M6956O68L5662J75378N5752j8310J14541J30551
5679A1443644o0211K8587R2423N0954J23022J9527J1279J35629J05461J14277
5669A2064592O9282j7677J12493P1553O6190J18351R3469k9835P323P2263L4750
$$ plain form
5658 12662754 12879450 12900721 12946200 13129841 13229415 13347820 13486462 13594683 13633248 13699052
5648 13699052 13745777 13756125 13920813 14045878 14107306 14256467 14271367 14290329 14388684 14430414 14484395
5637 14484395 14591231 14682021 14751833 14835857 15008173 15091730 15248057 15343812 15542564 15499961
5627 15499961 15552053 15690149 15798708 15887452 15969384 15997169 16234315 16272491 16287907 16461705
5617 16461705 16583645 16743418 16815465 16903683 17013450 17166347 17207986 17290454 17420114 17530869
5607 17530869 17597271 17782419 17911519 18059995 18015467 18122130 18258073 18412588 18523811 18645538
5597 18645538 18717635 18859056 18987591 19100212 19295105 19452054 19520271 19572530 19747221 19920500
5587 19920500 19998274 20098640 20218263 20341505 20520130 20551965 20638689 20783069 20870629 21004299
$$ packed form
5658A2662754K16696K1271M5479J83641R9574J18405J38642J08221L8565O5804
5648A3699052M6725J0348J64688J25065O1428J49161J4900J8962R8355M1730N3981
5637A4484395J06836R0790O9812Q4024J72316Q3557J56327R5755J98752m2603
5627A5499961N2092J38096J08559Q8744Q1932K7785K37146L8176J5416J73798
5617A6461705J21940J59773P2047Q8218J09767J52897M1639Q2468J29660J10755
5607A7530869O6402J85148J29100J48476m4528J06663J35943J54515J11223J21727
5597A8645538P2097J41421J28535J12621J94893J56949O8217N2259J74691J73279
5587A9920500P7774J00366J19623J23242J78625L1835Q6724J44380Q7560J33670
$$ plain form
5577 21004299 21166686 21245468 21382078 21548437 21656836 21613977 21735893 21905489 22005065 22136479
5567 22136479 22179433 22224039 22255004 22340124 22528493 22606666 22808952 22810294 22890979 22977930 22959383
5556 22959383 22953781 23065152 23225581 23252666 23335717 23364650 23394840 23444746 23417326 23583555 23737588
5545 23737588 23593215 23626440 23700504 23803244 23778068 23710868 23728645 23880992 23866814 23832972 23864447
5534 23864447 23803107 23848527 23859240 23861801 23892182 23829693 23747045 23728121 23688673 23709590 23678756
5523 23678756 23622578 23641564 23579621 23566148 23534303 23493476 23365552 23362327 23340437 23352465 23280951
5512 23280951 23172207 23082218 22993622 23018956 22838120 22769047 22693175 22620717 22459924 22412779 22383438
5501 22383438 22375548 22307407 22186326 22090809 22057409 22082149 22023838 21878277 21883128 21826064 21663667
$$ packed form
5577B1004299J62387P8782J36610J66359J08399m2859J21916J69596R9576J31414
5567B2136479M2954M4606L0965Q5120J88369P8173K02286J342Q0685Q6951j8547
5556B2959383n602J11371J60429K7085Q3051K8933L0190M9906k7420J66229J54033
5545B3737588j44373L3225P4064J02740k5176o7200J7777J52347j4178l3842L1475
5534B3864447o1340M5420J0713K561L0381o2489q2648j8924l9448K0917l0834
5523B3678756n6178J8986o1943j3473l1845m0827j27924l225k1890J2028p1514
5512B3280951j08744q9989q8596K5334j80836o9073p5872p2458j60793m7145k9341
5501B2383438p890o8141j21081r5517l3400K4740n8311j45561M851n7064j62397
$$ plain form
5490 21663667 21561310 21376851 21455365 21299422 21245955 21140755 21058228 21085613 21038340 21038013 20988331
5479 20988331 20896310 20914467 20883020 20753907 20738629 20637717 20724180 20772105 20750479 20635529 20575441
5468 20575441 20519751 20516106 20399441 20330014 20173332 19897256 19713980 19598883 19527055 19401682
5458 19401682 19147349 18925972 18709386 18575663 18407597 18312198 18342460 18256276 18132672 18008059
5448 18008059 18032218 17873693 17820918 17791958 17656055 17617878 17588844 17513887 17346762 17310407 17295199
5437 17295199 17246895 17206413 17226283 17200293 17069469 17137273 17037926 16986452 16981343 16987300 16867157
5426 16867157 16966860 16888399 16779378 16794467 16802256 16841149 16913275 16917437 16863084 16871864 16842040 16723153
5414 16723153 16732757 16778975 16700553 16830703 16911625 16836157 16826866 16903552 16923416 16996291 16999276 17065500
$$ packed form
5490B1663667j02357j84459P8514j55943n3467j05200q2527K7385m7273l27m9682
5479B0988331r2021J8157l1447j29113j5278j00912Q6463M7925k1626j14950o0088
5468B0575441n5690l645j16665o9427j56682k76076j83276j15097p1828j25373
5458A9401682k54333k21377k16586j33723j68066r5399L0262q6184j23604j24613
5448A8008059K4159j58525n2775k8960j35903l8177k9034p4957j67125l6355j5208
5437A7295199m8304m0482J9870k5990j30824O7804r9347n1474n109N957j20143
5426A6867157R9703p8461j09021J5089P789L8893P2126M162n4353Q780k9824j18887
5414A6723153R604M6218p8422J30150Q0922p5468r291P6686J9864P2875K985O6224
$$ plain form
5402 17065500 17074982 17229521 17273490 17265857 17388279 17335537 17330341 17442063 17630246 17701906 17786880
5391 17786880 17897122 17953307 18073297 18216838 18390246 18597578 18605798 18871692 19163287 19266626
5381 19266626 19367439 19644138 19854399 19957473 20183712 20494608 20744577 20940301 21141924
5372 21141924 21256479 21396843 21485418 21621954 21610613 21637781 21650560 21664359 21639349 21664768 21729282
5361 21729282 21868910 21901636 22001091 22120089 22163657 22336141 22543926 22642161 22886862 23013049
5351 23013049 23183946 23464074 23663411 23907960 24204162 24530903 24764279 25068034 25370956
5342 25370956 25776431 26171292 26426253 26833089 27267676 27517864 27886046 28324197 28697305
5333 28697305 29087661 29542048 30125673 30556334 31109826 31597362 32023052 32590767 33215426
$$ packed form
5402A7065500R482J54539M3969p633J22422n2742n196J11722J88183P1660Q4974
5391A7786880J10242N6185J19990J43541J73408K07332Q220K65894K91595J03339
5381A9266626J00813K76699K10261J03074K26239L10896K49969J95724K01623
5372B1141924J14555J40364Q8575J36536j1341K7168J2779J3799k5010K5419O4514
5361B1729282J39628L2726R9455J18998M3568J72484K07785R8235K44701J26187
5351B3013049J70897K80128J99337K44549K96202L26741K33376L03755L02922
5342B5370956M05475L94861K54961M06836M34587K50188L68182M38151L73108
5333B8697305L90356M54387N83625M30661N53492M87536M25690N67715O24659
$$ plain form
5324 33215426 33712000 34396669 35080314 35729760 36443866 37154512 38004551 38869753 39785211
5315 39785211 40659458 41626200 42677632 43623967 44574705 45769195 46907938 48188418 49488272
5306 49488272 50732667 52116378 53503128 54837254 56338786 57904255 59450900 60967065
5298 60967065 62551866 64198021 65883647 67409536 68940447 70263609 71549261 72827059
5290 72827059 74003041 74960524 75948500 76658297 76963677 77149177 77172820 77032694 76497376
5281 76497376 75975711 75080289 73946747 72716351 71296904 69838622 68233734 66538660
5273 66538660 64804319 63112662 61311054 59466449 57686914 55773700 54014569 52339392
5265 52339392 50663363 49025898 47384505 45849382 44348948 42995744 41682541 40248607
$$ packed form
5324C3215426M96574O84669O83645O49446P14106P10646Q50039Q65202R15458
5315C9785211Q74247R66742J051432R46335R50738J194490J138743J280480J299854
5306D9488272J244395J383711J386750J334126J501532J565469J546645J516165
5298F0967065J584801J646155J685626J525889J530911J323162J285652J277798
5290G2827059J175982R57483R87976P09797L05380J85500K3643j40126n35318
5281G6497376n21665q95422j133542j230396j419447j458282j604888j695074
5273F6538660j734341j691657j801608j844605j779535j913214j759131j675177
5265E2339392j676029j637465j641393j535123j500434j353204j313203j433934
$$ plain form
5257 40248607 39032777 37867943 36710196 35569029 34560880 33557690 32507598 31621700
5249 31621700 30874085 30064158 29256260 28554526 27826139 27191337 26499615 25855450 25236922
5240 25236922 24729124 24250592 23759255 23135457 22685800 22311803 21921871 21466089 21063308
5231 21063308 20560343 20174271 19780937 19403373 19079803 18779968 18422405 18035678 17883488
5222 17883488 17627926 17241461 16851444 16679323 16479910 16293219 16127038 15882863 15558453
5213 15558453 15397494 15174407 15055811 14960090 14750561 14578741 14480392 14346197 14185599 14050892
5203 14050892 14087200 14050802 13911830 13918328 13969127 13887467 13903611 13825603 13676878 13525926 13542735
5192 13542735 13524857 13310030 13150029 12925720 12722290 12529352 12269610 12014782 11678892 11435527
$$ packed form
5257D0248607j215830j164834j157747j141167j008149j003190j050092q85898
5249C1621700p47615q09927q07898p01734p28387o34802o91722o44165o18528
5240B5236922n07798m78532m91337o23798m49657l73997l89932m55782m02781
5231B1063308n02965l86072l93334l77564l23570k99835l57563l86727j52190
5222A7883488k55562l86465l90017j72121j99413j86691j66181k44175l24410
5213A5558453j60959k23087j18596r5721k09529j71820r8349j34195j60598j34707
5203A4050892L6308l6398j38972O498N0799q1660J6144p8008j48725j50952J6809
5192A3542735j7878k14827j60001k24309k03430j92938k59742k54828l35890k43365
$$ plain form
5182 11435527 11256715 11030129 10861460 10622596 10533776 10427783 10259381 10112374 9975332 9785385
5172 9785385 9594726 9435419 9366630 9257392 9254192 9126435 9069316 8919895 8838725 8616208
5162 8616208 8443581 8495248 8468012 8441941 8231762 8098150 8114019 8090913 7980694 8024974 7951540
5151 7951540 7889936 7829464 7905047 7892928 7748166 7752187 7742048 7539790 7554990 7550010 7564224
5140 7564224 7518474 7522274 7523623 7525129 7449234 7406728 7396185 7369287 7414312 7362392 7294656 7251606
5128 7251606 7150948 7057821 7068448 7165639 7292444 7230344 7155988 7150672 7237792 7221116 7244610
5117 7244610 7255990 7273627 7254053 7209844 7184095 7261077 7396102 7362363 7399607 7455666 7413999
5106 7413999 7483321 7485173 7553823 7599635 7583094 7612009 7751439 7781780 7761969 7765013 7786433 7701800
$$ packed form
5182A1435527j78812k26586j68669k38864q8820j05993j68402j47007j37042j89947
5172I785385j90659j59307o8789j09238l200j27757n7119j49421q1170k22517
5162H616208j72627N1667k7236k6071k10179j33612J5869k3106j10219M4280p3434
5151G951540o1604o0472P5583j2119j44762M021j0139k02258J5200m980J4214
5140G564224m5750L800J349J506p5895m2506j0543k6898M5025n1920o7736m3050
5128G251606j00658r3127J0627R7191J26805o2100p4356n316Q7120j6676K3494
5117G244610J1380J7637j9574m4209k5749P6982J35025l3739L7244N6059m1667
5106G413999O9322J852O8650M5812j6541K8915J39430L0341j9811L044K1420q4633
$$ plain form
5094 7701800 7687658 7666154 7600156 7559038 7350603 7216705 7042366 7070791 7043201 6874858 6697200
5083 6697200 6622710 6531276 6458835 6506665 6421063 6336585 6208801 6059392 5926811 5900655 5755816
5072 5755816 5726258 5713729 5774371 5684670 5676725 5582034 5517310 5531601 5408786 5428907 5319524
5061 5319524 5272713 5239508 5104853 5016776 5060837 5001443 5004707 4982692 4953101 4993648 4892110
5050 4892110 4797756 4753155 4649825 4589600 4647854 4732542 4638896 4559990 4547003 4609350 4579143
5039 4579143 4461442 4471355 4459026 4484288 4439007 4307380 4301192 4376462 4345483 4304650 4303858 4262092
5027 4262092 4302194 4222573 4198834 4279949 4201392 4083159 4091614 4125352 4120475 4140265 4111113 4028343
5015 4028343 4048936 4142126 4095171 4055075 4042369 3948298 4001882 4058461 4030819 3997904 3937183
$$ packed form
5094G701800j4142k1504o5998m1118k08435j33898j74339K8425k7590j68343j77658
5083F697200p4490r1434p2441M7830q5602q4478j27784j49409j32581k6156j44839
5072E755816k9558j2529O0642q9701p945r4691o4724J4291j22815K0121j09383
5061E319524m6811l3205j34655q8077M4061n9394L264k2015k9591M0547j01538
5050D892110r4354m4601j03330o0225N8254Q4688r3646p8906j2987O2347l0207
5039D579143j17701R913j2329K5262m5281j31627o188P5270l0979m0833p92m1766
5027D262092M0102p9621k3739Q1115p8557j18233Q455L3738m877J9790k9152q2770
5015D028343K0593R3190m6955m0096j2706r4071N3584N6579k7642l2915o0721
$$ plain form
5004 3937183 3987343 4023919 3937331 3883310 3938077 3880113 3824200 3922459 3879494 3776957 3773933
4993 3773933 3776899 3783311 3764299 3794435 3763287 3722101 3791322 3768432 3697530 3768684 3779107 3751024
4981 3751024 3838340 3882318 3907684 3798665 3722308 3689675 3647560 3666101 3691851 3747870 3835849
4970 3835849 3719783 3675471 3734098 3734714 3784089 3827030 3737866 3669673 3674264 3770095 3840292 3745103
4958 3745103 3639915 3767157 3807200 3841555 3860762 3941578 3964053 3861986 3801375 3884484 3792337
4947 3792337 3869516 3947080 3887856 3950727 3814903 3773321 3782275 3797824 3840027 3780762 3750757
4936 3750757 3761582 3771159 3832765 3780662 3808533 3792294 3799684 3719361 3673909 3678281 3725553 3798277
4924 3798277 3779876 3625316 3643178 3654055 3716729 3665760 3605943 3564864 3574701 3503949 3521585
$$ packed form
5004C937183N0160L6576q6588n4021N4767n7964n5913R8259m2965j02537l024
4993C773933K966O412j9012L0136l1148m1186O9221k2890p0902P1154J0423k8083
4981C751024Q7316M3978K5366j09019p6357l2633m2115J8541K5750N6019Q7979
4970C835849j16066m4312N8627O16M9375M2941q9164o8193M591R5831P0197r5189
4958C745103j05188J27242M0043L4355J9207Q0816K2475j02067o0611Q3109r2147
4947C792337P7179P7564n9224O2871j35824m1582Q954J5549M2203n9265l0005
4936C750757J0825R577O1606n2103K7871j6239P390q0323m5452M372M7272P2724
4924C798277j8401j54560J7862J0877O2674n0969n9817m1079R837p0752J7636
$$ plain form
4913 3521585 3436627 3423452 3435636 3363160 3412299 3450710 3449411 3396306 3487800 3453881 3469450 3458510
4901 3458510 3408004 3425742 3415977 3355571 3407628 3404419 3369169 3420604 3494168 3340671 3357925 3370151
4889 3370151 3379187 3474441 3465716 3434411 3431586 3405035 3366764 3403239 3421331 3462391 3441748 3461019
4877 3461019 3520525 3556121 3547017 3500142 3490301 3486226 3451547 3422271 3490402 3574809 3548902 3522371
4865 3522371 3540526 3525903 3489087 3549008 3563777 3534411 3473257 3506088 3415066 3408397 3415893 3455837
4853 3455837 3414870 3541380 3536531 3478732 3432623 3510567 3569624 3497346 3568834 3624614 3657520
4842 3657520 3610260 3674874 3561299 3620980 3582381 3448582 3569358 3572835 3585855 3746139 3733154
4831 3733154 3635142 3686432 3747289 3692590 3659131 3705463 3752691 3814979 3814611 3763302 3685343 3681100
$$ packed form
4913C521585q4958j3175J2184p2476M9139L8411j299n3105R1494l3919J5569j0940
4901C458510n0506J7738r765o0406N2057l209l5250N1435P3564j53497J7254J2226
4889C370151R036R5254q725l1305k825k6551l8271L6475J8092M1060k0643J9271
4877C461019N9506L5596r104m6875r841m075l4679k9276O8131Q4407k5907k6531
4865C522371J8155j4623l6816N9921J4769k9366o1154L2831r1022o669P496L9944
4853C455837m0967J26510m849n7799m6109P7944N9057p2278P1488N5780L2906
4842C657520m7260O4614j13575N9681l8599j33799J20776L477J3020J60284j2985
4831C733154r8012N1290O0857n4699l3459M6332M7228O2288l68n1309p7959m243
$$ plain form
4819 3681100 3797523 3919683 3968659 3879583 3984450 3999677 3988277 3945140 4098993 4113630 4044183
4808 4044183 4016297 4056170 4219801 4233747 4091682 4112247 4156162 4186177 4372813 4414104 4365391
4797 4365391 4411390 4474869 4434144 4438473 4486658 4534097 4576388 4672984 4705126 4716594 4802299 4797393
4785 4797393 4942461 4832313 4812271 4894176 4986601 5122587 5140745 5150500 5175705 5199572 5233639
4774 5233639 5278611 5377878 5394084 5502949 5570279 5587285 5698886 5684579 5805927 5927722 5995791
4763 5995791 6051612 6179943 6286393 6352173 6364732 6401250 6391813 6508578 6502081 6543171 6566084
4752 6566084 6714588 6920312 6912006 6995265 7123543 7212442 7325889 7543013 7595578 7624313 7753265
4741 7753265 7868504 8011766 8122020 8165915 8297735 8426186 8571827 8736415 8779101 8887878
$$ packed form
4819C681100J16423J22160M8976q9076J04867J5227j1400m3137J53853J4637o9447
4808D044183k7886L9873J63631J3946j42065K0565M3915L0015J86636M1291m8713
4797D365391M5999O3479m0725M329M8185M7439M2291R6596L2142J1468Q5705m906
4785D797393J45068j10148k0042Q1905R2425J35986J8158R755K5205K3867L4067
4774E233639M4972R9267J6206J08865O7330J7006J11601j4307J21348J21795O8069
4763E995791N5821J28331J06450O5780J2559L6518r437J16765o497M1090K2913
4752F566084J48504K05724q306Q3259J28278Q8899J13447K17124N2565K8735J28952
4741G753265J15239J43262J10254M3895J31820J28451J45641J64588M2686J08777
$$ plain form
4731 8887878 9032408 9079000 9346467 9551541 9607252 9846492 9947386 10081644 10278827 10489564
4721 10489564 10602778 10720287 10884119 11075999 11264790 11483229 11647238 11851764 12016605
4712 12016605 12146932 12435175 12748558 12943584 13155634 13390582 13594561 13813678 14014389
4703 14014389 14185040 14444054 14655181 14890209 15125149 15310292 15554137 15708529 15948433
4694 15948433 16136291 16359981 16561642 16847697 16963629 17146050 17408067 17586876 17757553
4685 17757553 17833839 17990556 18080768 18282024 18386748 18527089 18686336 18768411 18854108 18873023
4675 18873023 18934689 19130432 19134871 19291386 19491532 19503334 19565802 19652895 19690150 19768919 19876198
4664 19876198 19965672 20024781 20129430 20227135 20430243 20570626 20652822 20742067 20800073 20925039
$$ packed form
4731H887878J44530M6592K67467K05074N5711K39240J00894J34258J97183K10737
4721A0489564J13214J17509J63832J91880J88791K18439J64009K04526J64841
4712A2016605J30327K88243L13383J95026K12050K34948K03979K19117K00711
4703A4014389J70651K59014K11127K35028K34940J85143K43845J54392K39904
4694A5948433J87858K23690K01661K86055J15932J82421K62017J78809J70677
4685A7757553P6286J56717R0212K01256J04724J40341J59247Q2075Q5697J8915
4675A8873023O1666J95743M439J56515K00146J1802O2468Q7093L7255P8769J07279
4664A9876198Q9474N9109J04649R7705K03108J40383Q2196Q9245N8006J24966
$$ plain form
4654 20925039 21044176 21219076 21330728 21461849 21610761 21761747 21867676 21950947 22069886 22137860
4644 22137860 22231788 22269077 22285994 22386051 22440295 22541996 22533797 22535087 22547377 22502396 22483609
4633 22483609 22539868 22468476 22353432 22249913 22192808 22080245 21989731 21895906 21610040 21407358
4623 21407358 21262757 21025480 20869566 20641204 20482251 20324728 20190503 19992738 19798542
4614 19798542 19680154 19569866 19282211 19059717 18805366 18574457 18341658 18119818 17943738
4605 17943738 17580343 17342159 17229581 17059452 16755083 16493314 16317945 16183548 16013346
4596 16013346 15948841 15762242 15646137 15504611 15341179 15270491 15172608 15186174 15078660 14971043
4586 14971043 14865103 14786558 14702418 14653447 14591481 14576016 14458446 14478581 14455646 14414868 14406091
$$ packed form
4654B0925039J19137J74900J11652J31121J48912J50986J05929Q3271J18939O7974
4644B2137860R3928L7289J6917J00057N4244J01701q199J290J2290m4981j8787
4633B2483609N6259p1392j15044j03519n7105j12563r0514r3825k85866k02682
4623B1407358j44601k37277j55914k28362j58953j57523j34225j97765j94196
4614A9798542j18388j10288k87655k22494k54351k30909k32799k21840j76080
4605A7943738l63395k38184j12578j70129l04369k61769j75369j34397j70202
4596A6013346o4505j86599j16105j41526j63432p0688r7883J3566j07514j07617
4586A4971043j05940p8545q4140m8971o1966j5465j17570K0135k2935m0778q777
$$ plain form
4575 14406091 14357484 14315525 14281760 14410438 14423748 14500564 14481060 14498023 14412317 14492366 14553308
4564 14553308 14628094 14654784 14747601 14844080 14806449 14907690 14939551 14992920 15066342 15173939 15266535
4553 15266535 15430540 15436355 15553004 15627323 15675147 15814196 15908151 15929002 16019081 16185116 16253629
4542 16253629 16456499 16569749 16690952 16710927 16824757 16964617 17063608 17141081 17214659 17367475
4532 17367475 17468555 17507401 17652875 17802042 17920218 17893062 18032664 18198215 18160155 18195442
4522 18195442 18359502 18495645 18523998 18547807 18669664 18728170 18764991 18922717 18932011 18931925 18944535
4511 18944535 19040420 19086265 19103991 19169519 19276432 19190892 19235147 19401646 19444895 19403814 19352583
4500 19352583 19283442 19215446 19104696 19040345 18962820 18858035 18728519 18700901 18678921 18546875
$$ packed form
4575A4406091m8607m1959l3765J28678J3310P6816j9504J6963q5706Q0049O0942
4564A4553308P4786K6690R2817R6479l7631J01241L1861N3369P3422J07597R2596
4553A5266535J64005N815J16649P4319M7824J39049R3955K0851R0079J66035O8513
4542A6253629K02870J13250J21203J9975J13830J39860R8991P7473P3578J52816
4532A7367475J01080L8846J45474J49167J18176k7156J39602J65551l8060L5287
4522A8195442J64060J36143K8353K3809J21857N8506L6821J57726R294q6J2610
4511A8944535R5885M5845J7726O5528J06913q5540M4255J66499M3249m1081n1231
4500A9352583o9141o7996j10750o4351p7525j04785j29516k7618k1980j32046
$$ plain form
4490 18546875 18468152 18271907 18215675 18344732 18298402 18209577 18221430 18158728 18057533 17862064
4480 17862064 17844320 17735543 17622014 17549653 17431454 17359068 17216342 17158188 17056956 16949740
4470 16949740 16845897 16821756 16748965 16681963 16467734 16345442 16279121 16188172 16072444 15926088
4460 15926088 15958844 15839413 15696787 15656384 15666418 15460463 15342118 15250543 15142069 14928635
4450 14928635 14886958 14880868 14706779 14637930 14518968 14518789 14679720 14681167 14628513 14675377 14594200
4439 14594200 14288812 13937677 13627550 13411871 13190785 12931414 12702769 12486777 12229931
4430 12229931 12164956 11984556 11756127 11535384 11488454 11334821 11151034 11031177 10895294 10840691
4420 10840691 10633425 10423709 10352402 10240418 10114898 9882407 9763791 9705984 9623317 9576798
$$ packed form
4490A8546875p8723j96245n6232J29057m6330q8825J1853o2702j01195j95469
4480A7862064j7744j08777j13529p2361j18199p2386j42726n8154j01232j07216
4470A6949740j03843k4141p2791o7002k14229j22292o6321r0949j15728j46356
4460A5926088L2756j19431j42626m0403J0034k05955j18345r1575j08474k13434
4450A4928635m1677o090j74089o8849j18962j79J60931J447n2654M6864q1177
4439A4594200l05388l51135l10127k15679k21086k59371k28645k15992k56846
4430A2229931o4975j80400k28429k20743m6930j53633j83787j19857j35883n4603
4420A0840691k07266k09716p1307j11984j25520k32491j18616n7807q2667m6519
$$ plain form
4410 9576798 9527121 9504963 9301351 9225589 9191823 9085115 8917190 8881482 8873957 8786197 8711895
4399 8711895 8727982 8686935 8590254 8520848 8533438 8472220 8463889 8284287 8148817 8060345 8060394 8020774
4387 8020774 8010036 7936774 7853551 7734946 7726734 7759193 7708229 7581110 7539730 7550331 7497403
4376 7497403 7459081 7520248 7539922 7544247 7505387 7456239 7428233 7437172 7332593 7322405 7290934 7245545
4364 7245545 7209935 7176002 7264517 7223104 7252190 7279960 7298560 7236216 7123931 7178408 7195628
4353 7195628 7156077 7213284 7192386 7146431 7132316 7223074 7242524 7232390 7220506 7247472 7247411 7295418
4341 7295418 7278319 7220987 7295031 7218639 7221290 7241244 7106969 7121738 7005410 7028195 7128893
4330 7128893 7161059 7178106 7298190 7365587 7416431 7413850 7392101 7399872 7392260 7501070 7624377
$$ packed form
4410I576798m9677k2158k03612p5762l3766j06708j67925l5708p525q7760p4302
4399H711895J6087m1047r6681o9406J2590o1218q331j79602j35470q8472M9l9620
4387H020774j0738p3262q3223j18605q212L2459n0964j27119m1380J0601n2928
4376G497403l8322O1167J9674M325l8860m9148k8006Q939j04579j0188l1471m5389
4364G245545l5610l3933Q8515m1413K9086K7770J8600o2344j12285N4477J7220
4353G195628l9551N7207k0898m5955j4115R0758J9450j0134j1884K6966o1M8007
4341G295418j7099n7332P4044p6392K651J9954j34275J4769j16328K2785J00698
4330G128893L2166J7047J20084O7397N0844k581k1749P771p612J08810J23307
$$ plain form
4319 7624377 7708788 7793564 7923885 8008561 8075660 8048011 8101070 8156762 8087905 8207954 8312928
4308 8312928 8338457 8315820 8334783 8292302 8234307 8255642 8215164 8099424 8085531 8113289 8039911
4297 8039911 8097354 8121885 8187507 8293010 8181038 8283673 8370307 8458500 8556430 8733137 8892065
4286 8892065 8923181 9017140 9022224 9013119 8973451 8985162 8947739 8961279 9051713 9065809 9287398 9477392
4274 9477392 9504105 9391335 9143540 9154269 8998295 8819123 8880042 8915534 8904829 8968964 9105973
4263 9105973 9129597 9305443 9341337 9373733 9569290 9664674 9884512 10047825 10251339 10493469
4253 10493469 10833122 11070644 11242542 11365246 11392773 11157317 10825819 10594759 10301777 9970400
4243 9970400 9658227 9418765 9263055 9079745 8812291 8712387 8702664 8643043 8603424 8597978 8589741
$$ packed form
4319G624377Q4411Q4776J30321Q4676O7099k7649N3059N5692o8857J20049J04974
4308H312928K5529k2637J8963m2481n7995K1335m0478j15740j3893K7758p3378
4297H039911N7443K4531O5622J05503j11972J02635Q6634Q8193R7930J76707J58928
4286H892065L1116R3959N084r105l9668J1711l7423J3540R0434J4096K21589J89994
4274I477392K6713j12770k47795J0729j55974j79172O0919L5492j0705O4135J37009
4263I105973K3624J75846L5894L2396J95557R5384K19838J63313K03514K42130
4253A0493469L39653K37522J71898J22704K7527k35456l31498k31060k92982l31377
4243I970400l12173k39462j55710j83310k67454r9904r723n9621l9619n446q237
$$ plain form
4232 8589741 8431220 8416260 8479413 8383511 8330605 8331509 8369375 8308220 8210606 8150505 8139914 8210994
4220 8210994 8308846 8382174 8429526 8374648 8440216 8431790 8387254 8411138 8476509 8589632 8678943
4209 8678943 8690661 8693835 8781195 8875017 8875015 8934158 9047120 9167242 9231331 9177482 9220543 9269505
4197 9269505 9275115 9289050 9367635 9483825 9571918 9720886 9827628 9850899 9871905 9927260 10027564
4186 10027564 10119742 10201811 10319076 10340513 10398709 10444863 10589369 10749892 10792364 11034377
4176 11034377 11329976 11416512 11475993 11680182 11945619 12125485 12298209 12423890 12666091 12935854
4166 12935854 13131871 13388521 13543548 13834787 13944116 13931476 14185048 14522091 14819759 15088543
4156 15088543 15390076 15801222 16227561 16612784 16970620 17329228 17617728 17848636 18132873
$$ packed form
4232H589741j58521j4960O3153r5902n2906R04L7866o1155r7614o0101j0591P1080
4220H210994R7852P3328M7352n4878O5568q426m4536K3884O5371J13123Q9311
4209H678943J1718L174Q7360R3822kN9143J12962J20122O4089n3849M3061M8962
4197I269505N610J3935P8585J16190Q8093J48968J06742K3271K1006N5355J00304
4186A0027564R2178Q2069J17265K1437N8196M6154J44506J60523M2472K42013
4176A1034377K95599Q6536N9481K04189K65437J79866J72724J25681K42201K69763
4166A2935854J96017K56650J55027K91239J09329j2640K53572L37043K97668K68784
4156A5088543L01533M11146M26339L85223L57836L58608K88500K30908K84237
$$ plain form
4147 18132873 18620033 19087883 19587980 20191124 20709950 21275350 21981047 22821669 23888847
4138 23888847 25103018 26631554 28266175 30038008 31978427 33938210 35726912 36807422
4130 36807422 36825711 35845901 33894660 31448313 29019620 26985406 25193301 23798530 22768743
4121 22768743 21911309 21185496 20602406 20131502 19803013 19676819 19621858 19487743 19494028 19634059
4111 19634059 19653408 19775832 19839982 19838724 19947229 19891764 19810297 19895600 19694027 19556880 19693298
4100 19693298 19636636 19500429 19480250 19547077 19574339 19748492 19764325 19894419 20091626 20238699
4090 20238699 20471410 20387587 20502233 20668546 20680191 20747135 20881905 20948872 21100108 21136962
4080 21136962 21251063 21331644 21368954 21417335 21389501 21358007 21378779 21321670 21266982 21153863 21038579
$$ packed form
4147A8132873M87160M67850N00097O03144N18826N65400P05697Q40622J067178
4138B3888847J214171J528536J634621J771833J940419J959783J788702J080510
4130C6807422J8289r79810j951241k446347k428693k034214j792105j394771j029787
4121B2768743q57434p25813n83090m70904l28489j26194n4961j34115O285J40031
4111A9634059J9349J22424O4150j258J08505n5465q1467Q5303k01573j37147J36418
4100A9693298n6662j36207k0179O6827K7262J74153J5833J30094J97207J47073
4090B0238699K32711q3823J14646J66313J1645O6944J34770O6967J51236L6854
4080B1136962J14101Q0581L7310M8381k7834l1494K0772n7109n4688j13119j15284
$$ plain form
4069 21038579 20804047 20604536 20566495 20428143 20490361 20568824 20530256 20520161 20551349 20691781
4059 20691781 20765805 20680103 20616360 20619358 20749495 20866623 20912153 21025549 21168475 21323543
4049 21323543 21485300 21754541 22011065 22279796 22431177 22703616 23072385 23406217 23755870
4040 23755870 24263095 24696130 25075293 25653229 26121747 26601579 27210255 27939835 28708592
4031 28708592 29463503 30209550 31074249 31944443 32795139 33578771 34218193 34970014 35699025
4022 35699025 36443228 37104664 37801144 38539830 39402574 40367314 41317721 42258526 43339762
4013 43339762 44456646 45669387 46950844 48261435 49731101 51128919 52516537 54079131
4005 54079131 55682785 57339577 59038482 60881729 62817599 64825461 66966511 69204320
$$ packed form
4069B1038579k34532j99511l8041j38352O2218P8463l8568j0095L1188J40432
4059B0691781P4024q5702o3743K998J30137J17128M5530J13396J42926J55068
4049B1323543J61757K69241K56524K68731J51381K72439L68769L33832L49653
4040B3755870N07225M33035L79163N77936M68518M79832O08676P29580P68757
4031B8708592P54911P46047Q64699Q70194Q50696P83632O39422P51821P29011
4022C5699025P44203O61436O96480P38686Q62744R64740R50407R40805J081236
4013D3339762J116884J212741J281457J310591J469666J397818J387618J562594
4005E4079131J603654J656792J698905J843247J935870K007862K141050K237809
$$ plain form
3997 69204320 71525219 73911564 76358962 78769546 81248906 83904345 86548916 89154628
3989 89154628 91844460 94638671 97326611 99982681 102696672 105183804 107823604 110293489
3981 110293489 112733271 115012484 117280259 119355355 121221675 122942967 124518071 125917181
3973 125917181 127133969 128132320 128834907 129391030 129670570 129951235 129881922 129590793 129038379
3964 129038379 128330308 127510435 126438041 125208918 123901134 122341820 120526181 118807817
3956 118807817 116882368 114967103 112934092 110882000 108900971 107067049 105295103 103841336
3948 103841336 102524238 101391317 100436869 99899971 99537182 99198329 98291574 96105299 92186822
3939 92186822 86916361 81406945 76221056 71717732 67762751 64321321 61200397 58432635
$$ packed form
3997F9204320K320899K386345K447398K410584K479360K655439K644571K605712
3989H9154628K689832K794211K687940K656070K713991K487132K639800K469885
3981A10293489K439782K279213K267775K075096J866320J721292J575104J399110
3973A25917181J216788R98351P02587N56123K79540K80665o9313k91129n52414
3964A29038379p08071q19873j072394j229123j307784j559314j815639j718364
3956A18807817j925449j915265k033011k052092j981029j833922j771946j453767
3948A03841336j317098j132921r54448n36898l62789l38853r06755k186275l918477
3939I2186822n270461n509416n185889m503324l954981l441430l120924k767762
$$ plain form
3931 58432635 55863673 53543180 51412081 49533093 47655463 45910445 44442719 43131219
3923 43131219 41648483 40298818 39094237 37882751 36863036 35855171 34940444 33972851
3915 33972851 33098684 32269838 31490005 30750357 30204385 29595350 28853575 28291595 27784481
3906 27784481 27176238 26708579 26218055 25797019 25391212 24945367 24558690 24177033 23796594
3897 23796594 23392554 22906774 22407719 22075009 21604911 21234580 20993590 20711801 20410873
3888 20410873 20039221 19809902 19569179 19291443 19108855 18925952 18775304 18534494 18315226
3879 18315226 18247341 18135402 17953852 17919645 17682923 17448559 17298678 17235709 17156581 17145454
3869 17145454 17042283 16862409 16708201 16597964 16373182 16298371 16189221 15947782 15779242 15717312
$$ packed form
3931E8432635k568962k320493k131099j878988j877630j745018j467726j311500
3923D3131219j482736j349665j204581j211486j019715j007865r14727r67593
3915C3972851q74167q28846p79833p39648n45972o09035p41775n61980n07114
3906B7784481o08243m67659m90524m21036m05807m45845l86677l81657l80439
3897B3796594m04040m85780m99055l32710m70098l70331k40990k81789l00928
3888B0410873l71652k29319k40723k77736j82588j82903j50648k40810k19268
3879A8315226o7885j11939j81550l4207k36722k34364j49881o2969p9128j1127
3869A7145454j03171j79874j54208j10237k24782p4811j09150k41439j68540o1930
$$ plain form
3859 15717312 15620243 15547864 15341056 15345147 15252811 15229438 15240393 15128036 15111214 15058695 15114804
3848 15114804 15080711 15060654 14968030 14921805 14860304 14860662 14872214 14776162 14738218 14799772 14824986 14802078
3836 14802078 14890746 14968331 14882728 14952412 15055089 14974270 14954068 14981850 14987231 14968741 14915281
3825 14915281 15056153 15110688 15201608 15231201 15216397 15375839 15476538 15583170 15541228 15578875
3815 15578875 15678778 15758897 15860454 16065661 16195959 16228261 16272621 16467628 16695744 16697057
3805 16697057 16778316 16878876 16953662 17033156 17025728 17045934 17029445 16979651 17022543 16926104 16827115
3794 16827115 16782969 16573161 16349203 16193815 16046345 15758925 15583172 15463050 15269597 15237391
3784 15237391 15139667 15067495 14987059 15045206 14993319 14936920 14849125 14765986 14783375 14784841 14755843
$$ packed form
3859A5717312r7069p2379k06808M091r2336k3373J0955j12357j6822n2519N6109
3848A5114804l4093k0057r2624m6225o1501L58J1552r6052l7944O1554K5214k2908
3836A4802078Q8668P7585q5603O9684J02677q0819k0202K7782N381j8490n3460
3825A4915281J40872N4535R0920K9593j4804J59442J00699J06632m1942L7647
3815A5578875R9903Q0119J01557K05207J30298L2302M4360J95007K28116J313
3805A6697057Q1259J00560P4786P9494p428K0206j6489m9794M2892r6439r8989
3794A6827115m4146k09808k23958j55388j47470k87420j75753j20122j93453l2206
3784A5237391r7724p2172q0436N8147n1887n6399q7795q3139J7389J466k8998
$$ plain form
3773 14755843 14812872 14730963 14776961 14771603 14904299 14944654 14994719 15211872 15236844 15277975 15249056
3762 15249056 15122501 15085206 15100023 15019961 15054617 15111120 15109537 15117233 15277070 15464204 15502534
3751 15502534 15494487 15631191 15846876 15869381 15988975 16165181 16254673 16383389 16549205 16678316
3741 16678316 16780279 16918253 16924508 17024981 17092246 17231206 17442179 17542170 17679344 17714642
3731 17714642 17821979 18037326 18319139 18470191 18567226 18724241 18836124 19032789 19160554 19311780
3721 19311780 19423552 19632993 19811053 20070999 20323640 20543426 20850071 21062145 21256678
3712 21256678 21542828 21779811 22008194 22311607 22700278 22890729 23205470 23545164 23767737
3703 23767737 24134348 24523753 24824056 25075636 25401532 25780252 26133347 26545772 26992736
$$ packed form
3773A4755843N7029q1909M5998n358J32696M0355N0065K17153K4972M1131k8919
3762A5249056j26555l7295J4817q0062L4656N6503j583P696J59837J87134L8330
3751A5502534q047J36704K15685K2505J19594J76206Q9492J28716J65816J29111
3741A6678316J01963J37974O255J00473O7265J38960K10973R9991J37174L5298
3731A7714642J07337K15347K81813J51052R7035J57015J11883J96665J27765J51226
3721A9311780J11772K09441J78060K59946K52641K19786L06645K12074J94533
3712B1256678K86150K36983K28383L03413L88671J90451L14741L39694K22573
3703B3767737L66611L89405L00303K51580L25896L78720L53095M12425M46964
$$ plain form
3694 26992736 27466404 27916254 28289301 28731571 29174389 29593519 30062624 30586973 31096270
3685 31096270 31622238 32129477 32643152 33182031 33747619 34337159 34923009 35593406 36246136
3676 36246136 36883549 37489759 38103574 38955319 39715471 40387262 41071629 41801550 42761334
3667 42761334 43633159 44571942 45542067 46546436 47848554 49029491 50193725 51457758 52803873
3658 52803873 54199328 55712218 57177205 58796468 60488558 62245865 64024552 65826967
3650 65826967 67575473 69296044 71170373 72865211 74606214 76456227 78297139 80049522
3642 80049522 81762335 83376990 85040723 86593824 88183928 89600811 90875521 92146715
3634 92146715 93399736 94583060 95714911 96739319 97765984 98827187 99891349 101016882
$$ packed form
3694B6992736M73668M49850L73047M42270M42818M19130M69105N24349N09297
3685C1096270N25968N07239N13675N38879N65588N89540N85850O70397O52730
3676C6246136O37413O06210O13815Q51745P60152O71791O84367P29921R59784
3667D2761334Q71825R38783R70125J004369J302118J180937J164234J264033J346115
3658E2803873J395455J512890J464987J619263J692090J757307J778687J802415
3650F5826967J748506J720571J874329J694838J741003J850013J840912J752383
3642H0049522J712813J614655J663733J553101J590104J416883J274710J271194
3634I2146715J253021J183324J131851J024408J026665J061203J064162J125533
$$ plain form
3626 101016882 101969136 103094501 104252014 105412980 106657809 108006549 109476263 110981200
3618 110981200 112544617 114252248 115982737 117956317 119996654 122236012 124681096 127257017
3610 127257017 130113293 133041802 136183888 139524256 143113196 147018602 151062767 155315817
3602 155315817 159804864 164584382 169575847 174697415 180023378 185552810 191252644 196965983
3594 196965983 202849417 208774358 214754748 220641140 226578338 232582559 238355806 244070186
3586 244070186 249622352 255193732 260534347 265587554 270422225 275064411 279244611 283113179
3578 283113179 286663307 289878051 292752055 295425940 297787491 299859489 301671743 303305131
3570 303305131 304803316 305985641 307055001 307881189 308643690 309062025 309281839 309541986 309507463
$$ packed form
3626A01016882R52254J125365J157513J160966J244829J348740J469714J504937
3618A10981200J563417J707631J730489J973580K040337K239358K445084K575921
3610A27257017K856276K928509L142086L340368L588940L905406M044165M253050
3602A55315817M489047M779518M991465N121568N325963N529432N699834N713339
3594A96965983N883434N924941N980390N886392N937198O004221N773247N714380
3586B44070186N552166N571380N340615N053207M834671M642186M180200L868568
3578B83113179L550128L214744K874004K673885K361551K071998J812254J633388
3570C03305131J498185J182325J069360Q26188P62501M18335K19814K60147l4523
$$ plain form
3561 309507463 309219291 308784592 308159286 307426048 306507490 305417275 304048079 302529127 300744352
3552 300744352 298622837 296410182 293914885 291057199 287946228 284595992 280978030 276907842
3544 276907842 272698622 268196547 263359680 258285755 253072298 247637821 242085842 236423134
3536 236423134 230658362 224784104 219020513 213114727 207209313 201452569 195836472 190221038
3528 190221038 184629065 179132502 173899085 168789464 163906061 159298597 154807308 150590868
3520 150590868 146643176 142899787 139213522 135929125 132763417 129917986 127137324 124599185
3512 124599185 122394941 120313811 118471771 116656684 114903261 113429602 112120552 110833085
3504 110833085 109603506 108535994 107544789 106452833 105501906 104581966 103639681 102704975 101724121
$$ packed form
3561C09507463k88172m34699o25306p33238r18558j090215j369196j518952j784775
3552C00744352k121515k212655k495297k857686l110971l350236l617962m070188
3544B76907842m209220m502075m836867n073925n213457n434477n551979n662708
3536B36423134n764772n874258n763591n905786n905414n756744n616097n615434
3528A90221038n591973n496563n233417n109621m883403m607464m491289m216440
3520A50590868l947692l743389l686265l284397l165708k845431k780662k538139
3512A24599185k204244k081130j842040j815087j753423j473659j309050j287467
3504A10833085j229579j067512r91205j091956r50927r19940r42285r34706r80854
$$ plain form
3495 101724121 100850008 99947628 99085395 98230154 97290415 96137713 95006123 93976578 92797790
3486 92797790 91526530 90244200 88856716 87481177 85942593 84297819 82768062 81256749
3478 81256749 79622912 77865099 76223385 74522892 72802245 71020743 69259996 67583356
3470 67583356 65806373 64158280 62474782 60762123 59066665 57432802 55889411 54486375
3462 54486375 52978901 51623153 50299896 48969062 47706097 46512199 45356436 44216705
3454 44216705 43168623 42167928 41221523 40251160 39343709 38584960 37764322 36840456 36105222
3445 36105222 35326300 34614997 33999540 33335360 32636333 32074312 31353377 30674948 30306338
3436 30306338 29877966 29192167 28559566 28076663 27545737 27068093 26639312 26227912 25728076
$$ packed form
3495A01724121q74113r02380q62233q55241r39739j152702j131590j029545j178788
3486I2797790j271260j282330j387484j375539j538584j644774j529757j511313
3478H1256749j633837j757813j641714j700493j720647j781502j760747j676640
3470F7583356j776983j648093j683498j712659j695458j633863j543391j403036
3462E4486375j507474j355748j323257j330834j262965j193898j155763j139731
3454D4216705j048082j000695r46405r70363r07451p58749q20638r23866p35234
3445C6105222p78922p11303o15457o64180o99027n62021p20935o78429l68610
3436C0306338m28372o85799o32601m82903n30926m77644m28781m11400m99836
$$ plain form
3427 25728076 25359152 24995477 24533858 24042454 23533960 23142289 22790764 22303197 21946593
3418 21946593 21573190 21294449 21041059 20718885 20397803 20100758 19819880 19546743 19227338
3409 19227338 18985524 18740097 18477702 18223353 18047397 17851391 17552442 17341246 17222805
3400 17222805 16970340 16734892 16638466 16475213 16366234 16177035 15980979 15787119 15434051 15168223
3390 15168223 15000335 14725209 14616201 14359010 14217540 14130752 13946604 13727203 13567543 13359080
3380 13359080 13279370 13197725 13130322 12945746 12828879 12639604 12561695 12505251 12276819 12315566
3370 12315566 12181927 12004285 11945496 11909603 11837318 11716600 11648780 11543748 11435011 11308473
3360 11308473 11281161 11133334 10909103 10878641 10771649 10660777 10749062 10639002 10494062 10396442
$$ packed form
3427B5728076l68924l63675m61619m91404n08494l91671l51525m87567l56604
3418B1946593l73403k78741k53390l22174l21082k97045k80878k73137l19405
3409A9227338k41814k45427k62395k54349j75956j96006k98949k11196j18441
3400A7222805k52465k35448r6426j63253j08979j89199j96056j93860l53068k65828
3390A5168223j67888k75126j09008k57191j41470q6788j84148k19401j59660k08463
3380A3359080p9710q1645o7403j84576j16867j89275p7909n6444k28432L8747
3370A2315566j33639j77642n8789l5893p2285j20718o7820j05032j08737j26538
3360A1308473k7312j47827k24231l0462j06992j10872Q8285j10060j44940r7620
$$ plain form
3350 10396442 10372528 10195189 10093476 10037826 9971462 9890730 9827182 9795442 9711641 9602522 9527694
3339 9527694 9487845 9483792 9415250 9269712 9228342 9096187 8968631 8939656 8932221 8880346 8883223
3328 8883223 8841687 8878504 8837628 8743288 8738842 8765653 8753621 8617550 8496324 8578858 8548998
3317 8548998 8402504 8353653 8440931 8331690 8361995 8386671 8281489 8339109 8425251 8438801 8474665
3306 8474665 8378325 8313751 8368234 8355992 8196612 8170444 8292755 8405172 8321744 8210649 8228541
3295 8228541 8198366 8280881 8329023 8360110 8345249 8255222 8308227 8408329 8407130 8278012 8214308
3284 8214308 8297992 8224528 8266101 8255372 8145105 8073278 8062102 8138666 8091193 8116249 8120443
3273 8120443 8139162 8065706 7995382 8043586 8026318 8090384 8112044 8031957 7976671 8019358 8151879
$$ packed form
3350A0396442k3914j77339j01713n5650o6364q0732o3548l1740q3801j09119p4828
3339I527694l9849m053o8542j45538m1370j32155j27556k8975p435n1875K877
3328H883223m1536L6817m0876r4340m446K6811j2032j36071j21226Q2534k9860
3317H548998j46494m8851Q7278j09241L0305K4676j05182N7620Q6142J3550L5864
3306H474665r6340o4574N4483j2242j59380k6168J22311J12417q3428j11095J7892
3295H228541l0175Q2515M8142L1087j4861r0027N3005J00102j199j29118o3704
3284H214308Q3684p3464M1573j0729j10267p1827j1176P6564m7473K5056M194
3273H120443J8719p3456p0324M8204j7268O4066K1660q0087n5286M2687J32521
$$ plain form
3262 8151879 8012539 8000787 8065233 7967539 7964101 8090051 8130052 8149754 8147994 8152409 8073851 8137697
3250 8137697 8161413 8231311 8365742 8390830 8410303 8492033 8628662 8729970 8975850 9101654
3240 9101654 9190446 9560099 9780166 9899877 10030948 10129642 10145316 10086523 9897490 9527372
3230 9527372 9186413 8811099 8470714 8110060 7793401 7576914 7414855 7172794 6964579 6793571
3220 6793571 6664464 6604035 6543110 6457230 6361965 6306122 6313566 6292791 6244247 6188796 6167829
3209 6167829 6104723 6029930 5977187 5916976 5815228 5846004 5894179 5743230 5599201 5511584 5459953
3198 5459953 5444648 5344722 5262380 5170222 5086184 4928727 4879907 4800383 4625959 4608116 4577816
3187 4577816 4563840 4574712 4559291 4472998 4427101 4333480 4315693 4141519 4056285 4173798 4091964
$$ packed form
3262H151879j39340j1752O4446r7694l438J25950M0001J9702j760M415p8558O3846
3250H137697K3716O9898J34431K5088J9473Q1730J36629J01308K45880J25804
3240I101654Q8792L69653K20067J19711J31071R8694J5674n8793j89033l70118
3230I527372l40959l75314l40385l60654l16659k16487j62059k42061k08215j71008
3220F793571j29107o0429o0925q5880r5265n5843P444k0775m8544n5451k0967
3209F167829o3106p4793n2743o0211j01748L0776M8175j50949j44029q7617n1631
3198E459953j5305r9926q2342r2158q4038j57457m8820p9524j74424j7843l0300
3187D577816j3976J0872j5421q6293m5897r3621j7787j74174q5234J17513q1834
$$ plain form
3176 4091964 4032826 3925306 3910550 3881555 3960182 4001222 4081810 4030358 3995370 3919247 3934395
3165 3934395 3930697 3769198 3738555 3653488 3514566 3598840 3621804 3541761 3547297 3497044 3390542
3154 3390542 3321401 3310126 3336373 3276649 3222167 3259970 3245237 3197390 3138071 3129292 3141003 3122298
3142 3122298 3041411 2954412 2939784 2982527 2957241 2830640 2811577 2887424 2929597 2912156 2830614
3131 2830614 2718898 2699419 2659026 2678898 2669589 2619770 2538151 2602284 2593974 2558266 2638235 2657272
3119 2657272 2546328 2450218 2483119 2556775 2508562 2535322 2533299 2512749 2434576 2475487 2475970 2319600
3107 2319600 2361329 2280228 2381446 2375125 2322046 2321844 2309755 2151678 2224081 2207187 2193742 2223221
3095 2223221 2236799 2227398 2244550 2187479 2241072 2099441 2099459 2115284 2118439 2043395 2061487 2033146
$$ packed form
3176D091964n9138j07520j4756k8995P8627M1040Q0588n1452l4988p6123J5148
3165C934395l698j61499l0643q5067j38922Q4274K2964q0043N536n0253j06502
3154C390542o9141j1275K6247n9724n4482L7803j4733m7847n9319q779J1711j8705
3142C122298q0887q6999j4628M2743k5286j26601j9063P5847M2173j7441q1542
3131B830614j11716j9479m0393J9872r309m9819q1619O4133q310l5708P9969J9037
3119B657272j10944r6110L2901P3656m8213K6760k023k0550p8173M0911M83j56370
3107B319600M1729q1101J01218o321n3079k02j2089j58077P2403j6894j3445K9479
3095B223221J3578r401J7152n7071N3593j41631J8J5825L155p5044J8092k8341
$$ plain form
3083 2033146 1952913 1958068 1982902 1984201 1961448 2121111 2156982 2214658 2090671 2043737 2057175
3072 2057175 1981214 1953100 1889660 1983622 2019679 2007635 2007046 1898313 1871050 1902843 1941717 2026566
3060 2026566 2097344 2087390 1939739 1951493 2016851 2031093 2017678 1860416 1870667 1971333 1989258
3049 1989258 1997611 1941028 1887950 1856887 1853082 1911415 1853089 1836531 1864656 1921656 1924575 1900427
3037 1900427 1925495 1974780 1916497 1904561 1879938 1888932 1862431 1918197 1863792 1821749 1798200 1861276
3025 1861276 1968529 2043177 2016997 2027329 1928052 1872246 2012597 1940283 2009830 2141171 2157656
3014 2157656 2072228 2142636 2211740 2147586 2129006 2156274 2193953 2162159 2175946 2148299 2214190
3003 2214190 2316333 2356166 2358977 2332152 2443509 2558466 2568769 2555157 2590796 2618941 2683113
$$ packed form
3083B033146q0233N155K4834J299k2753J59663L5871N7676j23987m6934J3438
3072B057175p5961k8114o3440R3962L6057j2044n89j08733k7263L1793L8874Q4849
3060B026566P0778r954j47651J1754O5358J4242j3415j57262J0251J00666J7925
3049A989258Q353n6583n3078l1063l805N8333n8326j6558K8125N7000K919k4148
3037A900427K5068M9285n8283j1936k4623Q994k6501N5766n4405m2043k3549O3076
3025A861276J07253P4648k6180J0332r9277n5806J40351p2314O9547J31341J6485
3014B157656q5428P0408O9104o4154j8580K7268L7679l1794J3787k7647O5891
3003B214190J02143L9833K811k6825J11357J14957J0303j3612L5639K8145O4172
$$ plain form
2992 2683113 2759037 2823205 2786739 2720635 2721355 2775199 2799331 2763873 2727615 2652889 2618601 2612610
2980 2612610 2622447 2601048 2542595 2547940 2556469 2664549 2705694 2595660 2529306 2624340 2746455
2969 2746455 2798943 2840143 2893368 3025105 3047449 3108152 3189752 3251572 3412430 3540120 3590847
2958 3590847 3751165 3865880 3895137 3960859 3930901 3807882 3701272 3566633 3576962 3503609
2948 3503609 3382121 3284499 3227853 3061444 2961485 2888715 2819701 2729834 2606728 2553911 2570520
2937 2570520 2486020 2461477 2511220 2455632 2515397 2511217 2442532 2439740 2460967 2466310 2591677 2794794
2925 2794794 2777091 2790179 2890406 2989622 3107821 3137847 3054302 3044631 2995790 2908977 2861641
2914 2861641 2727562 2652601 2680380 2679996 2449286 2391585 2289141 2246066 2344585 2401515 2279217
$$ packed form
2992B683113P5924O4168l6466o6104P20N3844K4132l5458l6258p4726l4288n991
2980B612610R837k1399n8453N345Q529J08080M1145j10034o6354R5034J22115
2969B746455N2488M1200N3225J31737K2344O0703Q1600O1820J60858J27690N0727
2958C590847J60318J14715K9257O5722k9958j23019j06610j34639J0329p3353
2948C503609j21488r7622n6646j66409r9959p2770o9014q9867j23106n2817J6609
2937B570520q4500k4543M9743n5588N9765m180o8685k792K1227N343J25367K03117
2925B794794j7703J3088J00227R9216J18199L0026q3545r671m8841q6813m7336
2914B861641j34079p4961K7779l84k30710n7701j02444m3075R8519N6930j22298
$$ plain form
2903 2279217 2243605 2138348 2088487 2138955 2135777 2152300 2142825 2224352 2222978 2207077 2148498 2074612
2891 2074612 2176892 2148860 2042534 2037802 1980599 1816104 1772281 1740944 1781655 1743481 1718077
2880 1718077 1790553 1808219 1760831 1629974 1639495 1761973 1792202 1884052 1851388 1802372 1738251
2869 1738251 1797874 1823734 1829772 1806132 1707562 1701207 1701785 1670438 1593515 1584271 1567094 1617380
2857 1617380 1565485 1598837 1561964 1449104 1514830 1507309 1478402 1548235 1563404 1450346 1458375
2846 1458375 1526616 1518609 1472314 1518398 1470932 1496954 1498441 1426964 1380703 1309465 1231393 1259299
2834 1259299 1183240 1146395 1222742 1176983 1302586 1273676 1181993 1177623 1154274 1066365 1109111
2823 1109111 1063815 1120139 1054625 1077083 1037350 1069078 1100533 1026672 1066592 1081180 1184284
$$ packed form
2903B279217l5612j05257m9861N0468l178J6523r475Q1527j374j5901n8579p3886
2891B074612J02280k8032j06326m732n7203j64495m3823l1337M0711l8174k5404
2880A718077P2476J7666m7388j30857R521J22478L0229R1850l2664m9016o4121
2869A738251N9623K5860O038k3640r8570o355N78l1347p6923r244j7177N0286
2857A617380n1895L3352l6873j12860O5726p521k8907O9833J5169j13058Q029
2846A458375O8241q007m6295M6084m7466K6022J487p1477m6261p1238p8072K7906
2834A259299p6059l6845P6347m5759J25603k8910r1683m370k3349q7909M2746
2823A109111m5296N6324o5514K2458l9733L1728L1455p3861L9920J4588J03104
$$ plain form
2812 1184284 1122394 977857 1008453 1020596 975488 937592 918715 885580 957929 972316 974133
2801 974133 986555 941511 881735 857444 885633 936379 886196 857476 967925 971510 874423 814495
2789 814495 805302 891513 869141 792219 851699 814048 775657 763901 896195 929460 834764 772914
2777 772914 838824 916453 835501 814537 851618 759871 791103 774102 825475 920957 772464
2766 772464 723229 753001 827645 818469 767069 857989 885029 852807 758243 693754 819566 776089
2754 776089 694610 689201 727105 748696 742885 817683 724927 811643 799557 612761 563547 538359
2742 538359 545097 556721 516173 605434 670374 724388 667808 656195 689161 620684 558890 574727
2730 574727 713487 739375 637774 658348 628829 608030 752254 731368 708879 689514 698579
$$ packed form
2812A184284o1890j44537L0596J2143m5108l7896j8877l3135P2349J4387J817
2801I74133J2422m5044n9776k4291K8189N0746n0183k8720J10449L585r7087n9928
2789H14495r193Q6211k2372p6922N9480l7651l8391j1756J32294L3265r4696o1850
2777G72914O5910P7629q0952k0964L7081r1747L1232j7001N1373R5482j48493
2766G72464m9235K9772P4644r176n1400R0920K7040l2222r4564o4489J25812m3477
2754G76089q1479n409L7904K1591n811P4798r2756Q6716j2086j86796m9214k5188
2742E38359O738J1624m0548Q9261O4940N4014n6580j1613L2966o8477o1794J5837
2730E74727J38760K5888j01601K0574k9519k0799J44224k0886k2489j9365R065
$$ plain form
2719 698579 643070 623669 736267 792353 770542 746289 731147 655051 549080 493433 544101
2708 544101 609793 700232 693188 665739 642310 657678 740867 697382 692854 640668 743405 708346
2696 708346 676091 624677 578393 615645 611214 682084 713665 646086 621002 705826 684732 664027
2684 664027 634868 649106 716921 710610 647732 647782 740028 609086 619395 641363 648700 597623
2672 597623 556332 558603 563810 575581 557925 624033 725522 724140 669725 694899 636608 697692
2660 697692 680582 645694 572001 535879 596274 647944 672617 736924 710010 689023 710828 714180
2648 714180 785012 699204 638778 721999 804483 859678 775595 903073 963859 838567 744134
2637 744134 722936 879877 933528 950877 949499 921960 956303 910722 909677 944236 1022921 994854
$$ packed form
2719F98579n5509j9401J12598N6086k1811k4253j5142p6096j05971n5647N0668
2708E44101O5692R0439p044k7449k3429J5368Q3189m3485m528n2186J02737l5059
2696G08346l2255n1414m6284L7252m431P0870L1581o7579k5084Q4824k1094k0705
2684F64027k9159J4238O7815o311o2878N0R2246j30942J0309K1968P337n1077
2672E97623m1291K271N207J1771j7656O6108J01489j382n4415K5174n8291O1084
2660F97692j7110l4888p3693l6122O0395N1670K4673O4307k6914k0987K1805L352
2648G14180P0832q5808o0426Q3221Q2484N5195q4083J27478O0786j25292r4433
2637G44134k1198J56941N3651J7349j378k7539L4343m5581j045L4559P8685k8067
$$ plain form
2625 994854 1028633 968847 908997 1054795 1135981 1156282 1093197 991781 1064161 1117949 1077895
2614 1077895 1114632 1202685 1216732 1136522 1190632 1211277 1112729 1157367 1131564 1205703 1267244
2603 1267244 1195144 1145803 1231393 1266838 1203258 1116205 1209162 1198437 1249439 1189056 1266421
2592 1266421 1367629 1331313 1296735 1299445 1394838 1234400 1261440 1281847 1332488 1396152 1472319
2581 1472319 1421325 1452237 1467757 1513800 1625338 1572143 1525834 1513136 1555802 1434291 1289296
2570 1289296 1188759 1288559 1277351 1218723 1249844 1252403 1189577 1153396 1260199 1109277 1097672
2559 1097672 1104718 1188445 1172334 1045544 1061921 1056772 1013875 1025190 1029274 1100055 1151953 1232037
2547 1232037 1167918 1242251 1164981 1221366 1243478 1179358 1191590 1109442 1061803 1072870 996279
$$ packed form
2625I94854L3779n9786n9850J45798Q1186K0301o3085j01416P2380N3788m0054
2614A077895L6737Q8053J4047q0210N4110K0645r8548M4638k5803P4139O1541
2603A267244p2100m9341Q5590L5445o3580q7053R2957j0725N1002o0383P7365
2592A266421J01208l6316l4578K710R5393j60438K7040K0407N0641O3664P6167
2581A472319n0994L0912J5520M6043J11538n3195m6309j2698M2666j21511j44995
2570A289296j00537R9800j1208n8628L1121K559o2826l6181J06803j50922j1605
2559A097672P046Q3727j6111j26790J6377n149m2897J1315M084P0781N1898Q0084
2547A232037o4119P4333p7270N6385K2112o4120J2232q2148m7639J1067p6591
$$ plain form
2536 996279 954403 930968 957919 912146 950437 881909 897339 872962 856547 802444 843393 824739
2524 824739 790939 758419 753227 760256 701995 889095 857181 727910 609523 681636 685584 724103
2512 724103 695477 717665 704573 625408 560392 696560 631698 536038 543335 539100 593579 543840
2500 543840 535631 592073 608381 550212 523901 498898 447862 345312 334786 410603 450609 418210
2488 418210 311558 414616 418692 529219 551085 533802 571438 636521 604530 616146 560504
2477 560504 453736 513597 524934 445709 395891 345772 387314 296836 301250 297184 264157 260895
2465 260895 350453 302709 285043 241334 239408 332625 304595 379565 364417 330214 296281 306274
2453 306274 304353 397096 374418 385661 339485 348767 392509 364507 324890 279289 292463 286517
$$ packed form
2536I96279m1876k3435K6951m5773L8291o8528J5430k4377j6415n4103M0949j8654
2524H24739l3800l2520n192P029n8261J87100l1914j29271j18387P2113L948L8519
2512G24103k8626K2188j3092p9165o5016J36168o4862r5660P297m235N4479m9739
2500E43840q209N6442J6308n8169k6311k5003n1036j02550j0526P5817M0006l2399
2488D18210j06652J03058M076J10527K1866j7283L7636O5083l1991J1616n5642
2477E60504j06768N9861J1337p9225m9818n0119M1542r0478M414m066l3027l262
2465B60895Q9558m7744j7666m3709j926R3217k8030P4970j5148l4203l3933R993
2453C06274j921R2743k2678J1243m6176R282M3742k8002l9617m5601J3174n946
$$ plain form
2441 286517 224431 342202 451497 431372 330925 320250 312581 259743 369177 321952 303069
2430 303069 222492 233815 247966 277294 347999 449383 434445 334319 268722 262315 325387
2419 325387 318043 338804 436401 476137 322369 294943 309425 410202 367319 298897 247933
2408 247933 273439 278632 197497 269376 407661 385413 417396 432904 522820 477528 381705 334764
2396 334764 300110 308818 293416 330843 347673 314323 284721 379711 258849 279547 400688
2385 400688 409464 340340 332443 332940 337821 318765 226067 343037 320425 210874 283515 431169
2373 431169 389856 420093 377261 384989 383492 286211 343441 452723 457989 466312 467990 504456
2361 504456 443781 391309 455728 494475 444915 409332 388172 362870 371092 344699 349412 320956
$$ packed form
2441B86517o2086J17771J09295k0125j00447j0675p669n2838J09434m7225j8883
2430C03069q0577J1323J4151K9328P0705J01384j4938j00126o5597o407O3072
2419C25387p344K0761R7597L9736j53768k7426J4482J00777m2883o8422n0964
2408B47933K5506N193q1135P1879J38285k2248L1983J5508Q9916m5292r5823m6941
2396C34764l4654Q708j5402L7427J6830l3350k9602R4990j20862K0698J21141
2385D00688Q776o9124p897M97M881j9056r2698J16970k2612j09551P2641J47654
2373D31169m1313L0237m2832P728j497r7281N7230J09282N266Q323J678L6466
2361E04456o0675n2472O4419L8747m9560l5583k1160k5302Q222k6393M713k8456
$$ plain form
2349 320956 311974 298081 361655 406919 337405 298912 272693 237809 259611 218719 306531 262055
2337 262055 337693 273773 309341 350394 208508 168108 153300 218373 281276 312147 272357
2326 272357 318829 264323 216735 279107 357576 289128 291065 305811 281555 356664 286115 270560
2314 270560 174335 185759 246850 297947 325342 295124 383941 493975 442185 326904 269036
2303 269036 242780 385293 385150 325338 401073 307401 248869 397383 367327 367690 436291 374106
2291 374106 325060 386335 369360 349411 399042 355601 352038 406871 430854 336604 296035 405811
2279 405811 309052 259541 159441 287064 417385 373336 392386 369209 284129 212084 356203
2268 356203 385558 325715 309749 345773 342155 315535 303972 314089 352097 283879 245514 355564
$$ packed form
2349C20956q982j3893O3574M5264o9514l8493k6219l4884K1802m0892Q7812m4476
2337B62055P5638o3920L5568M1053j41886m0400j4808O5073O2903L0871l9790
2326B72357M6472n4506m7588O2372P8469o8448J937J4746k4256P5109p0549j5555
2314B70560r6225J1424O1091N1097K7395l0218Q8817J10034n1790j15281n7868
2303B69036k6256J42513j43n9812P5735r3672n8532J48514l0056L63O8601o2185
2291C74106m9046O1275j6975j9949M9631m3441l563N4833K3983r4250m0569J09776
2279D05811r6759m9511j00100J27623J30321m4049J9050k3177q5080p2045J44119
2268C56203K9355n9843j5966L6024l618k6620j1563J0117L8008o8218l8365J10050
$$ plain form
2256 355564 337953 316195 483268 429688 338495 383298 363032 383772 473099 474957 426570 473227
2244 473227 471715 398330 415505 473839 459932 487036 342266 413761 507771 361098 408469
2233 408469 394077 385330 398940 417527 440288 564076 593371 559251 569549 484477 453204 400890
2221 400890 347322 371500 342176 399898 459265 510117 570110 503955 556601 531317 429107
2210 429107 446869 490137 512444 534133 510608 491055 534849 603291 579617 504690 567917 597708
2198 597708 563301 639837 693844 627020 582165 667172 626376 582929 580018 614276 555891 593280
2186 593280 596977 638750 565787 607162 674319 648845 689204 698744 794440 727794 723309 827446
2174 827446 862138 785488 750097 814597 894672 930634 918776 910680 1010237 1076098 936590 885961
$$ packed form
2256C55564j7611k1758J67073n3580r1193M4803k0266K0740Q9327J858m8387M6657
2244D73227j512p3385J7175N8334j3907K7104j44770P1495R4010j46673M7371
2233D08469j4392q747J3610J8587K2761J23788K9295l4120J0298q5072l1273n2314
2221D00890n3568K4178k9324N7722N9367N0852N9993o6155N2646k5284j02210
2210D29107J7762M3268K2307K1689k3525j9553M3794O8442k3674p4927O3227K9791
2198E97708l4407P6536N4007o6824m4855Q5007m0796m3447k911L4258n8385L7389
2186E93280L697M1773p2963M1375O7157k5474M0359R540R5696o6646m485J04137
2174H27446L4692p6650l5391O4500Q0075L5962j1858q096R9557O5861j39508n0629
$$ plain form
2162 885961 928444 1050793 1065644 1101862 1175705 1156321 1254522 1293092 1219147 1242391 1274942
2151 1274942 1303908 1343374 1377533 1423439 1462083 1475145 1417280 1444212 1509207 1626214 1717846
2140 1717846 1704385 1761960 1776538 1883939 1987586 2049443 2116479 2096095 2185082 2269411 2499580
2129 2499580 2526989 2568178 2635366 2729056 2819547 2946402 3058999 3237341 3370360 3438551 3602595
2118 3602595 3703098 3883321 4179818 4608203 4862997 5255851 5731540 6126813 6595364 7036937
2108 7036937 7503695 7841066 8333087 8986375 9922185 10952170 12085946 13744828 15868737
2099 15868737 18609893 21819627 25736512 31066472 37533272 41347057 37442384 29068610
2091 29068610 21839506 16951784 13760138 11472473 9857332 8608595 7668266 6921441
$$ packed form
2162H85961M2483J22349J4851L6218P3843j9384R8201L8570p3945K3244L2551
2151A274942K8966L9466L4159M5906L8644J3062n7865K6932O4995J17007R1632
2140A717846j3461N7575J4578J07401J03647O1857O7036k0384Q8987Q4329K30169
2129B499580K7409M1189O7188R3690R0491J26855J12597J78342J33019O8191J64044
2118C602595J00503J80223K96497M28385K54794L92854M75689L95273M68551M41573
2108G036937M66758L37371M92021O53288R35810J029985J133776J658882K123909
2099A5868737K741156L209734L916885N329960O466800L813785l904673q373774
2091B9068610p229104m887722l191646k287665j615141j248737r40329p46825
$$ plain form
2083 6921441 6421753 6099704 5867680 5708055 5344267 5041310 4491844 4087492 3806057 3604029
2073 3604029 3320936 3116415 3101943 2998545 2880295 2746655 2642327 2545883 2464868 2305065
2063 2305065 2264357 2055698 1989759 1914111 1853458 1814254 1795900 1751695 1610306 1473572 1484082
2052 1484082 1506290 1460078 1426169 1370014 1355000 1253061 1186033 1142516 1179594 1260720 1157062
2041 1157062 1102386 1016021 888553 943487 999055 922007 874334 860440 931056 1025213 919258
2030 919258 824375 818221 774359 834095 737278 782070 733790 762673 774194 704801 719656 761419
2018 761419 789560 827029 701436 678676 617456 646323 689675 644881 552585 561422 571781 572747
2006 572747 594429 542867 529296 540219 596794 579308 510349 498516 500612 527661 518366 555590
$$ packed form
2083F921441m99688l22049k32024j59625l63788l02957n49466m04352k81435k02028
2073C604029k83093k04521j4472j03398j18250j33640j04328r6444q1015j59803
2063B305065m0708k08659o5939p5648o0653l9204j8354m4205j41389j36734J0510
2052A484082K2208m6212l3909n6155j5014j01939o7028m3517L7078Q1126j03658
2041A157062n4676q6365j27468N4934N5568p7048m7673j3894P0616R4157j05955
2030I19258r4883o154m3862N9736r6817M4792m8280K8883J1521o9393J4855M1763
2018G61419K8141L7469j25593k2760o1220K8867M3352m4794r2296Q837J0359R66
2006E72747K1682n1562j3571J0923N6575j7486o8959j1833K096K7049r295L7224
$$ plain form
1994 555590 571181 679944 600388 435839 363724 364129 463949 436759 501481 409137 355883 399566
1982 399566 435568 376648 295302 329026 432261 439748 381934 342802 339132 292335 344104 317655
1970 317655 302247 322941 291860 233926 298876 253609 287831 254983 243227 383806 370789
1959 370789 258100 302848 394402 399255 407519 306699 247721 301304 260544 193492 188461 181194
1947 181194 156612 217657 194716 90032 121668 241946 253044 276177 245968 367677 306934
1936 306934 223376 251306 177199 194218 248905 231384 235716 248277 246583 270056 283887 325787
1924 325787 219948 217586 194686 322026 363526 335363 334353 328910 428270 378014 237532 198777
1912 198777 193244 209752 179642 194587 259167 205425 179983 203839 260613 240075 231770 208360
$$ packed form
1994E55590J5591J08763p9556j64549p2115M05R9820k7190O4722r2344n3254M3683
1982C99566L6002n8920q1346L3724J03235P487n7814l9132l670m6797N1769k6449
1970C17655j5408K0694l1081n7934O4950m5267L4222l2848j1756J40579j3017
1959C70789j12689M4748R1554M853Q264j00820n8978N3583m0760o7052n031p267
1947A81194k4582O1045k2941j04684L1636J20278J1098K3133l0209J21709o0743
1936C06934q3558K7930p4107J7019N4687j7521M332J2561j694K3473J3831M1900
1924C25787j05839k362k2900J27340M1500k8163j010n443R9360n0256j40482l8755
1912A98777n533J6508l0110J4945O4580n3742k5442K3856N6774k0538q305k3410
$$ plain form
1900 208360 152739 204958 202659 221588 168950 158275 177835 188400 185237 203979 163213 160865
1888 160865 229690 126568 122937 204077 168671 41766 59663 147067 227127 145590 127924
1877 127924 109320 140016 177595 201747 147820 86932 105753 182804 150973 247925 235882 237818
1865 237818 124742 118084 109981 245448 287327 167362 250446 251707 244970 208329 242211 137936
1853 137936 140038 260824 234480 215165 94213 105852 135249 57881 14520 117260 263747
1842 263747 279423 280166 142746 144872 127051 160955 83126 214403 229157 190570 274373 298969
1830 298969 298822 206487 206941 401113 389193 438014 416760 324673 288300 228202 233217 145512
1818 145512 102866 183377 213135 263314 180394 147965 225450 178835 126468 287434 158654
$$ packed form
1900B08360n5621N2219k299J8929n2638j0675J9560J0565l163J8742m0766k348
1888A60865O8825j03122l631Q1140l5406j26905J7897Q7404Q0060q1537j7666
1877A27924j8604L0696L7579K4152n3927o0888J8821P7051l1831R6952j2043J936
1865B37818j13076o658q103J35467M1879j19965Q3084J261o737l6641L3882j04275
1853A37936K102J20786k6344j9315j20952J1639K9397p7368m3361J02740J46487
1842B63747J5676P43j37420K126j7821L3904p7829J31277J4754l8587Q3803K4596
1830B98969j47r2335M54J94172j1920M8821k1254r2087l6373o0098N015q7705
1818A45512m2646Q0511K9758N0179q2920l2429P7485m6615n2367J60966j28780
$$ plain form
1807 158654 140730 75183 96949 20973 -12713 37693 112388 115530 144930 95151 66789 95567
1795 95567 121973 164303 95313 176935 261490 224471 92549 167098 101578 91610 93029 183702
1783 183702 224535 92626 148367 255962 126896 63372 128605 116828 108683 152994 173749
1772 173749 81366 61228 69676 138654 78515 30144 87835 108367 80421 43206 132136 187506
1760 187506 166943 155786 190480 196757 248722 147591 103292 102464 235074 178915 100335 30266
1748 30266 37567 94082 68628 152449 65864 112001 185225 155527 96816 59686 160516 91736
1736 91736 48125 103568 281821 145380 160175 132806 133351 133010 171362 116024 84534 178318
1724 178318 57244 40085 111041 102444 43724 64047 50800 122030 134819 138229 195697 83756
$$ packed form
1807A58654j7924o5547K1766p5976l3686N0406P4695L142K9400m9779k8362K8778
1795I5567K6406M2330o8990Q1622Q4555l7019j31922P4549o5520r968J419R0673
1783A83702M0833j31909N5741J07595j29066o3524O5233j1777q145M4311K0755
1772A73749r2383k0138Q448O8978o0139m8371N7691K0532k7946l7215Q8930N5370
1760A87506k0563j1157L4694O277N1965j01131m4299q28J32610n6159p8580p0069
1748C0266P301N6515k5454Q3821q6585M6137P3224k9698n8711l7130J00830o8780
1736I1736m3611N5443J78253j36441J4795k7369N45l41L8352n5338l1490R3784
1724A78318j21074j7159P0956q597n8720K0323j3247P1230J2789L410N7468j11941
$$ plain form
1712 83756 42904 65910 64062 26221 50724 76851 176189 160928 71189 73860 115166 69074
1700 69074 82556 116380 131726 113873 86206 95772 126955 147578 142655 217746 117310 75175
1688 75175 101074 34413 -40807 73109 135647 128750 95575 59810 83939 129175 113466 103729
1676 103729 91215 28507 38288 2800 10412 83809 77068 47947 98671 232787 212720 111499
1664 111499 121372 202355 129415 55237 94249 59243 10051 -50142 7236 32180 67975 219738
1652 219738 271330 201730 128578 200793 118483 209184 89721 39029 111109 112622 18504 14200
1640 14200 173631 167318 84566 93543 -21784 -12524 2645 33768 165334 190875 130532 -70185
1628 -70185 36720 -7144 -31792 36688 121921 117831 -54315 -22169 76154 114138 54994 202029
$$ packed form
1712H3756m0852K3006j848l7841K4503K6127R9338j5261q9739K671M1306m6092
1700F9074J3482L3824J5346j7853k7667R566L1183K0623m923P5091j00436m2135
1688G5175K5899o6661p5220J13916O2538o897l3175l5765K4129M5236j5709r737
1676A03729j2514o2708R781l5488P612P3397o741k9121N0724J34116k0067j01221
1664A11499R873Q0983p2940p4178L9012l5006m9192o0193N7378K4944L5795J51763
1652B19738N1592o9600p3152P2215q2310R0701j19463n0692P2080J513r4118m304
1640A4200J59431o313q2752Q977j15327R260J5169L1123J31566K5541o0343k00717
1628g0185J06905m3864k4648O8480Q5233m090j72146L2146R8323L7984n9144J47035
$$ plain form
1616 202029 153334 79081 78292 45211 238703 223623 115117 132450 115583 103734 52666 31878
1604 31878 67652 134958 13713 2171 -8451 -81555 -101008 -18141 81157 89884 84202 47713
1592 47713 101783 77361 111248 209510 142449 34258 18548 116012 163642 23278 53668
1581 53668 85825 90533 -37825 -24492 63833 89407 152292 44226 70108 106342 43233 84615
1569 84615 59237 129778 141703 84926 156865 87698 -25301 16208 91044 31204 30759 25450
1557 25450 24241 31950 -22358 -6376 90866 3036 -69967 61367 97527 6243 29641 -78466
1545 -78466 -57934 9629 -77756 6909 27736 90359 7817 52029 56177 16445 73518 33909
1533 33909 57931 65768 -29097 92912 98545 16338 25449 -688 7540 -109258 -48646 51343
$$ packed form
1616B02029m8695p4253p89l3081J93492j5080j08506J7333j6867j1849n1068k0788
1604C1878L5774O7306j21245j1542j0622p3104j9453Q2867R9298Q727n682l6489
1592D7713N4070k4422L3887R8262o7061j08191j5710R7464M7630j40364L0390
1581E3668L2157M708j28358J3333Q8325K5574O2885j08066K5882L6234o3109M1382
1569H4615k5378P0541J1925n6777P1939o9167j12999M1509P4836n9840m45n309
1557B5450j209P709n4308J5982R7242q7830p3003J31334L6160r1284K3398j08107
1545g8466K0532O7563q7385Q4665K0827O2623q2542M4212M148l9732N7073l9609
1533C3909K4022P837r4865J22009N633q2207R111k6137Q228j16798O0612R9989
$$ plain form
1521 51343 38295 -17223 -30739 11397 18157 -34563 -47183 83182 85639 43493 65422 59324
1509 59324 83515 10237 -41425 79127 -253 65833 95735 109119 18126 -87803 24073
1498 24073 85952 198867 117302 62676 49449 -40885 26523 31054 -40029 14799 67486 37462
1486 37462 127245 35078 -65987 -7237 38899 69288 15802 42696 -24079 -47290 -21497 -5025
1474 -5025 -24429 -16312 65098 12485 -27128 -35664 69320 34345 -13655 -138519 -62285 92387
1462 92387 40885 62768 100593 126413 143897 89213 49074 104296 82745 36453 12205 66709
1450 66709 65848 32861 43870 -28841 20743 15185 28470 92005 156297 140056 119257 122469 75901
1437 75901 93369 -3503 -61993 28450 -41544 -27170 12831 -129589 -17755 6130 -3695 16135
$$ packed form
1521E1343j3048n5518j3516M2136O760n2720j2620J30365K457m2146K1929o098
1509E9324K4191p3278n1662J20552p9380O6086K9902J3384r0993j05929J11876
1498B4073O1879J12915q1565n4626j3227r0334O7408M531p1083N4828N2687l0024
1486C7462Q9783r2167j01065N8750M6136L0389n3486K6894o6775k3211K5793J6472
1474e025j9404Q117Q1410n2613l9613q536J04984l4975m8000j24864P6234J54672
1462I2387n1502K1883L7825K5820J7484n4684m0139N5222k1551m6292k4248N4504
1450F6709q61l2987J1009p2711M9584n558J3285O3535O4292j6241k0799L212m6568
1437G5901J7468r6872n8490R0443o9994J4374M0001j42420J11834K3885r825J9830
$$ plain form
1425 16135 -32523 -106348 -56319 -51114 56140 29636 26736 -44321 -2428 -24338 -41342 -6424
1413 -6424 64300 146943 52653 6909 -79517 -44292 72428 80614 53872 77721 59919 10235
1401 10235 17574 -4261 38395 29551 -42252 -134424 -128500 -45509 179581 104269 73547 60723
1389 60723 -36185 -12972 -20771 48237 60667 -26130 -101527 -1570 35097 25456 -13010 -97829
1377 -97829 -40799 108040 186255 183427 123453 33761 24083 92801 34508 -17041 9044 59022
1365 59022 94648 112932 27186 -1415 -20429 61576 48307 84954 88876 152103 176450 157932
1353 157932 104620 -12450 -56450 94654 177809 79041 -36635 194 45602 -43273 53147
1342 53147 110154 19204 -36327 17594 107037 88170 23306 21491 74876 157795 27684 -35487
$$ packed form
1425A6135m8658p3825N0029N205J07254k6504k900p1057M1893k1910j7004L4918
1413f424P0724Q2643r4290m5744q6426L5225J16720Q186k6742K3849j7802m9684
1401A0235P339k1835M2656q844p1803r2172N924Q2991K25090p5312l0722j2824
1389F0723r6908K3213p799O9008J2430q6797p5397R9957L6667r641l8466q4819
1377i7829N7030J48839P8215k828n9974q9692r678O8718n8293n1549K6085M9978
1365E9022L5626J8284q5746k8601j9014Q2005j3269L6647L922O3227K4347j8518
1353A57932n3312j17070m4000J51104Q3155r8768j15676L6829M5408q8875R6420
1342E3147N7007r0950n5531N3921Q9443j8867o4864j815N3385Q2919j30111o3171
$$ plain form
1330 -35487 -10699 1618 -49409 -2389 68917 60141 -21905 -87881 2743 -46371 3858 129520
1318 129520 230343 162027 92619 78008 98323 -6069 -33504 71793 -12412 -53060 -75802
1307 -75802 -9925 51894 64103 85596 145625 136082 41142 7576 102813 69324 22255 121482
1295 121482 37536 94058 131501 38770 79174 62521 51372 91483 46480 57332 61550 135419
1283 135419 123094 -5692 50042 104464 73349 62857 -4581 41538 109092 -4835 44081
1272 44081 60630 23786 39875 -34136 109490 105100 52803 41060 38499 -22431 -71896 88764
1260 88764 99892 31749 46976 81733 35693 21562 89288 60943 49896 103437 -139 -21122
1248 -21122 107657 97053 14501 -44421 -113379 -24907 119697 57080 -65547 31227 79490
$$ packed form
1330c5487K4788J2317n1027M7020P1306q776q2046o5976R0624m9114N0229J25662
1318A29520J00823o8316o9408j4611K0315j04392k7435J05297q4205m0648k2742
1307g5802O5877O1819J2209K1493O0029r543r4940l3566R5237l3489m7069R9227
1295A21482q3946N6522L7443r2731M0404j6653j1149M0111m5003J0852M218P3869
1283A35419j2325j28786N5734N4422l1115j0492o7438M6119O7554j13927M8916
1272D4081J6549l6844J6089p4011J43626m390n2297j1743k561o0930m9465J60660
1260H8764J1128o8143J5227L4757m6040j4131O7726k8345j1047N3541j03576k0983
1248b1122J28779j0604q2552n8922o8958Q8472J44604o2617j22627R6774M8263
$$ plain form
1237 79490 8570 -5405 37235 67759 76264 109139 87630 78828 115835 128651 36131 -47209
1225 -47209 26828 82739 39679 -27521 82415 90963 95226 68554 26644 35317 14674 6001
1213 6001 401 -10568 -22131 -58583 -87918 -15970 -8215 79666 152059 59632 40821 88597
1201 88597 778 -51136 42936 -22744 -56961 -93651 -119300 -41767 20239 22190 -51776 -13328
1189 -13328 119269 98154 83596 97547 61594 18307 48306 104753 151999 98150 54898 -15174
1177 -15174 93647 109157 -787 39335 30475 29399 -4292 40899 23668 -36326 -31783 -13662
1165 -13662 27062 -24909 -33305 46507 28413 28456 -60507 -56058 26221 5338 -42355 -67697 28453
1152 28453 -16823 -40325 23094 6196 3247 26986 56115 78000 29205 95163 138317 73723
$$ packed form
1237G9490p0920j3975M2640L0524Q505L2875k1509q802L7007J2816r2520q3340
1225d7209P4037N5911m3060o7200J09936Q548M263k6672m1910Q673k0643q673
1213F001n600j0969j1563l6452k9335P1948P755Q7881P2393r2427j8811M7776
1201H8597q7819n1914R4072o5680l4217l6690k5649P7533O2006J951p3966L8448
1189a3328J32597k1115j4558J3951l5953m3287K9999N6447M7246n3849m3252p0072
1177a5174J08821J5510j09944M0122q860j076l3691M5191j7231n9994M543J8121
1165a3662M0724n1971q396P9812j8094M3q8963M449Q2279k0883m7693k5342R6150
1152B8453m5276k3502O3419j6898k949K3739K9129K1885m8795O5958M3154o4594
$$ plain form
1140 73723 -4855 -45692 34732 29128 -7728 8743 -12018 -7790 -9706 -101073 26350 5116
1128 5116 -32384 -50305 -54571 31006 129365 101899 124871 150258 84703 -30372 -53014 -73831
1116 -73831 -58233 -24261 28357 20325 -61910 -66722 -137339 -85034 -35454 34117 4245 84830
1104 84830 176904 59392 22180 102907 144903 40529 24875 27489 55676 72952 -24750 -18755
1092 -18755 30221 65285 52088 10759 -21118 -34926 -113846 -58949 -85457 -47315 -60841 -13734
1080 -13734 -11389 -83601 -92652 -155413 -69460 774 29552 -20443 11903 -2590 -16711 -4269
1068 -4269 6985 -45407 -4601 -20648 14327 57061 15428 -32272 23342 103639 151107 182258
1056 182258 206266 135369 55141 18740 -17749 -38417 89156 147539 74581 32610 109139
$$ packed form
1140G3723p8578m0837Q0424n604l6856J6471k0761M228j916r1367J27423k1234
1128E116l7500j7921m266Q5577R8359k7466K2972K5387o5555j15075k2642k0817
1116g3831J5598L3972N2618q032q2235m812p0617N2305M9580O9571k9872Q0585
1104H4830R2074j17512l7212Q0727M1996j04374j5654K614K8187J7276r7702N995
1092a8755M8976L5064j3197m1329l1877j3808p8920N4897k6508L8142j3526M7107
1080a3734K345p2212r051o2761Q5953P0234K8778m9995L2346j4493j4121J2442
1068d269J1254n2392M0806j6047L4975M2734m1633m7700N5614Q0297M7468L1151
1056A82258K4008p0897q0228l6401l6489k0668J27573N8383p2958m1971P6529
$$ plain form
1045 109139 135006 63836 -35673 -43289 65118 27831 16400 -4799 -28957 -38157 14065 -16911
1033 -16911 8174 74780 15417 6308 40924 29090 68382 82453 -1225 -77716 -48651 29057
1021 29057 6771 -25974 51137 103210 120512 77581 32682 18006 68231 106515 106367 -20399
1009 -20399 -31016 7532 -73635 9659 85078 -27751 -61768 -57937 20014 -20162 -88931 -114238
997 -114238 -89304 -66124 13536 41703 17095 -3404 -84452 -122775 -40082 -68757 -68380 -48938
985 -48938 -70903 -104081 -141068 -80002 15567 13895 -19526 -83129 2704 -1660 -26590 62466
973 62466 -66985 -55791 51928 57794 -14238 18488 -55134 -63360 -119166 -117161 -90774 -28983
961 -28983 -51410 -46112 -34713 -95197 -66658 32245 61689 -72943 58286 35491 -13947 -44168
$$ packed form
1045A09139K5867p1170r9509p616J08407l7287j1431k1199k4158r200N2222l0976
1033a6911K5085O6606n9363r109L4616j1834L9292J4071q3678p6491K9065P7708
1021B9057k2286l2745P7111N2073J7302m2931m4899j4676N0225L8284j48j26766
1009b0399j0617L8548q1167Q3294P5419j12829l4017L831P7951m0176o8769k5307
997a14238K4934K3180P9660K8167k4608k0499q1048l8323Q2693k8675L77J9442
985d8938k1965l3178l6987O1066R5569j672l3421o3603Q5833m364k4930Q9056
973F2466j29451J1194J07719N866p2032L2726p3622q226n5806K005K6387O1791
961b8983k2427N298J1399o0484K8539R8903K9444j34632J31229k2795m9438l0221
$$ plain form
949 -44168 -48862 -41959 33237 -23856 -22644 6057 -62511 -38930 -3536 78441 6108 8624 101251
936 101251 89952 -1297 -24920 -72675 -26132 -6773 -30832 -50488 -27896 -77673 -128132 -121784
924 -121784 -11617 -43836 -24380 106500 64813 45845 111961 76940 -32872 -49528 -93939
913 -93939 -160408 -135804 -144302 9076 -5979 -20475 15756 -21550 22661 108121 -54991 -68724
901 -68724 -3703 -4174 -51721 -175360 -190752 -95602 -58531 -24306 36492 67163 76183 93599
889 93599 121937 39583 -21364 -79513 12692 -29269 -10253 69934 38042 2244 -37703 -50056
877 -50056 -31150 19188 -1343 -90062 -96633 -102990 -113899 -67471 -47969 -92688 -38318 35911
865 35911 -39922 -126387 -96059 -49791 -103412 -104139 -55938 -26537 -63474 -108270 -74047 -91963
$$ packed form
949d4168m694O903P5196n7093J212K8701o8568K3581L5394Q1977p2333K516R2627
936A01251j1299r1249k3623m7755M6543J9359k4059j9656K2592m9777n0459O348
924a21784J10167l2219J9456J30880m1687j8968O6116l5021j09812j6656m4411
913i3939o6469K4604q498J53378j5055j4496L6231l7306M4211Q5460j63112j3733
901f8724O5021m71m7547j23639j5392R5150L7071L4225O0798L0671R020J7416
889I3599K8338q2354o0947n8149R2205m1961J9016Q0187l1892l5798l9947j2353
877e0056J8906N0338k0531q8719o571o357j0909M6428J9502m4719N4370P4229
865C5911p5833q6465L0328M6268n3621p27M8201K9401l6937m4796L4223j7916
$$ plain form
853 -91963 -73153 -50844 -61875 46591 45921 -36153 -16031 -58200 -52508 -94890 -53933 2059
841 2059 -56866 -134988 -77539 18756 91370 -5098 -12241 -46145 -72310 -11114 11476 -70302
829 -70302 -83797 -39684 52330 -8818 63941 -27765 -49937 103957 109438 28193 -25051 -61287
817 -61287 -38853 -1914 1992 40103 42588 3299 -72392 -18378 18817 -51011 -74879 -43033
805 -43033 -40058 -109781 -81185 -68246 -87542 5813 -71774 -165309 -94020 -67028 -93948 -70295
793 -70295 -114709 -10777 -108911 -100652 -15759 -13129 -19601 -111947 -171905 -49663 -135520 -91419
781 -91419 -28872 -11563 -30355 -120679 -142954 -69203 -46424 -33494 -53705 -4359 -26378 3054
769 3054 59750 17368 -106338 -252036 -146218 17809 -12960 -63661 -45138 -173958 -91734
$$ packed form
853i1963J8810K2309j1031J08466o70q2074K0122m2169N692m2382M0957N5992
841B059n8925p8122N7449R6295P2614r6468p143l3904k6165O1196K2590q1778
829g0302j3495M4113R2014o1148P2759r1706k2172J53894N481q1245n3244l6236
817f1287K2434L6939L906L8111K485l9289p5691N4014L7195o9828k3868L1846
805d3033K975o9723K8596J2939j9296R3355p7587r3535P1289K6992k6920K3653
793g0295m4414J03932r8134Q259Q4893K630o472r2346n9958J22242q5857M4101
781i1419O2547J7309j8792r0324k2275P3751K2779J2930k0211M9346k2019K9432
769C054N6696m2382j23706j45698J05818J64027l0769n0701J8523j28820Q2224
$$ plain form
758 -91734 25992 1683 18421 -6903 -6305 13126 2127 -62112 51283 49418 -29153 -23895
746 -23895 11914 51188 -9290 -23579 -135508 -69064 39022 103397 188769 122783 -18561
735 -18561 -110518 -92031 -100959 -121382 -72146 12220 27961 -28204 -123883 -95111 -98671 -78262
723 -78262 -36172 -23749 14824 12791 8355 38135 79529 -47915 -41276 -71328 -60031 10354
711 10354 -57586 -114114 2768 30094 42633 144297 77196 92311 104751 31033 28608 6929
699 6929 -21789 -26864 -49385 -6522 21696 -41586 75789 44520 35124 23622 -40634 -107499
687 -107499 -82724 24121 23073 -42015 -61953 -74548 -60645 -5448 30458 8472 -41478 -122853
675 -122853 -49968 -77651 -130559 -141993 -47313 40220 -32515 -135222 -113412 -26682 2498 -670
$$ packed form
758i1734J17726k4309J6738k5324N98J9431j0999o4239J13395j865p8571N258
746b3895L5809L9274o0478j4289j11929O6444J08086O4375Q5372o5986j41344
735a8561r1957J8487q928k0423M9236Q4366J5741n6165r5679K8772l560K0409
723g8262M2090J2423L8573k033m436K9780M1394j27444O639l0052J1297P0385
711A0354o7940n6528J16882K7326J2539J01664o7101J5115J2440p3718k425k1679
699F929k8718n075k2521M2863K8218o3282J17375l1269r396j1502o4256o6865
687a07499K4775J06845j048o5088j9938j2595J3903N5197L5906k1986m9950q1375
675a22853P2885k7683n2908j1434R4680Q7533p2735j02707K1810Q6730K9180l168
$$ plain form
663 -670 -88135 -72280 -23031 -49819 -85425 -79860 -64587 -98579 -113777 -52382 545 11412 62640
650 62640 98206 -56220 -1994 -46275 -8160 5150 67331 143297 66936 -114759 -66462 -27905
638 -27905 -50294 3052 -8723 -1741 1815 3800 -66980 -27840 -58509 -37681 -31630 -38202 -119798
625 -119798 -146629 -79689 -93656 -21082 -40848 -77727 -90940 -187332 -121559 -108292 -73975 -37528
613 -37528 -65612 -69823 -34916 -81833 -76564 -54935 -28959 -6509 15237 -18377 25014 4614
601 4614 -104438 -126867 -35782 -116262 -77493 -86694 -201670 -76978 -105025 84756 113350 -5269
589 -5269 -9394 92575 4823 70878 -2963 -22712 4662 44279 -39192 -70130 -17232 -44495
577 -44495 -68026 -97389 -11747 61580 -12543 -20888 9669 -128786 -151657 -62195 8868 129458
$$ packed form
663f70q7465J5855M9249k6788l5606N565J5273l3992j5198O1395N2927J0867N1228
650F2640L5566j54426N4226m4281L8115J3310O2181P5966p6361j81695M8297L8557
638b7905k2389N3346j1775O982L556J985p0780L9140l0669K0828O051o572q1596
625a19798k6831O6940j3967P2574j9766l6879j3213r6392O5773J3267L4317L6447
613c7528k8084m211L4907m6917N269K1629K5976K2450K1746l3614M3391k0400
601D614j09052k2429R1085q0480L8769r201j14976J24692k8047J89781K8594j18619
589e269m125J01969q7752O6055p3841j9749K7374L9617q3471l0938N2898k7263
577d4495k3531k9363Q5642P3327p4123q345L0557j38455k2871Q9462P1063J20590
$$ plain form
565 129458 188552 112353 71393 20262 13868 -41545 -18967 -50704 -32058 -30755 40644 -33439
553 -33439 -27054 -34858 -67885 39781 27268 -60506 -10611 110973 71127 11204 9323 -56956
541 -56956 -126602 1338 -109373 -72133 68329 -19750 -138022 -211874 -77234 -37276 -68309
530 -68309 -117131 -138485 -98964 -114716 -70966 97469 63479 -5937 -49012 -42585 -30131 -111213
518 -111213 -81220 -79311 -77957 -129211 -166355 -149319 -82600 10299 64445 38935 -2598 -83583
506 -83583 -144470 -153982 -148854 -69421 -73444 -125595 -108674 -106258 -74238 12129 -49540 -139132 -137224
493 -137224 -90576 -98327 12392 -12931 -197728 -127174 -46718 -67096 -89679 -72128 -68694 -68096
481 -68096 -112931 -83154 24163 -18461 -146706 -178738 -201097 -214729 -116339 -37566 9915 -35798
$$ packed form
565A29458N9094p6199m0960n1131o394n5413K2578l1737J8646J303P1399p4083
553c3439O385p804l3027J07666j2513q7774M9895J21584l9846n9923j881o6279
541e6956o9646J27940j10711L7240J40462q8079j18272p3852J34640L9958l1033
530f8309m8822k1354L9521j5752M3750J68435l3990o9416m3075O427J2454q1082
518a11213K9993J909J354n1254l7144J7036O6719R2899N4146k5510m1533q0985
506h3583o0887r512N128P9433m023n2151J6921K416L2020Q6367o1669q9592J908
493a37224M6648p751J10719k5323j84797P0554Q0456k0378k2583J7551L434N98
481f8096m4835K9777J07317m2624j28245l2032k2359j3632R8390P8773M7481m5713
$$ plain form
469 -35798 -107419 -75665 -37024 -107507 -41015 -66571 -27902 -54181 -61800 18447 11245 -4492
457 -4492 -17403 29669 47361 13755 -78363 -42763 -38731 8842 -123891 -5596 72887 -12585
445 -12585 18247 -22142 -119012 -99278 -14880 77420 45951 -41128 -16151 -64347 -58451 -136337
433 -136337 -59036 -39971 -43986 35024 -42523 -76877 -77873 -135737 -58509 6845 8483 7228 -16335
420 -16335 725 -95534 -113505 -75452 -79015 -61273 -30319 -42222 -80213 -29586 -24125 -14152 12708
407 12708 16342 12977 -86589 -55352 -109529 -83520 -88970 -152925 -86907 -68952 -19755 -29049 -19937
394 -19937 -49645 -136149 -119643 -93377 -66971 -127053 -210805 -79321 -19815 6470 -5748 -58944
382 -58944 -101450 34645 -1223 -23717 56309 -27345 -52053 18498 5612 14135 37280 18349
$$ packed form
469c5798p1621L1754L8641p0483O6492k5556L8669k6279p619Q0247p202j5737
457d492j2911M7072J7692l3606r2118L5600M032M7573j32733J18295P8483q5472
445a2585L0832m0389r6870J9734Q4398R2300l1469q7079K4977m8196N896p7886
433a36337P7301J9065m015P9010p7547l4354r96n7864P7228O5354J638j255k3563
420a6335J7060r6259j7971L8053l563J7742L0954j1903l7991N0627N461R973K6860
407A2708L634l365r9566L1237n4177K6009n450o3955O6018J7955M9197r294R112
394a9937k9708q6504J6506K6266K6406o0082q3752J31484N9506K6285j2218n3196
382e8944m2506J36095l5868k2494Q0026q3654k4708P0551j2886Q523K3145j8931
$$ plain form
370 18349 16708 -106799 -36263 8869 -48166 -145652 -160852 8028 -17957 -121364 -72676 -36287
358 -36287 37025 71322 27149 -32102 4179 1458 -82628 -145758 -168960 -150046 -81550 65550
$$ packed form
370A8349j641j23507P0536M5132n7035r7486j5200J68880k5985j03407M8688L6389
358c6287P3312L4297m4173n9251L6281k721q4086o3130k3202J8914O8496J47100
$$ [...]
##END NTUPLES=NMR SPECTRUM
##END=
