##TITLE=1H_CA-9015-1
 CDCl3
 8 sc, 
 7.06.2022
##JCAMPDX= 6.0         $$ Bruker NMR JCAMP-DX V2.0
##DATA TYPE= NMR SPECTRUM
##DATA CLASS= NTUPLES
##ORIGIN= UXNMR, Bruker Analytische Messtechnik GmbH
##OWNER= root
$$ XWIN-NMR		Version 3.5
$$ Tue Jun  7 13:54:02 2022 Russian Standard Time (UT+4h)  she@DPX200
##.OBSERVE FREQUENCY= 200.13135
##.OBSERVE NUCLEUS= ^1H
##.ACQUISITION MODE= SIMULTANEOUS
##.ACQUISITION SCHEME= undefined
##.AVERAGES= 8
##.DIGITISER RES= 18
##SPECTROMETER/DATA SYSTEM= spect
##.PULSE SEQUENCE= zg30
##.SOLVENT NAME= CDCl3
##.SHIFT REFERENCE= (INTERNAL, CDCl3, 0, 15.8064)
##AUDIT TRAIL= $$ (NUMBER, WHEN, WHO, WHERE, WHAT)
$$ ##TITLE= Audit trail, XWIN-NMR		Version 3.5
$$ ##JCAMPDX= 5.01
$$ ##ORIGIN= Bruker BioSpin GmbH
$$ ##OWNER= she
$$ F:/spectra/data/she/nmr/H-F/1/pdata/1/auditp.txt
$$ ##AUDIT TRAIL=  $$ (NUMBER, WHEN, WHO, WHERE, WHAT)
(   1,<2022-06-07 13:52:04.18 +0400>,<she>,<DPX200>,
      <created by zg, POWCHK disabled, PULCHK disabled
       configuration hash MD5:
       00 E9 B6 7A A2 85 ED C7 34 08 36 98 17 FE 4E 26
       data hash MD5: 16K
       26 6A 8A C9 38 3F EC 2D F1 6E C1 E2 CB 3D 32 E1>)
(   2,<2022-06-07 13:52:45.81 +0400>,<she>,<DPX200>,
      <Start of raw data processing
       efp BC_mod = 2 LB = 0.24 FT_mod = 6 PKNL = 1 PHC0 = -18032.67 PHC1 = 8.200737 SI = 16K 
       data hash MD5: 16K
       2D FE 84 F5 00 0A D1 D2 F8 3E 7F AB 88 DB 31 7E>)
(   3,<2022-06-07 13:53:07.65 +0400>,<she>,<DPX200>,
      <pk PHC0 = 0.8638104 PHC1 = 5.400001 
       data hash MD5: 16K
       53 A8 19 B1 27 2B C6 FF 3F D4 64 B8 40 BA 5F 30>)
(   4,<2022-06-07 13:53:10.82 +0400>,<she>,<DPX200>,
      <abs ABSG = 5 
       data hash MD5: 16K
       F2 50 24 47 E0 07 53 9D D3 11 1B B4 E1 0B 3D A1>)
$$ ##END=
$$ 
$$ hash MD5
$$ 39 BD 83 8C 08 C9 01 84 DD CF F2 3C 97 8C E5 4E
##$RELAX= 
##$RELAX= 
##$RELAX= 
##$RELAX= 
##$RELAX= 
##$RELAX= 
$$ Bruker specific parameters
$$ --------------------------
##$DU= <F:/spectra>
##$EXPNO= 1
##$NAME= <H-F>
##$PROCNO= 1
##$TYPE= <nmr>
##$USER= <she>
##$AMP= (0..31)
100 100 100 100 100 100 100 100 100 100 100 100 100 100 100 100 100 100 
100 100 100 100 100 100 100 100 100 100 100 100 100 100 
##$AQSEQ= 0
##$AQ_mod= 1
##$AUNM= <au_zg>
##$AUTOPOS= <>
##$BF1= 200.13
##$BF2= 200.13
##$BF3= 200.13
##$BF4= 200.13
##$BF5= 200.13
##$BF6= 200.13
##$BF7= 200.13
##$BF8= 200.13
##$BYTORDA= 1
##$CFDGTYP= 0
##$CFRGTYP= 5
##$CHEMSTR= <none>
##$CNST= (0..31)
1 1 145 1 1 1 1 1 1 1 1 1 1 1 1 1 1 1 1 1 1 1 1 1 1 1 1 1 1 1 1 1 
##$CPDPRG= <>
##$CPDPRG1= <>
##$CPDPRG2= <>
##$CPDPRG3= <>
##$CPDPRG4= <mlev>
##$CPDPRG5= <mlev>
##$CPDPRG6= <mlev>
##$CPDPRG7= <mlev>
##$CPDPRG8= <mlev>
##$CPDPRGB= <>
##$CPDPRGT= <>
##$D= (0..31)
0 1.2 0 0 0 0 0 0 0 0.06 0 0.03 0 0 0 0 0.0002 0 0 0 0 0 0 0 0 0 0 0 0 
0 0 0 
##$DATE= 1654595523
##$DBL= (0..7)
120 120 120 120 120 120 120 120 
##$DBP= (0..7)
150 150 150 150 150 150 150 150 
##$DBP07= 0
##$DBPNAM0= <>
##$DBPNAM1= <>
##$DBPNAM2= <>
##$DBPNAM3= <>
##$DBPNAM4= <>
$$ [...]
##$SUBNAM2= <"">
##$SUBNAM3= <"">
##$SUBNAM4= <"">
##$SUBNAM5= <"">
##$SUBNAM6= <"">
##$SUBNAM7= <"">
##$SUBNAM8= <"">
##$SUBNAM9= <"">
##$SW= 18.05172834244
##$SWIBOX= (0..15)
0 0 2 0 0 0 0 0 0 0 0 0 0 0 0 0 
##$SW_h= 3612.71676300578
##$TD= 16384
##$TD0= 1
##$TE= 0
##$TE2= 300
##$TE3= 300
##$TEG= 300
##$TL= (0..7)
0 120 120 120 120 120 120 120 
##$TP= (0..7)
150 150 150 150 150 150 150 150 
##$TP07= 0
##$TPNAME0= <>
##$TPNAME1= <>
##$TPNAME2= <>
##$TPNAME3= <>
##$TPNAME4= <>
##$TPNAME5= <>
##$TPNAME6= <>
##$TPNAME7= <>
##$TPOAL= (0..7)
0.5 0.5 0.5 0.5 0.5 0.5 0.5 0.5 
##$TPOFFS= (0..7)
0 0 0 0 0 0 0 0 
##$TUNHIN= 0
##$TUNHOUT= 0
##$TUNXOUT= 0
##$USERA1= <user>
##$USERA2= <user>
##$USERA3= <user>
##$USERA4= <user>
##$USERA5= <user>
##$V9= 5
##$VALIST= <valist>
##$VCLIST= <CCCCCCCCCCCCCCC>
##$VD= 0
##$VDLIST= <DDDDDDDDDDDDDDD>
##$VPLIST= <PPPPPPPPPPPPPPP>
##$VTLIST= <TTTTTTTTTTTTTTT>
##$WBST= 1024
##$WBSW= 4
##$XGAIN= (0..3)
0 0 0 0 
##$XL= 0
##$YL= 0
##$YMAX_a= 720456
##$YMIN_a= -938780
##$ZGOPTNS= <>
##$ZL1= 120
##$ZL2= 120
##$ZL3= 120
##$ZL4= 120
##$ABSF1= 15.74469
##$ABSF2= -2.307159
##$ABSG= 5
##$ABSL= 3
##$ALPHA= 0
##$AQORDER= 0
##$ASSFAC= 0
##$ASSFACI= 0
##$ASSFACX= 0
##$ASSWID= 0
##$AUNMP= <proc_1d>
##$AZFE= 0.1
##$AZFW= 0.1
##$BCFW= 0
##$BC_mod= 2
##$BYTORDP= 0
##$COROFFS= 0
##$CY= -3
##$DATMOD= 1
##$DC= 0
##$DFILT= <>
##$DTYPP= 0
##$F1P= 0
##$F2P= 0
##$FCOR= 1
##$FTSIZE= 16384
##$FT_mod= 6
##$GAMMA= 0
##$GB= 0
##$INTBC= 1
##$INTSCL= 0
##$ISEN= 128
##$LB= 0.24
##$LEV0= 0
##$LPBIN= 0
##$MAXI= 10000
##$MC2= 0
##$MEAN= 0
##$ME_mod= 0
##$MI= 1.114404
##$NCOEF= 0
##$NC_proc= -5
##$NLEV= 6
##$NOISF1= 3.799351
##$NOISF2= 2.8
##$NSP= 0
##$NTH_PI= 0
##$NZP= 0
##$OFFSET= 15.80639
##$PC= 1
##$PHC0= -18031.81
##$PHC1= 13.60074
##$PH_mod= 1
##$PKNL= yes
##$PPARMOD= 0
##$PSCAL= 0
##$PSIGN= 0
##$REVERSE= no
##$SF= 200.129993026549
##$SI= 16384
##$SIGF1= 3
##$SIGF2= 2
##$SINO= 5.538805
##$SIOLD= 16384
##$SREGLST= <1H.CDCl3>
##$SSB= 0
##$STSI= 16384
##$STSR= 0
##$SW_p= 3612.71676300578
##$SYMM= 0
##$S_DEV= 0
##$TDeff= 16384
##$TDoff= 0
##$TI= <>
##$TILT= no
##$TM1= 0
##$TM2= 0
##$TOPLEV= 0
##$USERP1= <user>
##$USERP2= <user>
##$USERP3= <user>
##$USERP4= <user>
##$USERP5= <user>
##$WDW= 1
##$XDIM= 16384
##$YMAX_p= 269259316
##$YMIN_p= -153338
$$ End of Bruker specific parameters
$$ ---------------------------------
##NTUPLES= NMR SPECTRUM
##VAR_NAME=  FREQUENCY,     SPECTRUM/REAL,   SPECTRUM/IMAG
##SYMBOL=    X,             R,               I
##VAR_TYPE=  INDEPENDENT,   DEPENDENT,       DEPENDENT
##VAR_FORM=  AFFN,          ASDF,            ASDF
##VAR_DIM=   16384,         16384,           16384
##UNITS=     HZ,            ARBITRARY UNITS, ARBITRARY UNITS
##FACTOR=    0.220516191357247, 1,           1
##FIRST=     3163.332682181, 0,              0
##LAST=      -449.384080824783, 0,           0
##MIN=       -449.384080824783, -153338,     0
##MAX=       3163.332682181, 269259316,      0
$$ Real data points
##PAGE= N=1
##DATA TABLE= (X++(R..R)), XYDATA
$$ [...]
9289 4345788 4338310 4336744 4402100 4413516 4500375 4534096 4566789 4623368 4695173 4791797 4841248 4854170
9277 4854170 4871491 4955937 5065736 5157767 5278220 5352262 5407927 5481248 5603884 5692356 5785471
9266 5785471 5884029 6032095 6175229 6261697 6405973 6536035 6733251 6943298 7112332 7360891
9256 7360891 7596868 7913653 8250282 8594725 8949465 9296990 9704720 10170473 10720340 11161637
9246 11161637 11402712 11537394 11627103 11818411 12112140 12284291 12223818 11886202 11440607 10978848
9236 10978848 10573644 10252708 10142440 10080183 10026534 9939092 9858603 9796850 9741312 9738363 9795305
9225 9795305 9809218 9919010 10095870 10246373 10460053 10712728 10996202 11313894 11725812 12158320
9215 12158320 12568890 12987419 13410199 13850612 14214253 14456456 14830581 15303309 15813775
9206 15813775 16041382 16056023 15991861 15890888 15756390 15393504 14888189 14299696 13826228 13558569
9196 13558569 13377107 13274116 13219945 13268940 13331875 13423974 13484996 13564051 13704192 13841410
9186 13841410 14011134 14150251 14376696 14591955 14818690 15103732 15477123 15860597 16263175
9177 16263175 16689684 17114348 17622584 18218061 18778509 19358940 19937498 20683930 21449648
9168 21449648 22316017 23250410 24268155 25433741 26732682 28142134 29673929 31304561
9160 31304561 32960007 34662708 36440512 38300615 40118290 41835954 43317407 44495674
9152 44495674 45388204 46095604 46552405 46782586 46549574 45803188 44545854 43062849 41402175
9143 41402175 39737996 38191545 36974842 35966429 35070543 34296209 33661204 33155680 32801583
9134 32801583 32609361 32569850 32774869 33185595 33752011 34445760 35429555 36560351 37887484
9125 37887484 39342088 40869625 42596276 44259147 45891408 47461005 48948500 50323582
9117 50323582 51594231 52679123 53448646 53844526 53705775 53030360 51836161 50210537 48098286
9108 48098286 45545415 42727422 39923563 37226154 34850051 32710288 30847088 29283903
9100 29283903 28005059 26913933 25884655 24941884 24093414 23304084 22602232 21966760 21399790
9091 21399790 20849942 20399486 20038885 19731867 19452543 19147449 18860529 18571148 18272426
9082 18272426 18025215 17821919 17557723 17337276 17063471 16779873 16508727 16280527 16066064
9073 16066064 15864703 15620143 15421624 15250998 15148022 15034963 14916682 14813108 14671622
9064 14671622 14608461 14593707 14573993 14542416 14537662 14620411 14626103 14599178 14626300 14655699 14728636 14776165
9052 14776165 14864554 14919728 15025126 15147353 15157490 15231928 15308920 15430955 15501736 15575473 15705590
9041 15705590 15803995 16023180 16221176 16450289 16708549 16928522 17177699 17579147 17859756 18023951
9031 18023951 18203319 18296759 18423444 18558959 18698830 18705893 18452069 18031816 17589716 17263697
9021 17263697 16967360 16727499 16505485 16363543 16242206 16073058 15918421 15842271 15773513 15745878
9011 15745878 15756124 15777349 15856379 15934186 16102653 16276489 16459069 16721341 17056277 17413995
9001 17413995 17778764 18157158 18540843 18818299 19086589 19374133 19686853 20021866 20296996
8992 20296996 20349508 20263953 20087320 19844961 19509749 19009308 18381151 17724153 17149574 16714529
8982 16714529 16397876 16134918 15880139 15603638 15428355 15268031 15082801 14875177 14730747
8973 14730747 14537265 14344649 14237606 14204871 14140181 14049790 13923907 13839626 13769727 13675472
8963 13675472 13639613 13552737 13508177 13449033 13418211 13447217 13365536 13270248 13165143 13169275 13162443
8952 13162443 13134352 13063473 12992338 12999399 13026874 12991790 12979445 12987471 12952551 12936628 12948937 12881173
8940 12881173 12844664 12867018 12843966 12853889 12836269 12812345 12759117 12779046 12769522 12705045 12640455 12687879
8928 12687879 12654032 12625657 12599884 12564105 12511369 12462182 12449252 12413930 12379428 12385728 12319582
8917 12319582 12312668 12317024 12314389 12348843 12353998 12318089 12278877 12243624 12223216 12250292 12231819 12235217
8905 12235217 12205028 12169430 12189188 12172290 12170122 12150055 12133343 12108493 12046722 12045336 12039465 12039854
8893 12039854 12032154 12008355 11995324 11949149 11948833 11976954 11960760 12003664 12007308 11948280 11985677 11991827
8881 11991827 11967602 11887813 11957320 11980553 11978844 12027582 12006406 12009408 12001200 11971461 12008599 12060436
8869 12060436 12027357 12101490 12165706 12212355 12232126 12255509 12225022 12179236 12159425 12174505 12202378
8858 12202378 12209739 12209866 12263077 12239440 12214260 12277555 12275298 12274403 12318365 12328572 12331788 12367657 12467822
8845 12467822 12496777 12535622 12577620 12625881 12697971 12791924 12875125 12928838 13014517 13113989 13204971
8834 13204971 13260368 13277785 13397335 13512436 13624189 13696502 13782502 13908642 14071104 14208725
8824 14208725 14291009 14351299 14414702 14494281 14615382 14706380 14768408 14867743 14949925 15043367 15121170
8813 15121170 15247015 15409660 15519897 15691761 15861642 16067216 16277237 16505417 16860294
8804 16860294 17103535 17438465 17779798 18174562 18629029 19063562 19534388 20045411 20598107
8795 20598107 21083216 21550613 21994671 22283397 22459081 22548046 22649240 22822381 23023071 23322005
8785 23322005 23649714 24130345 24636975 25169607 25796019 26477892 27223874 28179650 29323445
8776 29323445 30607545 31998569 33445108 34808337 36074744 37291421 38637761 40253820
8768 40253820 42088993 44033812 45803795 47305788 48198003 48413100 47802195 46757420 45547766
8759 45547766 44415252 43481439 42840914 42375442 41921561 41443369 40936712 40410467 40033983
8750 40033983 39848832 39825998 40164710 40780317 41669320 42862300 44340797 46145369 48045954
8741 48045954 50022689 52035499 54059282 56218176 58669399 61248215 64085308 67032716
8733 67032716 69963394 72441900 74089965 74627353 74162234 72825014 70780533 68406928
8725 68406928 66049929 63986571 61965733 59553716 56899679 54334044 52088300 50376945
8717 50376945 49148148 48323481 47893878 47920693 48363743 49240060 50642274 52520816 54930990
8708 54930990 57968482 61712099 66290475 71628906 77763208 84950612 93357470 103094104
8700 103094104 109746200 106649361 97009705 85871739 76913783 70883253 66490943 62888475
8692 62888475 59069841 54895378 50389784 46017991 41993835 38672261 35972995 33739773
8684 33739773 31887905 30304463 28803542 27342702 25969869 24749828 23669819 22693439
8676 22693439 21827853 21104291 20462337 19847910 19289842 18688252 18121460 17595608 17089441
8667 17089441 16564877 16087298 15630878 15164828 14792878 14417441 14099298 13764495 13405376
8658 13405376 13073987 12798214 12535511 12328290 12126839 11932039 11754938 11564869 11364433
8649 11364433 11204595 11028220 10901711 10749156 10633161 10483251 10401795 10371721 10273705 10223709
8639 10223709 10135170 10065254 10029586 10027226 10029818 10070486 10081397 10132589 10165675 10173288 10255309 10308713
8627 10308713 10458442 10606290 10775837 10844315 10880297 10962529 10999599 11012763 11087246 11069976 10920815
8616 10920815 10793936 10684042 10571407 10456662 10368348 10237378 10095057 10053651 10045462 10033109
8606 10033109 10048928 10027630 10085977 10211907 10321868 10404239 10546781 10750784 10936325 11169626
8596 11169626 11417674 11668720 11944746 12258026 12582332 12967024 13300284 13709743 14287106
8587 14287106 14771991 15099597 15472366 15821920 16088466 16446017 16917703 17506147 18320986
8578 18320986 19386236 20467691 21706652 22912491 23818647 24538721 25261585 26092288 26958558
8569 26958558 27275226 26944178 26269223 25446051 24867891 24297236 23470896 22573111 21725363
8560 21725363 20945747 20200274 19545937 19059281 18774704 18600609 18522181 18501967 18542850 18683267
8550 18683267 18904786 19320389 19884477 20666730 21581582 22634668 23661504 24613001 25504428
8541 25504428 26598382 27877839 29322347 30832823 31996510 32493620 32142127 31037429
8533 31037429 29248668 27282418 25552702 24148130 23174042 22401194 21564438 20485481 19262251
8524 19262251 18006131 16830766 15904496 15141772 14502409 14017162 13584672 13240543 13039456
8515 13039456 12867516 12802369 12846884 12941642 13172347 13489717 13990593 14407315 14623299 14820780
8505 14820780 14932169 15134088 15346299 15242792 14802951 14190508 13623949 13155818 12583921
8496 12583921 11975377 11251341 10551489 9912142 9287269 8737675 8284343 7857111 7488058
8487 7488058 7139902 6808796 6444336 6144800 5964892 5739377 5470620 5317085 5130384 4997568
8477 4997568 4898582 4778739 4616101 4510784 4428608 4308792 4177553 4087239 4040152 3945641
8467 3945641 3881550 3790636 3717410 3655292 3592459 3525315 3423753 3357156 3339987 3291573 3209497
8456 3209497 3156751 3105789 3055137 3023975 2938033 2910120 2859899 2840105 2807759 2762748 2726818
8445 2726818 2631714 2578929 2532582 2493302 2570805 2516085 2482903 2462882 2383317 2389752 2329965 2300156
8433 2300156 2327526 2369932 2348544 2278521 2226206 2198949 2204612 2211149 2200691 2200593 2166511 2084212
8421 2084212 2044380 2033319 2028362 2030869 1987209 1965842 1956834 1944053 1939333 1977940 1947515 1915516
8409 1915516 1857470 1860323 1898261 1892649 1919296 1862710 1872688 1851169 1798804 1791331 1863656 1870487
8397 1870487 1767748 1771601 1770987 1764600 1744380 1671348 1690761 1709416 1673260 1670040 1709576 1695147
8385 1695147 1631993 1570071 1583709 1615039 1570745 1562615 1548356 1537279 1576993 1568002 1558432 1558419 1533126
8372 1533126 1517459 1510359 1522881 1547177 1534188 1556132 1556303 1529294 1560664 1561956 1525141 1540373
8360 1540373 1537770 1499910 1433751 1424126 1366855 1370098 1375114 1373094 1387787 1334599 1311959 1295510
8348 1295510 1258095 1278771 1293502 1262045 1249105 1226921 1228056 1228506 1221700 1210062 1247401 1223087
8336 1223087 1204222 1185089 1185708 1220496 1234181 1179277 1136715 1145141 1123782 1141385 1122534 1141221
8324 1141221 1111331 1055503 1055461 1078294 1114161 1074918 1044171 1069001 1050200 1059409 1051655 1038184
8312 1038184 1011031 972223 939354 989499 1034040 988135 956175 963394 966564 910468 889537 922720
8300 922720 949784 879440 845706 866222 891314 847251 846691 835293 831897 858573 877098 891643
8288 891643 851094 883856 852570 852538 870288 843525 808462 830078 867329 870162 843117 771398
8276 771398 812895 835911 837005 775668 850072 837129 832835 837895 814371 783996 754842 769076
8264 769076 732810 745239 832736 796819 773792 789910 771861 768967 768953 795160 784895 790126 820106
8251 820106 838473 798672 791506 770434 796351 776388 774279 786653 797985 785540 784577 769252
8239 769252 777659 801870 767083 760890 759874 755326 780902 770286 833256 864652 870717 860647 864553
8226 864553 873246 905783 917372 947795 964112 964744 984578 931098 871969 788053 764302 732528
8214 732528 749332 831166 796071 799229 795064 757972 695993 692355 728163 746196 748122 697601
8202 697601 676598 645129 651116 655359 702805 675683 633611 556259 559741 457822 943184 1091872
8190 1091872 844271 837546 740811 721144 689294 670078 679590 684035 633984 678719 673462 680226
8178 680226 694925 675082 653028 689210 685311 704396 691364 668851 630545 596262 620998 647602
8166 647602 610141 643971 627418 526552 499823 538875 569329 568223 522983 525867 551826 586260
8154 586260 535432 512269 506760 537649 567013 541322 553278 546177 547350 519916 505965 534064
8142 534064 544465 574362 566567 525496 499588 544227 603363 573315 492143 494152 504381 531104
8130 531104 521801 459591 467543 477005 451912 487260 507649 516773 526668 481527 485717 484274 448262
8117 448262 456721 513248 465796 455885 483635 442419 436751 529017 456158 432691 430342 451008
8105 451008 416550 404677 428545 487829 506309 449680 428271 488176 450752 431659 443786 439773
8093 439773 446638 408371 428073 422519 446428 411745 434437 429783 408414 403127 384969 431169
8081 431169 413701 335979 381834 371941 364567 363324 378276 357071 337225 347976 327788 279443
8069 279443 323206 375577 320249 297237 373289 364983 376740 364464 331688 333249 322891 317175
8057 317175 291126 313442 335876 350687 365581 323056 271175 253397 242392 298143 332853 307165
8045 307165 298918 249305 261825 268164 235083 246986 282431 315604 284259 245186 264263 206594
8033 206594 219521 274458 259255 245322 212318 204693 212702 242569 219069 188118 197641 254630
8021 254630 221594 201530 231063 262932 234319 251898 226535 223104 223524 243608 247641 229765
8009 229765 229944 230745 274741 232500 194508 162333 176859 182871 226064 281983 199789 192579 227587
7996 227587 206625 190020 232767 236445 231342 210317 215139 183369 168658 201841 228442 199240
7984 199240 198581 207843 204130 186290 187941 209470 208792 220283 189019 228656 222767 165126 187789
7971 187789 200254 182952 237695 241908 175366 189687 201350 187682 170386 134747 160828 159043
7959 159043 161380 204825 213732 178290 191970 211371 148894 175110 195890 193335 150559 112900
7947 112900 126631 138624 163151 141214 202389 140499 120736 140259 166757 238194 215157 175086
7935 175086 126534 71779 78440 92900 131222 165733 173892 167801 185610 158146 164790 143623
7923 143623 150412 154693 135144 148026 124080 125856 81058 161941 140862 130896 65247 107840
7911 107840 115232 96507 121930 95234 154278 125576 116119 136552 123784 108267 85067 125681
7899 125681 210683 131913 87919 90055 154686 117861 137503 156505 127183 139569 186105 178093
7887 178093 120222 109527 141215 167984 187015 228066 187195 117375 146665 138090 173964 176916
7875 176916 188677 182784 138812 160080 173658 207121 173298 147343 149182 119664 106613 85113
7863 85113 87698 131379 125639 97498 70267 54806 50463 46190 61381 58129 84965 70420 87596
7850 87596 84908 84415 100758 69611 73298 125319 174374 143389 96116 70733 98392 90477 102515
7837 102515 86345 80755 123790 89089 65345 123265 105982 108330 119759 87979 120448 126578
7825 126578 66848 66049 54096 124746 167002 97603 97770 83125 60228 103131 61971 77160
7813 77160 47161 71610 76899 101425 98970 161364 105599 124931 131357 11468 -17017 -4307
7801 -4307 40648 28265 43811 55086 60603 49805 44776 15825 22023 -8583 1129 21666 67666
7788 67666 54975 80708 99114 118900 125883 98499 89337 72755 59054 63613 110745 119978 131511
7775 131511 105889 85258 82396 104958 120782 85462 79119 80698 20076 52605 79188 29953
7763 29953 58380 126753 147407 110013 73299 59101 84702 65538 100715 78443 45498 52587
7751 52587 47698 15680 2708 32780 40168 85957 140120 102059 58642 86713 62087 83712
7739 83712 32627 5748 68508 21235 19734 43155 2173 8764 66959 108541 11282 8680
7727 8680 25662 -14686 18774 -9238 60 10143 23495 27019 36371 30688 -5626 42198 6429
7714 6429 13897 68237 95133 111206 55994 47439 23853 61724 40750 22493 54947 47389 47637
7701 47637 63627 30775 57992 68092 36374 43424 41764 42855 11756 -8701 1185 15312 -25377
7688 -25377 -4503 55302 20396 12053 332 13761 22362 3984 14708 57363 58678 35198
7676 35198 330 24046 26334 49613 11357 48435 97565 56210 11092 -40056 -13130 32427
7664 32427 -2357 -15704 12331 15630 32517 -7467 -59278 -31170 33606 54616 35673 48599
7652 48599 38326 -20681 23160 80553 67682 18486 -9196 -2846 -4198 -26405 -412 -1871
7640 -1871 19173 32610 6686 5815 35532 11820 7072 50713 113014 71625 38053 16834 12842
7627 12842 16414 27345 60127 40698 23910 41649 36146 34445 83587 112814 87338 44537
7615 44537 23900 -13871 -13585 -8626 -15258 -9673 -1822 -33737 -36796 4120 -23126 -35725 -51002
7602 -51002 -35481 -32700 -24522 -48119 -34313 15305 35508 73625 22622 8485 24170 -20605
7590 -20605 -48296 -53690 -34289 -47694 7355 43028 28661 -22501 -20372 -2958 -21169 12004
7578 12004 37344 19617 35145 35441 49363 34204 58522 69161 39067 -4585 -14829 8374
7566 8374 -17955 4700 -16713 22129 29609 24468 17105 46234 33046 14014 -26047 -31020 14167
7553 14167 187 17713 42606 2323 -41963 13034 -6581 -57884 -11814 7492 -1209 27814
7541 27814 8786 -8108 4941 22811 27609 -2431 -11040 -7425 18396 36789 36214 20589 44875
7528 44875 4017 6995 -13074 3666 -18814 23202 43451 19531 15118 -19928 -8287 44341
7516 44341 51835 48738 30305 17426 -10570 -60885 20630 60691 32415 27880 81713 14217
7504 14217 -65417 -43871 27514 -1352 -63089 -38573 -33211 -44395 -21772 -10024 7813 36468
7492 36468 35382 -467 20404 18504 55499 24521 -5027 21149 25663 12823 33437 57252
7480 57252 39818 30598 25319 37227 -9845 22152 63714 55149 15558 42086 76915 39203
7468 39203 20526 16376 9643 -7520 -34780 -64108 -29345 -34315 -39575 50158 9353 -34105 2928
7455 2928 36001 -13137 -74371 -11237 674 -14453 18706 -21747 -46357 -1601 8121 -12098
7443 -12098 -17542 34287 28888 22598 37882 37077 34965 18324 14725 13452 23034 51987 56422 21846
7429 21846 -10085 -21546 -46952 -11726 20287 59628 104164 119832 96322 18875 -6260 -3832
7417 -3832 -2865 -6040 19584 30081 39825 44444 68593 39996 20913 34545 38901 30463 12741
7404 12741 35861 26023 -14637 25328 37334 22772 929 1066 17751 6188 -4237 -17953
7392 -17953 31041 -2373 -41407 -9956 -5872 -1993 -1425 8614 29100 33766 29957 27408 -32487
7379 -32487 -19425 1253 -25527 -5406 -34211 -66248 -58434 -15810 -28776 -43134 -22099 -30636
7367 -30636 -44570 -684 -22658 -60954 15727 85903 1619 -11466 30103 63494 71907 38118
7355 38118 62345 59202 56883 4308 17979 29507 5539 -103 6825 -44943 -1208 38055 23367
7342 23367 -5260 2538 72790 7688 -28724 -28757 18960 8320 -9210 17469 26627 17562 6847
7329 6847 10647 -30679 -23547 26537 20653 1372 -15883 17087 56952 19743 -10525 17220 10844
7316 10844 -23228 -26249 -31345 -59680 -38288 -22441 23301 -2353 841 -10494 -20454 28054 5567
7303 5567 -12637 6515 -2289 -4764 -11054 -9264 -15609 -5740 -2648 -4115 -20647 -14406 55370 85903
7289 85903 49137 6282 4349 14045 14149 23197 25336 7243 30782 66111 41264 -37054 -32502
7276 -32502 -20718 -21836 -15046 -8698 -11096 8286 32386 62674 17144 986 31774 47295 3870
7263 3870 -4926 40630 51569 22340 52761 40944 35118 98901 70462 21844 61588 82364
7251 82364 58884 24738 -8041 -13089 11038 61193 50254 67131 57659 49496 50313 24913 61027
7238 61027 33846 84605 108789 72674 86009 84755 74566 104879 106589 119265 101686 98901
7226 98901 95515 49460 -6266 -6626 70128 103426 111382 81456 57640 65895 64736 77295 56540
7213 56540 29567 76279 101165 106951 93122 61379 49487 49924 129688 125719 95628 108448 82292
7200 82292 84098 127080 102266 35533 81278 89986 84565 107248 78214 71687 70072 107172 201961
7187 201961 163295 163574 141388 122448 148509 159499 121653 118997 130867 160623 167503 187731
7175 187731 194708 160340 156614 150612 120212 153300 175221 165983 117076 123876 178984 170042 143555
7162 143555 184798 201929 184957 192536 213885 237256 241505 235818 216590 195691 186672 173945
7150 173945 183379 256054 243342 302183 329835 301746 274245 269690 328352 364677 368851 376144
7138 376144 328249 313245 314407 360629 384996 386677 419237 414536 408877 385893 430074 410269
7126 410269 443272 493776 478415 499800 538715 500857 494415 559552 611333 644072 612465 672509
7114 672509 752061 744051 780415 846275 866221 923625 930817 950760 984758 1030050 1057304 1087275
7102 1087275 1143407 1243805 1324121 1386349 1433004 1462602 1544367 1656578 1766833 1894236 2047715
7091 2047715 2267585 2439688 2621841 2897949 3204102 3508309 3904818 4396424 4891293 5441279
7081 5441279 6032798 6730107 7313317 7809776 8042569 7834184 7314218 6450480 5552772 4789210
7071 4789210 4134917 3644426 3255831 2966909 2737634 2530148 2347762 2146851 1965842 1849169
7061 1849169 1765749 1701403 1539009 1448630 1381322 1337804 1299010 1234839 1175645 1201582 1160933
7050 1160933 1083478 1079070 1052593 1062037 1067513 1095020 1119844 1117137 1098339 1037876 1057358 1068359
7038 1068359 1000639 1027127 977065 969296 882931 763060 756988 761699 752906 706787 653258 612319
7026 612319 557298 508895 551415 559609 546781 542304 510970 496649 498309 476846 499258 554425
7014 554425 608495 620440 641379 612485 570796 557411 570235 552399 511147 480245 431375 453615
7002 453615 431233 348684 336887 340734 347091 337002 302981 283877 258581 276543 248826 263474
6990 263474 259387 215072 204992 204382 174923 169443 216286 249105 184260 177049 175473 206336 221732
6977 221732 210999 185834 188153 187477 176244 148298 180054 187793 170496 173223 156099 189290 173997
6964 173997 119445 169744 211515 196957 166456 107145 144340 192653 214395 160218 164567 216620
6952 216620 167598 148895 179384 161960 145013 191896 199271 150640 147312 152385 206734 151710
6940 151710 128700 195563 209828 171771 165283 146475 162336 154326 194665 228734 198042 160311
6928 160311 188997 169023 125919 125551 135770 132145 120137 162164 177285 158241 99229 128402
6916 128402 162844 181452 205217 205913 189230 186408 168352 153670 158488 181709 158279 181399
6904 181399 190756 141969 166414 176014 171308 191977 227246 245865 218857 191703 181573 196514
6892 196514 205172 206010 253886 275240 274108 248205 302294 327508 260085 229922 242232 272259
6880 272259 274301 345976 375231 354463 360791 339022 372954 391131 409655 400650 388044 398852
6868 398852 412090 433572 418481 497090 525292 554364 609751 586535 649005 720082 773479 830911
6856 830911 914842 1002342 1043368 1130018 1249636 1316876 1477123 1574859 1652649 1621329 1551554
6845 1551554 1467092 1369143 1251438 1140954 1057780 947354 869008 739894 726630 653916 624843
6834 624843 596682 548392 488654 511994 544504 547289 522196 563221 571261 542942 529598 470270
6822 470270 508058 457191 431595 421568 411149 423365 380751 397079 422207 386623 367763 372399
6810 372399 386219 411434 414405 389982 391209 384148 398499 385112 388373 377615 317510 256908
6798 256908 254372 291096 262908 249195 245754 271965 261208 274814 273802 221633 177355 190323
6786 190323 197953 233803 179512 196896 220479 221653 230369 189413 160394 162469 168153 199570 215849
6773 215849 200914 211674 162697 147840 148431 140537 103204 77429 111548 127290 139738 166005
6761 166005 150272 149523 165481 160376 139764 160626 156088 149089 183145 175730 123317 130010 143464
6748 143464 177755 186106 124835 144357 197906 209197 170894 108506 156144 200369 260073 211834
6736 211834 171284 177264 171688 201727 231395 236006 265538 271781 255895 277622 288048 206659
6724 206659 191297 232095 240904 242481 175706 170427 141561 140917 134713 181252 186403 172094 234056
6711 234056 231689 193088 209655 202798 206630 207547 227346 221262 188217 237654 229760 226618 238179
6698 238179 265423 267531 244236 241528 253062 265575 236342 198961 251808 224080 200967 168673
6686 168673 187983 217825 191605 254508 224843 205465 217707 255391 287447 278895 246447 235205
6674 235205 231448 238594 226464 186109 212380 217936 200041 153654 226045 210529 211189 243772 243676
6661 243676 275017 243648 272612 282094 275052 290236 284891 283756 296164 196599 202194 261589 262640
6648 262640 266659 237741 252264 231235 231349 296390 338922 279435 238778 292651 342337 322371
6636 322371 331010 348935 350333 301246 298468 303162 300904 364900 312509 321622 323637 314050 330757
6623 330757 364406 324376 290862 267032 299687 322030 318645 322314 310795 287757 302476 313629
6611 313629 315818 312620 348533 324361 282785 310235 287479 308846 310250 291876 342507 324278
6599 324278 313592 303529 273962 297715 335233 268471 244277 299095 329824 280655 317677 353999
6587 353999 309461 288590 295149 280662 284438 266849 221011 217372 208408 290634 250768 287273
6575 287273 262834 281197 294804 304552 319935 304941 312201 297544 303069 380927 383857 352807
6563 352807 366104 372613 404229 431388 382977 379171 367285 424774 421629 421807 450725 473584 430859
6550 430859 410220 437408 374676 399014 430431 399340 387026 349204 352798 386890 385026 379503
6538 379503 332850 357258 329098 321731 301757 338688 345612 337956 392175 321441 333537 343028
6526 343028 325380 319748 326840 354780 343094 359222 355966 376889 363177 375831 384303 390121 390635
6513 390635 382828 358950 359643 365366 375258 378767 381729 389782 370393 392615 374580 341240 404014
6500 404014 379970 428625 401162 359842 386303 434160 408727 401940 433726 452540 447480 425720
6488 425720 390213 432890 436848 401168 453071 483576 454684 489580 540555 466448 474017 478252
6476 478252 479813 532929 553149 475977 484404 461143 471901 499292 528794 500895 456304 462135
6464 462135 542266 557113 518052 531323 538788 578849 564712 535239 528088 549635 512668 525218
6452 525218 579566 574345 578442 536952 556082 540814 560415 557480 584845 617306 691088 673347
6440 673347 634394 646132 619381 659747 685437 643385 649859 690726 742813 729893 704803 753705
6428 753705 717936 697137 713058 749302 759349 773522 804773 818858 819468 817634 812024 819962 785192
6415 785192 750948 748174 793806 833936 864238 880122 880477 850388 879517 894669 926530 938093
6403 938093 947211 922168 916279 974512 1031707 984785 1004647 1047258 1029511 1029168 1069052 1061486 1083057
6390 1083057 1170275 1165634 1181213 1179306 1205223 1240116 1253428 1259133 1276038 1321516 1354079 1373375
6378 1373375 1364845 1376410 1391948 1432425 1521112 1546235 1568010 1604995 1610829 1635508 1634900 1677745
6366 1677745 1770128 1843012 1904513 1929630 1961778 1978900 2044212 2135920 2179158 2205398 2330479
6355 2330479 2383909 2385443 2450365 2549922 2589617 2694457 2770674 2907183 2964662 3079292 3202250
6344 3202250 3320471 3434363 3525474 3672232 3848447 3978434 4097969 4312029 4423184 4574948
6334 4574948 4677658 4788864 4942878 5053175 5179955 5277921 5373952 5497511 5560981 5639190
6324 5639190 5722957 5910319 6074299 6212045 6395354 6599752 6721490 6946689 7266682 7540441
6314 7540441 7799624 8081213 8453004 8817731 9171236 9510578 9882794 10261406 10644263 10994878
6304 10994878 11235337 11462078 11639701 11765023 11800422 11832846 11825542 11747795 11679415 11601927 11503088
6293 11503088 11494972 11505118 11506790 11557171 11695447 11798865 11968059 12223087 12415623 12697817
6283 12697817 13015154 13385509 13776122 14222452 14637679 15074451 15452750 15792145 16083195
6274 16083195 16350084 16452488 16448213 16353025 16148462 15865451 15443117 15040700 14637859 14233856
6264 14233856 13789141 13484391 13158894 12858494 12585030 12401634 12264931 12113938 12015289 11968255
6254 11968255 12058040 12074388 12086529 12169983 12255283 12355813 12474794 12571925 12605875 12612344 12654580
6243 12654580 12542510 12396548 12195633 11913644 11539483 11166006 10738228 10316409 9890461
6234 9890461 9448032 9081695 8693867 8378178 8086464 7825614 7513433 7264690 7081580 6914472
6224 6914472 6752535 6573961 6413405 6328110 6215757 6084059 6012724 5958680 5885608 5824603
6214 5824603 5720616 5619027 5491286 5303806 5219143 5076509 4880388 4684908 4515567 4421424
6204 4421424 4284114 4148196 3963900 3827448 3675847 3603174 3509458 3388914 3323251 3213983
6194 3213983 3132366 3060773 2998672 2979402 2907905 2877998 2851743 2839854 2818962 2760459 2711258
6183 2711258 2730371 2711224 2657760 2682801 2710751 2676405 2677566 2694195 2705126 2696099 2729784 2715977
6171 2715977 2705557 2712461 2649520 2693204 2676390 2746231 2780880 2781882 2814954 2843548 2846677 2907856
6159 2907856 2904264 2918280 2942528 2950529 2999068 3064898 3076137 3114158 3160946 3164484 3150660 3199985
6147 3199985 3221262 3248460 3241870 3231839 3212984 3255262 3301936 3276484 3233151 3233559 3264953 3306727
6135 3306727 3318492 3295693 3243312 3248889 3264216 3258602 3241908 3245853 3257381 3180857 3191269 3206093
6123 3206093 3172550 3221498 3260058 3203225 3236113 3238285 3206801 3184234 3194656 3200637 3212897 3208173
6111 3208173 3171136 3148776 3154513 3091199 3043401 3010728 2967317 2940273 2937304 2903735 2834445 2804506
6099 2804506 2790676 2834239 2787839 2753469 2698337 2671758 2657327 2602887 2623532 2600512 2546301
6088 2546301 2525947 2508959 2430448 2421828 2417952 2385598 2348261 2340946 2294831 2232542 2248160 2241127
6076 2241127 2214060 2237095 2212671 2180734 2188958 2212381 2206066 2149466 2170064 2156175 2184216 2174935
6064 2174935 2189274 2218576 2197093 2167717 2193480 2231745 2216948 2241239 2237275 2257801 2285877 2297452
6052 2297452 2255712 2320455 2397823 2428883 2417182 2466883 2484676 2468944 2473548 2531047 2582745 2655579
6040 2655579 2659953 2669878 2655630 2715585 2720442 2676850 2729785 2784159 2788626 2814738 2813865 2811155 2831523
6027 2831523 2840614 2802636 2783141 2770207 2796312 2827171 2878403 2843257 2809900 2866990 2897904 2923168
6015 2923168 2933735 2920928 2863409 2886216 2911114 2943090 2905402 2903188 2918517 2887877 2880472 2947462
6003 2947462 2933913 2910279 2878659 2880175 2911341 2848866 2828369 2812225 2795084 2834860 2799085 2780564
5991 2780564 2714832 2707321 2667107 2609755 2608302 2582615 2545989 2534844 2527792 2492821 2490437 2467634
5979 2467634 2405540 2391936 2401209 2363452 2315733 2297558 2292615 2237604 2175128 2183417 2103472 2149163
5967 2149163 2114698 2118287 2056916 2063067 2044079 1971964 1958421 1961883 1955119 1932931 1936553 1909279
5955 1909279 1914315 1877364 1859790 1914597 1824709 1797345 1821959 1838921 1837688 1803626 1808420 1805312
5943 1805312 1788882 1801457 1843743 1841964 1773953 1749568 1810620 1830590 1845234 1808299 1798921 1832625
5931 1832625 1852223 1860923 1850842 1817428 1868720 1873409 1940721 1899008 1910059 1962118 1969299 1966695
5919 1966695 1970308 1991296 1970821 1997596 1952598 1982148 2024288 2018922 2026776 2015349 2072493 2114015
5907 2114015 2169967 2130856 2102621 2122272 2179388 2167583 2227063 2270283 2272888 2279074 2295172 2275827
5895 2275827 2312768 2291313 2305642 2349501 2368786 2459600 2471392 2445421 2507816 2666790 2725367
5884 2725367 2706612 2698082 2772875 2754521 2821001 2884739 2984809 3076580 3103899 3183314 3226562
5873 3226562 3263013 3336462 3353552 3325770 3357804 3365482 3394089 3391161 3396198 3391132 3448866 3485468
5861 3485468 3475455 3525378 3626104 3667886 3731474 3769703 3837031 3918692 3996525 4079353 4116650
5850 4116650 4178323 4198512 4209736 4193491 4274008 4362064 4381559 4442419 4459012 4537562 4682148
5839 4682148 4810644 4890637 4952014 5092394 5287022 5515144 5691216 5831676 6039940 6188556
5829 6188556 6334772 6444803 6522196 6547605 6514743 6476368 6469100 6418515 6380181 6393233 6377475
5818 6377475 6384179 6409057 6468139 6541678 6700564 6798939 6922641 7054447 7160090 7288888 7440693
5807 7440693 7553985 7644958 7710121 7755984 7768861 7719474 7652974 7581068 7463681 7342210 7146809
5796 7146809 6992139 6793467 6581214 6460895 6355172 6202658 6108487 6035340 6041549 6005612
5786 6005612 5971577 6018612 6026057 6011790 6085810 6182201 6189693 6235270 6264648 6255881 6245525 6204724
5774 6204724 6080240 5985266 5905871 5826273 5747154 5639808 5548435 5467916 5410955 5375754 5409701
5763 5409701 5368077 5301281 5256156 5226280 5244776 5278051 5282021 5274187 5334154 5337214 5273068 5205691
5751 5205691 5193649 5181463 5213020 5256884 5272281 5252409 5216018 5257038 5259181 5290567 5336689 5404914
5739 5404914 5454309 5491490 5569733 5618846 5688232 5778103 5870844 5901097 5956020 5979459 6064645
5728 6064645 6111209 6114280 6130946 6183226 6221705 6281586 6330476 6336142 6456656 6546834 6551163 6632857
5716 6632857 6755194 6824357 6957564 7111108 7232822 7353226 7530829 7696656 7828908 8000564
5706 8000564 8159917 8347981 8600048 8798035 9010392 9276291 9551080 9763986 10064975 10490783
5696 10490783 10862758 11181238 11610745 12053672 12499449 12999786 13562613 14118973 14726545
5687 14726545 15335938 16013410 16653328 17300572 18003807 18693567 19225671 19655640 20069980
5678 20069980 20359738 20555200 20631107 20724906 20770276 20778089 20657663 20571057 20496913 20430706 20314215
5667 20314215 20279796 20252712 20257449 20321375 20524873 20713576 20962633 21273448 21708778 22182291
5657 22182291 22703275 23334300 24024185 24715491 25469578 26233959 26996482 27772335 28492455
5648 28492455 29162632 29727547 30242783 30753554 31243657 31699898 32200501 32599377 33073358
5639 33073358 33514083 33891212 34230358 34478937 34658527 34814341 34855152 34828747 34751088 34473187
5629 34473187 34071085 33514838 32887385 32152302 31356806 30557998 29804273 29122768 28496391
5620 28496391 27972575 27520962 27189792 26904655 26687430 26629107 26698785 26805353 26959929 27144599
5610 27144599 27340710 27550518 27780955 28006744 28164562 28299531 28376408 28341767 28257321 28021399
5600 28021399 27710445 27278919 26649580 25959368 25146426 24242606 23296176 22370934 21433673
5591 21433673 20479316 19615038 18819323 18085107 17388224 16759271 16141595 15595978 15099846
5582 15099846 14797779 14493515 14182761 13879161 13602511 13391189 13167410 12989566 12841607
5573 12841607 12716374 12633486 12552013 12500972 12462121 12440727 12439772 12452253 12485955 12529301 12610916
5562 12610916 12731661 12846806 12977698 13126317 13276984 13409769 13603420 13868652 14114453
5553 14114453 14417079 14730211 15082488 15506298 15901459 16391970 16889704 17434598 18088763
5544 18088763 18714947 19452488 20245066 21087251 21975544 22979989 24004848 25038446 26150989
5535 26150989 27177619 28181645 29119546 29920729 30602900 31090349 31471142 31681110 31676331
5526 31676331 31603953 31401166 31152234 30844012 30534832 30272479 29997396 29670655 29449468 29321798
5516 29321798 29198514 29171335 29254968 29391807 29602235 29920766 30271977 30727259 31230499 31806313
5506 31806313 32482326 33098876 33661456 34150539 34543463 34868138 35052484 35052014 34949647 34774341
5496 34774341 34419511 34058782 33683766 33261525 32867363 32510067 32039138 31626186 31252812
5487 31252812 30808261 30387589 29963276 29516004 29070995 28592567 28091804 27510676 26822247
5478 26822247 26139658 25464581 24729644 23998782 23355697 22765297 22227664 21768876 21369137
5469 21369137 21013847 20711105 20508854 20379246 20287053 20249270 20239796 20231294 20316463 20415529 20479748
5458 20479748 20534034 20534411 20517573 20446617 20295494 20104407 19795910 19370969 18853009 18229500
5448 18229500 17489456 16818361 16109179 15409362 14678462 14039304 13470737 12894372 12447069
5439 12447069 12010186 11591939 11198236 10869465 10580246 10252738 9975988 9776111 9505763
5430 9505763 9326712 9192538 9049819 8849623 8703588 8608907 8493642 8424941 8346584 8250536
5420 8250536 8149504 8069593 8011861 7893089 7797526 7733557 7673485 7658946 7567581 7485746 7407960
5409 7407960 7429444 7352533 7261582 7223142 7200337 7205665 7225864 7264000 7277699 7248091 7235681 7323695
5397 7323695 7306539 7263287 7213820 7248308 7289068 7321275 7322427 7379383 7458043 7514940 7567804 7604551
5385 7604551 7678714 7765382 7859368 7998997 8041645 7997392 7955999 7933002 7889068 7904022 7895098
5374 7895098 7823524 7760534 7749262 7840327 7876357 7895092 7967121 8060162 8198620 8286235 8350532
5363 8350532 8454258 8567891 8740735 8911684 9034043 9237795 9447375 9664433 9887459 10229631
5353 10229631 10575664 10850349 11157423 11520786 11821802 12025700 12208283 12350358 12450057 12534136
5343 12534136 12725985 12989404 13261824 13682769 14222819 14797525 15447375 16164186 16951929
5334 16951929 17724092 18255777 18417278 18107303 17508647 16847223 16149225 15561235 15081297
5325 15081297 14614076 14207807 13872591 13590420 13357222 13213020 13117894 13113976 13213638 13370178
5315 13370178 13657486 13941393 14343429 14905136 15532728 16259172 17166058 18154228 19200267
5306 19200267 20393910 21559598 22398778 22474557 21607603 20032384 18203980 16522401 15108114
5297 15108114 13971719 13104324 12459564 11885160 11450352 11063266 10770518 10550709 10386571
5288 10386571 10291694 10288677 10312466 10361613 10481138 10629121 10815934 11095195 11436790 11844664
5278 11844664 12241735 12747279 13285564 13878892 14317403 14396497 14016708 13103798 12044098
5269 12044098 11127500 10451923 9887755 9474142 9131777 8873240 8660336 8432169 8240266
5260 8240266 8063834 7953236 7860480 7766108 7622765 7498197 7379603 7232398 7162229 7076468
5250 7076468 6959702 6929285 6859943 6780658 6708845 6690190 6685376 6724160 6715904 6682287 6720164 6691690
5238 6691690 6688299 6645772 6629053 6616439 6508033 6429891 6353295 6257580 6153008 6128461 6106873
5227 6106873 6003223 5954251 5917818 5872028 5845784 5831173 5827822 5836248 5829355 5758301 5698556 5768203
5215 5768203 5752692 5733604 5679304 5563101 5484368 5459762 5439157 5347655 5245732 5245066 5197901
5204 5197901 5165096 5228234 5203055 5183955 5179564 5197398 5218287 5219639 5219813 5167678 5235528 5217081
5192 5217081 5188482 5099690 5052625 5041384 4990628 4939318 4889827 4817568 4800631 4732265 4691222
5181 4691222 4714904 4683160 4645715 4635148 4647978 4646228 4604754 4606126 4668149 4688641 4729719 4783668
5169 4783668 4808636 4876544 4942530 4961998 4986076 4969596 4914354 4833726 4782499 4657585 4601746
5158 4601746 4502909 4442654 4344427 4283249 4269516 4257002 4268289 4184533 4106782 4096582 4069281
5147 4069281 4079595 4063713 4017677 3982626 4011820 4038902 4029483 3967582 3973093 3983860 3982249 4054622
5135 4054622 4072239 4064094 4048471 3993658 3895694 3856327 3803245 3751815 3691411 3638787 3630256 3581433
5123 3581433 3550161 3572760 3504077 3449245 3399211 3348947 3333237 3318335 3322450 3275691 3251519 3225985
5111 3225985 3201916 3163680 3150723 3149317 3130521 3124348 3184295 3171623 3102925 3073907 3077281 3056556
5099 3056556 3009036 2957454 2956803 2994122 2974334 2985748 2964323 2960929 2910498 2865836 2864197 2892397
5087 2892397 2862498 2819027 2812535 2814420 2810850 2819415 2842671 2808970 2821867 2850089 2788672 2792991
5075 2792991 2761832 2748037 2754458 2714034 2696327 2649052 2654252 2616605 2577510 2636013 2645647 2599751
5063 2599751 2573458 2603067 2592413 2588763 2547990 2524727 2476281 2463805 2488952 2494739 2485212 2478371
5051 2478371 2442056 2425345 2426437 2413964 2438582 2437004 2439017 2375153 2384953 2453205 2413528 2346972
5039 2346972 2332730 2359039 2384648 2375631 2353528 2341558 2340225 2343456 2388297 2376681 2403684 2380450
5027 2380450 2343484 2305476 2309070 2315567 2314223 2327756 2398381 2363630 2273668 2240456 2282066 2308730
5015 2308730 2249655 2282906 2329980 2332347 2348180 2372015 2313290 2311149 2317747 2307786 2324646 2367704
5003 2367704 2339972 2340669 2403168 2357647 2378074 2413086 2417857 2413396 2405372 2376078 2335597 2323510
4991 2323510 2380369 2423830 2501291 2457957 2419535 2421571 2453780 2446066 2421103 2419821 2445936 2380231
4979 2380231 2281106 2335760 2335609 2326904 2311490 2311870 2315030 2396335 2364263 2309724 2329706 2365537 2391551
4966 2391551 2431099 2439826 2473488 2406662 2398722 2425399 2438256 2471593 2507870 2583422 2597959 2575356
4954 2575356 2595387 2630266 2635471 2666567 2700036 2758093 2814125 2806952 2852966 2932413 2932057 2993241
4942 2993241 3057433 3117573 3144475 3190313 3285266 3369429 3458477 3527841 3549570 3644773 3733685
4931 3733685 3808748 3853941 3923217 3982324 3946513 3956404 3994934 4098317 4137181 4135182 4145972 4216312
4919 4216312 4240667 4210040 4180290 4210245 4234364 4223801 4184718 4166720 4175567 4221103 4268987 4313910
4907 4313910 4308899 4368453 4425283 4469154 4535653 4583638 4606431 4620353 4644241 4681595 4713204 4717232
4895 4717232 4771728 4775936 4795121 4777957 4776551 4782689 4783478 4787971 4823345 4854255 4876656 4887195 4955899
4882 4955899 4993311 5043135 5147637 5222900 5342639 5428579 5503520 5552780 5564983 5636942 5688037
4871 5688037 5690224 5691019 5692025 5719220 5759909 5763141 5751393 5777896 5706433 5685120 5630222 5589311
4859 5589311 5575838 5525941 5526579 5586156 5586889 5599410 5648215 5641150 5704012 5719870 5763885 5775938
4847 5775938 5800599 5808207 5779284 5733814 5700697 5683808 5599343 5483956 5388348 5316370 5247475
4836 5247475 5145045 5005768 4837249 4707894 4599941 4467285 4324057 4143635 4040761 3936050
4826 3936050 3858440 3795703 3695697 3570972 3496705 3479490 3412526 3410711 3376766 3322220 3232730
4815 3232730 3229762 3216984 3208653 3146330 3126170 3152375 3130213 3110420 3123931 3123818 3089325 3159169
4803 3159169 3180933 3238474 3265922 3243666 3240233 3325028 3354612 3339534 3401397 3382916 3421728 3480802
4791 3480802 3537868 3520590 3553369 3676034 3734833 3786473 3888981 3944166 3961132 4031570 4202864
4780 4202864 4284807 4348311 4433850 4558884 4699016 4831286 4939947 4999886 5093815 5195056
4770 5195056 5211098 5239781 5330473 5348832 5377757 5361018 5348513 5279736 5276152 5224305 5188341 5082504
4758 5082504 4961240 4907570 4859778 4796685 4688849 4639932 4594920 4569634 4551626 4545013 4549219
4747 4549219 4584743 4557019 4589423 4673221 4654293 4648625 4679596 4705815 4738757 4833555 4885725 4974341
4735 4974341 5061179 5116223 5212691 5311768 5392758 5478609 5499611 5521751 5595670 5682712 5740459
4724 5740459 5767457 5798392 5747598 5682084 5665073 5645769 5646156 5557383 5501440 5408673 5357446 5314250
4712 5314250 5202109 5065320 4924995 4867967 4793447 4747843 4657872 4547533 4464065 4307778
4702 4307778 4227290 4137702 4080795 3989560 3893765 3846326 3788266 3738714 3655581 3624104 3649012
4691 3649012 3649156 3632700 3604099 3592485 3568986 3565660 3531500 3539282 3533448 3500253 3520461 3497443
4679 3497443 3495660 3484640 3487895 3483645 3539845 3618508 3590954 3555628 3601352 3552456 3534991 3525465
4667 3525465 3458780 3419188 3399118 3374148 3352361 3302458 3155833 2972567 2939944 2905984 2834608
4656 2834608 2768495 2684815 2640265 2575507 2542359 2517906 2456121 2443691 2398139 2305018 2283182
4645 2283182 2290455 2296579 2292760 2191518 2146340 2090902 2091026 2073759 2047510 2006584 1990895 2015411
4633 2015411 2083224 2062970 1991478 1970907 1909541 1889319 1858474 1815947 1804353 1790162 1743816
4622 1743816 1768050 1792078 1754011 1752580 1714441 1640662 1607335 1612606 1635392 1664419 1652531 1569057
4610 1569057 1629292 1651837 1682119 1687650 1641909 1668501 1668811 1712332 1680919 1679103 1682221 1632705
4598 1632705 1590214 1578179 1606503 1636772 1687020 1704667 1706186 1662478 1604945 1607748 1590797 1530555
4586 1530555 1544446 1607276 1536701 1553882 1534289 1539941 1562666 1561223 1541830 1479955 1496412 1503318
4574 1503318 1488731 1488788 1490332 1489155 1479990 1486699 1439630 1406905 1452012 1490241 1472843 1508817 1546269
4561 1546269 1513768 1505188 1466130 1462942 1481499 1531311 1559699 1526148 1477014 1517561 1533977 1578363
4549 1578363 1573786 1576053 1551696 1566004 1568360 1550074 1565228 1551022 1505814 1562982 1613871 1590028
4537 1590028 1584341 1606492 1584784 1543422 1586154 1608364 1590032 1639016 1647386 1612456 1593122 1610808
4525 1610808 1668184 1695366 1706715 1686408 1661532 1691672 1670629 1714572 1727432 1722166 1811204 1831452
4513 1831452 1828108 1825187 1884585 1919816 1956444 1995741 1999711 2076001 2078192 2077817 2078067 2126961 2180613
4500 2180613 2195408 2168909 2187004 2192326 2205115 2244629 2283568 2325234 2343143 2343260 2351930 2411449
4488 2411449 2480751 2468298 2513688 2569264 2599324 2679624 2720286 2707215 2740293 2798744 2765765
4477 2765765 2816767 2799308 2810030 2838324 2823546 2850138 2926675 2909645 2941161 2969138 2978427 3017263
4465 3017263 3068344 3086844 3117947 3206289 3239832 3270920 3346319 3407165 3479556 3519719 3541199
4454 3541199 3549745 3673527 3726555 3733625 3847905 3893843 3916304 3946769 3991492 4014226 4004790 4059180
4442 4059180 4088402 4098630 4095037 4079945 4100859 4161056 4188880 4212571 4237667 4233070 4235054 4328564
4430 4328564 4315998 4398476 4447060 4495421 4600126 4659452 4736812 4833179 4928244 4992264 5168533
4419 5168533 5327352 5539982 5707820 5895505 6099282 6336302 6617245 7004569 7390618 7761491
4409 7761491 8246433 8866807 9588319 10436913 11426732 12511801 13865499 15509394 17355368
4400 17355368 19489847 22017963 24741722 27261366 28961714 28969998 27066987 23963917 20438511
4391 20438511 17232288 14703318 12731448 11241913 10068220 9141262 8441135 7892056 7399085
4382 7399085 6945330 6614229 6327063 6020709 5733315 5468260 5188602 4983155 4806696 4618630
4372 4618630 4478318 4313702 4162970 4041485 3969068 3922078 3808084 3665413 3598670 3523338
4362 3523338 3448736 3398540 3295810 3255784 3205163 3169992 3114427 3001974 3003009 2992475 2965311
4351 2965311 2898005 2883758 2888951 2863774 2831845 2797926 2783787 2765131 2762847 2744136 2770303 2770968
4339 2770968 2714229 2661301 2647993 2687859 2720310 2755326 2749461 2785563 2763034 2780361 2827359 2809046
4327 2809046 2822489 2841106 2821037 2826958 2827894 2798630 2832037 2825002 2839050 2888179 2872581 2892446
4315 2892446 2937496 2935553 2960128 3023999 3002199 2970275 3023002 3108506 3198121 3218808 3274004 3353405
4303 3353405 3407679 3509956 3659288 3775053 3767920 3687226 3622751 3526437 3483076 3409641 3319132
4292 3319132 3281520 3223484 3212937 3265076 3315308 3325389 3303009 3267357 3308362 3358988 3317190
4281 3317190 3291614 3358656 3391044 3416343 3399192 3420274 3466536 3515730 3525939 3578026 3653795
4270 3653795 3643246 3645290 3698565 3757737 3810734 3860638 3913887 4038937 4095874 4088772 4131557 4171129
4258 4171129 4252504 4375551 4415350 4515611 4616131 4703652 4785555 4914971 5030529 5120861
4248 5120861 5231650 5330691 5536617 5656579 5786695 5966418 6156621 6347421 6491496 6679306
4238 6679306 6913076 7133881 7315111 7549817 7844812 8206453 8569990 8951311 9345873 9850253
4228 9850253 10463122 11121217 11855805 12717618 13768812 14949653 16297633 17915298 19839747
4219 19839747 21947272 24349913 26986000 29656768 31784319 32475400 31336661 28693545
4211 28693545 25457605 22339614 19751423 17764253 16217567 15128144 14298209 13625545
4203 13625545 13184250 12842164 12683452 12514266 12521493 12585983 12670985 12793725 12977335 13187068
4193 13187068 13407321 13628276 13874741 14096540 14169345 14150252 14099217 14045179 14013963 13890844
4183 13890844 13886724 13954890 13965474 14057442 14206278 14416338 14737290 15261096 15885843 16688421
4173 16688421 17579145 18748429 20219023 21917966 23876768 26130398 28627807 31109045
4165 31109045 32982650 33592946 32608658 30192001 26965571 23826878 21127858 18957007
4157 18957007 17304619 15976010 14953136 14174807 13551491 13043520 12698319 12354889 12023196
4148 12023196 11782538 11515397 11312593 11170375 11104914 11029044 10905415 10834769 10811932 10816574
4138 10816574 10721053 10663591 10652514 10550882 10498602 10426080 10364528 10347931 10377244 10435091 10431066
4127 10431066 10401394 10494505 10648731 10756716 10825268 10966559 11093781 11200824 11311004 11374370
4117 11374370 11488700 11615165 11738006 11883361 12056430 12176645 12391893 12596190 12824695
4108 12824695 13062665 13346466 13664402 13928939 14300124 14682895 15061453 15455287 15917637
4099 15917637 16402626 16890250 17501846 18152324 18883881 19722027 20631950 21638022 22727262
4090 22727262 23963277 25326851 26911250 28638779 30550582 32564905 34628054 36681226
4082 36681226 38677520 40327210 41143433 40798969 39502622 37664049 35733637 34035190
4074 34035190 32727446 31781282 31111569 30629023 30313488 30141415 30145287 30260160 30485377 30819488
4064 30819488 31105901 31388005 31708431 32033372 32456458 32967799 33528683 34126980 34738410
4055 34738410 35411551 36201126 37088975 38015335 39115601 40325267 41590656 42937446 44411522
4046 44411522 45977239 47651696 49397143 51263460 53256776 55316004 57473874 59716883
4038 59716883 62058184 64532612 67080922 69795387 72612169 75531415 78605739 81808594
4030 81808594 85084670 88548089 92173615 96029858 100183573 104583254 109191431 114208092
4022 114208092 119700342 125805176 132740286 140581159 149532716 159749243 171362182 184292333
4014 184292333 198497534 214102437 231396633 249637512 265154761 269259316 258123509
4007 258123509 237188077 213724220 193204910 176972376 164326744 154300539 146271784
4000 146271784 139834144 134691692 130564818 126897343 122475705 117428265 112280595 107577752
3992 107577752 103445000 99657981 96073854 92796218 89868186 87050747 84440688 81916386
3984 81916386 79510377 77169416 74885528 72693204 70476847 68410449 66456552 64514728
3976 64514728 62677536 60961556 59288785 57677168 56052343 54496686 53053961 51620426
3968 51620426 50183292 48797799 47497626 46265408 45081044 43908154 42894470 41827703
3960 41827703 40769281 39759409 38791128 37777493 36914490 36092200 35277429 34544657 33752222
3951 33752222 33060134 32412712 31710703 31042428 30437737 29788128 29167507 28702158 28188438
3942 28188438 27660384 27164496 26703672 26239621 25767829 25376163 25000338 24589955 24252097
3933 24252097 23904125 23603226 23292633 22948216 22662054 22457584 22185530 21948489 21720385
3924 21720385 21523008 21326459 21076298 20880859 20618375 20300173 20034479 19799143 19523841
3915 19523841 19289252 19098282 18870071 18650444 18509338 18396554 18232656 18044430 17904002
3906 17904002 17788962 17614718 17445752 17348198 17244645 17167748 17084978 16986728 16955357 16871920
3896 16871920 16807570 16756823 16739662 16728691 16731416 16729464 16716230 16724688 16730013 16774753 16796582 16862118
3884 16862118 16922259 16991437 17101121 17258616 17377138 17468637 17548778 17695774 17870751 18034566
3874 18034566 18175886 18343366 18532217 18752826 18997454 19222629 19498334 19808791 20138059
3865 20138059 20485877 20912133 21348336 21771010 22293471 22848918 23330357 23839643 24380753
3856 24380753 25019720 25676234 26359938 27030376 27662024 28334980 29052037 29757372 30453101
3847 30453101 31120517 31817380 32499840 33145611 33750139 34358891 34903047 35429822 36007445
3838 36007445 36415038 36745859 37018773 37280662 37453660 37586959 37625885 37615479 37532183 37443783
3828 37443783 37264375 37023971 36783989 36393790 36012173 35617998 35172900 34650843 34235674
3819 34235674 33815295 33396049 32990360 32544004 32166220 31765225 31383241 31058641 30800154
3810 30800154 30530955 30313672 30096350 29925735 29811809 29679459 29575293 29526160 29496551 29510714
3800 29510714 29532168 29561454 29614746 29658023 29678993 29746085 29806841 29767997 29757708 29832587 29811923
3789 29811923 29770159 29669837 29518232 29407697 29246209 28989397 28744823 28472645 28159389 27805201
3779 27805201 27470876 27113478 26744699 26381936 25963297 25553865 25123113 24733055 24339113
3770 24339113 23848170 23403810 22969634 22552216 22069036 21656008 21216314 20763973 20347993
3761 20347993 19961806 19617381 19284813 18936229 18629185 18389957 18124222 17905482 17723595
3752 17723595 17512201 17339886 17215838 17152631 17082857 16973550 16901861 16919643 16910141 16920325 17030345
3741 17030345 17096415 17190874 17184026 17174080 17188710 17290542 17357596 17414190 17455012 17549317 17716125
3730 17716125 17886323 17947037 18087021 18198328 18355671 18514343 18674441 18809771 18944356 19199664
3720 19199664 19467263 19693028 19946546 20170751 20391067 20581545 20614376 20663548 20689162 20704459
3710 20704459 20775305 20831854 20862886 20934254 21058840 21188660 21380055 21519700 21715592 21886783
3700 21886783 22054397 22249062 22472901 22733188 23029132 23285586 23534928 23846785 24167652
3691 24167652 24494631 24875011 25230263 25582262 26032581 26474960 26866950 27343739 27923420
3682 27923420 28473579 28973054 29533394 30242398 30935516 31652643 32420446 33206587 34002800
3673 34002800 34878436 35819866 36852079 37870637 38962704 40145519 41378851 42684399
3665 42684399 44070168 45547022 47140108 48787036 50530586 52392610 54431080 56573596
3657 56573596 58855315 61366581 63976601 66859430 69989287 73319197 76909752 80836256
3649 80836256 85086237 89662755 94649586 99929886 105542589 111519263 117797803 124240665
3641 124240665 130852492 137516516 144063030 150319388 156129299 161339714 165882611 169711248
3633 169711248 172729428 175056738 176743244 177892396 178573914 178852333 178757922 178301016 177476914
3624 177476914 176230688 174516143 172298012 169433637 165899049 161778109 157081830 151947234
3616 151947234 146498524 140873301 135216468 129699531 124406417 119440911 114752928 110454948
3608 110454948 106475906 102846079 99510922 96486126 93668622 91033060 88623594 86349866
3600 86349866 84215584 82225520 80355133 78613572 76974934 75478557 74079663 72724974
3592 72724974 71571603 70444160 69440895 68528959 67687277 66978472 66330091 65793042 65320221
3583 65320221 64990791 64736139 64612422 64649234 64819129 65161080 65619969 66174531 66896274 67810167
3573 67810167 68924077 70143595 71494482 73033561 74773398 76610828 78606408 80800267
3565 80800267 83198377 85625376 88186702 90845301 93567303 96338599 99110365 101866163
3557 101866163 104570306 107251794 109872116 112338577 114650221 116857647 118975786 120937456
3549 120937456 122734212 124424824 125904025 127156412 128128845 128860446 129316199 129570707 129437584
3540 129437584 129149722 128569103 127779486 126895628 125939601 124804026 123681901 122439540 121256808
3531 121256808 120014995 118794844 117660853 116503295 115427371 114318942 113306970 112444372
3523 112444372 111667866 110941216 110343103 109863561 109415004 109056863 108748823 108450682 108222230
3514 108222230 108014638 107814866 107643732 107442049 107238590 107003357 106742628 106391189 105970332
3505 105970332 105383269 104652137 103854079 102915831 101736949 100358845 98911292 97264897 95498101
3496 95498101 93635704 91724294 89761595 87752397 85680152 83582123 81342284 79096548
3488 79096548 76917382 74726398 72500863 70298382 68079673 65850032 63663589 61499534
3480 61499534 59422583 57464902 55642593 54019426 52458504 51012286 49777145 48659098
3472 48659098 47595308 46749438 46001231 45430133 44960141 44605727 44333803 44143883 44083187
3463 44083187 44034630 44036984 43960846 43801624 43633451 43439787 43198161 43045217 42850703 42557857
3453 42557857 42206842 41819842 41441535 41128091 40839555 40595967 40334554 40051997 39841111
3444 39841111 39417064 38993258 38489809 37912776 37303051 36773341 36223283 35671056 35198100
3435 35198100 34749377 34322420 33909809 33466102 32908254 32395207 31794927 31168131 30494791
3426 30494791 29907512 29272913 28656597 27962834 27121303 26177604 25273041 24445732 23693177
3417 23693177 23098043 22480397 21920070 21406667 20895650 20369875 19836110 19283287 18835550
3408 18835550 18439665 18089288 17787955 17578393 17486039 17355629 17240848 17243401 17328884 17342467
3398 17342467 17332461 17399907 17504973 17633341 17753486 17695583 17417656 17040210 16679436 16255217
3388 16255217 15703931 15205734 14702980 14314186 13878328 13479725 13081266 12667436 12305541
3379 12305541 11942927 11667148 11431882 11268362 11045498 10948005 10807048 10792015 10763577 10792668
3369 10792668 10885563 10961239 11005756 11075030 11082827 11040815 10991903 10771359 10607049 10476030 10294381
3358 10294381 10096824 9913143 9729601 9567905 9472850 9370214 9290023 9273472 9216957 9239150
3348 9239150 9246725 9262847 9186066 9115907 8968664 8878002 8833524 8697045 8614373 8577490 8590316
3337 8590316 8574279 8567012 8566494 8614278 8720173 8775002 8877776 8901315 8915029 8971482 9001536 9049554
3325 9049554 9121409 9189271 9314694 9471392 9641327 9827865 10039531 10231454 10333833 10359803
3315 10359803 10324343 10233557 10177373 10082016 9898987 9706775 9429602 9154223 9007287 8934345
3305 8934345 8913379 8903785 8848086 8877378 8877791 8942848 9016246 9049739 9092321 9123884 9255589 9460265
3293 9460265 9589532 9622865 9686537 9813969 9926059 10101953 10323192 10520035 10715832 10883119
3283 10883119 10989287 11015680 10926880 10824136 10704953 10532837 10328087 10066408 9782754 9567826
3273 9567826 9395055 9246776 9109185 8953027 8836091 8778692 8769636 8786621 8853478 8982205
3263 8982205 9049672 9158219 9268980 9393656 9482507 9564906 9634415 9719093 9838205 10026596
3253 10026596 10133073 10223705 10286492 10312767 10421179 10487082 10527870 10484710 10265767 10049093
3243 10049093 9841020 9525369 9123567 8676352 8276475 7882971 7565595 7312011 7175435
3234 7175435 7054130 6912104 6836173 6790570 6713664 6712907 6715585 6682272 6655048 6597725 6554743 6587810
3222 6587810 6593338 6638483 6685243 6750147 6844852 6968307 7082797 7075938 7098135 7045093 6960620
3211 6960620 6796293 6549649 6247186 5904405 5664464 5467719 5330697 5171640 5028399 4897365
3201 4897365 4858062 4795882 4693339 4650228 4586725 4506087 4473451 4418477 4429411 4429565 4481345 4552792
3189 4552792 4547817 4599391 4648711 4696357 4803198 4875970 4915947 4949910 4944695 4898700 4856954 4839191
3177 4839191 4791871 4722915 4675068 4672612 4550035 4439956 4352580 4254306 4185400 4100023 3993501
3166 3993501 3881245 3798100 3774951 3749200 3741916 3733082 3753262 3728448 3590003 3412843 3289843
3155 3289843 3226823 3149337 3050006 2994566 2978553 2909769 2864005 2844137 2842632 2819556 2805602 2777432
3143 2777432 2798615 2832143 2839457 2799746 2766641 2757372 2772092 2859825 2885768 2937500 2988921 3097154
3131 3097154 3209307 3297549 3382464 3509968 3557219 3353154 3120878 2975769 2814731 2675063
3121 2675063 2610316 2471086 2367569 2335963 2281662 2246173 2256427 2223695 2239133 2185800 2176225
3110 2176225 2196689 2157435 2089322 2069957 2145638 2157084 2191270 2204824 2234102 2275319 2272309 2278752
3098 2278752 2324703 2349005 2389504 2430254 2347973 2214090 2172237 2118649 2020901 1972567 1946256
3087 1946256 1895592 1883357 1896997 1836873 1734466 1739600 1749390 1761120 1757827 1691235 1700274 1748604
3075 1748604 1729529 1677432 1642823 1623738 1673060 1651417 1630543 1629155 1596712 1565464 1539158 1508340
3063 1508340 1521915 1503787 1516523 1550970 1533839 1486071 1514180 1507533 1464727 1515223 1451218 1428639
3051 1428639 1470862 1412926 1420967 1437054 1435610 1407141 1376992 1337944 1324643 1381350 1333623 1324980
3039 1324980 1356532 1352507 1328265 1364392 1320962 1322599 1257511 1294474 1289235 1298017 1302657 1274151
3027 1274151 1316232 1303974 1255882 1273362 1265689 1267444 1199875 1181443 1207248 1230226 1218817 1174920
3015 1174920 1218680 1216030 1251357 1201565 1210509 1252705 1208912 1221626 1240600 1206083 1195996 1207040
3003 1207040 1208695 1225620 1239990 1227164 1233761 1298610 1282694 1231102 1248879 1226705 1227971 1268881
2991 1268881 1285105 1298162 1308074 1324032 1292013 1271719 1278040 1227327 1282560 1279488 1255962 1326303
2979 1326303 1355718 1374389 1417507 1469681 1464196 1470289 1525500 1445378 1402212 1446797 1553491 1556072
2967 1556072 1586875 1581134 1604568 1632491 1621963 1659604 1656949 1648688 1651373 1698372 1738541 1729506
2955 1729506 1759533 1801189 1837070 1887509 1919341 1932653 2004171 2100337 2135614 2156104 2248193
2944 2248193 2325989 2402560 2425660 2465966 2538215 2593841 2637751 2673069 2707198 2762997 2776746
2933 2776746 2868398 2892688 2903748 2977323 3047266 3121871 3208291 3183873 3190316 3292264 3406859
2922 3406859 3469399 3545566 3641891 3744407 3933300 4053165 4219827 4416906 4547582 4748395
2912 4748395 4953115 5182422 5483038 5791065 6118558 6447798 6919138 7332861 7822130 8384547
2902 8384547 9025387 9731640 10571329 11528992 12648224 13783705 14797313 15606356 16054750
2893 16054750 15993491 15367062 14287194 13003240 11843501 10852576 10014461 9353935 8928453
2884 8928453 8583603 8362892 8220953 8150643 8131482 8135468 8290851 8500922 8784720 9130340
2874 9130340 9529934 9942705 10503100 11122673 11979405 12946121 14151133 15523367 16934152
2865 16934152 18651808 20521997 22395891 23881885 24300587 23524813 21960765 19871094
2857 19871094 17669231 15636689 13862435 12438358 11303556 10446438 9790081 9213379 8818921
2848 8818921 8487729 8136574 7906206 7710485 7523484 7441072 7436590 7425361 7474736 7613294
2838 7613294 7842153 8110338 8460865 8768736 9204241 9676462 10158967 10544205 10813216 10957858
2828 10957858 10751553 10326509 9737957 9039260 8180774 7353614 6619666 5993324 5480690
2819 5480690 5047119 4748563 4394972 4172290 3998362 3790452 3636836 3452634 3292177 3201251
2809 3201251 3102997 2961346 2825933 2744802 2656156 2620900 2571850 2465084 2399366 2324596 2227333
2798 2227333 2154551 2175856 2098465 2069796 2057526 2016164 1892409 1838261 1783687 1729264 1706666
2787 1706666 1661580 1611978 1552586 1533348 1510872 1429515 1395261 1375078 1320648 1306785 1340376
2776 1340376 1284076 1255454 1239819 1147467 1143313 1116072 1139398 1166027 1149488 1107499 1067981 1057403
2764 1057403 1029117 974002 957795 995956 955506 907014 933983 927658 908708 938004 856725 857789
2752 857789 827427 808501 793940 794640 802324 841611 800824 716498 689346 711743 676918 677861 700061
2739 700061 684861 633077 583563 625735 611867 600372 606540 608835 603116 589438 618543 599615
2727 599615 597183 641311 651958 599833 582773 591153 578222 527568 482576 509336 591519 554843
2715 554843 572951 555996 507005 533371 500752 521485 508470 485976 483846 499389 462174 443369
2703 443369 413303 427409 424690 473125 400535 364350 426868 467973 447916 465591 452568 397827
2691 397827 415321 395830 388113 420386 392645 392956 419380 404854 410980 413586 420047 418188 387016
2678 387016 369668 376651 365183 330557 345668 341535 338976 321946 352410 423044 404790 345603
2666 345603 321023 299890 313485 302544 371204 302897 291764 302841 312929 336884 333783 337016
2654 337016 282638 289278 301321 315293 312005 311366 307525 320057 341737 346505 292323 295015 277741
2641 277741 349180 325178 277772 262969 265255 284050 325661 361653 402972 400895 366446 340159
2629 340159 297163 350483 316712 309776 315783 357258 392791 355570 330836 313431 375237 403553
2617 403553 410364 406491 345503 351546 389135 423037 412948 381258 405822 446109 485202 441923
2605 441923 406153 459870 433873 397529 350833 348395 407425 434286 398255 407883 417551 372726
2593 372726 344538 415459 455894 443122 487107 516017 484105 467747 438687 471616 483098 524036
2581 524036 577762 522873 561169 635380 587786 560456 566591 568970 569969 535938 546471 496593
2569 496593 476781 527504 584640 582413 622774 645469 604422 606701 623233 644548 616013 592748
2557 592748 623238 622819 658495 679393 681826 684230 726795 717481 742259 757263 726810 724478 747833
2544 747833 697298 653327 670631 692103 699538 672323 657431 661719 699828 750546 687620 727405
2532 727405 756218 746314 747610 794332 821893 781430 768730 795365 811044 787854 772266 733716
2520 733716 675179 672479 680741 671234 636120 642611 660037 577243 597736 620002 653126 667813
2508 667813 628370 553285 587100 626845 600687 650910 659729 634851 588844 620958 602095 606253
2496 606253 605881 621342 627671 681297 653177 617382 607798 575411 602377 608113 585528 532752 523810
2483 523810 476547 453222 435964 444638 434573 420531 400981 390249 362001 406485 410441 426912
2471 426912 406975 381263 389447 406694 383599 390717 389494 363002 350139 345246 300242 317100
2459 317100 353860 335261 311392 292153 283283 231985 263234 296286 305291 248213 223948 189060
2447 189060 189822 205022 219443 212564 216204 185215 220327 258586 220755 209190 134675 161159
2435 161159 166600 190225 186907 176286 170417 131013 148693 164612 159396 176157 103090 127379
2423 127379 166839 199945 163414 156838 114846 124460 108645 129549 153581 127035 152519 93580
2411 93580 121069 127850 120557 118442 161396 200799 175070 160523 169928 153086 166443 175936 151853
2398 151853 186453 153685 153759 125651 73888 126479 100555 57581 68690 48143 74998 72564
2386 72564 137261 192264 101059 83268 119258 117478 94111 70073 734 89658 102999 109260
2374 109260 83394 47834 109866 107906 81425 59493 65675 130017 29432 -35914 58088 38551
2362 38551 59850 76076 81126 84563 38260 82719 138845 102892 92521 76904 77311 35765 27926
2349 27926 50986 43846 122360 120081 91138 89767 101644 79146 36842 47553 110814 73739
2337 73739 50942 53222 64009 43306 69065 86137 106659 98877 68328 102091 46713 74201
2325 74201 112802 103667 98857 125736 84371 19455 68043 129267 137901 124304 155574 170176
2313 170176 163202 144435 107826 119796 105647 119339 148906 123474 122029 144669 177824 139511
2301 139511 173014 144076 66487 81006 116964 145922 141676 117534 140224 88508 102884 91710
2289 91710 94219 105994 76867 123052 137094 131003 141123 165525 161250 134836 121686 82205
2277 82205 46696 126385 131794 115732 116087 95138 96029 127109 100849 65038 59913 105161 126591
2264 126591 92965 107862 95104 99143 74660 91797 71476 57002 92562 95125 85233 76660
2252 76660 111238 65306 60039 61189 26957 58685 54536 76134 35240 16813 75242 52353
2240 52353 76778 115366 143818 126328 134515 134381 117580 141853 85806 78737 88846 83583 120889
2227 120889 61724 45785 42438 69084 80045 54771 14413 24359 53996 69740 108215 99000
2215 99000 88639 94154 87150 86582 96387 121428 132736 162774 157187 103431 109858 118151 116566 104314
2201 104314 79115 84778 44149 73681 117994 99747 100408 107327 70522 70812 86643 106943 91813
2188 91813 82893 67805 84528 91583 110494 153273 152732 71791 53987 86110 124015 119578 121896
2175 121896 104573 96805 106039 141616 151529 137101 135717 137288 114106 84552 50784 88774 120851
2162 120851 133919 109482 96566 115002 79375 105360 118356 169917 180010 126601 135818 184339
2150 184339 191346 220050 198044 207240 188838 218893 239476 207686 171627 145808 169700 198409
2138 198409 201555 207332 211342 218313 177015 171751 188932 225790 225589 202083 246142 247237 281955
2125 281955 299500 242010 273578 257035 276390 306142 357366 338738 309178 324726 340148 354734
2113 354734 337584 367009 396583 383678 399658 393622 384851 393917 446132 432573 490347 533657
2101 533657 519102 524227 540112 569893 530015 545672 615281 596174 584599 598747 576999 609105
2089 609105 607744 587854 609452 637758 737949 744681 754473 744448 750417 781509 816177 837191
2077 837191 929248 966283 998873 1038671 1065474 1128902 1160089 1187178 1217798 1252065 1356929
2066 1356929 1434541 1503715 1612793 1633497 1661633 1736188 1912338 2058942 2164749 2277223
2056 2277223 2471297 2623799 2856588 3122488 3324100 3520817 3713456 3996832 4418748 4920476
2046 4920476 5551797 6289856 7149035 8206811 9347647 10665269 12224146 14189899 16116365
2037 16116365 16122710 14282627 11750618 9389325 7732011 6513873 5575598 4845057 4295061
2028 4295061 3836204 3484460 3296064 3046647 2873059 2768364 2624295 2468743 2288255 2054411
2018 2054411 1932103 1805293 1684099 1627558 1546298 1428924 1366985 1319575 1289103 1219911 1129422
2007 1129422 1041448 1002354 976631 939359 889090 829312 812832 779943 752511 730278 687258
1996 687258 695108 689749 661595 628630 628759 637161 630864 628611 543990 554496 537313 499363 489650
1983 489650 494719 474570 438104 433765 403786 421023 415003 394524 400564 372466 366923 387076 359290
1970 359290 320229 276130 312052 336298 354725 346850 311392 322458 286718 279868 297124 314128
1958 314128 253457 261363 232122 248154 218800 209584 228901 257637 199535 189847 217229 185549
1946 185549 221232 240073 234075 185612 165380 124968 90092 131555 171193 154686 157970 193588
1934 193588 203117 178583 225214 172857 156590 178495 154040 169814 190013 178167 152644 137567
1922 137567 112407 138601 169140 149409 101177 118734 107047 59907 45535 108635 118663 149447
1910 149447 148876 148792 115919 77230 107098 117701 144056 154897 148707 87233 99711 75234 92506
1897 92506 92763 97937 88575 101564 115502 77409 66440 81523 44445 78492 111230 130410 89464
1884 89464 47541 22911 11295 64750 42649 74704 112059 125780 82045 -18912 20250 62349
1872 62349 18288 40227 41524 91485 97056 89304 46303 37061 20209 33865 46744 23506 54802
1859 54802 91403 100601 69690 55141 96565 72990 95905 67748 47230 36336 27411 4953
1847 4953 38308 71188 69789 52365 77875 68292 65225 38737 69961 58132 68310 94176 106636
1834 106636 119332 94906 65694 41681 78675 75300 37254 32692 56779 28940 51693 14868
1822 14868 48794 56242 65391 73281 40713 43743 75134 100738 60494 -15781 16309 34437 16186
1809 16186 57611 44467 70968 64884 49240 24998 -6111 -17762 -26391 19896 24346 66348
1797 66348 34507 31400 62840 90359 59141 32517 72408 7304 -56538 -11851 -28453 33838
1785 33838 13214 15551 50365 91201 77301 83519 63893 38664 62475 105658 134262 96724
1773 96724 76782 63108 90551 69031 106476 160052 124812 63325 62978 70002 63525 77499 109956
1760 109956 102951 49378 92293 69309 22957 6595 55765 75534 57704 13975 8660 9133
1748 9133 -17479 19842 26901 8533 27967 16889 33163 8094 -5318 -44260 -57176 -13588
1736 -13588 7385 25366 51223 9117 -4505 14747 10692 12857 33989 60158 39688 45621
1724 45621 37742 65020 89437 39126 32270 78664 74841 39732 14608 18797 23003 24666 36266
1711 36266 10362 1912 46139 31616 31520 49966 39793 -37521 -9082 27912 19069 -16559 28453
1698 28453 21873 12336 21880 21984 13394 50268 27003 -10152 -7960 28500 24855 30164 34496 -22765
1684 -22765 -87574 -42464 6892 9802 14138 -2932 3793 -12970 -957 -1726 648 28444 -1130
1671 -1130 34783 61897 38799 54277 51480 38172 62657 46446 33974 59048 93968 73210
1659 73210 -6578 -908 -23697 -2598 17512 -52421 2520 699 -10250 26664 38522 10317
1647 10317 3643 8084 1454 -33972 -75558 -56068 10451 -68986 -72543 -66919 -34112 16108 35838
1634 35838 7274 19941 -6337 -12214 -24579 -2104 17451 30045 58485 2856 15195 8370
1622 8370 29765 40376 58152 52781 -604 -77390 27025 60488 41127 71322 -16374 -62265
1610 -62265 -1035 26859 65947 54136 43202 15019 21448 30801 30664 9456 13688 -10305 38633
1597 38633 -35131 -66863 -9737 25940 20000 53454 61418 39617 35006 4906 -24561 0
1585 0 6987 21447 5434 -40539 -58849 -67741 -29560 40307 73911 44716 17707 17326 28099
1572 28099 25550 2651 36894 34501 3319 23585 -8050 -28372 -12602 -13558 -1026 16249 22747
1559 22747 -15756 -2557 17122 -20964 2216 25057 23773 20532 48812 55376 26262 44087
1547 44087 9632 -11417 -27475 -22641 4222 14722 26542 -6992 4431 4059 31331 13783
1535 13783 17642 23163 937 -6060 -7363 35919 -22681 -66057 -82586 -17221 46796 41760 2086
1522 2086 4041 -810 6788 -23850 13447 -7772 -19300 22000 28158 27845 -18134 -3551 -417
1509 -417 40010 27261 -6185 -234 19097 -10686 14264 35289 -23539 -44793 -57410 -23533
1497 -23533 -18074 10159 16583 5901 2600 -4377 3831 -20087 25435 -6710 25946 -17543 -33799
1484 -33799 -12553 23565 -6293 -17782 -10756 1310 -23152 37280 59188 5008 -10903 -16582
1472 -16582 -50268 -97814 -91646 -50119 -44059 -23464 -7018 65112 52815 12571 9896 52459
1460 52459 62772 -16647 -52566 -32970 -10944 28709 5842 -45545 -29151 -5621 -29617 27223
1448 27223 50667 28892 42339 32462 16489 6050 18839 10658 -1435 -2366 -48120 -40575 10392
1435 10392 -14106 -32750 -13636 -20944 -45758 -7916 -6297 13461 21710 -19189 -15440 -13528 -29295
1422 -29295 25090 49730 -20663 -83571 -90342 -26715 2562 -44802 -58766 -51454 -20064 -47931
1410 -47931 -63850 -30377 3597 2319 -8817 -2685 -6859 -21879 -4918 8378 23176 -10097
1398 -10097 -11080 -1056 13700 25717 37726 39659 85123 107126 83071 20081 15241 -21302 -8055
1385 -8055 54253 64078 21168 12324 26118 -1576 -47751 -18954 27754 740 -72970 -25462
1373 -25462 36829 27199 -2773 27448 37013 35472 -30738 -13047 9951 -56156 -51127 -66641 -55088
1360 -55088 -66003 -61685 -13590 -9231 -21582 6882 14111 -2960 35489 56786 -22864 -12086
1348 -12086 23967 -27410 -20665 -45730 -48186 -36100 -18830 -26559 -15907 -16049 -34201 11040 27135
1335 27135 24358 32179 -14665 -69415 -37937 -5595 6234 -11891 -18983 -69236 -46939 13421
1323 13421 41215 73 11218 -10142 -10370 4285 45351 5145 -70827 661 -12710 -68278
1311 -68278 -68781 -10616 -13190 1865 26752 7505 -30003 -22713 33371 63354 20271 -18877 1457
1298 1457 17520 69475 4301 -33677 -55667 -27803 -32300 -3759 -1729 -22170 -9813 -11463 -3263
1285 -3263 15811 -33006 -13899 48495 11031 -25085 -2441 16718 -1378 6218 -7667 -47753
1273 -47753 7645 7399 -14056 -10504 -57147 -58627 -22956 -7613 27419 23050 4151 -11064 -67138
1260 -67138 -42008 -719 15966 -628 -11045 3813 -64417 -67692 -37935 -1110 34962 57792
1248 57792 46590 37195 18791 51604 56076 -51695 -46871 -7606 43903 -7292 -31488 -10606
1236 -10606 -31975 -83701 -41311 17788 -28149 -19992 12266 -49239 -13622 -15486 7033 28530
1224 28530 2392 -18584 -15300 -5563 -21206 -28988 10013 -24929 1593 18677 -29951 -8861
1212 -8861 27593 -5424 -38409 -3569 8199 -32068 -26884 17905 28382 25815 8217 9414 -29574
1199 -29574 -43936 -52471 -45767 -30691 -52070 -33112 -15328 4252 2305 7520 7591 -5374 -15679
1186 -15679 -21049 -31725 -18686 -53213 -68571 24571 -26281 -60977 -54057 -12228 11558 19831
1174 19831 21667 4217 60257 49443 -20589 14168 26287 53225 85100 49093 -44689 -22741
1162 -22741 58376 43838 55977 25969 -24424 -19996 2726 -1325 -75472 -80134 -79413 -20331 -29169
1149 -29169 36713 82044 52759 16016 -18342 -33347 -20564 -34171 -65299 -24805 17042 -16644
1137 -16644 -3341 -28085 -23960 20665 21702 3138 11818 -506 -45686 -62707 -34023 4180
1125 4180 -12595 10756 -8643 8233 -25395 4950 -21174 11716 -3773 -6150 29625 55344
1113 55344 18136 30225 21533 34818 55469 21915 -44609 -28919 129 4552 -37086 -60119
1101 -60119 -48063 -55728 -62129 -53859 -36254 9622 10595 -12431 -28906 -11397 -59097 -60768 -17804
1088 -17804 -4448 3721 -15078 9774 -1428 -17435 -31914 34477 34291 31839 34162 19655 12803
1075 12803 12730 -26265 -27415 21375 37926 9303 -20144 -6850 5801 2656 -3982 -16025 -2006
1062 -2006 4508 -3445 -70353 -32045 16167 72816 20760 -39269 -26444 -3031 21249 -13571
1050 -13571 -19185 -38621 -14951 -11713 -27767 -36778 -12414 -42315 -35398 -40077 16682 75758 23173
1037 23173 -14184 -11886 -32129 -41283 -20999 -33038 -21145 -14101 33081 30853 22828 -10059 -15651
1024 -15651 -36970 -11525 10140 29835 2056 9086 5506 4199 -30425 -37809 -12550 -21455 -50184
1011 -50184 -37479 -22285 -8198 6606 -26808 5509 3554 -30874 -41719 -4229 -40766 5472
999 5472 -8961 -39091 -57776 -84549 -64991 2607 46289 18489 9358 -26873 -22638 -35682 -40163
986 -40163 -76828 -50643 -52764 -24322 27194 -73467 -51323 6963 37642 1555 -5206 1902
974 1902 -12448 -34999 -13949 -32480 -75050 -11197 36087 47127 8955 37111 71280 46887
962 46887 4337 39272 20466 5125 -14696 -33979 -46604 -31847 -13489 -20608 -27591 -4574
950 -4574 -13310 -3253 41664 9062 -54330 -52846 -41337 -52438 -36030 -16739 22493 -37721 -60354
937 -60354 -45852 -42372 -40569 10688 -17673 -68855 -32417 -18622 5015 -874 -14228 -23690 43014
924 43014 44035 33850 28364 11240 79911 35492 17087 34033 40880 43716 25584 -22740 -36579
911 -36579 9717 -471 -37483 -16434 -1859 1881 -67841 -15586 -43659 -46543 2516 19653
899 19653 3297 -19403 -55487 -29802 37011 3046 -16519 39799 41169 -23863 13114 21482
887 21482 -28101 -75142 -49429 -30024 -9857 1076 -39037 -49397 5839 40507 22704 27980
875 27980 10894 31319 -4232 -25992 12295 49033 12966 7887 6296 3626 46230 472 -8228
862 -8228 -7924 6589 27576 12003 -18130 29153 14548 17314 63267 29337 61626 50840 2028
849 2028 -2139 -10959 -3777 4544 24260 30275 30132 -48 24750 -6503 -2663 15369 -33011 -67705
835 -67705 -102100 -83067 -53201 -62692 -67461 -19069 9091 31828 59320 -1963 -882 -4529 -12594
822 -12594 13450 -1642 -10507 3658 16614 -23519 -10695 -16424 2608 -4274 8184 37247 36857
809 36857 23684 60534 43211 -14161 -7977 -44304 -50062 -17772 -8661 -50228 19981 34578 51097
796 51097 31267 16227 -22909 4300 -28202 10755 34142 12427 11571 17034 47487 4916 8268
783 8268 -12163 -35282 -17593 -32599 -27183 3962 8737 -33950 -12115 26962 -44406 -87825 -73578
770 -73578 15688 13896 -6363 -32070 -38408 -29478 -16033 48066 49613 4392 -29831 -17795 5281
757 5281 -20594 -24040 -25792 -27770 -52121 -38619 -18024 -21521 -8823 -33573 5550 29704 15344
744 15344 -67915 -47348 13691 -17644 -2595 -1456 18694 -2699 -23557 -27008 -39556 -63505
732 -63505 1953 40517 32172 16861 25873 -23797 -41103 -20308 11170 37247 9177 24336
720 24336 -19727 -65065 -56739 11072 16273 -3476 38780 35348 -45088 -58215 -29127 -39899 -38443
707 -38443 -18488 -20978 13790 -1010 -17675 31158 15936 1615 11828 7068 -12108 4088
695 4088 -30754 -56998 -41859 -13302 -36613 -13453 -7842 -30067 -20888 -26087 -4499 13521 -19320
682 -19320 -30362 -11136 -19707 12684 11571 -23158 4132 22774 8419 -8562 -18426 7173 45771
669 45771 -39339 -7587 -28007 15999 25851 -2114 11949 -4336 -40333 -37919 -15481 -66660
657 -66660 -71516 -36805 -19200 -37714 -7541 8366 36194 30879 23411 30844 -33578 -72797 -34442
644 -34442 -35315 -65640 -42350 20154 94 -25814 22273 51991 19857 35823 41154 -1854 28126
631 28126 20281 -60579 -45441 -21199 -29503 6369 -2029 -20984 -16016 -16263 24097 28008 8946
618 8946 -25201 2763 8279 -49754 -35164 22917 -30986 -1820 8212 -25742 -32450 4681 44528
605 44528 37155 -4027 -14177 14343 17536 -46827 -20212 -46089 -54619 -45049 14134 28098 -29644
592 -29644 -15534 -12472 -34874 -42262 -47270 -51479 -31497 -24223 5751 98658 46844 -19595 16198
579 16198 41466 33874 32655 22096 11162 -11443 -40293 2170 -1262 -20220 6248 13360 -71674
566 -71674 -40383 -55478 -22136 -6238 -27010 -43743 -8656 14033 -17000 -12473 39917 55868
554 55868 5408 194 10742 -31472 -27534 46506 4820 -25354 22618 40380 19700 -3279
542 -3279 -49904 -29938 10672 26320 8466 2201 -7473 -37715 -32440 -24393 13604 -5534 -33992
529 -33992 -59929 -54351 -6323 -19750 -20677 -41815 -6606 30473 6335 8546 30608 62632 8337
516 8337 25773 -9015 -15393 -17220 929 -41068 -104601 -86823 -45996 -33414 -46940 -3997 -24650
503 -24650 1018 51990 4773 -5951 -20412 -9623 10377 33493 -29100 -45147 -917 -4837
491 -4837 17572 62602 13074 -18222 -36337 -23464 -41735 -51077 -27824 -28404 17264 -55535 -21017
478 -21017 2999 -44952 -76642 -73021 -36045 7932 5307 3706 -15818 -26375 -3295 -4086 -5112
465 -5112 3021 24665 10417 -38580 -56278 -24592 6320 12231 26208 -4400 -4158 -8218 -38110
452 -38110 4669 22416 -20552 -19026 -3254 -3243 -2548 -15273 -32388 -3894 13234 13569 -30407 -12238
438 -12238 -30573 -20321 13574 3419 -3861 -26417 -26923 42717 43273 15664 -6256 -13244 57288
425 57288 32368 7042 59939 27159 -67701 -33633 8128 5523 18395 2748 23821 11436
413 11436 25167 89138 42384 39107 74405 62435 58248 30215 8126 -13653 -19446 -21672 -53341
400 -53341 -27871 -25385 9383 -24564 -11552 31864 10343 -7933 -15076 -4401 -5368 -15385 -11160
387 -11160 -11207 -67754 -46380 28914 53042 -6942 -71685 -56703 -68329 -20303 -30615 -10841 19207
374 19207 48172 9860 14282 48721 19408 36205 27942 12450 -2135 -19209 -22340 -4629 -17553
361 -17553 -17137 -2683 5333 -2125 56626 42341 42731 85746 90653 36144 25256 -7043 -27872
348 -27872 -36087 -11707 36493 37545 50683 24303 -15131 -41299 -34057 -22371 -20636 4991 16753
335 16753 -10423 31402 51402 -34761 -49936 -40988 -5615 -7040 -17829 6158 29269 -2387
323 -2387 -3100 -57025 -63754 -44600 3638 56869 45163 51137 35315 -1070 -4050 3261 3853 16935
309 16935 9221 -19021 26743 59845 23433 -35995 -19251 9293 -39410 -7279 17243 58591
297 58591 52093 37169 19308 -11760 -55132 -39308 -3200 -10350 -26358 -15074 -13504 3728 -21929
284 -21929 3692 6741 -2960 -17377 4453 -15142 39249 -17007 -53667 -15257 -34770 -28422 -42129
271 -42129 -6585 -6075 -6135 76134 70079 4994 49783 83636 40560 -10083 31513 54026 68420
258 68420 64841 16118 27501 38724 14442 27620 18841 17569 -13470 -39537 -39179 -12643 -12577 9427
244 9427 10766 -37990 -16077 -27374 586 21124 27022 -24093 -18218 43806 -14115 -38202 -24835
231 -24835 -15845 4480 -6298 3541 -15304 -21966 -16178 -11368 -12935 -2945 -28668 -46086 -29088
218 -29088 -45706 -30646 -32956 53433 21439 8323 -16223 -51443 -7899 5060 9086 25091
206 25091 33073 24701 18238 37944 28786 20472 -13701 -5496 14056 -20951 -85805 -71654 638
193 638 -5166 7794 3022 -217 -25596 -27848 -22968 2867 7009 12850 18653 25069 30612 -7647
179 -7647 -34748 -36089 14179 18831 1914 12019 16979 -30755 -35025 -9051 23867 32393 -16596
166 -16596 -16337 -7345 10675 48717 24789 22004 31735 15920 -26003 9658 20702 -9773 -20640
153 -20640 -26009 -11796 -22704 -21262 8912 21804 76858 59796 9289 14077 52476 39139 -15382
140 -15382 -837 22305 46498 17576 -663 7348 3822 -1039 46925 37690 24814 27078 34213
127 34213 22713 -9685 36048 7846 -62301 -37057 93 -1453 -88 8072 9440 612 -43830
114 -43830 -8270 18217 6359 2290 11922 -46201 -48135 -1077 11564 34273 40055 33258 12227
101 12227 43195 23245 -29489 -8959 21782 -3658 -23401 -52061 -16369 1408 -39834 -16383
89 -16383 -12160 -10431 4658 8780 -847 -17614 3967 -24822 -22406 7301 17684 9075 13360 27071
75 27071 1568 3623 -1301 2444 -13275 -6317 8725 14284 5765 5148 33530 16242 25177 69286
61 69286 31837 -15085 -34184 -20971 -28778 -40582 -22178 -2261 26170 44412 10754 9047 10821
48 10821 13571 3870 9377 -21561 -31075 -1028 -12791 -22885 9214 31380 7178 20064 -4746
35 -4746 4375 7252 -36242 -24580 -39147 -977 -11313 -28430 -11437 20023 2931 -21319 -1552
22 -1552 -22975 -3962 26004 27219 43006 47071 22207 -3536 -25576 -73303 -29332 -10050 11241
9 11241 51690 -3343 27419 35414 21600 43934 26052 -23260 -25656
0 -25656
$$ Imaginary data points
##PAGE= N=2
##DATA TABLE= (X++(I..I)), XYDATA
16383 -1412899 -1378320 -1367834 -1364351 -1337216 -1297962 -1256125 -1245284 -1238961 -1203128 -1165258 -1109846 -1080727
16371 -1080727 -1085340 -1064838 -1014109 -1012632 -970977 -954258 -928782 -879125 -873624 -837696 -810703 -801817
16359 -801817 -790457 -749964 -721109 -693296 -679967 -652123 -641384 -656673 -605184 -563947 -558963 -521020
16347 -521020 -483311 -494865 -456233 -377660 -331088 -315006 -317306 -294375 -294249 -305633 -226754 -223523
16335 -223523 -207159 -173205 -131561 -102728 -79175 -72849 -28518 -20183 1798 46380 58077 60240
16323 60240 81057 118942 161177 182575 180829 202101 218094 206347 205055 250186 269731 310419
16311 310419 333285 369319 422751 420324 383742 422640 488304 485180 491840 481444 527174 544055
16299 544055 576852 608169 656210 648622 647170 679389 697061 706324 705805 758201 812127 796843
16287 796843 838907 885002 876741 864587 899045 921546 949589 977284 977061 961032 988740 1021839
16275 1021839 1027556 1030466 1031008 1101230 1162217 1148536 1166725 1176087 1186491 1199605 1195382 1281591
16263 1281591 1285716 1270889 1307402 1348464 1362845 1341314 1349534 1337821 1333296 1352035 1380404 1401814
16251 1401814 1424296 1458093 1467417 1474623 1515484 1530344 1475849 1502797 1547631 1566194 1600624 1665278
16239 1665278 1678252 1723854 1670126 1687325 1691719 1745980 1746079 1713859 1728221 1766138 1772273 1801046
16227 1801046 1788346 1742486 1756448 1761678 1788977 1827039 1845851 1840161 1839964 1868065 1867364 1842360
16215 1842360 1876945 1884406 1922678 1932569 1950958 1998655 1948636 1951700 1989154 1994188 2019357 2029481
16203 2029481 2033219 2011611 2015309 2036038 2058174 2060518 2066916 2091485 2129920 2112361 2149116 2157675
16191 2157675 2161217 2128186 2151478 2192078 2188404 2191381 2178476 2211362 2212811 2206124 2190428 2230823
16179 2230823 2251634 2267098 2283669 2276580 2272962 2279580 2277940 2260937 2308641 2344499 2312370 2308650
16167 2308650 2309788 2284066 2343887 2314418 2302503 2313881 2293265 2301143 2312700 2362903 2360473 2391827
16155 2391827 2386996 2357637 2383461 2414444 2404723 2392826 2442564 2448016 2421975 2440966 2432349 2408532
16143 2408532 2467487 2462749 2481516 2508147 2443454 2434744 2437912 2464242 2417080 2440157 2465532 2465208
16131 2465208 2473017 2483278 2481335 2434189 2419414 2461753 2518675 2475430 2510028 2560625 2517558 2522348
16119 2522348 2537977 2519243 2504284 2557400 2596808 2545880 2506856 2501255 2536868 2526628 2554649
16108 2554649 2562764 2570626 2569665 2483068 2478916 2540007 2565355 2569211 2534752 2530897 2595291 2596703 2592371
16095 2592371 2619054 2592814 2577469 2576425 2595997 2591357 2614388 2608670 2574841 2544731 2595103 2636105
16083 2636105 2607966 2560918 2657583 2637238 2598376 2611465 2620674 2643084 2603070 2617766 2648409
16072 2648409 2650880 2599939 2611276 2609039 2577959 2555120 2584541 2625719 2637795 2628077 2609913 2605005
16060 2605005 2624673 2647331 2609202 2574296 2547685 2600088 2592013 2555091 2574604 2616332 2605364
16049 2605364 2556202 2587925 2607445 2583979 2594764 2627370 2633815 2645391 2592398 2567946 2599962
16038 2599962 2633678 2644195 2595392 2626275 2672423 2644921 2682473 2647140 2656496 2683688 2652767
16027 2652767 2590211 2636857 2615596 2621652 2618970 2589238 2603125 2593608 2583736 2601075 2611467 2575982
16015 2575982 2607334 2634121 2660229 2669524 2613923 2605052 2636022 2681719 2675452 2659703 2631124 2644274
16003 2644274 2643500 2654459 2665946 2687750 2637292 2616462 2610628 2594741 2619646 2608837 2615848 2604045
15991 2604045 2564675 2619052 2645694 2662229 2666379 2671137 2624997 2577640 2616927 2631989 2645827 2589644
15979 2589644 2580229 2616276 2646135 2658809 2614757 2630422 2636218 2596710 2616422 2631177 2669434 2663981
15967 2663981 2678118 2668796 2658360 2665372 2671623 2687304 2633400 2613290 2646868 2618262 2692054 2687756
15955 2687756 2661538 2628133 2685557 2680764 2688623 2662148 2635398 2658069 2651999 2603885 2632116 2664500
15943 2664500 2642349 2651855 2707185 2680084 2701415 2715427 2704426 2657527 2656410 2666498 2586624 2626144
15931 2626144 2664312 2664033 2626796 2646963 2696226 2689739 2654106 2713822 2690226 2649605 2653633 2689729
15919 2689729 2720857 2674808 2657384 2715053 2697022 2751533 2754368 2723155 2690113 2662784 2679931
15908 2679931 2716851 2707249 2670546 2713607 2685526 2670427 2648313 2647416 2705449 2678483 2681173 2718663
15896 2718663 2716616 2688059 2699092 2699371 2714792 2721951 2670546 2692842 2712734 2683468 2707892 2721642
15884 2721642 2708985 2675455 2666890 2706730 2724503 2658642 2625895 2648289 2651510 2631150 2614249 2692556
15872 2692556 2731024 2699463 2687803 2734843 2757808 2724983 2698136 2715174 2685954 2684469 2661641
15861 2661641 2651541 2644731 2673846 2717232 2719155 2728431 2692336 2681738 2699424 2767375 2745336 2753440
15849 2753440 2710207 2672684 2720708 2742368 2740262 2725903 2698931 2691297 2678054 2728937 2702297 2689729
15837 2689729 2748928 2760089 2735277 2709365 2703769 2675363 2705067 2744610 2711467 2649988 2648823 2689345
15825 2689345 2736934 2717006 2666435 2719814 2713284 2678830 2671402 2642754 2684711 2699279 2693217 2675612
15813 2675612 2687940 2666318 2713515 2754531 2714451 2668974 2705288 2711889 2737919 2733838 2740732 2764806
15801 2764806 2725209 2716039 2751113 2729199 2695385 2725336 2682188 2654851 2703321 2721157 2701764
15790 2701764 2688801 2734807 2715002 2651059 2671114 2702853 2726731 2727671 2749067 2747312 2743703 2744506
15778 2744506 2708193 2704516 2699105 2738426 2726295 2724919 2739650 2756247 2781190 2751247 2745630 2760403
15766 2760403 2773961 2730483 2725217 2725023 2721641 2675431 2697427 2694094 2741842 2781195 2773894 2767088 2728417
15753 2728417 2721231 2723228 2694221 2684666 2691129 2696241 2750159 2712286 2730570 2725495 2695873 2716714
15741 2716714 2747457 2763724 2730238 2729254 2729966 2715183 2740826 2725544 2712221 2722114 2770162 2774438
15729 2774438 2715296 2727258 2751021 2772508 2772974 2809317 2795577 2775296 2763855 2717500 2709120 2790572
15717 2790572 2780426 2791641 2731586 2732702 2774669 2738421 2731717 2705988 2735452 2776837 2764256 2704004
15705 2704004 2725461 2747344 2774008 2793331 2736540 2736417 2773320 2783413 2749153 2732158 2774003 2785711
15693 2785711 2731507 2718153 2710512 2705302 2745635 2768485 2751678 2767573 2806343 2781507 2760658 2739470
15681 2739470 2727477 2758314 2784834 2760441 2791462 2793057 2829410 2833990 2809311 2795651 2786615 2736019
15669 2736019 2726523 2757822 2758009 2686646 2691859 2720831 2746980 2796284 2764596 2802471 2800797 2776780
15657 2776780 2757101 2743838 2746131 2728709 2757413 2756443 2752987 2746641 2716852 2746987 2774075 2779367
15645 2779367 2765424 2729973 2732924 2771969 2763854 2776059 2764928 2772512 2790724 2804927 2803711 2735998
15633 2735998 2758650 2716990 2677174 2697228 2752747 2757163 2791872 2783716 2786654 2792515 2772171 2781609
15621 2781609 2787541 2773894 2777165 2802649 2773906 2764222 2788128 2797209 2788390 2778664 2781190 2794238 2762292
15608 2762292 2739836 2718210 2752670 2784955 2812666 2772421 2799563 2757014 2706079 2768364 2799891
15597 2799891 2799693 2786901 2739291 2770253 2835374 2821913 2804341 2761973 2736912 2717897 2722304 2797732
15585 2797732 2813689 2766746 2792826 2788660 2793626 2789058 2757253 2777542 2758653 2810852 2783517 2744844
15573 2744844 2753066 2762999 2806857 2806630 2790300 2803144 2860310 2887061 2836702 2815004 2817377 2762500
15561 2762500 2787103 2815728 2734467 2732248 2763080 2804621 2792732 2752978 2783344 2796813 2779973
15550 2779973 2757549 2787157 2796410 2807940 2825138 2802318 2787354 2759847 2760773 2766836 2766894 2786763 2782848
15537 2782848 2795229 2826420 2851438 2792543 2759671 2761500 2748513 2787678 2848649 2817871 2842758
15526 2842758 2824253 2802765 2754688 2717740 2781821 2810773 2783905 2790502 2853730 2881117 2838736
15515 2838736 2791048 2812136 2810582 2771740 2746646 2802521 2783730 2811782 2809163 2848028 2851418 2782950
15503 2782950 2773113 2778876 2772068 2779453 2823075 2838859 2834171 2785627 2800473 2785442 2784983 2734055 2777133
15490 2777133 2842971 2835552 2843182 2844069 2852011 2858663 2787802 2741736 2755695 2756561 2813484 2790155 2837179
15477 2837179 2826081 2804415 2771868 2814383 2794937 2812997 2833421 2833372 2835723 2777346 2728468 2743690
15465 2743690 2816011 2806613 2833917 2823629 2829044 2796946 2842003 2813597 2798682 2865447 2841466 2812966
15453 2812966 2839125 2827473 2819747 2796661 2800679 2796681 2798247 2795267 2825669 2835729 2858125 2867776
15441 2867776 2831181 2884611 2886520 2874272 2836412 2835709 2854521 2842194 2827379 2844661 2820041 2800288
15429 2800288 2816632 2799327 2783752 2787014 2811423 2842277 2861084 2805635 2779270 2789444 2822504
15418 2822504 2839906 2780942 2824164 2834375 2843434 2840101 2827739 2841902 2814636 2803918 2827180 2883927
15406 2883927 2840610 2814262 2819804 2837045 2824309 2780903 2806894 2805636 2813955 2843854 2835092 2845290
15394 2845290 2830976 2833004 2810135 2833001 2837130 2840685 2812172 2808022 2788917 2800697 2827776 2840283
15382 2840283 2856249 2933128 2860618 2815808 2832640 2852609 2856954 2848879 2826727 2815456 2846604 2842146
15370 2842146 2819669 2837956 2842239 2824141 2867999 2835721 2819053 2821625 2845831 2878578 2893948 2889665
15358 2889665 2946231 2874863 2905865 2858401 2838853 2866261 2866278 2891306 2934921 2846054 2839093 2866066
15346 2866066 2862673 2822383 2849138 2838641 2853700 2855451 2808622 2798573 2811586 2819462 2867277 2863078
15334 2863078 2867591 2868367 2854123 2854490 2854452 2911414 2882966 2857275 2811617 2827156 2819327 2897509 2908266
15321 2908266 2865568 2893990 2901574 2864992 2814588 2826822 2847744 2831259 2849191 2859856 2905708
15310 2905708 2932021 2871789 2848342 2870504 2894147 2885594 2913218 2899382 2863734 2861687 2834926 2851736
15298 2851736 2807307 2845570 2940777 2935714 2918659 2902602 2925129 2904965 2818551 2867256 2860332 2873385
15286 2873385 2882239 2800498 2806266 2910404 2912864 2910217 2884641 2881558 2841592 2855203 2914946 2892290
15274 2892290 2915492 2957135 2936522 2865592 2895174 2914288 2893619 2875198 2843610 2881960 2862688
15263 2862688 2881039 2917938 2911776 2857422 2808587 2870388 2894161 2899724 2954474 2950374 2933337 2937763
15251 2937763 2916846 2910814 2891246 2873099 2877420 2899861 2845262 2884725 2884445 2879702 2903719 2928924
15239 2928924 2930462 2931809 2936935 2897243 2958337 2910150 2869127 2859101 2850753 2870081 2868463 2830191
15227 2830191 2850132 2881616 2897050 2884109 2893747 2903828 2898076 2907020 2911957 2908321 2876528 2926077
15215 2926077 2962727 3001750 2968290 2879741 2915178 2956188 2911774 2882409 2873972 2898963 2904402 2899481
15203 2899481 2881061 2911159 2906621 2848485 2871777 2853150 2808781 2840032 2872476 2913826 2913973 2890727
15191 2890727 2877341 2910848 2964115 2937947 2887003 2922792 2954999 2940001 2942040 2914416 2895308
15180 2895308 2930315 2915205 2880149 2879331 2925011 2935579 2941715 2940417 2936329 2897120 2876115 2901329
15168 2901329 2906968 2905374 2925757 2931954 2952399 2949971 2939423 2927239 2918625 2952352 2948106 2999021
15156 2999021 2962892 2930082 2892061 2903826 2934638 2935760 2918987 2903109 2935914 2945153 2967713 2975614
15144 2975614 2972925 2942390 2877516 2870493 2915295 2935107 2956874 2947604 2955527 2945438 2956557 2950019
15132 2950019 2924127 2903476 2923763 2947339 2932787 2926482 2936564 2948728 2931755 2995471 3018778
15121 3018778 2951740 2945526 2951556 2973722 2997613 2971495 2971433 2997016 2988606 2990614 2969647 2916958 2929892
15108 2929892 2929602 2955700 2945785 2956240 2973748 2993737 2934157 2955267 2950952 2921289 2989811 3005444
15096 3005444 2983940 2981507 2943941 2903676 2950187 2927627 2893066 2926861 2937862 2984484 2976701 2965183
15084 2965183 2968946 2959927 2980352 2965821 2991245 2942832 2929078 2939748 2888483 2894785 2920496 2963313
15072 2963313 2947597 2905717 2913716 2922711 2910330 2928282 2948674 2955275 2932508 2963566 2966273 2942064
15060 2942064 2982129 2966977 2974999 2929592 2945009 2928169 2984068 2998169 2982130 2952422 2960181 2949306
15048 2949306 2916742 2948614 2960005 2960055 2963496 2942626 2957728 2999296 2945050 2938543 2923510 2942186
15036 2942186 2973794 2958991 3016411 3028469 2989485 2889938 2920511 2966151 2967793 2986023 2924795
15025 2924795 2956313 2950209 2917400 2892972 2928344 2932232 2955616 2959757 2927871 2989928 3018934 2951692
15013 2951692 2959113 2958331 2946692 2938197 2961476 2933070 2933006 2968437 2972382 3005991 2990932 2971284 2971277 2952721
14999 2952721 2987813 3028598 3016019 3027117 3024181 3013119 3018829 2994819 3042498 3043921 2999090 3009999
14987 3009999 3032933 3007435 2988802 2988120 2965352 3004423 2984882 3009695 2997778 2946101 2994992 3025888
14975 3025888 3008532 2997920 3031568 3056472 3001695 2941542 2987160 2994115 2989193 2998861 2972784 3000242
14963 3000242 2979939 3028211 3006089 2952494 2975486 2953559 2982768 2978088 2941463 2954551 2974387
14952 2974387 2965694 2941095 2931392 2954088 2932840 2887227 2946513 2938111 2971188 2948424 2928973 2926025
14940 2926025 2905058 2925214 2964477 2990328 2984717 2962443 2942422 2944794 2927334 2975559 2985177 2983438
14928 2983438 3009866 3022545 3024995 3036167 3017245 3012032 3016588 3018547 3032334 3027930 2945164 2953732
14916 2953732 2968275 2974277 2960016 2961511 2999159 2958969 2993846 2978707 2965948 3010665 3024227 3038878
14904 3038878 3022998 3005706 2996490 3035658 3033945 2988304 3000848 3026542 3038685 2993268 3000213 2990261
$$ [...]
##END NTUPLES=NMR SPECTRUM
##END=
