##TITLE=1H_CA-9014-1
 CDCl3
 8 sc, 
 2.06.2022
##JCAMPDX= 6.0         $$ Bruker NMR JCAMP-DX V2.0
##DATA TYPE= NMR SPECTRUM
##DATA CLASS= NTUPLES
##ORIGIN= UXNMR, Bruker Analytische Messtechnik GmbH
##OWNER= root
$$ XWIN-NMR		Version 3.5
$$ Thu Jun  2 14:01:27 2022 Russian Standard Time (UT+4h)  she@DPX200
##.OBSERVE FREQUENCY= 200.13135
##.OBSERVE NUCLEUS= ^1H
##.ACQUISITION MODE= SIMULTANEOUS
##.ACQUISITION SCHEME= undefined
##.AVERAGES= 8
##.DIGITISER RES= 18
##SPECTROMETER/DATA SYSTEM= spect
##.PULSE SEQUENCE= zg30
##.SOLVENT NAME= DMSO
##.SHIFT REFERENCE= (INTERNAL, DMSO, 0, 15.7392)
##AUDIT TRAIL= $$ (NUMBER, WHEN, WHO, WHERE, WHAT)
$$ ##TITLE= Audit trail, XWIN-NMR		Version 3.5
$$ ##JCAMPDX= 5.01
$$ ##ORIGIN= Bruker BioSpin GmbH
$$ ##OWNER= she
$$ F:/spectra/data/she/nmr/H-F/1/pdata/1/auditp.txt
$$ ##AUDIT TRAIL=  $$ (NUMBER, WHEN, WHO, WHERE, WHAT)
(   1,<2022-06-02 13:59:54.28 +0400>,<she>,<DPX200>,
      <created by zg, POWCHK disabled, PULCHK disabled
       configuration hash MD5:
       00 E9 B6 7A A2 85 ED C7 34 08 36 98 17 FE 4E 26
       data hash MD5: 16K
       27 11 36 DB 9A E2 D6 50 3C 2F DF 0C 5F 86 7A 02>)
(   2,<2022-06-02 13:59:57.39 +0400>,<she>,<DPX200>,
      <Start of raw data processing
       efp BC_mod = 2 LB = 0.24 FT_mod = 6 PKNL = 1 PHC0 = -18041.88 PHC1 = 15.40074 SI = 16K 
       data hash MD5: 16K
       FC 2B F0 2C B6 57 BD 88 43 BE BE F9 57 3A 52 25>)
(   3,<2022-06-02 14:00:21.28 +0400>,<she>,<DPX200>,
      <pk PHC0 = -1.887713 PHC1 = 1.6 
       data hash MD5: 16K
       07 1A 5D 49 78 BC 26 77 1C 7F 49 64 69 CD 0D 0A>)
(   4,<2022-06-02 14:00:24.92 +0400>,<she>,<DPX200>,
      <abs ABSG = 5 
       data hash MD5: 16K
       66 5E 3C 6D F9 E9 DC E0 14 37 D2 9F 52 9B 30 14>)
(   5,<2022-06-02 14:00:55.26 +0400>,<she>,<DPX200>,
      <abs ABSG = 5 
       data hash MD5: 16K
       1E 1E E5 09 8D 93 E9 9D 81 A0 77 19 13 99 00 FA>)
$$ ##END=
$$ 
$$ hash MD5
$$ BD 50 C0 DB 57 24 5F B5 5A EB 10 72 6A EC 39 2D
##$RELAX= 
##$RELAX= 
##$RELAX= 
##$RELAX= 
##$RELAX= 
##$RELAX= 
$$ Bruker specific parameters
$$ --------------------------
##$DU= <F:/spectra>
##$EXPNO= 1
##$NAME= <H-F>
##$PROCNO= 1
##$TYPE= <nmr>
##$USER= <she>
##$AMP= (0..31)
100 100 100 100 100 100 100 100 100 100 100 100 100 100 100 100 100 100 
100 100 100 100 100 100 100 100 100 100 100 100 100 100 
##$AQSEQ= 0
##$AQ_mod= 1
##$AUNM= <au_zg>
##$AUTOPOS= <>
##$BF1= 200.13
##$BF2= 200.13
##$BF3= 200.13
##$BF4= 200.13
##$BF5= 200.13
##$BF6= 200.13
##$BF7= 200.13
##$BF8= 200.13
##$BYTORDA= 1
##$CFDGTYP= 0
##$CFRGTYP= 5
##$CHEMSTR= <none>
##$CNST= (0..31)
1 1 145 1 1 1 1 1 1 1 1 1 1 1 1 1 1 1 1 1 1 1 1 1 1 1 1 1 1 1 1 1 
##$CPDPRG= <>
##$CPDPRG1= <>
##$CPDPRG2= <>
##$CPDPRG3= <>
##$CPDPRG4= <mlev>
##$CPDPRG5= <mlev>
##$CPDPRG6= <mlev>
##$CPDPRG7= <mlev>
##$CPDPRG8= <mlev>
##$CPDPRGB= <>
##$CPDPRGT= <>
##$D= (0..31)
0 1.2 0 0 0 0 0 0 0 0.06 0 0.03 0 0 0 0 0.0002 0 0 0 0 0 0 0 0 0 0 0 0 
0 0 0 
##$DATE= 1654163993
##$DBL= (0..7)
$$ [...]
##$SUBNAM2= <"">
##$SUBNAM3= <"">
##$SUBNAM4= <"">
##$SUBNAM5= <"">
##$SUBNAM6= <"">
##$SUBNAM7= <"">
##$SUBNAM8= <"">
##$SUBNAM9= <"">
##$SW= 18.05172834244
##$SWIBOX= (0..15)
0 0 2 0 0 0 0 0 0 0 0 0 0 0 0 0 
##$SW_h= 3612.71676300578
##$TD= 16384
##$TD0= 1
##$TE= 0
##$TE2= 300
##$TE3= 300
##$TEG= 300
##$TL= (0..7)
0 120 120 120 120 120 120 120 
##$TP= (0..7)
150 150 150 150 150 150 150 150 
##$TP07= 0
##$TPNAME0= <>
##$TPNAME1= <>
##$TPNAME2= <>
##$TPNAME3= <>
##$TPNAME4= <>
##$TPNAME5= <>
##$TPNAME6= <>
##$TPNAME7= <>
##$TPOAL= (0..7)
0.5 0.5 0.5 0.5 0.5 0.5 0.5 0.5 
##$TPOFFS= (0..7)
0 0 0 0 0 0 0 0 
##$TUNHIN= 0
##$TUNHOUT= 0
##$TUNXOUT= 0
##$USERA1= <user>
##$USERA2= <user>
##$USERA3= <user>
##$USERA4= <user>
##$USERA5= <user>
##$V9= 5
##$VALIST= <valist>
##$VCLIST= <CCCCCCCCCCCCCCC>
##$VD= 0
##$VDLIST= <DDDDDDDDDDDDDDD>
##$VPLIST= <PPPPPPPPPPPPPPP>
##$VTLIST= <TTTTTTTTTTTTTTT>
##$WBST= 1024
##$WBSW= 4
##$XGAIN= (0..3)
0 0 0 0 
##$XL= 0
##$YL= 0
##$YMAX_a= 539171
##$YMIN_a= -977290
##$ZGOPTNS= <>
##$ZL1= 120
##$ZL2= 120
##$ZL3= 120
##$ZL4= 120
##$ABSF1= 15.73918
##$ABSF2= -2.31267
##$ABSG= 5
##$ABSL= 3
##$ALPHA= 0
##$AQORDER= 0
##$ASSFAC= 0
##$ASSFACI= 0
##$ASSFACX= 0
##$ASSWID= 0
##$AUNMP= <proc_1d>
##$AZFE= 0.1
##$AZFW= 0.1
##$BCFW= 0
##$BC_mod= 2
##$BYTORDP= 0
##$COROFFS= 0
##$CY= -3
##$DATMOD= 1
##$DC= 0
##$DFILT= <>
##$DTYPP= 0
##$F1P= 0
##$F2P= 0
##$FCOR= 1
##$FTSIZE= 16384
##$FT_mod= 6
##$GAMMA= 0
##$GB= 0
##$INTBC= 1
##$INTSCL= 0
##$ISEN= 128
##$LB= 0.24
##$LEV0= 0
##$LPBIN= 0
##$MAXI= 10000
##$MC2= 0
##$MEAN= 0
##$ME_mod= 0
##$MI= 1.114404
##$NCOEF= 0
##$NC_proc= -6
##$NLEV= 6
##$NOISF1= 3.799351
##$NOISF2= 2.8
##$NSP= 0
##$NTH_PI= 0
##$NZP= 0
##$OFFSET= 15.73918
##$PC= 1
##$PHC0= -18043.77
##$PHC1= 17.00074
##$PH_mod= 1
##$PKNL= yes
##$PPARMOD= 0
##$PSCAL= 0
##$PSIGN= 0
##$REVERSE= no
##$SF= 200.13000647649
##$SI= 16384
##$SIGF1= 3
##$SIGF2= 2
##$SINO= 5.538805
##$SIOLD= 16384
##$SREGLST= <1H.CDCl3>
##$SSB= 0
##$STSI= 16384
##$STSR= 0
##$SW_p= 3612.71676300578
##$SYMM= 0
##$S_DEV= 0
##$TDeff= 16384
##$TDoff= 0
##$TI= <>
##$TILT= no
##$TM1= 0
##$TM2= 0
##$TOPLEV= 0
##$USERP1= <user>
##$USERP2= <user>
##$USERP3= <user>
##$USERP4= <user>
##$USERP5= <user>
##$WDW= 1
##$XDIM= 16384
##$YMAX_p= 365476853
##$YMIN_p= -584507
$$ End of Bruker specific parameters
$$ ---------------------------------
##NTUPLES= NMR SPECTRUM
##VAR_NAME=  FREQUENCY,     SPECTRUM/REAL,   SPECTRUM/IMAG
##SYMBOL=    X,             R,               I
##VAR_TYPE=  INDEPENDENT,   DEPENDENT,       DEPENDENT
##VAR_FORM=  AFFN,          ASDF,            ASDF
##VAR_DIM=   16384,         16384,           16384
##UNITS=     HZ,            ARBITRARY UNITS, ARBITRARY UNITS
##FACTOR=    0.220516191357247, 1,           1
##FIRST=     3149.88211752531, 0,            0
##LAST=      -462.834645480473, 0,           0
##MIN=       -462.834645480473, -584507,     0
##MAX=       3149.88211752531, 365476853,    0
$$ Real data points
##PAGE= N=1
##DATA TABLE= (X++(R..R)), XYDATA
$$ [...]
6120A2892457K52716R0892M8521o1751o7221k08669k41863l33415l46321l08760
6110A1716586k07132m48040l76810l90893l48447k60599k33449l68694k89899
6101H792623k03858j52549k22703k08916p4359j02659j15516j64833j35993p0040
6091G341197L0522L7645o6909r6317K0965L7129O06l5094L6397N6052k1513M7727
6079G388407N0953P7278J13993O4243M1495n294J56123J90012P0678J63064K23159
6068H534111k8741N9420L03635K57833K65385K68958K75169J90917L18532L99012
6058A0844231N11842M09821K59669L88187M21362L59573K20711N4198Q866J26382
6048A3604842P5588l6528j9835J01676J20724K01247K47673L49484K63785M61399
$$ y = [12892457, 13145173, 13236065, 13284586, 13222835, 13155614, 12946945, 12705082, 12371667, 12025346, 11716586, 11509454, 11061414, 10684604, 10293711, 9945264, 9684665, 9451216, 9082522, 8792623, 8588765, 8436216, 8213513, 8004597, 7930238, 7827579, 7712063, 7547230, 7411237, 7341197, 7371719, 7409364, 7342455, 7246138, 7267103, 7304232, 7304838, 7269744, 7306141, 7362193, 7340680, 7388407, 7439360, 7516638, 7630631, 7694874, 7736369, 7731075, 7887198, 8077210, 8147888, 8310952, 8534111, 8505370, 8564790, 8868425, 9126258, 9391643, 9660601, 9935770, 10126687, 10445219, 10844231, 11356073, 11765894, 12025563, 12413750, 12835112, 13194685, 13415396, 13469594, 13478460, 13604842, 13680430, 13643902, 13624067, 13725743, 13846467, 14047714, 14295387, 14644871, 14908656, 15370055]
6038A5370055N85967O05418O62261P81583R22441R79040J078296J214668J285160
6029B3484889J349130J245169J016673O96836N53888P1669l15900o88185q00186
6020B6613983q50007p59996p29568n67425m27157k42788n0667r5107K20119M81382
6010B3592769N36868O11123Q54908J052318J106550J371088J557358J700609J784415
6001C4168006J784544J607366J186834N22835k63303r87085j619763j783328k064490
5992C2551616j906059j725081j524217j207251r35447r28304o37681m27652k52459
5983B3007465p5463q2941J39562L61697N09575N66279O11542Q64796Q44891P41762
5973B7489165P92681N51134J45549j79186n15134j104354j405372j409658j614331
$$ y = [15370055, 15956022, 16561440, 17223701, 18005284, 18927725, 19906765, 20985061, 22199729, 23484889, 24834019, 26079188, 27095861, 27792697, 28346585, 28418254, 28102354, 27414169, 26613983, 25763976, 25003980, 24274412, 23706987, 23279830, 23037042, 22986375, 22891268, 23111387, 23592769, 24129637, 24740760, 25595668, 26647986, 27754536, 29125624, 30682982, 32383591, 34168006, 35952550, 37559916, 38746750, 39269585, 39006282, 38019197, 36399434, 34616106, 32551616, 30645557, 28920476, 27396259, 26189008, 25253561, 24325257, 23687576, 23259924, 23007465, 22932002, 22849061, 22988623, 23350320, 23859895, 24426174, 25037716, 25902512, 26747403, 27489165, 28281846, 28832980, 28978529, 28799343, 28284209, 27179855, 25774483, 24364825, 22750494]
5964B2750494j495062j343506j245017j049769r26549o98520o02593n60724n08270
5955A4320484k93983k61745j94665l1631p4799o0369J5910j6687l1301J9586K0291
5944A3411091j17468k17121k46254k50009m32478n73896n25751m03849m72370
5935A0171895m49111l30729l92914l57441k75509k06781k13612j45160k80032
5926G520606m4697j51835j16799p5300m5584M205N401r8407k5857k1528j81875
5915F768330p2085j57282k05153j8897q9142q6060j60128j50037j45965j10824
5905E572757J6916n4894p7087j1172L5666j07149K4922Q2633j26698j02101P3157
5894E326950p1703O650o9M2733K20l4364j08535j06145m305k7616o5987J5792
$$ y = [22750494, 21255432, 19911926, 18666909, 17617140, 16690591, 15992071, 15389478, 14828754, 14320484, 14026501, 13764756, 13570091, 13538460, 13463661, 13403292, 13419202, 13402515, 13371214, 13390800, 13411091, 13293623, 13076502, 12830248, 12580239, 12147761, 11573865, 11048114, 10644265, 10171895, 9722784, 9392055, 8999141, 8641700, 8366191, 8159410, 7945798, 7800638, 7520606, 7475909, 7324074, 7207275, 7131975, 7086391, 7090596, 7095997, 6997590, 6971733, 6950205, 6768330, 6696245, 6538963, 6333810, 6314913, 6225771, 6139711, 5979583, 5829546, 5683581, 5572757, 5589673, 5534779, 5457692, 5446520, 5482186, 5375037, 5399959, 5482592, 5355894, 5253793, 5326950, 5255247, 5261897, 5261828, 5304561, 5304781, 5270417, 5161882, 5055737, 5051432, 5023816, 4957829, 4973621]
5882D973621j5534j32928N9101p0629j67639O2853r0622p6124n8057O624j27792
5871D362874K9771j7590q714K4931N2192K1608k4479o2348l3462R1056j0260J1435
5859D437014J08720j04725j60348J8482K1384K2393M7243J7761L3170P0220o5457
5848D445857j28791j5886K0713k7191P891j17848M2825n4499J5172R9703j72474
5837D115472k4107N8225P0236j0512j6140J3139j6583m26q334j8220n0807k0956
5825D090987q0510Q7515K9467k143o61q2991N4590J26650J04850m6431j33518
5814D147805o8322N0465m6911q3844l8777o8155N021l4474J8505M3533j01135
5803C823711j15269Q7649n7339N2209M2320Q794L5107J3409p6917K8230M0701
$$ y = [4973621, 4958087, 4825159, 4884260, 4813631, 4645992, 4708845, 4618223, 4542099, 4484042, 4490666, 4362874, 4392645, 4375055, 4366341, 4391272, 4443464, 4465072, 4440593, 4378245, 4344783, 4435839, 4425579, 4437014, 4545734, 4441009, 4280661, 4299143, 4320527, 4342920, 4390163, 4407924, 4441094, 4511314, 4445857, 4317066, 4301180, 4321893, 4294702, 4302593, 4184745, 4227570, 4173071, 4188243, 4287946, 4115472, 4091365, 4149590, 4219826, 4209314, 4193174, 4206313, 4189730, 4189304, 4180970, 4162750, 4111943, 4090987, 4010477, 4097992, 4127459, 4125316, 4124655, 4041664, 4096254, 4222904, 4327754, 4281323, 4147805, 4079483, 4129948, 4083037, 3999193, 3960416, 3892261, 3897282, 3862808, 3881313, 3924846, 3823711, 3708442, 3796091, 3738752, 3790961, 3833281, 3842075, 3877182, 3890591, 3813674, 3841904, 3882605]
5792C882605j05936J45031J2850n4618Q7760p9144N988K4992Q9556j1236j8550
5781C979298M061L2283n3721l247l3087j14194k0885K0841O2190l178J1813q8218
5769C793956k1614M8680P3464q0443o2786Q5253J5217j6673Q1141j01578p2987
5758C741630N7276M7467M6041K5338l1731l2047R396P0555R2570j20642M3438
5747C949291L5485j10088J6432k408J62168p5559J4308J58125J1912l3932J9099
5736D144833m353M9624J33564J0475N0152J6361J9259L2113Q3268J27336j8896
5725D643736R8701J20149R8035J09871K3330J62456J55721J51512J89337K3985
5715E776833J88673K55701J76561J54350K11385J14606Q4841L3687k8689p4936
$$ y = [3882605, 3776669, 3921700, 3934550, 3879932, 3967692, 3888548, 3894536, 3919528, 4009084, 3997848, 3979298, 3983359, 4015642, 3961921, 3958674, 3925587, 3811393, 3790508, 3811349, 3873539, 3870361, 3882174, 3793956, 3772342, 3821022, 3894486, 3814043, 3751257, 3836510, 3851727, 3835054, 3916195, 3814617, 3741630, 3798906, 3846373, 3892414, 3917752, 3886021, 3853974, 3863370, 3933925, 4026495, 3905853, 3949291, 3984776, 3874688, 3891120, 3888712, 4050880, 3975321, 3989629, 4147754, 4159666, 4125734, 4144833, 4140480, 4190104, 4323668, 4334143, 4384295, 4400656, 4419915, 4452028, 4535296, 4662632, 4643736, 4742437, 4862586, 4960621, 5070492, 5093822, 5256278, 5411999, 5563511, 5752848, 5776833, 5965506, 6221207, 6397768, 6552118, 6763503, 6878109, 6962950, 6996637, 6967948, 6893012]
5705F893012k07108k14418j34622j63316j74467p0078r3712j01888j34332n824
5695E593247j00171l8191J04327R9693j22027N6420R5599L005M0828J76215J35299
5684F044244J27226P9570J21299J40791P7018J34765K05227K14757P5075J3358
5674G233330R2168R7163n6283j0092j25294j8459n4231j1660k05390j32232n3193
5663F755827l5149J7489j84752j23840j22153q4177n0972j17610m7675m6849j23748
5652E836391k3047j4668l0370j09620L8788J8945m0036M2568J6389m9871l2763
5641E652706j28618J3465J4233q6078k4978K4656L0786j24651k1907M0030J0547
5630E400191O2440l882j16540J69885L5971J105j03426Q9799k2659l5821M076
$$ y = [6893012, 6685904, 6471486, 6336864, 6173548, 5999081, 5929003, 5835291, 5733403, 5599071, 5593247, 5493076, 5454885, 5559212, 5658905, 5536878, 5593298, 5688897, 5691902, 5732730, 5908945, 6044244, 6171470, 6251040, 6372339, 6513130, 6590148, 6724913, 6930140, 7144897, 7219972, 7233330, 7325498, 7422661, 7366378, 7356286, 7230992, 7212533, 7158302, 7146642, 6941252, 6809020, 6755827, 6720678, 6738167, 6553415, 6429575, 6307422, 6223245, 6172273, 6054663, 6006988, 5960139, 5836391, 5813344, 5798676, 5768306, 5658686, 5697474, 5716419, 5676383, 5718951, 5735340, 5685469, 5652706, 5524088, 5537553, 5551786, 5465708, 5440730, 5465386, 5496172, 5371521, 5349614, 5389644, 5400191, 5462631, 5458749, 5342209, 5512094, 5548065, 5549170, 5445744, 5535543, 5512884, 5477063, 5481139]
5619E481139j9406Q1781N0024K5696L6017J2788q8832j6342M4682m690k7002l9616
5607E536239p8151R4789N5884K1882j5502J3917j31477O3742k8258M3634N8427
5596E635126r351L7636L482j47743J8068J04623J7175o5379O4286J65201K964
5585E826088r5306J7560N6334J0008J03877k1890J07611N9113L7941J50894J57507
5574F409737J3526J39654J16938Q2401M1789J14129J00056N6725l830J24631P7874
5563G273630N8369k7854n0349m0811M8064j181J1093K6806j16031N6960J17791
5552G356487O274p9535N9633L7471P8614J02726J70741J99998J8529j2661J36329
5541H074606L4830J33794j8024p2118P0474J05137M3977J90979J43262P7530J51868
$$ y = [5481139, 5461733, 5543514, 5593538, 5619234, 5655251, 5668039, 5579207, 5562865, 5607547, 5602857, 5575855, 5536239, 5458088, 5552877, 5608761, 5630643, 5615141, 5629058, 5497581, 5561323, 5533065, 5576699, 5635126, 5625775, 5663411, 5666893, 5519150, 5537218, 5641841, 5659016, 5593637, 5657923, 5823124, 5826088, 5730782, 5748342, 5804676, 5814684, 5918561, 5896671, 6004282, 6063395, 6101336, 6252230, 6409737, 6423263, 6562917, 6679855, 6762256, 6804045, 6918174, 7018230, 7074955, 7071125, 7195756, 7273630, 7331999, 7304145, 7253796, 7212985, 7261049, 7259868, 7270961, 7297767, 7181736, 7238696, 7356487, 7362761, 7283226, 7342859, 7380330, 7458944, 7561670, 7732411, 7932409, 7950938, 7938277, 8074606, 8109436, 8243230, 8225206, 8153088, 8223562, 8328699, 8372676, 8563655, 8706917, 8784447, 8936315]
5530H936315P3027R4048J22450J50278K40543J88957K69029K02036O4090M5318
5520A0386091J45343J18720k3248m6502K0372Q5324J7085R6578L0727J8108M9313
5509A0897911j4453J17050J30564J30056J07291J42325J02728R0590J72987J30235
5499A2007284R355K60159K07672P8090J57685O6712M9685J22898L05716J54261
5489A3419517J13880P6769J10625O3788J55131K01592K54972K83459J62010J48994
5479A4990737K14319M07178L12260K27756L10662L37975K62879L21090N33569
5470A7918425N40332M34458N02693O47658N60857O20207O83339Q01777R46118
5461B3655864J083371J164415J452796J675914K055208K529267L096647L739946
$$ y = [8936315, 9009342, 9103390, 9225840, 9376118, 9616661, 9805618, 10074647, 10276683, 10340773, 10386091, 10531434, 10650154, 10626906, 10580404, 10600776, 10686100, 10703185, 10799763, 10830490, 10848598, 10897911, 10883458, 11000508, 11131072, 11261128, 11368419, 11510744, 11613472, 11704062, 11877049, 12007284, 12016639, 12276798, 12484470, 12562560, 12720245, 12786957, 12836642, 12959540, 13265256, 13419517, 13533397, 13610166, 13720791, 13784579, 13939710, 14141302, 14396274, 14679733, 14841743, 14990737, 15205056, 15612234, 15924494, 16152250, 16462912, 16800887, 17063766, 17384856, 17918425, 18458757, 18893215, 19395908, 20043566, 20604423, 21224630, 21907969, 22709746, 23655864, 24739235, 25903650, 27356446, 29032360, 31087568, 33616835, 36713482, 40453428]
5453D0453428L925184K954635o02093k854065m190953m575615l283152k262223
5445B9565146j473382j032004q08819o06067l46943l08234j08689m4785M458P9499
5435B4920180J52077J41749K67420L05991M17237M77260N49022O60449N50192
5426B8441577O58036Q49019O11957L25744J20461r7076m06472l99321l34549k10167
5416B9559209j08645O2086n3951J61634K76491K01687K63029L04486K31556L25375
5406C1222957M94938N47777N21730N76478O91074O08888Q28674P58046J050993
5397C7301555J074075J014611J304276J424611J450016J384812J183547R45914
5389D7083417O43425O85904P85894Q10252J278929J381599J375776J696442J983463
$$ y = [40453428, 44378612, 47333247, 46731154, 43877089, 39686136, 35110521, 31827369, 29565146, 28091764, 27059760, 26250941, 25644874, 25297931, 24989697, 24881008, 24836223, 24840681, 24920180, 25072257, 25214006, 25481426, 25787417, 26204654, 26681914, 27230936, 27891385, 28441577, 29099613, 29948632, 30560589, 30886333, 31006794, 30909718, 30503246, 30103925, 29769376, 29559209, 29450564, 29512650, 29458699, 29620333, 29896824, 30098511, 30361540, 30666026, 30897582, 31222957, 31717895, 32265672, 32787402, 33363880, 34054954, 34663842, 35492516, 36250562, 37301555, 38375630, 39390241, 40694517, 42119128, 43569144, 44953956, 46137503, 47083417, 47726842, 48412746, 49198640, 50008892, 51287821, 52669420, 54045196, 55741638, 57725101]
5380E7725101K300465K500653K764178L155502L366750L819014L935372M110570
5372H3677605M392042M646392N080044N256278N565727N952529O366504O563992
5364A27501113O567600O412385O354065N862811M887104L748543K050147M1837
5356A63425605k229009m208692n876529p089991p772102q092691q278575q135539
5348A11742477p823561p434768o890526o326827n601151m992550m440054m009194
5340F4223846l529725l094701k781308k385111k297386k062695j942401j863273
5332D4267246j570231j650111j542225j458297j189026j162506j167494j020849
5324C3506507q12703r27003q18521p92671p08729q58717o23598n86762n32833
$$ y = [57725101, 60025566, 62526219, 65290397, 68445899, 71812649, 75631663, 79567035, 83677605, 88069647, 92716039, 97796083, 103052361, 108618088, 114570617, 120937121, 127501113, 134068713, 140481098, 146835163, 152697974, 157585078, 161333621, 163383768, 163425605, 161196596, 156987904, 151111375, 144021384, 136249282, 128156591, 119878016, 111742477, 103918916, 96484148, 89593622, 83266795, 77665644, 72673094, 68233040, 64223846, 60694121, 57599420, 54818112, 52433001, 50135615, 48072920, 46130519, 44267246, 42697015, 41046904, 39504679, 38046382, 36857356, 35694850, 34527356, 33506507, 32693804, 31766801, 30948280, 30155609, 29446880, 28588163, 27964565, 27377803, 26844970]
5315B6844970o20331n99024m13991l91814l89191m94797m26905m68270m13942
5306B2626705l56748k45699m05365m19038m34945m16164m95601m64842l39846
5297A9048457k48956k50173k52964l70118l90326k96748l21590l27690j55988
5288A6433904l12478k27486k62271k53536l24918k70135j23676k00610j77937
5279A4280857j69192n0425j47987k38057j74400r8943r09j40196j59152o9764
5269A3031832j40832j42955j31810k09027k50384o0784j70256j17764n5834j76089
5259A1576097j61846j06344j40708p9039j32934j51230q2167q0432j12603p5588
5249A0453206M3409j43156o1080o7072k1411M8208J15700q8752M9255Q1599j3340
$$ y = [26844970, 26224639, 25625615, 25211624, 24819810, 24430619, 23935822, 23508917, 23040647, 22626705, 22269957, 22024258, 21618893, 21199855, 20764910, 20348746, 19853145, 19388303, 19048457, 18799501, 18549328, 18296364, 17926246, 17535920, 17239172, 16917582, 16589892, 16433904, 16121426, 15893940, 15631669, 15378133, 15053215, 14783080, 14659404, 14458794, 14280857, 14111665, 14061240, 13913253, 13675196, 13500796, 13401853, 13400944, 13260748, 13101596, 13031832, 12891000, 12748045, 12616235, 12407208, 12156824, 12096040, 11925784, 11808020, 11752186, 11576097, 11414251, 11307907, 11167199, 11088160, 10955226, 10803996, 10721829, 10641397, 10528794, 10453206, 10496615, 10353459, 10292379, 10225307, 10203896, 10252104, 10367804, 10279052, 10328307, 10409906, 10396566]
5238A0396566q9436j9283J28634N1748R4893R307J84962j1944N8459l8609j801
5227A0763496L7921M5924K6405J7444r8023O089J2650J14852J17000p1714o8910
5216A0903134j53962r9351J7810L6083j52154N1684k6661Q787Q6783R2563J4719
5205A0779435M0721L7898J68165J09353J06885N8135J13371J43995N4349J10393
5195A1722700r0593m971J88575O2365L9873j27405J596N9900q7767k1661J64985
5184A1907597J27895J3136J20849J03340P3656J23869J52353J57808J84424J62519
5174A3127446K03147K52878J86592J29239J64456K29572L47999K14619K76405
5165A5132353L02169K94491K33807J27361L15821L53047K16994K71761K51193
$$ y = [10396566, 10307130, 10287847, 10416481, 10468229, 10563122, 10572429, 10757391, 10745447, 10803906, 10765297, 10763496, 10801417, 10847341, 10873746, 10891190, 10793167, 10799256, 10811906, 10926758, 11043758, 10972044, 10903134, 10749172, 10649821, 10667631, 10703714, 10551560, 10603244, 10576583, 10585370, 10672153, 10764716, 10779435, 10820156, 10858054, 11026219, 11135572, 11242457, 11300592, 11413963, 11557958, 11612307, 11722700, 11632107, 11627136, 11815711, 11878076, 11917949, 11790544, 11792140, 11852040, 11764273, 11742612, 11907597, 12035492, 12048628, 12169477, 12272817, 12346473, 12470342, 12622695, 12780503, 12964927, 13127446, 13330593, 13583471, 13770063, 13899302, 14063758, 14293330, 14641329, 14855948, 15132353, 15434522, 15729013, 15962820, 16090181, 16406002, 16759049, 16976043, 17247804, 17498997]
5156A7498997L93426L71895M43664N08386M12851M20653M88485M44818L66718
5147B1349893L72151M29888N99560O25263O46887P61218R05954P44214Q79920
5138B7314948J137779J248742J391295J647861J831012J996139K059559K424706
5130D1052041K537991K492516K276964J971526J446643O95940J77263l0615l07236
5121E2313033m85786m17764m20666m92361n73427n79798m77848m35987l71505
5112D8057891k3970K02851N02643R30994J369885J647361K193594K647135L158353
5103F0686737L399516L731742L821194L719269L188345K381054J509792P11493
5095H3149142J93484K1172j54340l69582o42900j445314k187379l124492l865762
$$ y = [17498997, 17892423, 18264318, 18707982, 19216368, 19629219, 20049872, 20538357, 20983175, 21349893, 21722044, 22151932, 22751492, 23376755, 24023642, 24784860, 25690814, 26435028, 27314948, 28452727, 29701469, 31092764, 32740625, 34571637, 36567776, 38627335, 41052041, 43590032, 46082548, 48359512, 50331038, 51777681, 52473621, 52650884, 52620269, 52313033, 51827247, 51409483, 50988817, 50496456, 49923029, 49343231, 48865383, 48429396, 48057891, 48033921, 48236772, 48739415, 49670409, 51040294, 52687655, 54881249, 57528384, 60686737, 64086253, 67817995, 71639189, 75358458, 78546803, 80927857, 82437649, 83149142, 83342626, 83363798, 83209458, 82839876, 82196976, 80751662, 78564283, 75439791, 71574029]
5086G1574029m209831m108640l793708l308763k763364k348601j652921j220837
5078D8167364p23843k69242K13112O02061N77896P90893Q67231P50690O72710
5069E1648872O44064M65741K68845L67101J57642m2048m03578r84773j727953
5060E0393913k269295k692797l160530l094017k931074k703509k268376k073330
5052B9200985j661684j543784j432378j250981j071651r40836p41166o67314n51202
5043A9339989o34111n06203l46533m28032l47095l11743l21924k54303k19832
5034A5970213k29564j03288n4684j91788k57753r3669j96685j31875m1565r2940
5024A4576402j18045J8268j53261p0017j9239N2170P8560L9821P2912K24457J95103
$$ y = [71574029, 67364198, 63255558, 59461850, 56153087, 53389723, 51041122, 49388201, 48167364, 47443521, 47174279, 47387391, 47989452, 48567348, 49358241, 50225472, 50976162, 51648872, 52292936, 52758677, 53027522, 53394623, 53552265, 53510217, 53106639, 52121866, 50393913, 48124618, 45431821, 42271291, 39177274, 36246200, 33542691, 31274315, 29200985, 27539301, 25995517, 24563139, 23312158, 22240507, 21299671, 20558505, 19891191, 19339989, 18705878, 18199675, 17853142, 17425110, 17078015, 16766272, 16444348, 16190045, 15970213, 15740649, 15637361, 15582677, 15390889, 15133136, 15039467, 14842782, 14710907, 14669342, 14576402, 14458357, 14476625, 14323364, 14253347, 14234108, 14286278, 14364838, 14404659, 14477571, 14702028, 14897131]
5013A4897131K67540J72907L67128L25921K90200N82644N93186M79707N67716
5004A8544080O57236O60758O94786Q26745P28291M99085M68561M22548K42415
4995B3744505J36727K6069l20593m76780n34145q25907r15201r25361q93531q39892
4985A8175891p56841o38335n81884o67253l84157l56805m89203k77320k65055
4976A3759038k55582k12636j50934r7513j14190r5641m314j82714r475J1102m8569
4965A2598572o5875J2616r247j04178M171M5993J17236q518m873J18670P8413
4954A2782980J67390K09847Q1781J55747J76567J26636K40632K40515J97372L17288
4944A4696755K36345L43506L66737L33978K81960L12581L43948L44925M33764
$$ y = [14897131, 15164671, 15337578, 15704706, 16030627, 16320827, 16903471, 17496657, 17976364, 18544080, 19201316, 19862074, 20556860, 21383605, 22111896, 22610981, 23079542, 23502090, 23744505, 23881232, 23907301, 23586708, 23109928, 22575783, 21749876, 20834675, 19909314, 19015783, 18175891, 17419050, 16780715, 16198831, 15531578, 15147421, 14790616, 14301413, 14024093, 13759038, 13503456, 13290820, 13139886, 13042373, 12928183, 12832542, 12828228, 12645514, 12636039, 12647141, 12598572, 12532697, 12545313, 12536066, 12431888, 12436059, 12482052, 12599288, 12590770, 12585897, 12704567, 12782980, 12950370, 13160217, 13241998, 13397745, 13574312, 13700948, 13941580, 14182095, 14379467, 14696755, 14933100, 15276606, 15643343, 15977321, 16259281, 16571862, 16915810, 17260735, 17694499]
4935A7694499N49850N52401N89565M19360N81786O92298P17419Q38151O94006
4926B3329335R78868J100328J166415J313178J554488J597687J852746K136535
4918C5029580K275607K535446K835345L046747L112908K817772K503121J933179
4910E6089705J118180J89013k66175p34963r41973r19298q54784q13392o89224
4901E2177089p33330p46839p29321n07410j71615L7113M10198P43631J174686
4892E1654202J764145K051533K384478K937090L161802L353639L375733L055994
4884G3738616K458967J626358O68582L0708n48684r66147r49427r21737j138316
4875G3998920j665719k296746k922348l497047l559296l552590l388243l032108
$$ y = [17694499, 18244349, 18796750, 19386315, 19805675, 20387461, 21079759, 21797178, 22635329, 23329335, 24308203, 25408531, 26574946, 27888124, 29442612, 31040299, 32893045, 35029580, 37305187, 39840633, 42675978, 45722725, 48835633, 51653405, 54156526, 56089705, 57207885, 57396898, 57130723, 56395760, 55453787, 54534489, 53679705, 52866313, 52177089, 51443759, 50696920, 49967599, 49460189, 49288574, 49325687, 49735885, 50479516, 51654202, 53418347, 55469880, 57854358, 60791448, 63953250, 67306889, 70682622, 73738616, 76197583, 77823941, 78492523, 78523231, 77974547, 77008400, 76058973, 75137236, 73998920, 72333201, 70036455, 67114107, 63617060, 60057764, 56505174, 53116931, 50084823]
4867E0084823k560026k062872j607527j210349q53418m87584k98871M2921J94230
4858D1241327M10669N59010M85968N17284M42863L43235L10672L27414J84832
4849D4823274o7449m57489j202966j790378k185639k497232k613919k562566k388415
4840B9057221k151151j714177j562753j305592j141437j025260q38279o95648
4832A8622924p91525p60323n78495n28973n48144m17080m07478l88849k46644
4823A3955413k68860l75265l16783k28947k29028k16124k64627k12277j75331
4814A1668171j55327k46558j44618k10550j18147q4962k41289j44806o2085j08616
4804A0151213r1155q3134j0411j50153j18428n1383n6465j21455j39730K6418
$$ y = [50084823, 47524797, 45461925, 43854398, 42644049, 41790631, 41303047, 41004176, 41047097, 41241327, 41651996, 42211006, 42696974, 43214258, 43657121, 44000356, 44311028, 44638442, 44823274, 44755825, 44298336, 43095370, 41304992, 39119353, 36622121, 34008202, 31445636, 29057221, 26906070, 25191893, 23629140, 22323548, 21182111, 20156851, 19318572, 18622924, 17831399, 17071076, 16492581, 15963608, 15415464, 14998384, 14590906, 14202057, 13955413, 13686553, 13311288, 12994505, 12765558, 12536530, 12320406, 12055779, 11843502, 11668171, 11512844, 11266286, 11121668, 10911118, 10792971, 10708009, 10466720, 10321914, 10259829, 10151213, 10060058, 9976924, 9966513, 9816360, 9697932, 9646549, 9590084, 9468629, 9328899, 9355317]
4794I355317K1634j33897q2692m6283j77211j26933K4942N2813r0087K782m4170
4783H756215j07301j7489n2351R304l2521L6740J9824p2459o8135k4426J28272
4772H575673L4071m7823q088N1135n1675J9819k7158R0874P7210K3139J1895Q3243
4760H832315L6393l4487L9950L9392l7920P9061M9791n2130K770N5209J46167
4749I156511K3108r2450O1649J9263j5376N309l4627M5326J5674j061l3501P792
4737I157617O2917R5241P1419L8739J29139N5893O2496R9506o183L2414J74406
4726I973604K87255J71118K280L1829Q8603J03895K5596J75371J65032J36361
4716A1160944K05141J45461J88796J99797R7298J69141J71118K03473J60804J91949
$$ y = [9355317, 9376951, 9243054, 9160362, 9114079, 8936868, 8809935, 8834877, 8887690, 8797603, 8800385, 8756215, 8648914, 8631425, 8579074, 8588378, 8555857, 8592597, 8612421, 8539962, 8471827, 8447401, 8575673, 8609744, 8561921, 8553833, 8604968, 8553293, 8573112, 8545954, 8636828, 8714038, 8737177, 8749072, 8832315, 8868708, 8834221, 8874171, 8913563, 8875643, 8954704, 9004495, 8952365, 8955135, 9010344, 9156511, 9179619, 9087169, 9148818, 9168081, 9152705, 9158014, 9123387, 9168713, 9184387, 9183326, 9149825, 9157617, 9220534, 9315775, 9387194, 9425933, 9555072, 9610965, 9673461, 9772967, 9766784, 9799198, 9973604, 10260859, 10431977, 10434257, 10466086, 10554689, 10658584, 10684180, 10859551, 11024583, 11160944, 11366085, 11511546, 11700342, 11900139, 11997437, 12166578, 12337696, 12541169, 12701973, 12893922]
4706A2893922K39051K13389L21012J74871K71581K24199K91279K49896J49113
4697A5028313L55645L78836N05228M71912L05724M08336L05121L15073L68522
4688A8442710K64368K06509J42090J26842J15630J83795J38366K16432J99472
4679B0036214J62278K73281J58484K54721K99852K79671K15614K82628K47917
4670B2210660K17295L13109J69023K38431M48769L16545L39602L25255L68192
4661B4946881L96170M74832L57276L27148M53843M04379K97868K75764L49092
4652B8283253L84500M70991M06335M73615M89653N49263N72150N62314N87581
4643C2779655P24624Q35856Q60016Q93827R87284J073424J073408J140460J257620
$$ y = [12893922, 13132973, 13346362, 13667374, 13842245, 14113826, 14338025, 14629304, 14879200, 15028313, 15383958, 15762794, 16268022, 16739934, 17045658, 17453994, 17759115, 18074188, 18442710, 18707078, 18913587, 19055677, 19182519, 19298149, 19481944, 19620310, 19836742, 20036214, 20198492, 20471773, 20630257, 20884978, 21184830, 21464501, 21680115, 21962743, 22210660, 22427955, 22741064, 22910087, 23148518, 23597287, 23913832, 24253434, 24578689, 24946881, 25343051, 25817883, 26175159, 26502307, 26956150, 27360529, 27658397, 27934161, 28283253, 28667753, 29138744, 29545079, 30018694, 30508347, 31057610, 31629760, 32192074, 32779655, 33504279, 34340135, 35200151, 36093978, 37081262, 38154686, 39228094, 40368554, 41626174]
4634D1626174J338222J279241J349630J190627J213223J076390R41366R67834
4626E0982707R23701R90943R18623R17562J010664Q83847R31742R34639R63584
4617E9458012R45084J033857R79006J111152J081352J237214J448488J497214
4609F8791379J677415J858220K014995K243136K478722K760317L066459L260608
4601H8151251L412321L401413L339927K812856K176755J186788j10569j073748
4593A03296994j833384k165233k176683j835158j346789p31296k23338L89218
4585I3374331J208414J614793J951499K290915K565051K407693K069297J542316
4577A09024309R81143Q5326n54386j360360k105232k494937k708394k887859k871448
$$ y = [41626174, 42964396, 44243637, 45593267, 46783894, 47997117, 49073507, 50014873, 50982707, 51906408, 52897351, 53815974, 54733536, 55744200, 56628047, 57559789, 58494428, 59458012, 60403096, 61436953, 62415959, 63527111, 64608463, 65845677, 67294165, 68791379, 70468794, 72327014, 74342009, 76585145, 79063867, 81824184, 84890643, 88151251, 91563572, 94964985, 98304912, 101117768, 103294523, 104481311, 104370742, 103296994, 101463610, 99298377, 97121694, 95286536, 93939747, 93208451, 92985113, 93374331, 94582745, 96197538, 98149037, 100439952, 103005003, 105412696, 107481993, 109024309, 110005452, 110090778, 109536392, 108176032, 106070800, 103575863, 100867469, 97979610, 95108162]
4568I5108162k667641k207663j875525j262356r84415o51438j59474K46935O79640
4559H6226225R67561J083098J437449J635182J710493J634472J662923J656567
4551I8013970J429108J321092R07351O16871M45337k6604l97985m43580p94154
4542A01071406q90173j040963j148854p96273r32725p72055o32533l87973m29385
4533I4040472k26434j45977k85669k36068m50944n57055p65004r33593j036955
4524H9402773j411882j631857j781308j884066j915102j951458j791909j890225
4516G5144966j803275j749524j640586j520833j568075j440800j321535j185856
4508F2914482j168742j190308j051807j095256j029595j013600j046349j040891
$$ y = [95108162, 92440521, 90232858, 88357333, 87094977, 86110562, 85459124, 85299650, 85546585, 86226225, 87193786, 88276884, 89714333, 91349515, 93060008, 94694480, 96357403, 98013970, 99443078, 100764170, 101671521, 102288392, 102733729, 102707125, 102309140, 101865560, 101071406, 100181233, 99140270, 97991416, 97195143, 96262418, 95490363, 94857830, 94469857, 94040472, 93814038, 93668061, 93382392, 93146324, 92695380, 92138325, 91373321, 90439728, 89402773, 87990891, 86359034, 84577726, 82693660, 80778558, 78827100, 77035191, 75144966, 73341691, 71592167, 69951581, 68430748, 66862673, 65421873, 64100338, 62914482, 61745740, 60555432, 59503625, 58408369, 57378774, 56365174, 55318825, 54277934]
4500E4277934q48448r19770q05446r44708r48387q80665p29716p70698q29571
4491D6600525r56143p74221r24431q92124q48235q28301p08651q00612p78931
4482C9088876o49107n81844m94596l89257n15626m52654l05783l17244j67629
4473C5215136k89398j85017q4260j78192j41390l32244k22703j99011j47856j18582
4463C3316483o7178j56299j13774N743o2768p6531J1737m2349N1055Q6972J60070
4452C3113161J57209M8257J89920J77539J90438R0858k4793J14010K00560K05708
4442C4462867J88178K08365K13373J94289K13315J70194M22454L12409M89052
4433C6874496M19383M71966M57091N75652P47389P41250Q93368Q10277Q83023
$$ y = [54277934, 53429486, 52509716, 51704270, 50759562, 49811175, 48930510, 48200794, 47430096, 46600525, 45644382, 44870161, 43945730, 43053606, 42205371, 41377070, 40668419, 39867807, 39088876, 38439769, 37857925, 37363329, 36974072, 36458446, 36005792, 35700009, 35382765, 35215136, 34925738, 34740721, 34656461, 34478269, 34336879, 34004635, 33781932, 33582921, 33435065, 33316483, 33249305, 33093006, 32979232, 32984975, 32922207, 32845676, 32857413, 32815064, 32866119, 32953091, 33113161, 33270370, 33318627, 33508547, 33686086, 33876524, 33967382, 33942589, 34056599, 34257159, 34462867, 34651045, 34859410, 35072783, 35267072, 35480387, 35650581, 36073035, 36385444, 36874496, 37293879, 37765845, 38222936, 38798588, 39545977, 40287227, 41180595, 41990872, 42873895]
4424D2873895J063728J062968J189831J281977J331852J451100J488651J553767
4416E3297769J693058J914700J841435J895602K050155K335953K408143K641643
4408G0078458K682009L090394L525351L798058M324248N011511N544221O263874
4400A04318124P043478P920769Q968630J0045931J1449862J3011718J5076182
4393A77834694J7475516J9747846K1691377K2431520K1133926J5808960O044289
4386C02168128o129742j6894159k4352064k7263154k6365835k3095250j9452347
4379A58615577j5969539j2973247j0566930q811918p298394o206496n374486m843132
4371H6571435m476311l932200l579259l293799k868008k728998k655820k415552
$$ y = [42873895, 43937623, 45000591, 46190422, 47472399, 48804251, 50255351, 51744002, 53297769, 54990827, 56905527, 58746962, 60642564, 62692719, 65028672, 67436815, 70078458, 72760467, 75850861, 79376212, 83174270, 87498518, 92510029, 98054250, 104318124, 111361602, 119282371, 128251001, 138296932, 149746794, 162758512, 177834694, 195310210, 215058056, 236749433, 259180953, 280314879, 296123839, 302168128, 296038386, 279144227, 254792163, 227529009, 201163174, 178067924, 158615577, 142646038, 129672791, 119105861, 110293943, 102995549, 96789053, 91414567, 86571435, 82095124, 78162924, 74583665, 71289866, 68421858, 65692860, 63037040, 60621488]
4363F0621488k338390k197116k077656j890554j716868j423242j451572j274868
4355D6251222j290681j080744j039884j040666j009008r45747q36337q36628r17205
4346C7254322p75150q76617p79134n78735o59269o89491o37555o64067m11356
4337C1182948n19826m74163l22342m95816m09363k09014m11696k82672l10219
4328B7747837k87282K599k29892q9617j0032j2522n288j42843K7716j3225m6797
4317B6940654n399l7321r4614k08723j62871k18079j80046j70974k43316l46855
4307B5272456j62506k35527k42463k42710k77549n8691j56001j62799q4467r7288
4297B3552455j79271k28753n9465o2179j97977r4312j91013q2701k10172j90257
$$ y = [60621488, 58283098, 56085982, 54008326, 52117772, 50400904, 48977662, 47526090, 46251222, 44960541, 43879797, 42839913, 41799247, 40790239, 39844492, 39008155, 38171527, 37254322, 36479172, 35602555, 34823421, 34244686, 33585417, 32895926, 32258371, 31594304, 31182948, 30663122, 30188959, 29866617, 29370801, 28961438, 28752424, 28340728, 28058056, 27747837, 27460555, 27463154, 27233262, 27143645, 27133613, 27121091, 27115803, 26972960, 27000676, 26987451, 26940654, 26935255, 26897934, 26803320, 26594597, 26431726, 26213647, 26033601, 25862627, 25619311, 25272456, 25109950, 24874423, 24631960, 24389250, 24111701, 24053010, 23897009, 23734210, 23649743, 23552455, 23373184, 23144431, 23084966, 23022787, 22824810, 22730498, 22539485, 22456784, 22246612, 22056355]
4287B2056355j78094k35537j45229o2234r121P731J19781k5344o101J3767J35347
4276B1671321Q9959J02439K611j66534j16544l7025J8235j05613j09272q7400
4266B1262177m0291m7003P9695N1273P0400j66973j8563N8150j28128n3203k2391
4255B1045143j740k8362m5528N6863J1961l7328j05107j75294k6449j29799l768
4244B0560592J8170M763j3904M5725O6971L7940J2113J55576J36341O0720J23622
4233B1208629K54446J64314J80934K41652J71491P7414J16853k4567o9502j55376
4223B2166288j20127j45359j66078r5373m2030N8858J2784K2782J01832K10589
4213B2004166O5668J39759J79996J59803Q2171J61777J44717N1349K15910J61784
$$ y = [22056355, 21878261, 21642724, 21497495, 21435261, 21426140, 21433871, 21553652, 21528308, 21522207, 21535974, 21671321, 21761280, 21863719, 21866330, 21699796, 21583252, 21546227, 21564462, 21458849, 21349577, 21262177, 21221886, 21174883, 21254578, 21305851, 21376251, 21209278, 21190715, 21248865, 21120737, 21067534, 21045143, 21043403, 21015041, 20969513, 21026376, 21038337, 21001009, 20895902, 20720608, 20694159, 20564360, 20560592, 20578762, 20583525, 20569621, 20615346, 20682317, 20720257, 20732370, 20887946, 21024287, 21085007, 21208629, 21463075, 21627389, 21808323, 22049975, 22221466, 22298880, 22415733, 22391166, 22321664, 22166288, 22046161, 21900802, 21734724, 21639351, 21597321, 21656179, 21668963, 21691745, 21793577, 22004166, 22069834, 22209593, 22389589, 22549392, 22631563, 22793340, 22938057, 22989406, 23205316, 23367100]
4203B3367100K28770R5372K26967L57887K53636K66581K96614M06054L98925M10734
4193B6308640M95291N60732N21358N45469M47860L82843L15556M501p3011r7518
4183B9411721j05171J34630J02829J13134L68179L67559L60665L58049L22181
4174C1433776J13484J00024R7361P3045M4138n6728p46Q2512k8242k177n3486
4163C1802961J6039o0670l9246K00542K20258J79587L26440L64609L21988K54230
4153C3586738K90429N81242M85715N91991O86824R53424J324535J574498J537896
4144D1613292J250563O60164J21558j47843m04778p38649r29727j233387j540650
4135C8650543j760736j830728j703607j590314j439724j262452j160879j047482
$$ y = [23367100, 23595870, 23691242, 23918209, 24276096, 24529732, 24796313, 25092927, 25498981, 25897906, 26308640, 26803931, 27364663, 27886021, 28431490, 28879350, 29262193, 29577749, 29582250, 29509239, 29411721, 29306550, 29441180, 29544009, 29657143, 30025322, 30392881, 30753546, 31111595, 31433776, 31547260, 31647284, 31744645, 31817690, 31861828, 31805100, 31804354, 31886866, 31858624, 31856447, 31802961, 31819000, 31758330, 31719084, 31919626, 32139884, 32319471, 32645911, 33010520, 33332508, 33586738, 33877167, 34458409, 34944124, 35536115, 36222939, 37176363, 38500898, 40075396, 41613292, 42863855, 43524019, 43645577, 43497734, 43092956, 42354307, 41424580, 40191193, 38650543, 36889807, 35059079, 33355472, 31765158, 30325434, 29062982, 27902103, 26854621]
4127B6854621q40123o55146n45136m92995l73740l72654k35459j72365l71759
4118B2795244k56733m27836m58769m31001l88442n49588l39470l14638j87243
4109A9441524k30813j41277j93720M8166r5862j03826O3601O5334J9808R9928
4099A8972863K03339R6932J45775K28169M6616O3997N0515L2688O4332m204j63829
4088A9737193r6404L703k25161j26066j69334K5238j06776l7355J4014j33337
4078A8885715j41706M7100j88314j6602k25730k24026j53091k27315j35912j13044
4068A7507075j99474N118R5019L8453j15696L2092J22721o1627Q4872J66205J90343
4057A7865101M11627K37916K13680J57556J87181L4900J60786K44331K82439L82138
$$ y = [26854621, 26014498, 25359352, 24814216, 24321221, 23947481, 23574827, 23339368, 23167003, 22795244, 22538511, 22110675, 21651906, 21220905, 20832463, 20282875, 19943405, 19628767, 19441524, 19210711, 19069434, 18875714, 18923880, 18828018, 18724192, 18787793, 18853127, 18872935, 18972863, 19176202, 19273134, 19418909, 19647078, 19693694, 19757691, 19808206, 19840894, 19905226, 19901022, 19737193, 19640789, 19644492, 19419331, 19293265, 19123931, 19149169, 19042393, 19005038, 19019052, 18885715, 18744009, 18791109, 18602795, 18586193, 18360463, 18136437, 17983346, 17756031, 17620119, 17507075, 17307601, 17312719, 17407738, 17446191, 17330495, 17362587, 17485308, 17423681, 17508553, 17674758, 17865101, 18276728, 18514644, 18728324, 18885880, 19073061, 19107961, 19268747, 19513078, 19795517, 20177655]
4047B0177655M13373L19533K72013L23223K41291J49860N9807j0771j34482n8299
4037B1753203j26968r7262M6214J30744K17494J49189K59558K58073K69657K02436
4027B3062338J59305J51606K16125J83655P3385J59623j8263J11715J98422L00302
4017B4598213J30411K60245L54636L28873M94740M65787M48220M30024N15798
4008B8026947O46584P49191P00739O92033P92063R10675Q74125Q61099J013085
3999C5266541J103688J215650J296831J372360J358284J488828J676944J726534
3991D6505660J776935J824266J887627K028396K202600K335424K412570K620658
3983F3594136K795431K786676K961207L128334L136918L275345L392770L577558
$$ y = [20177655, 20591028, 20910561, 21182574, 21505797, 21747088, 21896948, 21956755, 21945984, 21811502, 21753203, 21626235, 21528973, 21575187, 21705931, 21923425, 22072614, 22332172, 22590245, 22859902, 23062338, 23221643, 23373249, 23589374, 23773029, 23846414, 24006037, 23987774, 24099489, 24297911, 24598213, 24728624, 24988869, 25343505, 25672378, 26167118, 26632905, 27081125, 27511149, 28026947, 28673531, 29422722, 30123461, 30815494, 31607557, 32518232, 33392357, 34253456, 35266541, 36370229, 37585879, 38882710, 40255070, 41613354, 43102182, 44779126, 46505660, 48282595, 50106861, 51994488, 54022884, 56225484, 58560908, 60973478, 63594136, 66389567, 69176243, 72137450, 75265784, 78402702, 81678047, 85070817, 88648375]
3975H8648375L580301L679634L692357L796584L877759L996756L911966L941474
3967A19125206M031105M029657L914805L909944L761834L444260L535983L267660
3959A49020454K966124K896812K684657K642795K451050K160059J969807J731514
3951A68523272J529649J306963Q52007M50154m6813m90869q98304j233367j475567
3942A68517125j701910j917128k012896k261188k448082k622092k830424l051843
3934A49671562l204599l299262l613835l869177m010482l917128l899404m101573
3926A19756102m012217m059529l951417l851116l863643l811835l850987l811666
3918H8543692l694102l590638l519501l278046l231241l175732k916436k807979
$$ y = [88648375, 92228676, 95908310, 99600667, 103397251, 107275010, 111271766, 115183732, 119125206, 123156311, 127185968, 131100773, 135010717, 138772551, 142216811, 145752794, 149020454, 151986578, 154883390, 157568047, 160210842, 162661892, 164821951, 166791758, 168523272, 170052921, 171359884, 172211891, 172662045, 172615232, 172124363, 171226059, 169992692, 168517125, 166815215, 164898087, 162885191, 160624003, 158175921, 155553829, 152723405, 149671562, 146466963, 143167701, 139553866, 135684689, 131674207, 127757079, 123857675, 119756102, 115743885, 111684356, 107732939, 103881823, 100018180, 96206345, 92355358, 88543692, 84849590, 81258952, 77739451, 74461405, 71230164, 68054432, 65137996, 62330017]
3910F2330017k664301k690029k504478k295066k199923k019559k030799j905175
3902D4020687j774050j645083j651409j584433j653182j313878j291253j214492
3894C1892907j166090j185336j102684j003576q96749q36086q10942p40301o65172
3885B3485971p16447o84402n55201n95722n94524n03661m17163m41938m61288
3876A8515625n04861m66168m32742k84244k64331l18279k57869m29427l87027
3867A5170677l35811k32758j98365k13989k53207l98900j95823k19122k84031
3858A2838671j61898k20509k44968j18676l04969j82985j40309j27864j63244
3849A1173249j56412j12910j60140n6777k25195j54747j41674j07731k06168n8145
$$ y = [62330017, 59665716, 56975687, 54471209, 52176143, 49976220, 47956661, 45925862, 44020687, 42246637, 40601554, 38950145, 37365712, 35712530, 34398652, 33107399, 31892907, 30726817, 29541481, 28438797, 27435221, 26538472, 25702386, 24891444, 24151143, 23485971, 22769524, 22085122, 21529921, 20934199, 20339675, 19836014, 19418851, 18976913, 18515625, 18010764, 17544596, 17111854, 16827610, 16563279, 16245000, 15987131, 15557704, 15170677, 14834866, 14602108, 14403743, 14189754, 13936547, 13537647, 13341824, 13122702, 12838671, 12676773, 12456264, 12211296, 12092620, 11787651, 11604666, 11464357, 11336493, 11173249, 11016837, 10903927, 10743787, 10687010, 10461815, 10307068, 10165394, 10057663, 9851495, 9793350]
3839I793350j26417q3655j27853j75553j51344r7506K9071o5174j69565j52635
3829H672719l1039o1827j4581q7132k6369o8842n4500o7682o1354m3444m0157
3818H115792q9976k3915k1532o0038r1825J6797J0702r2250k0828J13701j1720
3807G844908j00514k1806j15355p3999O0869j0922J6358j4645p7358k5100j5666
3796G466770J377m0979M8286K6055n784J7421m1878q7319L7192k678J8985k6338
3784G411110O6916r3695p8114R6941j3305r2685K1241P2689K4088l7132M1408
3773G419462j2361L9448j34698l6627J29029M2950p200o962O3380L6977M0859
3762G574257l6319q032m5867L7289R9251P6785j7522J6955J06160P4994J69255
$$ y = [9793350, 9666933, 9583278, 9455425, 9279872, 9128528, 9031022, 9060093, 8994919, 8825354, 8672719, 8641680, 8579853, 8565272, 8478140, 8451771, 8382929, 8328429, 8260747, 8199393, 8155949, 8115792, 8025816, 8001901, 7980369, 7920331, 7828506, 7845303, 7856005, 7763755, 7742927, 7856628, 7844908, 7744394, 7722588, 7607233, 7533234, 7594103, 7583181, 7599539, 7584894, 7507536, 7482436, 7466770, 7468147, 7427168, 7475454, 7501509, 7495725, 7513146, 7471268, 7383949, 7421141, 7418463, 7437448, 7411110, 7478026, 7384331, 7306217, 7403158, 7389853, 7297168, 7318409, 7391098, 7415186, 7378054, 7419462, 7407101, 7446549, 7311851, 7275224, 7404253, 7447203, 7440003, 7433041, 7496421, 7533398, 7574257, 7537938, 7529906, 7484039, 7521328, 7620579, 7697364, 7679842, 7696797, 7802957, 7877951, 8047206]
3751H047206K8313M4515R2219J53977J27968J50339Q8895J15953J22582K17129
3741I189096K01769J48638K34172K39130J85998J95993J72438J92820K79071J38970
3731A1178095K59666Q4754J59731J54401J38559J60963O9779J73338J28861O1636
3721A2569783J06987L550k018J6693J38187J45084J2391k0012J38568J4386m1542
3710A3082057k6293N6545O5915K4503J81662K71703J57276Q9600J42398J89983
3700A4235349L46827J86721J92093L10732K84757K90132J94178K89489K35852
3691A6566130L15637M08309K73920K89243K28383K95808L24395K69907L48705
3682A9320437L39388L11958L76077L59782L32542L46203J51828K94700K04906
$$ y = [8047206, 8075519, 8120034, 8212253, 8366230, 8494198, 8644537, 8733432, 8849385, 8971967, 9189096, 9390865, 9539503, 9773675, 10012805, 10198803, 10394796, 10567234, 10760054, 11039125, 11178095, 11437761, 11522515, 11682246, 11836647, 11975206, 12136169, 12205948, 12379286, 12508147, 12569783, 12676770, 12680320, 12678302, 12694995, 12833182, 12978266, 12990657, 12970645, 13109213, 13123599, 13082057, 13055764, 13112309, 13178224, 13202727, 13384389, 13656092, 13813368, 13902968, 14045366, 14235349, 14582176, 14768897, 14960990, 15271722, 15556479, 15846611, 16040789, 16330278, 16566130, 16881767, 17290076, 17563996, 17853239, 18081622, 18377430, 18701825, 18971732, 19320437, 19659825, 19971783, 20347860, 20707642, 21040184, 21386387, 21538215, 21832915, 22037821]
3673B2037821J23423K07542K18883M16260M11036L93494M80664N14198M73838
3664B5277159N41343O79771P09428O53672Q81159P69711P75792Q43880Q37598
3655C1969513Q99653J059926R22329J008186J210235J061313J127020J170451
3647D0428626J234404J241346J258440J197960J326379J320272J420221J422331
3639E0849979J411660J594536J596157J672903J744067J768308J898350K000485
3631F4536445J876097J764469J835885J820092J751046J621275J525364J630325
3623G8360998J389572J304130J468416J374463J246604J245145J109928J126794
3615H8626050J014254R00129P64860O88948N75462M39863L41811M26817M59383
$$ y = [22037821, 22161244, 22368786, 22587669, 23003929, 23414965, 23808459, 24289123, 24803321, 25277159, 25818502, 26498273, 27207701, 27861373, 28742532, 29512243, 30288035, 31131915, 31969513, 32869166, 33929092, 34851421, 35859607, 37069842, 38131155, 39258175, 40428626, 41663030, 42904376, 44162816, 45360776, 46687155, 48007427, 49427648, 50849979, 52261639, 53856175, 55452332, 57125235, 58869302, 60637610, 62535960, 64536445, 66412542, 68177011, 70012896, 71832988, 73584034, 75205309, 76730673, 78360998, 79750570, 81054700, 82523116, 83897579, 85144183, 86389328, 87499256, 88626050, 89640304, 90540433, 91305293, 91994241, 92569703, 93009566, 93351377, 93778194, 94237577]
3606I4237577L92765M55544N81911O45100P12007P88026R29346J105158J111116
3597A00958550J308694J322810J365022J517141J800887J938805K008243K253459
3589A14473611K552894K611959K868049L183618L382794L581429L742159L936873
3581A40333386M178046M459055M517245M645100M736951M762467M762425M771260
3573A77165935M624885M507467M202060M108825L926312L655197L661701L512096
3565B09364478L334210L111170K873365K574527K255403K056384J656849J087416
3557B28313802O65364K98490P3004l91074n64341p83108p63796p43199q00508
3548B25304634o27325o63579n29625n13497o58345n70881m35233l49433k35901
$$ y = [94237577, 94630342, 95085886, 95667797, 96312897, 97024904, 97812930, 98742276, 99847434, 100958550, 102267244, 103590054, 104955076, 106472217, 108273104, 110211909, 112220152, 114473611, 117026505, 119638464, 122506513, 125690131, 129072925, 132654354, 136396513, 140333386, 144511432, 148970487, 153487732, 158132832, 162869783, 167632250, 172394675, 177165935, 181790820, 186298287, 190500347, 194609172, 198535484, 202190681, 205852382, 209364478, 212698688, 215809858, 218683223, 221257750, 223513153, 225569537, 227226386, 228313802, 228979166, 229277656, 229350660, 228959586, 228395245, 227612137, 226848341, 226105142, 225304634, 224677309, 224013730, 223484105, 222970608, 222312263, 221741382, 221306149, 220956716, 220720815]
3539B20720815j18918K75922M50516O40559R72079J311881J489683J667726K068829
3530B29479092K059606K117294K121566K029071J973092J893132J631856J305306
3522B44610015J106025R57753O93355M97562K28537R8017j60719l86681o36773
3513B47007091q53204j294616j737466k052524k362302k911009l206223l420824
3505B29168923l871810m027066m125929m014864m106133m065315l968789l842655
3497A97146362l804890l680488l509253l520558l398935l437882l375174l065942
3489A69353240l009005k727180k509311k278060j965517j583658j183516r88087
3481A53108906o19024j27830N0241N02084Q12611J019342J435682J635865J774215
$$ y = [220720815, 220601897, 220877819, 221328335, 221968894, 222940973, 224252854, 225742537, 227410263, 229479092, 231538698, 233655992, 235777558, 237806629, 239779721, 241672853, 243304709, 244610015, 245716040, 246673793, 247367148, 247864710, 248093247, 248191264, 248030545, 247643864, 247007091, 246153887, 244859271, 243121805, 241069281, 238706979, 235795970, 232589747, 229168923, 225297113, 221270047, 217144118, 213129254, 209023121, 204957806, 200989017, 197146362, 193341472, 189660984, 186151731, 182631173, 179232238, 175794356, 172419182, 169353240, 166344235, 163617055, 161107744, 158829684, 156864167, 155280509, 154096993, 153108906, 152489882, 152362052, 152412293, 152914377, 153726988, 154746330, 156182012, 157817877, 159592092]
3472A59592092J988819K218752K317363K390945K523752K797107L088816L504526
3464A80422172L955304M335280N033889N712455O241416O936456P703924Q428925
3456B28769821R197174J0043630J0816810J1581831J2417749J2824620J2951005
3449C08602640J2826225J1999192J0550223Q727519O563094M230099J915283O2578
3441C65476853j436791k322877k969027l462059l621709l832699m202502m959640
3433C38669549n960509p302696r298372j1229489j3164358j4869761j6006528
3426B60837836j6559359j6652602j6126213j5348648j4135713j2931434j1558022
3419A57525845j0409806r303845q267733p495798o672835n933814n275902m730412
$$ y = [159592092, 161580911, 163799663, 166117026, 168507971, 171031723, 173828830, 176917646, 180422172, 184377476, 188712756, 193746645, 199459100, 205700516, 212636972, 220340896, 228769821, 237966995, 248010625, 258827435, 270409266, 282827015, 295651635, 308602640, 321428865, 333428057, 343978280, 352705799, 359268893, 363498992, 365414275, 365476853, 364040062, 361717185, 358748158, 355286099, 351664390, 347831691, 343629189, 338669549, 332709040, 325406344, 316107972, 304878483, 291714125, 276844364, 260837836, 244278477, 227625875, 211499662, 196151014, 182015301, 169083867, 157525845, 147116039, 137812194, 129544461, 122048663, 115375828, 109442014, 104166112, 99435700]
3411I9435700m405243l975629l633406l300623k924110k877721k421916k468021
3403G3429031k202042k039300j951966j672506j535018j575912j525655j371581
3395E9555051j234117j177595j236820j124111j163911j090604j107653j034135
3387E0386105r21170j095118r00846r54826q12126q83805p52556r32410q73594
3378D2259654q17722p06315q18520p32877p51774q38925o67186o88381n92235
3369C5645719p10708o69680p87170p72638p83658r05765o80861o50262p26825
3360B8958152n84201m83748n09249m70116m78754m35940m23445m25710l45233
3351B4801756m86918l88751m18038n93060m28444m32384m11669l78599m46042
$$ y = [99435700, 95030457, 91054828, 87421422, 84120799, 81196689, 78318968, 75897052, 73429031, 71226989, 69187689, 67235723, 65563217, 64028199, 62452287, 60926632, 59555051, 58320934, 57143339, 55906519, 54782408, 53618497, 52527893, 51420240, 50386105, 49464935, 48369817, 47468971, 46514145, 45702019, 44818214, 44065658, 43133248, 42259654, 41441932, 40735617, 39917097, 39184220, 38432446, 37593521, 36926335, 36237954, 35645719, 34935011, 34265331, 33478161, 32705523, 31921865, 31016100, 30335239, 29684977, 28958152, 28373951, 27890203, 27380954, 26910838, 26432084, 25996144, 25572699, 25146989, 24801756, 24314838, 23926087, 23508049, 22914989, 22486545, 22054161, 21642492, 21263893, 20817851]
3342B0817851l38491l93162l47965k66624l02784k48509j41597k20329k81462
3333A8276928k49224k49100k17495j41233k30680j11181j32739j13616j84009
3324A6647651m6756j41717l8983K7509m3253N955k8384J4302J0518P2091P29J77075
3312A6656737J15268O8141j43688k53701j97050l62255k38397k22757o6178o0479
3302A5295641j30792P6792L1828p9265m3601K0543J5710N4572M2794L4488m139
3291A5314571M4447N7070n4430K0758J19133R3714J26350J29137K17675J14526
3281A6182951K44N8440q5167j55231j20672R0326Q8909R021L7508J58412J48967
3270A6413708J12044J86813L60650L12983L60419K34843K42280L66650L16947
$$ y = [20817851, 20479360, 20086198, 19738233, 19471609, 19168825, 18920316, 18778719, 18558390, 18276928, 18027704, 17778604, 17561109, 17419876, 17189196, 17078015, 16945276, 16831660, 16647651, 16600895, 16459178, 16420195, 16447704, 16404451, 16410406, 16382022, 16396324, 16406842, 16478933, 16479662, 16656737, 16772005, 16840146, 16696458, 16442757, 16245707, 15883452, 15645055, 15422298, 15356120, 15295641, 15164849, 15241641, 15273469, 15194204, 15150603, 15171146, 15186856, 15241428, 15284222, 15318710, 15314571, 15359018, 15416088, 15361658, 15382416, 15501549, 15595263, 15721613, 15850750, 16068425, 16182951, 16183195, 16241635, 16156468, 16001237, 15880565, 15970891, 16059800, 16068821, 16106329, 16264741, 16413708, 16525752, 16712565, 17073215, 17386198, 17746617, 17981460, 18223740, 18590390, 18907337]
3261A8907337J53676J86166Q9623J26139l0910o4495L19843M96473N32914M69449
3251B1186215N16551N33132N09639O25531P76043Q41718R16200R25351R16675
3242B7747055Q67459P82454N22828J17341l23125p17019j276390j396278j432204
3233B4892121j300216j240105j211894r26618p75262p36817o51581m99388m93035
3224A7057205m14167k62552k94682k04342j19196j74682m7010K0027L7921J69358
3214A5767880J18430K07564L46376M52549L90931R7950k73209m74904p59694q32065
3204A5041808p60792o11598l89700m22845l82230k73044k12625k85518j36708
3195A1566748o7108j03466q3325p26J05748R8737K15805K41342J73253K28052
$$ y = [18907337, 19061013, 19247179, 19336802, 19462941, 19432031, 19367536, 19687379, 20183852, 20716766, 21186215, 21702766, 22235898, 22745537, 23371068, 24147111, 24988829, 25905029, 26830380, 27747055, 28614514, 29396968, 29919796, 30037137, 29714012, 28996993, 27720603, 26324325, 24892121, 23591905, 22351800, 21139906, 20213288, 19438026, 18701209, 18049628, 17550240, 17057205, 16643038, 16380486, 16085804, 15881462, 15762266, 15587584, 15540574, 15560601, 15598522, 15767880, 15886310, 16093874, 16440250, 16892799, 17283730, 17381680, 17108471, 16633567, 15873873, 15041808, 14281016, 13669418, 13279718, 12856873, 12474643, 12201599, 11988974, 11703456, 11566748, 11499640, 11396174, 11312849, 11312123, 11417871, 11516608, 11732413, 11973755, 12147008, 12375060]
3185A2375060K69327L48934O84534P43259P85777J046846J135929J049851K64963
3176A8704480m87467j032571j297144j387704j253582r46841o98106n63100l47445
3167A0690520l54381k75902j91225l1936l5340j60751l1597m9567O0566o2659
3157I557728N7807l4866K8816R0437J25863K08455J91097L27676M17761L05192
3147A1275966N17533M10302m093m48266o53560p17697p90298o74153n27444m63038
3137G925252l68397l33558k79659k37795k06011j58825j97076j74743o8880j96297
3127E704011L4864q9578j56935j48442o7781r0519j07238j10252n2600J6967j49999
3116D782498o5081J118M3965p0258o2427j85902J1418l9123k8695o9677J7043
$$ y = [12375060, 12644387, 12993321, 13677855, 14421114, 15206891, 16253737, 17389666, 18439517, 18704480, 18217013, 17184442, 15887298, 14499594, 13246012, 12299171, 11601065, 11037965, 10690520, 10336139, 10060237, 9869012, 9837076, 9801736, 9640985, 9609388, 9559821, 9620387, 9557728, 9615535, 9580669, 9609485, 9699922, 9825785, 10034240, 10225337, 10553013, 10970774, 11275966, 11793499, 12203801, 12199708, 11751442, 11097882, 10380185, 9589887, 8915734, 8388290, 7925252, 7556855, 7223297, 6943638, 6705843, 6499832, 6341007, 6143931, 5969188, 5900308, 5704011, 5738875, 5649297, 5492362, 5343920, 5276139, 5185620, 5078382, 4968130, 4915530, 4932497, 4782498, 4717417, 4718535, 4762500, 4692242, 4629815, 4443913, 4455331, 4416208, 4387513, 4317836, 4334879]
3105D334879j12501P3974r8360m8663L6036p4318L1763m7319j5936P946l659k9247
3093D054595J1909n8185k442r9095m2744L4817n8149M1375k7861p4392p8726L4691
3081C735793j11563p360R9878o1224k0992l6100j14621j82071n9238M5868p3800
3070C214570m1138j7957M7922j00138p6724M7982l0427N2557K162J3997o1978
3059C050828p1189N5307o7029l6886l1170j6885O528j22925M0560m5056k6727
3048B735356M6560N9395l7046q744j16746p4804J45647R779j5552p258m2448j05882
3036B588257o313O226m0533Q6093p600J3845l5436r1802j2024k8217P9580J7055
3024B569131m8543k5399K5083O0895o4309N8651n7989J5165j4999q0434O1676
$$ y = [4334879, 4222378, 4296352, 4197992, 4149329, 4185365, 4111047, 4142810, 4095491, 4079555, 4087501, 4083842, 4054595, 4066504, 4008319, 4005877, 3906782, 3864038, 3898855, 3840706, 3882081, 3854220, 3779828, 3701102, 3735793, 3624230, 3616870, 3716748, 3655524, 3634532, 3598432, 3483811, 3301740, 3242502, 3288370, 3214570, 3173432, 3155475, 3203397, 3103259, 3026535, 3074517, 3044090, 3096647, 3098809, 3112806, 3050828, 2979639, 3034946, 2967917, 2931031, 2899861, 2882976, 2889504, 2766579, 2807139, 2762083, 2735356, 2781916, 2841311, 2804265, 2795521, 2678775, 2603971, 2749618, 2759397, 2743845, 2736587, 2694139, 2588257, 2581944, 2588170, 2547637, 2633730, 2626130, 2639975, 2604539, 2512737, 2500713, 2472496, 2552076, 2569131, 2520588, 2495189, 2520272, 2581167, 2516858, 2575509, 2517520, 2532685, 2517686, 2437252, 2498928]
3013B498928J2442R1543l9668J065O5818l2863l4444P2988N1548k3256K707l4881
3001B631927L5008R0903J3975J7555O8611N4495r3345P2679l7337n0701k1107
2990B782663r276l7042j10857J1839O2335q0702q6977J50283j5318j0916K3117
2979B679149M5553K0841M7574J2781J0582M5537M8161J33766M0288R1786o281
2968C169737N0350R4724K6320J63308M4037O7302n5955p1419p8529j1624o0209
2957C338042j50047q8647M0367L4781j10907K7859K1330o8223o8911L7322P4406
2946C087372J19633M5440j2326j1194P7855J15525J8761M5497M9888Q6801j4002
2935C609250J10033O3349P0310J17029Q7992J50061L4940P1248O6390j81481k2895
$$ y = [2498928, 2511370, 2602913, 2563245, 2564310, 2630128, 2597265, 2562821, 2635809, 2687357, 2664101, 2666808, 2631927, 2666935, 2757838, 2771813, 2789368, 2857979, 2912474, 2819129, 2891808, 2854471, 2803770, 2782663, 2773387, 2736345, 2625488, 2637327, 2699662, 2618960, 2531983, 2682266, 2666948, 2656032, 2679149, 2724702, 2745543, 2793117, 2805898, 2816480, 2862017, 2910178, 3043944, 3084232, 3176018, 3169737, 3220087, 3314811, 3341131, 3504439, 3548476, 3615778, 3559823, 3488404, 3409875, 3398251, 3338042, 3187995, 3099348, 3139715, 3174496, 3063589, 3091448, 3112778, 3044555, 2975644, 3012966, 3087372, 3207005, 3252445, 3240119, 3228925, 3306780, 3422305, 3441066, 3486563, 3536451, 3623252, 3609250, 3719283, 3782632, 3852942, 3969971, 4057963, 4208024, 4242964, 4314212, 4380602, 4199121, 4176226]
2924D176226k6015l5166K2171J5171M4229j5060Q4851J7324k0340o457l2098Q0037
2912D304873P4434J61063J0442J4569J08182K1747K4976O2446J51473K9930K8274
2901D992409N8044N4016J78758J19307J09573n9777q1559k00324k82027p6899
2891D811521r9492J7434j37040j36604M7637K7774k6795Q8620m3940N9664N7956
2880D666735m2914j5332N1856J19677O8237m7872o720r3617o340r201L5382j03852
2868D616039o023J5090m918j83783r0591j52453j16991j07139o7156o7510o6797
2857C767768L8633j1203n5552p5279p3295o4932n331l9978J14768p8140o4111
2846C453348j32660k9385j56982l930l0460m9747j45089p3067j10916j65860j13782
$$ y = [4176226, 4150211, 4115045, 4137216, 4152387, 4196616, 4181556, 4266407, 4283731, 4263391, 4256934, 4224836, 4304873, 4379307, 4540370, 4550812, 4565381, 4673563, 4695310, 4720286, 4782732, 4934205, 4964135, 4992409, 5050453, 5104469, 5283227, 5402534, 5512107, 5452330, 5370771, 5170447, 4888420, 4811521, 4712029, 4729463, 4592423, 4455819, 4503456, 4531230, 4504435, 4593055, 4549115, 4608779, 4666735, 4623821, 4608489, 4660345, 4780022, 4848259, 4800387, 4793667, 4700050, 4693710, 4684509, 4719891, 4616039, 4610016, 4625106, 4620188, 4436405, 4345814, 4193361, 4076370, 3969231, 3902075, 3834565, 3767768, 3806401, 3795198, 3739646, 3664367, 3591072, 3526140, 3520809, 3480831, 3595599, 3517459, 3453348, 3320688, 3291303, 3134321, 3130391, 3099931, 3050184, 2905095, 2832028, 2721112, 2555252, 2441470]
2835B441470j05549r0379M7159K4830q8256o1743l0872J2960r1642p8813o7015
2824A912150O8296j17492M5741m349j6485l3356j66193R925J9066k0004m8125
2813A649174k3745p3245q58j13145K7318p0216j33175J31486O8920J7051k994
2802A476571j03182k7185q5342l3659P3841Q805p7155j07262M1867l0224J4607
2791A151682M7253l1475p2453J5849p8096j7261O3873M2263J7838P6012o6486
2780A148999j31579L16m058K9673l9172M827m6263m846j31507J6086J23290P8149
2768A043915l4418r9347j46080l835l0954J8494Q2120N8326n0197q3960J0705
2757G64769K5343P5843l3160k9890k4694k7942m1853L2838K6554l3858J625o8439
$$ y = [2441470, 2335921, 2245542, 2292701, 2317531, 2229275, 2167532, 2136660, 2149620, 2057978, 1979165, 1912150, 1980446, 1862954, 1908695, 1904346, 1887861, 1854505, 1688312, 1698237, 1717303, 1697299, 1649174, 1625429, 1552184, 1551326, 1438181, 1465499, 1395283, 1262108, 1393594, 1462514, 1479565, 1476571, 1373389, 1346204, 1260862, 1227203, 1301044, 1309849, 1232694, 1125432, 1167299, 1137075, 1151682, 1198935, 1167460, 1095007, 1110856, 1032760, 1015499, 1079372, 1121635, 1139473, 1215485, 1148999, 1017420, 1017736, 1013678, 1043351, 1004179, 1009006, 962743, 957897, 826390, 842476, 965766, 1043915, 1009497, 910150, 764070, 760235, 729281, 747775, 829895, 888221, 838024, 754064, 764769, 790112, 865955, 832795, 802905, 778211, 750269, 708416, 741254, 767808, 733950, 735575, 667136]
2745F67136p6207K8848Q0311o8761l4595P4721o0147O6907M2568p4967m7650O8480
2733F66644j08213N926m8647O1867J2489O6639R1665p2697n4339j13958n8607
2722D48769J51864Q582j59096L276P676k5988J7284O2084J50651j14438o6242
2711D84422Q9300j02480J1278J931N5473m5935M6996q822l261K7038k6009K3536
2699E53467K1021m3267j9427r8736l1947J70419j2033j12435K2539M0677k4739
2688D65539o199m696j7738J37668l0594J4168l8084n6809J1971k0111q673k0535
2676D25907p745O3628j4249R112P4541r8295P300M4379Q661J2116M1114r0997
2664D75472J7480L3146m2840j19651M4333L2082l1652J2446m8959P4497o2497
$$ y = [667136, 590929, 619777, 700088, 631327, 596732, 671453, 611306, 678213, 720781, 645814, 598164, 666644, 558431, 564357, 515710, 577577, 590066, 656705, 748370, 675673, 621334, 507376, 448769, 600633, 609215, 450119, 453395, 461071, 435083, 452367, 514451, 665102, 550664, 484422, 573722, 471242, 482520, 484451, 539924, 493989, 540985, 532163, 528902, 555940, 529931, 553467, 574488, 531221, 511794, 413058, 381111, 551530, 539497, 427062, 449601, 490278, 465539, 459340, 454644, 436906, 574574, 543980, 558148, 520064, 463255, 475226, 455115, 446442, 425907, 418162, 481790, 467541, 476653, 551194, 452899, 460199, 504578, 513239, 525355, 566469, 475472, 492952, 526098, 483258, 363607, 407940, 440022, 408370, 420816, 371857, 446354, 383857]
2653C83857o9884m5360J3226J6501m0916J46215K4216l4739o2263n4139L9460
2642C16174J18853j05979j1836N5113O037J0715j8459P4527j3922q2438j0538
2631C38247R0489L8468p4063m3633J7844L9510J13396k4981j37211O6121Q6342
2620E10529P7467J0378k7968j18133k6098J1999J4552l2428j02962L779q209J62471
2608D75377P5800q9828L8271j6224p4777J3796r049n0413j21836L0951M2512j6417
2596B98163j2805j6751j170M6160J6319L9404L8346M3698p1000o0937J07377Q2297
2584E09101j31562n4676o9051K0066N7908L4837K2047l8060l1554P374k2988K1519
2572C24961N4169M879m3773q6217J7696M0767m2755j03013J45682P8866j00354
$$ y = [383857, 313973, 268613, 281839, 298340, 257424, 403639, 427855, 393116, 330853, 276714, 316174, 435027, 329048, 317212, 372325, 378362, 389077, 370618, 445145, 431223, 348785, 338247, 428736, 467204, 393141, 349508, 367352, 406862, 520258, 495277, 358066, 424187, 510529, 587996, 598374, 570406, 452273, 426175, 438174, 452726, 420298, 317336, 321115, 312906, 475377, 551177, 461349, 499620, 483396, 408619, 422415, 413366, 362953, 241117, 272068, 314580, 298163, 285358, 268607, 267437, 313597, 329916, 369320, 407666, 451364, 380364, 319427, 426804, 509101, 377539, 322863, 253812, 273878, 331786, 366623, 388670, 350610, 319056, 326430, 303442, 324961, 379130, 384009, 340236, 254019, 271715, 312482, 269727, 166714, 312396, 391262, 290908]
2561B90908m2989l3279R4449p4698J50746K5940l5509o2116j11026J6775J3918
2550B33119J37703j4188N9686p4620j08557R5281l8267l5147N5192q9646R3947
2539C14503n9865J081J17571q2561n1841k2240j2350R788p2383Q260K8489L2208
2527B10660N4949j1656M5588o1826M3604l3882j79864r285N5351J12629O016q6444
2515A45840n0010J8521Q3780m8009K0621m8304J1984j3994m2571L9164l1962j054
2503H4006k5921J58631n2060l14P693K786M4362l5018q813r6805M3724O8535q898
2490A81908p8110q2498l058L2899J7387k3210P7608M1101m9466k2218M5657P5928
2478B13928m4423k8192p4674o0074k227j6053O5733O473J5592L1251M7810m2722
$$ y = [290908, 247919, 214640, 309089, 234391, 385137, 411077, 375568, 313452, 202426, 219201, 233119, 370822, 356634, 416320, 341700, 233143, 328424, 290157, 255010, 310202, 220556, 314503, 254638, 255719, 373290, 290729, 238888, 216648, 204298, 214086, 141703, 149963, 178452, 210660, 265609, 253953, 299541, 237715, 281319, 247437, 67573, 58288, 113639, 226268, 232284, 145840, 95830, 114351, 198131, 150122, 170743, 122439, 134423, 120429, 77858, 117022, 85060, 84006, 58085, 216716, 164656, 164342, 172035, 174821, 219183, 184165, 175352, 78547, 122271, 190806, 181908, 103798, 21300, 18242, 51141, 68528, 45318, 122926, 164027, 114561, 92343, 138000, 213928, 169505, 141313, 66639, 6565, 4338, -11715, 54018, 60491, 76083, 107334, 155144, 112422]
2466A12422j3796l6430m5999K3333R5007q6033o352p1072K5870k5529n713N152
2454b9140J1370J3215J106J8638K2845P935k390O1315m8809n6041O137J6856q151
2441A4886M6733l0915J0424m4919K9541k9888J06196o5313k5721n2768J6130K3729
2429a885R1668k1757j06305L9802k2968M7146K4288J625L2743j02296l2431N5106
2417D736n553m2183N3371j4710J1838J4732m0264J31864p2289j42928j956J13780
2405A0438J7255l4982J8849k3565n2716P615N8085O5238l3676l4890l6990J05952
2393F6613l0522o4227n600L3275R2666q7538j20193J00276J3674m175J38253k1058
2381A11444l3633m597r5939K1326M5711J6831M2345K2141k5972J9646M4514l1064
$$ y = [112422, 98626, 62196, 16197, 39530, 134537, 48504, 42152, -28920, -3050, -28579, -34292, -29140, -17770, -4555, -3449, 15189, 38034, 45969, 43579, 104894, 56085, 44, 6181, 23037, 14886, 61619, 30704, 41128, -3791, 25750, -4138, 102058, 36745, 11024, -41744, -25614, -1885, 89783, 68026, -38279, 1523, -21445, 25701, 49989, 51614, 84357, -17939, -50370, 4736, -817, -43000, 10371, -4339, 7499, 22231, -18033, 113831, 41542, -101386, -103342, 10438, 27693, -7289, 11560, -12005, -64721, -57106, 979, 66217, 32541, -2349, -39339, 66613, 36091, -28136, -33736, -461, 92205, 4667, -115526, -15250, -1576, -5751, 132502, 111444, 77811, 73214, -22725, -1399, 44312, 61143, 103488, 125629, 99657, 119303, 163817, 132753]
2369A32753N3289L2325P0431n7083j16111j51K041l1797p2200Q411l3691m3584
2357e5367j1947Q7481N6644L703Q5855r7547L0640q2069l9649N6670J7079p6270
2345b4777J32220L3612j10811j37877L7685K9295O6118k8502r1480l8993M1998
2334i1512N5652K6870J5136l8265k5822m2702Q0137J18762N755j1858M0409j32824
2322b62m6924L4950j1161L5157m2570m3056Q2906k1989n107m4610j6565l6011
2310a15242M6110k8954L1806J4281k1112j3708J7041O6772n355k3706N6220j8823
2298E330L3917L1514j38535K6778R6266p8451J1665J7947q0182j21711J41963
2287e3499O4345o7952r3472Q860p218R4409K0445J3369Q7684m1577N068K6669
$$ y = [132753, 186042, 218367, 288798, 231715, 115604, 115453, 117494, 85697, 13497, 21908, -11783, -55367, -67314, 20167, 76811, 80514, 166369, 68822, 99462, 17393, -22256, 34414, 51493, -24777, 107443, 141055, 30244, -107633, -69948, -40653, 25465, -3037, -94517, -133510, -91512, -35860, -8990, 6146, -32119, -57941, -100643, -20506, 98256, 104011, 92153, 132562, -262, -47186, -12236, -23397, 11760, -30810, -73866, 9040, -12949, -18056, -62666, -79231, -115242, -69132, -98086, -66280, -51999, -73111, -86819, -69778, -3006, -8361, -32067, 24153, 5330, 39247, 70761, -67774, -40996, 55270, -23181, -11516, 6431, -73751, -195462, -53499, 10846, -57106, -150578, -141718, -148936, -54527, -34082, -20713, 66971, 25394, 30462, 57131]
2275E7131r9650M1547L0526n2114m6547K2387R5080j16732Q3100L1883p1822k5070
2263e0281l0080N9015J14360r5464J5801N4022p2589N6534q6018p48J12565K5526
2251A02643j7352k1471j3462M9972J988M7960j09380j25149Q6888J6085N2601
2240G1323n8024J2660n805j03844M7866M8313o5046M3574N3431q7817m4497O4685
2228b3181P090j3782L958k7451K12057J641n9062N8976p0331j6265k1831K3172
2216G4991N430O6887k0750M7301o0734j8921J6968J7958M9917J4894L7012o6854
2204A64099p6534M4988R89O3169M2184l0774l3442Q0615N838m2979j7501J9180
2192B19832P8142L7290p9363j16079R4172R6343J2186p2539K3368n564L2129K4353
$$ y = [57131, -42519, -972, 29554, -22560, -69107, -46720, 48360, -68372, 14728, 46611, -25211, -50281, -80361, -21346, 93014, -2450, 13351, 67373, -5216, 51318, -34700, -35448, 77117, 102643, 85291, 63820, 50358, 100330, 102318, 150278, 40898, -84251, 2637, 18722, 71323, 13299, 25959, 20154, -83690, -35824, 12489, -52557, -8983, 44448, -43369, -87866, -23181, -16091, -29873, -25915, -53366, 158691, 160332, 101270, 160246, 89915, 73650, 51819, 74991, 80421, 147308, 126558, 173859, 113125, 94204, 111172, 129130, 179047, 193941, 230953, 164099, 87565, 132553, 133542, 196711, 238895, 208121, 174679, 255294, 261132, 218153, 200652, 219832, 297974, 335264, 255901, 139822, 233994, 330337, 342523, 269984, 293352, 287788, 319917, 344270]
2180C44270J11866q4296m714L7584l0606J76639L4179o9649j5640K6264o1871
2169D64026R7311P530K2615R709K2819K2268N0511m2583O1538N8368j7182L0924
2157G87854l0363N7417j1488n5935l403M5180M8511J59140J9799m255O2479M1203
2145A116139K7848r745O201L0586J78564M2082L4311P0358J07223R3043Q697J61347
2133A866654J26191O0872J30818M7304J03214J23046J63338J24280J20014J43485
2123C009216K49433L13299J69887Q2768L18239L35181M01379M99170N12717M00611
2113F291900L55905M03973O43072Q35731Q13648J126703J255498J768018K216350
2104A5710798K652349L513763M456036N353079M295705n72548l944025o041102
$$ y = [344270, 456136, 371840, 367126, 404710, 374104, 550743, 584922, 515273, 499633, 525897, 464026, 561337, 568867, 591482, 601191, 624010, 646278, 696789, 654206, 715744, 774112, 756930, 787854, 757491, 814908, 803420, 747485, 744082, 789262, 837773, 996913, 1016712, 1012457, 1074936, 1116139, 1143987, 1134242, 1140443, 1171029, 1349593, 1391675, 1425986, 1496344, 1603567, 1696610, 1705307, 1866654, 1992845, 2053717, 2184535, 2231839, 2335053, 2458099, 2621437, 2745717, 2865731, 3009216, 3258649, 3571948, 3741835, 3824603, 4142842, 4478023, 4879402, 5378572, 5891289, 6291900, 6647805, 7051778, 7694850, 8530581, 9344229, 10470932, 11726430, 13494448, 15710798, 18363147, 21876910, 26332946, 31686025, 35981730, 35409182, 31465157, 25424055]
2096B5424055n789752l909741k872702k025450j615906j105604q86533n17655
2088F700712n71194m09334k41273l21629l93805l64980k56097l02980k68947k20144
2078C350329k31781j90203j43089j39889j63101j38655j42051q7465p6409p2205
2068A965481j6460m3186q1748j07144K4009q1013j36801n6480l89k5319q4712
2057A356238j25937j8942o0941j15450P1554o6104k5433j23610l4120L0309J5384
2046I02948p7220M5611l8917q4468N1097o7333l9493n9549n5944P7351J1256M1776
2034G07115j1762n8589l6635m8435p1838j8028l6156l2065J05707L1991l0751
2023E00554j04825R819l5410m933j47297Q9925o2624K393L3410N9671n2628j67705
$$ y = [25424055, 19634303, 15724562, 12851860, 10826410, 9210504, 8104900, 7218367, 6700712, 6129518, 5720184, 5478911, 5157282, 4763477, 4398497, 4142400, 3839420, 3570473, 3350329, 3118548, 2928345, 2785256, 2645367, 2482266, 2343611, 2201560, 2114095, 2037686, 1965481, 1949021, 1905835, 1824087, 1716943, 1740952, 1659939, 1523138, 1466658, 1466269, 1440950, 1356238, 1230301, 1211359, 1150418, 1034968, 1106522, 1040418, 1014985, 891375, 857255, 887564, 902948, 825728, 871339, 832422, 747954, 799051, 731718, 692225, 632676, 576732, 654083, 665339, 707115, 695353, 636764, 600129, 551694, 479856, 461828, 425672, 393607, 499314, 531305, 500554, 395729, 405548, 370138, 365205, 217908, 307833, 245209, 247602, 281012, 340683, 288055, 120350]
2011A20350P5361R7562O9673q6708l7142p755N4618p0575O729O1514m4696O5008
1999C03939J8850m7037r5806o2011m173l8424k883L1270q0503M863p951J32064
1987A52198n5645n0616P4574L708l6886q4585Q5262M8823O5810j1712J3020j01790
1975A02161n6163J3044J5911J06304p4063M081r3314j48596J09070M2143R5049
1964A15627P948O7682K4350j07161q8003N0133P5399K7818j13294L7915l0766
1953F7648n1853l8666M4088o2858L1822N1701r568q9147M6600Q7367r6577k0752
1941d0195J03322J1757m6202L8072l3417m5804P3556k5201l3170L2534N0900j05535
1929a9383K6359l5331M1624J5459k6907O1176K7259m2982o1446j5029q908M483
$$ y = [120350, 195711, 293273, 362946, 276238, 239096, 231341, 285959, 215384, 222113, 283627, 238931, 303939, 322789, 275752, 179946, 117935, 113762, 75338, 72455, 103725, 23222, 28085, 20134, 152198, 96553, 45937, 120511, 124219, 87333, 2748, 88010, 136833, 202643, 190931, 203951, 102161, 45998, 59042, 74953, 181257, 107194, 111275, 17961, -130635, -21565, 20578, 115627, 123575, 191257, 215607, 108446, 20443, 70576, 145975, 173793, 60499, 98414, 67648, 15795, -22871, 21217, -41641, -9819, 41882, 32314, -56833, -10233, 77134, -19443, -40195, 63127, 74884, 28682, 66754, 33337, -12467, 61089, 35888, 2718, 35252, 86152, -19383, 6976, -28355, 13269, 28728, 1821, 62997, 90256, 47274, -14172, -29201, -38109, -33626]
1917c3626j5878o4299L6333N6600j9728M7998j6977o087K6582m6969K4212K8097
1905A6258o6619N2274j01508M0009R3439R0482j22094J5235M7112n7234r7342
1894h9988N3880j4748J70426m2463M9657L1578j08876j18039L9568J7585j0930
1883b2350J9236p6723l3865M6453Q8250L2440j09912o9538Q0652l9873m8680M3461
1871i0449N9668P6067p9099n9402J51557k8521m0449j34276J3968J37359M3878
1860E0301q8258m0547K7979R1035j3527M20n0363o1523J2668k5430J4083M1592
1848d1570q3129j0194Q1216j24069N8079j7989p5433N1597J02906m1925P1267
1837b9244O7127k2816l7907N1135Q9453j4297l0930Q446J5395ML1379r9484L360
$$ y = [-33626, -49504, -113803, -77470, -20870, -40598, 7400, -9577, -15664, 10918, -36051, -11839, 16258, -50361, 1913, -99595, -59586, 33853, 124335, 2241, 17476, 64588, 7354, -89988, -36108, -50856, 119570, 77107, 126764, 158342, 49466, -68573, -29005, -11420, -22350, -3114, -79837, -113702, -67249, 21001, 53441, -56471, -126009, -45357, -85230, -133910, -90449, -30781, 45286, -33813, -93215, 58342, 29821, -10628, -144904, -130936, 6423, 50301, -37957, -78504, -50525, 40510, 26983, 27403, -22960, -84483, -71815, -97245, -83162, -41570, -124699, -134893, -53677, -177746, -119667, -137656, -213089, -161492, -58586, -100511, -29244, 37883, 15067, -22840, 28295, 117748, 103451, 72521, 80967, 96362, 96366, 127745, 28261, 31621]
1824C1621l4421J755Q0245q5209n0523n2181J01548Q2320m2256j72884K7065O6399
1812d6521l8579O0486K5985n741j05757K5169o7912k820M4108P823K640K2725
1800g8394P6566j06971k1328j826Q833m8851p3398J19443L8306j05391J7133J58663
1788a7215n2307k1626m6092J2014R374l4329o6200K0169J08129N4375q5242J4379
1776a04571N538m846n7835O0559K9338r5490q244K6252J21290o3805J5383n7228
1764a33659J4150M2772m6194O8161J13396m5120j00102K2878j16772K6938K2229
1753a31323K6147k8467J1957K4868K394r576j7032L5784o7977l6120O4452l0604
1741a55497j9018m8144J30353Q2727o8790l2979l7760L0752k2512J40712p3653
$$ y = [31621, -2800, -1045, 79200, -6009, -56532, -108713, -7165, 75155, 32899, -139985, -112920, -46521, -85100, -24614, 1371, -4370, -110127, -84958, -152870, -155690, -111582, -103759, -101119, -78394, -1828, -108799, -130127, -131953, -123120, -171971, -245369, -125926, -87620, -193011, -175878, -17215, -69522, -91148, -137240, -125226, -115852, -150181, -216381, -196212, -88083, -33708, -118950, -104571, -99033, -103879, -161714, -101155, -71817, -167307, -175551, -149299, -28009, -91814, -76431, -133659, -119509, -76737, -122931, -54770, 58626, 13506, -86596, -63718, -180490, -153552, -131323, -105176, -133643, -121686, -96818, -94424, -104000, -121032, -85248, -153225, -189345, -124893, -155497, -174515, -222659, -92306, -9579, -78369, -111348, -149108, -118356, -140868, -156, -73809]
1730g3809j12464Q1186k5987P4425P797L4572j4450k0367p800L0023q7874p4606
1718a89354L8104j5675J6444L1724J7140l4907o6185L8181J29306M1572j5707
1707i357o1918r171l0521J8218L0485J024j3519k8301k9657N5530n0986m8316
1695a76489k2233o4238Q2001Q8638P003n0716j3979n187K988J7870L5365J8824
1683h0153L8505L0377o1079Q684n2735O3836J2094o3798l9924J49195o7990J9572
1671d3416L1446o0161J1889M6351n9781l7041l403M0553N5215r4400p450K9055
1659i1143o0013r20J11213L0784j7752m0880j02022M0262J867n7118J08662M5189
1647c1871j19558P0827k9013j0816P1345o7593O9404n3032m3867n123L7924n9966
$$ y = [-73809, -186273, -105087, -131074, -56649, -48852, -14280, -28730, -49097, -56897, -26874, -114748, -189354, -151250, -166925, -150481, -118757, -101617, -136524, -202709, -164528, -35222, 6350, -9357, -71275, -80446, -110967, -92749, -62264, -61240, -74759, -103060, -132717, -77187, -128173, -176489, -198722, -262960, -180959, -92321, -85318, -136034, -150013, -155200, -152212, -134342, -98977, -80153, -41648, -11271, -72350, -63666, -116401, -52565, -40471, -104269, -144193, 5002, -62988, -43416, -11970, -72131, -60242, -13891, -73672, -110713, -114116, -73563, -18348, -112748, -120198, -91143, -151156, -152076, -40863, -10079, -27831, -68711, -170733, -130471, -128604, -185722, -77060, -31871, -151429, -80602, -109615, -120431, -49086, -116679, -47275, -100307, -144174, -149297, -111373, -171339]
1635a71339r7836R1190J07010j6832M7992j16011K5646q8719o825L993K1507K0927
1623a79297m5605P5037K1661M8751o0576n3968L0206l7540n6628N1180M6610k513
1611a62682j11222R7639J29291j20374p7190J12687Q5609j10769Q8141N8935l5370
1600d5305K2334o0908O6228o5065R687r0745o8132R2852O179K6020O1765K3126
1588b1964j7535j46732l0878M5972m3714O236j890R174J9458K7459J33166K910
1576a8338k2657p9996j6737o0115P7910M6939j11472q856k8899o6541J603P0828
1564b16331N9239O3411l2213M2423j29731j1622N9368L0701Q2518K331k3161o8905
1552a41972q4117Q4360o050P6456j6308l8466K2860n8973M831l623K8424R7630
$$ y = [-171339, -269175, -177985, -70975, -87807, -39815, -155826, -130180, -218899, -225724, -221731, -200224, -179297, -224902, -149865, -128204, -79453, -140029, -193997, -163791, -201331, -257959, -206779, -160169, -162682, -273904, -176265, -46974, -167348, -244538, -131851, -46242, -157011, -68870, -9935, -45305, -22971, -83879, -17651, -82716, -73029, -163774, -231906, -139054, -132875, -106855, -45090, -21964, -39499, -186231, -217109, -171137, -214851, -208615, -210505, -201331, -181873, -154414, -21248, -18338, -40995, -120991, -137728, -197843, -119933, -72994, -184466, -193322, -222221, -288762, -287159, -216331, -157092, -93681, -125894, -83471, -213202, -224824, -165456, -134755, -52237, -49906, -73067, -141972, -226089, -141729, -147779, -71323, -87631, -126097, -103237, -162210, -157379, -161002, -132578, -34948]
1540c4948q4856p712J28186j06001r4297R7672k3599r6633M7817o553n9813N74
1528b40163J12163K3684k2063K2967j8739o8116m3961P2687k386K9113K0330O839
1516a07645l984K2442r9697l5926O7155M2910J00080p8543p8499J32010P1287
1505C1590P5526j02837j44218j3141r4710Q3802Q1334j7722J0196J3685J638M293
1493g0564K4698o5330J14964m9510n6518J0571p94P6534m4045j6379M9068O7314
1481D0009q5627r0952p3660K3315N7064j08232J56947m9452m4110N6226k3334
1470a41806M2133L6110q2720J5645N3360j9198K7700j5171r464m505Q3444r2641
1458a07113M5179o7651N3988L2948j34185o1085O2008l0949Q1937o201O1248N2971
$$ y = [-34948, -119804, -127516, 670, -105331, -199628, -101956, -125555, -222188, -174371, -180924, -240737, -240163, -128000, -104316, -126379, -103412, -122151, -190267, -234228, -161541, -163927, -134814, -114484, -107645, -111629, -89187, -188884, -224810, -157655, -114745, -14665, -93208, -171707, -39697, 31590, 107116, 4279, -139939, -153080, -247790, -163988, -82654, -100376, -90180, -76495, -74857, -70564, -45866, -111196, 3768, -45742, -102260, -91689, -92483, -15949, -59994, -76373, -27305, 40009, -45618, -136570, -210230, -186915, -129851, -238083, -81136, -130588, -174698, -118472, -141806, -99673, -63563, -146283, -130638, -77278, -96476, -68776, -83947, -93411, -97916, -14472, -107113, -61934, -129585, -75597, -42649, -176834, -237919, -175911, -206860, -124923, -131124, -69876, -16905]
1446a6905n7296n4925K7899J8373k0976j7611O1336o8053l3314Q8922K8075l7700
1434h2175m4971N702j4181L2695j3998j24862P3262j9524l1140J12922l6330M2515
1422a00085o524K1194j06380J8632l1114N3283O0937q7845K3985K2484L3740k2172
1410a19865r0872K5961N8287L8713k4588J8819R2521p3532N008N3327l4748k1430
1398g2399m9024r479K1468q9036Q5341K5962q8449L9488J1211L0216N3211k1469
1386f2959J17472j65517p4663J26925k0153j00766J2873N6053j348Q6485r9903
1375a25501k5078J54562o4312q8937M1409n791K2969L078p2069J8049K8718J3721
1363i9182M4593o2023m1602L5819m298m3487r2465m8240Q7571J9115J4231L5619
$$ y = [-16905, -74201, -129126, -101227, -82854, -103830, -121441, -60105, -128158, -161472, -72550, -44475, -82175, -127146, -121444, -135625, -102930, -116928, -241790, -168528, -188052, -219192, -106270, -142600, -100085, -106609, -85415, -191795, -173163, -204277, -150994, -90057, -177902, -153917, -131433, -97693, -119865, -210737, -184776, -126489, -87776, -112364, -93545, -1024, -74556, -69548, -16221, -50969, -72399, -121423, -130902, -109434, -198470, -113129, -87167, -175616, -136128, -124917, -94701, -41490, -62959, 54513, -111004, -185667, -58742, -78895, -179661, -166788, -110735, -112083, -25598, -125501, -150579, 3983, -60329, -149266, -107857, -113648, -90679, -87601, -159670, -141621, -112903, -99182, -54589, -116612, -158214, -122395, -126693, -170180, -262645, -310885, -223314, -204199, -189968, -154349]
1351a54349n8429k970Q4999o9218R0499j02440l8077J36233K344j56L7558p7943
1339a51949K2541l3594K2558K1807k1802m6988L3339r1040J16396M5712O0506
1328b2514p6408k9374L9291j15334q056M0096p590k3971L5469N4087k9878q392
1316a52574K3588l401J45359j04973p1687K674Q311N3488J6323l121k6529L8415
1304g4127j6606l7842N362n6015J15855k2356n2258M8982k5771l2861K4794j9897
1292a42740M6312o2535J8723N658l967q7516N5874J2798J78230J9020j0256q4546
1280e4945j31305N663R9420l6474K7766j17500m1587J38784r248o65L4963m3784
1268a28912m0323Q7367L3965Q6391k4559l7497q4111n356j04280J25071k2221
$$ y = [-154349, -212778, -215748, -130749, -199967, -109468, -211908, -249985, -113752, -111408, -111564, -74006, -151949, -129408, -163002, -140444, -118637, -140439, -187427, -154088, -245128, -128732, -83020, -22514, -98922, -128296, -89005, -204339, -212395, -172299, -179889, -203860, -168391, -114304, -144182, -152574, -128986, -132387, 12972, -92001, -163688, -161014, -152703, -99215, -82892, -86013, -112542, -74127, -90733, -128575, -123213, -179228, -63373, -85729, -137987, -89005, -114776, -147637, -122843, -142740, -96428, -158963, -140240, -134582, -138549, -226065, -170191, -157393, 20837, 39857, 29601, -54945, -186250, -180587, -81167, -117641, -89875, -207375, -248962, -110178, -119426, -120091, -85128, -128912, -169235, -81868, -47903, 38488, 13929, -23568, -107679, -113035, -217315, -92244, -114465]
1257a14465q8460q1962R5180O9668o3166J25853K506r401p5832J2355L7831o7284
1245a57177J0901k456P6804k716l3131J4140N452J9874K6504m4898J112K3818
1233f1773K899J9709j5758k3242q3248J28228j9137l754l745j11437k6895J28490
1221f9663O8163n9128l8925j08318l202j2743J24190o3733k7161O2665K0282R0175
1209a7398k4013l9241O0845J2038l8070J6692k898O1397K5348j38829O5463j22069
1197a40735o2034J10169m7038k2079N3175P6147o2127K939L303M7576j7404k1636
1185g9744o3340m2476L7429R4945J0581P4829N0304j13674M6051n0350o2031l7645
1173a35121J36536M1838K0523j20771m4979O8020n8430m3006N344l5941O1241
$$ y = [-114465, -202925, -284887, -189707, -120039, -183205, -57352, -54846, -64247, -140079, -127724, -89893, -157177, -146276, -148732, -71928, -74644, -107775, -93635, -88183, -68309, -41805, -86703, -85591, -61773, -58874, -39165, -54923, -78165, -161413, -33185, -52322, -56076, -59821, -171258, -198153, -69663, -1500, -60628, -99553, -207871, -211073, -223816, -99626, -163359, -190520, -127855, -107573, -17398, -41411, -80652, -19807, -7769, -45839, -29147, -32045, 29352, 54700, -84129, -18666, -140735, -202769, -92600, -139638, -161717, -108542, -32395, -94522, -91583, -88280, -40704, -58108, -79744, -143084, -185560, -148131, -53186, -42605, 32224, 82528, -31146, 14905, -35445, -97476, -135121, 1415, 43253, 63776, -56995, -101974, -33954, -92384, -135390, -130046, -165987, -104746]
1162a04746o3858l7253J81824K1754N210J9373q4730l8559o534j2327J8317J37
1150a01392K2289q719o6238O0155k7852K2287L9584p3277O5829L5946O354J2754
1138a2280J39404j28240k9686o350J4898j29474P8491P6972j15533N7302K0255
1127c4241q3316r148J3073k232N7088L0159q6082r2101J02037J04813K6930j19217
1115i2237r1802M2818M5559M436L8424J28120j7048n239n9178M7343L9086j05093
1103b4811O994K0880j03338j0321J6794j3812Q6743n8360n9590j5491l8487J14060
1091g8739m4183M0517R911J2874K4289j6656Q494k1511j920O866L435j01127K0575
1078a37175J22716J2333m5261l84o3678l1459K9047J5392o0685K6396J1011P5298
$$ y = [-104746, -168604, -205857, -24033, -2279, 2931, 22304, -62426, -100985, -107519, -119846, -101529, -101392, -79103, -87822, -154060, -93905, -121757, -99470, -59886, -133163, -67334, -31388, -25034, -12280, 127124, -1116, -30802, -37152, -22254, -151728, -73237, 3735, -111798, -54496, -34241, -117557, -126705, -113632, -115864, -58776, -28617, -114699, -206800, -104763, 50, 26980, -92237, -184039, -141221, -95662, -91226, -52802, 75318, 58270, 53031, -6147, 41196, 80282, -24811, -17817, 3063, -100275, -110596, -93802, -107614, -20871, -79231, -138821, -154312, -192799, -78739, -122922, -82405, -72494, -59620, -35331, -51987, -43493, -65004, -66924, -60058, -56623, -157750, -137175, -14459, -2126, -47387, -47771, -111449, -142908, -113861, -98469, -159154, -132758, -121747, -46449]
1066d6449n97n5684O8373L598l3970q6155o681O5500K5740j0050J1563M320Q7824
1053B7332j6049r2773l0096l5869J9127j3461N1294M2608N0971k5124P468j74942
1041a89514L9439J25157p2936k1683N6244k5202M4048L2428P9548n5995n2683
1030d1149J4006m2144o7527O6378j4807Q323R7792K8092j30861j589m714N8482
1018b9718q888J2938J1966r414r887L5064K4276J125q550n193M6614l6895j13713
1005i0275o4734J01678k587q8028k0846J83395K913q2799l8505L296p8794O0940
993a14346J01990L5093Q410r088n2455p9889K7187P3336j43606N9104Q0019M4483
981C0238J1079j2677M0440q3952q5527k6782M0286m0053l3482M4773R6389r1834
$$ y = [-46449, -47046, -102730, -34357, -30759, -64729, -150884, -157565, -92065, -66325, -76375, -64812, -60492, 27332, 11283, -81490, -111586, -147455, -128328, -141789, -90495, -47887, 3084, -22040, -14572, -189514, -150075, -24918, -97854, -119537, -63293, -88495, -44447, -12019, 67529, 11534, -41149, -27143, -69287, -136814, -70436, -85243, -76920, 20872, 48964, -81897, -83486, -88200, -29718, -38606, -25668, -13702, -23116, -33003, 2061, 26337, 27462, 18912, 13719, 60333, 23438, -90275, -155009, -53331, -55918, -143946, -164792, 18603, 21516, -61283, -99788, -96492, -175286, -114346, -12356, 22737, 31147, 22059, -30396, -110285, -83098, -9762, -153368, -94264, -14245, 30238, 41317, 28640, 69080, -14872, -100399, -127181, -86895, -126948, -160430, -115657, -19268, -111102]
969a11102N9614N1502j24994M9342n5833M3834r2155L1205J68596m887o2916K1170
957b6624l701K0828m3805J2260M0560M0996n6174n8291M7125J967m7510J0625
945f1744R3712J59j85115k9722J19191Q5355k3006k9942L3673N6455p2578j02865
933a16427n484P0510j3018P330l5305k567j2323n840K7755K7442J2306l515L7250
920a1886K6341k6953r4199R1421M1813K670K0695j54716l6925O9429L7713L3386
908a211m543l9413r0536M5748j3215o092P6484K8696o836L934r4107K7854L0484
895d2753K2900L421j2513L3753q0428q0997m506K2831J11052l9856O9053J9897
883B1854k3879Q8275o3432q7789L4785L4017m2434L1219M6197o0761j2301q1375
$$ y = [-111102, -51488, 14, -124980, -75638, -131471, -87637, -179792, -148587, 20009, 15122, -47794, -26624, -30325, -9497, -53302, -41042, -482, 40514, -15660, -73951, -26826, -24859, -72369, -61744, 31968, 32127, -152988, -182710, -63519, 21836, -1170, -31112, 2561, 59016, -13562, -116427, -121911, -51401, -64419, -57089, -92394, -94961, -107284, -113124, -85369, -57927, -45621, -49136, -11886, 14455, -12498, -106697, -15276, 26537, 29207, 49902, -104814, -141739, -72310, -34597, -1211, -5754, -45167, -135703, -89955, -103170, -109262, -32778, -4082, -10918, -6984, -101091, -73237, -42753, -19853, -16432, -28945, 4808, -75620, -156617, -161123, -138292, -27240, -67096, 1957, 21854, -2025, 86250, 22818, -64971, -30186, 3831, -38603, -7384, 38813, -21948, -34249, -115624]
871a15624J1335Q0034P2777q6808m1061Q950K2376J00576k7060L6441l7545j093
859B3298n3063l2759J27312L3340m7450l4307o5291O0971q2486M5701N1685n5262
847b8311O649m8908k1039p381R9044M0807j8316L8752q4629o6557J44372p2158
835a7675N5760K1829M5022j60477K5623L2078K7090M4626k2232j0754l9620M6198
823D7468l3739j2829M2886o3255Q7204k7277n5789n647o5333J10548m8823J01268
811G6682O1022m1870l1166m1240o8448l4179K5402j1855p946M3068l6584K7427
799c9687j3154L0054L6094J01072j8154j41110K1425R4025n1563o257l1273O8320
787D9792n6807N692M8046n8115K0766o0200J21934K1715J281p5154l7312O8411
$$ y = [-115624, -104289, -24255, 48522, -38286, -79347, -70397, -48021, 52555, 25495, 61936, 24391, 23298, -29765, -62524, 64788, 98128, 50678, 16371, -48920, 12051, -70435, -24734, 26951, -28311, -21662, -70570, -91609, -98990, 54, 40861, 22545, 61297, -23332, -89889, 54483, -17675, 38085, 59914, 104936, -55541, -29918, 2160, 29250, 73876, 51644, 40890, 1270, 47468, 13729, 900, 43786, -19469, 67735, 40458, -15331, -20978, -86311, 24237, -24586, 76682, 137704, 95834, 64668, 23428, -45020, -79199, -53797, -65652, -73598, -30530, -67114, -39687, -52841, -22787, 13307, 114379, 96225, -44885, -23460, 70565, 19002, 12745, -18528, 49792, -7015, -1323, 46723, -11392, 9374, -50826, 71108, 92823, 94104, 18950, -18362, 50049]
775E0049k2582l0367K3145R666m241N5631l3771O3473l4670J6601o3810M9582
763G8706M3000p9872J2410k380J0590n6430l0270k7687O607l0747J0691N0743
751a4639M2576P7253r8497K2142P2373k4465K0414n0995l3269k5584p2476L438
739h1729o501M0542Q1675j12234N6904O0897n8452R706J8756O968k338q9876Q6004
726A0322N4187J9328n6563P5927n9659p1437J36331n2529r959J3180l2622q5552
714e9046Q8822j492j0439l1379M7087j8562o336l594K321J5389R7646o0477k4772
701C5168K5195q5845m401J1081J01329n0758l9394K9102K3396l7892Q3117j5010
689G5088l473Q591K6366Q9177j00927o4597k2561K4936n354K4764N5718k5642
$$ y = [50049, 27467, -2900, 20245, 29911, 25670, 81301, 47530, 111003, 76333, 92934, 29124, 78706, 121706, 41834, 54244, 51864, 62454, 6024, -24246, -51933, -45326, -76073, -65382, -14639, 27937, 105190, 6693, 28835, 101208, 76743, 97157, 46162, 12893, -12691, -85167, -81729, -88230, -47688, 33987, -78247, -21343, 39554, -18898, -9192, 9564, 16532, 14194, -75682, 10322, 64509, 83837, 27274, 103201, 43542, -27895, 108436, 55907, 45948, 59128, 26506, -59046, 29776, 28284, 17845, -13534, 33553, 14991, 8655, 5061, 7382, 22771, 120417, 59940, 35168, 60363, -25482, -29883, -18802, 82527, 31769, -7625, 21477, 44873, 6981, 90098, 75088, 71615, 80206, 106572, 195749, 94822, 30225, 7664, 32600, 27246, 52010, 107728, 82086]
677H2086j08789n4797J53455M6886l5664k3986R446j4468R523o5151R821l895
665D467L265l461m0090N2513o2588r6355m6330J29671R4023P1736l2333m7338
653B7180K3526K5534K9237J3467j1833r6013K7165p728o8962M0263L9861K5440
641F7137Q6286j0566j70635j3813J02670k4685m6709j1399Q7306O492J6791P4707
629A63582N070j26008J06035n7484p7745j8820n1847Q9364j5394N4669p273J3698
617G7847P579n3604n4676J30968N6936m5046j9596k4224m9474N6725J6062J6712
605A16209O8791o0243m7145k8789J148m6761Q2805K6406o1401J04680m4053K407
593A14054Q5185p5388q8085L8001Q4138K3002r1869o6364o2380M3444J31097P648
$$ y = [82086, -26703, -81500, 71955, 118841, 83177, 59191, 68637, 54169, 63692, -1459, 8362, 4467, 7732, 4271, -35819, 16694, -45894, -142249, -188579, -58908, 35115, 106851, 74518, 27180, 50706, 76240, 105477, 118944, 107111, 11098, 38263, 30535, -38427, 1836, 41697, 67137, 153423, 142857, -27778, -41591, 61079, 36394, -10315, -21714, 65592, 72084, 88875, 163582, 168652, 42644, 148679, 91195, 13450, -5370, -57217, 32147, 16753, 71422, 64149, 77847, 85426, 31822, -22854, 108114, 165050, 120004, 100408, 76184, 26710, 83435, 99497, 116209, 185000, 124757, 77612, 48823, 49971, 3210, 86015, 112421, 51020, 155700, 111647, 114054, 199239, 123851, 35766, 73767, 157905, 180907, 89038, 22674, -39706, 3738, 134835, 142483]
581A42483L5138K1775P0196j02260l6467p8646m6187L9260q5957M6067J21529
570A26931J6787O031M2223j7608M2349O0738j04507q7059j3969J29577O41J515
558B03649Q9723l5549O033q5168k8483j6054L1450o0532o6524N7074J4908K8622
546A39149n182l4267J3087O6694m8459k5399j6224J9792M0605l3329N0421q453
534A58435j13309J01017O3543l1249j7655J3615L5969j43985j8175J19332K4640
523A92178j34830l7681O4639K2329M4504J1631j46382j8719J49379j8147O6305
512A95206o5171k0820J17775r6682j04818o6787J26347O6684k7936j9822j6644
501H7332J2289l72L634M9125n7008j5725n5691J34490o893l7846R390n2056R754
$$ y = [142483, 177621, 199396, 269592, 167332, 130865, 52219, 6032, 45292, -40665, 5402, 126931, 143718, 149749, 191972, 174364, 216713, 277451, 172944, 85885, 71916, 201493, 202134, 203649, 293372, 257823, 263856, 178688, 150205, 134151, 165601, 105069, 38545, 95619, 110527, 139149, 133967, 99700, 112787, 179481, 131022, 105623, 89399, 109191, 149796, 116467, 166888, 158435, 45126, 146143, 209686, 178437, 160782, 174397, 210366, 66381, 48206, 167538, 192178, 57348, 19667, 84306, 106635, 151139, 162770, 16388, -2331, 147048, 128901, 195206, 130035, 109215, 226990, 130308, 25490, -41297, 85050, 151734, 123798, 103976, 87332, 99621, 99249, 102883, 152008, 95000, 79275, 23584, 158074, 151181, 113335, 122725, 70669, 80423]
488H0423N0121n7196l7357K6068j1508j3679m9872M1285O167L8320J8508K1952
476A13232M1578o1500j9165O7049k2677p5868o4650J43214J2210J4405K1121k5151
464A43798L1638K5397n2925k2198p468K9124M717k811P0826k1290O239P738k0723
451A92062n5084k90Q5487l6468m3217R6201j8186n0307o5555K869R8417Q1882
439B87811j4458j05065o6985J33930J2643l0738n4231j3514k286K0638j0073m7311
427A10361Q6241K3231r2277q9157J27142M8273K5724q6980k3860M2350k6472q121
415A36455R9271P7109j21624N9992K1323j6678L4957o0946K8080K5296o2069K568
403B23734K9507k9244Q4704l2397m8262p330o8324o1497M2871J00676j42042m1376
$$ y = [80423, 130544, 73348, 35991, 62059, 50551, 36872, -13000, 28285, 34452, 72772, 91280, 113232, 154810, 93310, 74145, 141194, 118517, 42649, -22001, 121213, 133423, 147828, 168949, 143798, 175436, 200833, 147908, 125710, 118242, 147366, 152083, 149272, 220098, 198808, 205047, 212785, 192062, 136978, 136688, 222175, 185707, 142490, 238691, 220505, 170198, 104643, 107512, 205929, 287811, 273353, 168288, 101303, 235233, 247876, 217138, 162907, 149393, 147107, 167745, 157672, 110361, 196602, 219833, 127556, 38399, 165541, 213814, 239538, 152558, 128698, 171048, 144576, 136455, 235726, 312835, 191211, 251203, 272526, 255848, 290805, 229859, 257939, 283235, 221166, 223734, 253241, 223997, 308701, 276304, 228042, 220712, 152388, 90891, 133762, 234438, 92396, 51020]
391E1020L5164N9984J16259o5983O710m0102q523O3867K6747J6188n1942j53432
379E5957M0735Q0743O2535K1755M4611p3521q3461L3774n2887M7083P1727M1691
367B90742Q2597j06214K8327L6793j04002j28932N010M1231Q473M0276p964O1561
355B47898j2679M4552j1508m8168N9967O2910m1995p3731J435j923k0860O7000
343B72898j3114m6094J23914n8856n8718K2934l3672M7868l2475k4875N0410R7786
331C48006r844L0398l1144q6055o0210M1901O3333n7393k9502L5689n1473J5119
319B08825R2198J1887J00437n8139j21885j13086N7645L3692n850J12857o7815
308B50766p9334Q9454l5344l6344J2624q228R5848m1280j3678j09712L4755M0366
$$ y = [51020, 86184, 146168, 262427, 196444, 203154, 163052, 154529, 218396, 245143, 261331, 209389, 55957, 96692, 177435, 239970, 261725, 306336, 232815, 149354, 183128, 130241, 177324, 249051, 290742, 373339, 267125, 295452, 332245, 228243, 99311, 104321, 145552, 154025, 194301, 186337, 247898, 235219, 279771, 268263, 220095, 280062, 342972, 300977, 227246, 228681, 226758, 205898, 272898, 259784, 213690, 337604, 278748, 220030, 242964, 209292, 257160, 224685, 199810, 250220, 348006, 338162, 368560, 337416, 251361, 191151, 233052, 296385, 238992, 209490, 245179, 193706, 208825, 301023, 312910, 413347, 355208, 233323, 120237, 177882, 211574, 205724, 318581, 250766, 171432, 260886, 225542, 189198, 201822, 193594, 289442, 248162, 234484, 124772, 159527, 199893]
296A99893N7457N1088j299L857l0835N9067m3829r3535l3420o1441q359M9225
284A47869J22621R6491k5019k7191k5573L592j6747M9456l1426m3701P2344p993
272C14723M6703n5173k6530K7316o4583K5224k4683l5673O2169m7387L0970J13852
260C66928r475r6664o9987L4710K8675j00821Q1401l9708L9388P4406k7194L6503
248C18162m7950k7333Q0810j07926K2780L1586K9224j5299M2555p1746k480J21227
236C73610q9130m0384m8998J7119j7242Q247K7718J15460m377o1230K868P9836
224C63497J7213k3479l1000K665p5213L6431j16770R2762M7005l4466K3216J26921
212D28782q3952q202P8952o5412r0611l6188N8849j4462n2771Q5888L3488j66
$$ y = [199893, 257350, 308438, 307139, 310996, 280161, 339228, 295399, 201864, 168444, 107003, 98644, 147869, 270490, 366981, 341962, 314771, 289198, 292790, 276043, 325499, 294073, 250372, 322716, 314723, 361426, 306253, 279723, 307039, 242456, 267680, 242997, 207324, 269493, 222106, 253076, 366928, 357453, 260789, 190802, 225512, 254187, 153366, 234767, 195059, 234447, 308853, 281659, 318162, 270212, 242879, 323689, 215763, 238543, 270129, 299353, 284054, 326609, 254863, 252383, 373610, 284480, 244096, 195098, 212217, 194975, 203222, 230940, 346400, 342023, 280793, 283661, 363497, 380710, 357231, 326231, 328896, 253683, 290114, 173344, 266106, 313111, 278645, 301861, 428782, 344830, 336628, 415580, 350168, 259557, 223369, 282218, 267756, 214985, 300873, 334361, 334195]
200C34195k2349q6247J24190k06j6823q9228O993K632n1340Q5559L0255J5531
$$ y = [334195, 311846, 225599, 349789, 349583, 332760, 243532, 250525, 253157, 201817, 287376, 317631, 333162]
$$ [...]
##END NTUPLES=NMR SPECTRUM
##END=
