##TITLE=1H_CA-9013-2
 DMSO
 8 sc, 
 31.05.2022
##JCAMPDX= 6.0         $$ Bruker NMR JCAMP-DX V2.0
##DATA TYPE= NMR SPECTRUM
##DATA CLASS= NTUPLES
##ORIGIN= UXNMR, Bruker Analytische Messtechnik GmbH
##OWNER= root
$$ XWIN-NMR		Version 3.5
$$ Wed Jun  1 14:28:41 2022 Russian Standard Time (UT+4h)  she@DPX200
##.OBSERVE FREQUENCY= 200.13135
##.OBSERVE NUCLEUS= ^1H
##.ACQUISITION MODE= SIMULTANEOUS
##.ACQUISITION SCHEME= undefined
##.AVERAGES= 8
##.DIGITISER RES= 18
##SPECTROMETER/DATA SYSTEM= spect
##.PULSE SEQUENCE= zg30
##.SOLVENT NAME= DMSO
##.SHIFT REFERENCE= (INTERNAL, DMSO, 0, 15.7524)
##AUDIT TRAIL= $$ (NUMBER, WHEN, WHO, WHERE, WHAT)
$$ ##TITLE= Audit trail, XWIN-NMR		Version 3.5
$$ ##JCAMPDX= 5.01
$$ ##ORIGIN= Bruker BioSpin GmbH
$$ ##OWNER= she
$$ F:/spectra/data/she/nmr/H-F/1/pdata/1/auditp.txt
$$ ##AUDIT TRAIL=  $$ (NUMBER, WHEN, WHO, WHERE, WHAT)
(   1,<2022-06-01 14:27:33.01 +0400>,<she>,<DPX200>,
      <created by zg, POWCHK disabled, PULCHK disabled
       configuration hash MD5:
       00 E9 B6 7A A2 85 ED C7 34 08 36 98 17 FE 4E 26
       data hash MD5: 16K
       1A 94 71 F3 0F AC 12 3C 0B 19 30 EA C5 1B 35 FE>)
(   2,<2022-06-01 14:27:35.32 +0400>,<she>,<DPX200>,
      <Start of raw data processing
       efp BC_mod = 2 LB = 0.24 FT_mod = 6 PKNL = 1 PHC0 = -18039.51 PHC1 = 11.20074 SI = 16K 
       data hash MD5: 16K
       F5 87 DA 48 74 45 0B 4F 12 68 32 B2 35 B7 53 28>)
(   3,<2022-06-01 14:27:53.18 +0400>,<she>,<DPX200>,
      <pk PHC0 = -1.34137 PHC1 = 5.199999 
       data hash MD5: 16K
       65 17 8D F6 75 B3 B1 EF AF 0C 0C 4C 66 A9 61 7E>)
(   4,<2022-06-01 14:27:56.71 +0400>,<she>,<DPX200>,
      <abs ABSG = 5 
       data hash MD5: 16K
       C4 77 62 70 8A 2A 62 6B BA AD D5 A7 6C D6 62 37>)
$$ ##END=
$$ 
$$ hash MD5
$$ 69 3B B2 DA 25 53 8D DF 37 4C 4A 59 86 CA 59 33
##$RELAX= 
##$RELAX= 
##$RELAX= 
##$RELAX= 
##$RELAX= 
##$RELAX= 
$$ Bruker specific parameters
$$ --------------------------
##$DU= <F:/spectra>
##$EXPNO= 1
##$NAME= <H-F>
##$PROCNO= 1
##$TYPE= <nmr>
##$USER= <she>
##$AMP= (0..31)
100 100 100 100 100 100 100 100 100 100 100 100 100 100 100 100 100 100 
100 100 100 100 100 100 100 100 100 100 100 100 100 100 
##$AQSEQ= 0
##$AQ_mod= 1
##$AUNM= <au_zg>
##$AUTOPOS= <>
##$BF1= 200.13
##$BF2= 200.13
##$BF3= 200.13
##$BF4= 200.13
##$BF5= 200.13
##$BF6= 200.13
##$BF7= 200.13
##$BF8= 200.13
##$BYTORDA= 1
##$CFDGTYP= 0
##$CFRGTYP= 5
##$CHEMSTR= <none>
##$CNST= (0..31)
1 1 145 1 1 1 1 1 1 1 1 1 1 1 1 1 1 1 1 1 1 1 1 1 1 1 1 1 1 1 1 1 
##$CPDPRG= <>
##$CPDPRG1= <>
##$CPDPRG2= <>
##$CPDPRG3= <>
##$CPDPRG4= <mlev>
##$CPDPRG5= <mlev>
##$CPDPRG6= <mlev>
##$CPDPRG7= <mlev>
##$CPDPRG8= <mlev>
##$CPDPRGB= <>
##$CPDPRGT= <>
##$D= (0..31)
0 1.2 0 0 0 0 0 0 0 0.06 0 0.03 0 0 0 0 0.0002 0 0 0 0 0 0 0 0 0 0 0 0 
0 0 0 
##$DATE= 1654079252
##$DBL= (0..7)
120 120 120 120 120 120 120 120 
##$DBP= (0..7)
150 150 150 150 150 150 150 150 
##$DBP07= 0
##$DBPNAM0= <>
##$DBPNAM1= <>
##$DBPNAM2= <>
##$DBPNAM3= <>
##$DBPNAM4= <>
$$ [...]
##$SUBNAM2= <"">
##$SUBNAM3= <"">
##$SUBNAM4= <"">
##$SUBNAM5= <"">
##$SUBNAM6= <"">
##$SUBNAM7= <"">
##$SUBNAM8= <"">
##$SUBNAM9= <"">
##$SW= 18.05172834244
##$SWIBOX= (0..15)
0 0 2 0 0 0 0 0 0 0 0 0 0 0 0 0 
##$SW_h= 3612.71676300578
##$TD= 16384
##$TD0= 1
##$TE= 0
##$TE2= 300
##$TE3= 300
##$TEG= 300
##$TL= (0..7)
0 120 120 120 120 120 120 120 
##$TP= (0..7)
150 150 150 150 150 150 150 150 
##$TP07= 0
##$TPNAME0= <>
##$TPNAME1= <>
##$TPNAME2= <>
##$TPNAME3= <>
##$TPNAME4= <>
##$TPNAME5= <>
##$TPNAME6= <>
##$TPNAME7= <>
##$TPOAL= (0..7)
0.5 0.5 0.5 0.5 0.5 0.5 0.5 0.5 
##$TPOFFS= (0..7)
0 0 0 0 0 0 0 0 
##$TUNHIN= 0
##$TUNHOUT= 0
##$TUNXOUT= 0
##$USERA1= <user>
##$USERA2= <user>
##$USERA3= <user>
##$USERA4= <user>
##$USERA5= <user>
##$V9= 5
##$VALIST= <valist>
##$VCLIST= <CCCCCCCCCCCCCCC>
##$VD= 0
##$VDLIST= <DDDDDDDDDDDDDDD>
##$VPLIST= <PPPPPPPPPPPPPPP>
##$VTLIST= <TTTTTTTTTTTTTTT>
##$WBST= 1024
##$WBSW= 4
##$XGAIN= (0..3)
0 0 0 0 
##$XL= 0
##$YL= 0
##$YMAX_a= 214169
##$YMIN_a= -427262
##$ZGOPTNS= <>
##$ZL1= 120
##$ZL2= 120
##$ZL3= 120
##$ZL4= 120
##$ABSF1= 15.7546
##$ABSF2= -2.29725
##$ABSG= 5
##$ABSL= 3
##$ALPHA= 0
##$AQORDER= 0
##$ASSFAC= 0
##$ASSFACI= 0
##$ASSFACX= 0
##$ASSWID= 0
##$AUNMP= <proc_1d>
##$AZFE= 0.1
##$AZFW= 0.1
##$BCFW= 0
##$BC_mod= 2
##$BYTORDP= 0
##$COROFFS= 0
##$CY= -3
##$DATMOD= 1
##$DC= 0
##$DFILT= <>
##$DTYPP= 0
##$F1P= 0
##$F2P= 0
##$FCOR= 1
##$FTSIZE= 16384
##$FT_mod= 6
##$GAMMA= 0
##$GB= 0
##$INTBC= 1
##$INTSCL= 0
##$ISEN= 128
##$LB= 0.24
##$LEV0= 0
##$LPBIN= 0
##$MAXI= 10000
##$MC2= 0
##$MEAN= 0
##$ME_mod= 0
##$MI= 1.114404
##$NCOEF= 0
##$NC_proc= -7
##$NLEV= 6
##$NOISF1= 3.799351
##$NOISF2= 2.8
##$NSP= 0
##$NTH_PI= 0
##$NZP= 0
##$OFFSET= 15.7524
##$PC= 1
##$PHC0= -18040.85
##$PHC1= 16.40074
##$PH_mod= 1
##$PKNL= yes
##$PPARMOD= 0
##$PSCAL= 0
##$PSIGN= 0
##$REVERSE= no
##$SF= 200.130003830941
##$SI= 16384
##$SIGF1= 3
##$SIGF2= 2
##$SINO= 5.538805
##$SIOLD= 16384
##$SREGLST= <1H.CDCl3>
##$SSB= 0
##$STSI= 16384
##$STSR= 0
##$SW_p= 3612.71676300578
##$SYMM= 0
##$S_DEV= 0
##$TDeff= 16384
##$TDoff= 0
##$TI= <>
##$TILT= no
##$TM1= 0
##$TM2= 0
##$TOPLEV= 0
##$USERP1= <user>
##$USERP2= <user>
##$USERP3= <user>
##$USERP4= <user>
##$USERP5= <user>
##$WDW= 1
##$XDIM= 16384
##$YMAX_p= 339824243
##$YMIN_p= -1138775
$$ End of Bruker specific parameters
$$ ---------------------------------
##NTUPLES= NMR SPECTRUM
##VAR_NAME=  FREQUENCY,     SPECTRUM/REAL,   SPECTRUM/IMAG
##SYMBOL=    X,             R,               I
##VAR_TYPE=  INDEPENDENT,   DEPENDENT,       DEPENDENT
##VAR_FORM=  AFFN,          ASDF,            ASDF
##VAR_DIM=   16384,         16384,           16384
##UNITS=     HZ,            ARBITRARY UNITS, ARBITRARY UNITS
##FACTOR=    0.220516191357247, 1,           1
##FIRST=     3152.52795204917, 0,            0
##LAST=      -460.188810956612, 0,           0
##MIN=       -460.188810956612, -1138775,    0
##MAX=       3152.52795204917, 339824243,    0
$$ Real data points
##PAGE= N=1
##DATA TABLE= (X++(R..R)), XYDATA
$$ [...]
$$ plain form
7558 3271093 3520904 3394168 3318237 3307702 3359616 3298881 3048245 3179650 2846731 2761529
7548 2761529 2759099 2963176 2802061 2867086 2755317 2871709 3001920 2866756 2620207 2339054
7538 2339054 2448083 2284914 2157102 2260573 2335964 2124486 2245114 2055831 2319433 2169318
7528 2169318 1942711 1943255 2227667 1848398 1581107 1652035 1630791 1852876 1791210 1567710 1208068
7517 1208068 1168548 1196570 1244714 1584451 1474738 1339804 1295357 1184205 1114612 1191581 1216347
7506 1216347 968577 1233558 1235478 994039 982443 1237920 1127661 938097 1098951 961470
7496 961470 800730 617377 730683 792544 921131 1114033 906738 1014299 959989 782136
7486 782136 515339 120752 350336 485939 641268 1046330 784515 1045290 957244 545603
$$ packed form
7558C271093K49811j26736p5931j0535N1914o0735k50636J31405l32919q5202
7548B761529k430K04077j61115O5025j11769J16392J30211j35164k46549k81153
7538B339054J09029j63169j27812J03471P5391k11478J20628j89283K63602j50115
7528B169318k26607N44K84412l79269k67291P0928k1244K22085o1666k23500l59642
7517A208068l9520K8022M8144L39737j09713j34934m4447j11152o9593P6969K4766
7506A216347k47770K64981J920k41439j1596K55477j10259j89564J60854j37481
7496I61470j60740j83353J13306O1861J28587J92902k07295J07561n4310j77853
7486G82136k66797l94587K29584J35603J55329M05062k61815K60775q8046m11641
$$ plain form
7476 545603 688814 387157 303393 622538 715631 559688 561453 667072 278450 169329
7466 169329 185217 321443 348768 68796 432728 563283 276084 115306 108858 160216 201185
7455 201185 179437 348064 631727 405766 466372 250337 212061 422890 411577 228279
7445 228279 277049 441505 377743 216559 440427 334288 184965 -1518 -386 246423
7435 246423 220327 237678 96628 107666 97500 311022 156148 145386 137795 142128 238811
7424 238811 -173860 -90218 211125 277803 260790 64760 -240574 -313017 -536819 -206064
7414 -206064 -26570 -65078 84110 298361 400056 143295 -160123 -363676 -445865 -460936
7404 -460936 29187 -139793 -155642 57307 -26789 -177127 -190407 -472860 -395047 -206215
$$ packed form
7476E45603J43211l01657q3764L19145R3093j55943J765J05619l88622j09121
7466A69329J5888J36226K7325k79972L63932J30555k87199j60778o448N1358M0969
7455B01185k1748J68627K83663k25961O0606k16035l8276K10829j1313j83298
7445B28279M8770J64456o3762j61184K23868j06139j49323j86483J132K46809
7435B46423k6096J7351j41050J1038j0166K13522j54874j0762p591M333R6683
7424B38811m12671Q3642L01343O6678j7013j96030l05334p2443k23802L30755
7414b06064J79494l8508J49188K14251J01695k56761l03418k03553q2189j5071
7404d60936M90123j68980j5849K12949q4096j50338j3280k82453P7813J88832
$$ plain form
7394 -206215 -235382 -297552 -393229 -190704 -170930 -357449 -340502 -170533 -40243 58864 -87680
7383 -87680 -248277 -384144 -41101 127564 -277236 -72318 6842 116151 3426 -255595
7373 -255595 -195740 -538060 -323808 -415053 -156415 123917 293407 97064 -238611 -100706
7363 -100706 -271069 -214856 -219340 -340601 -396914 -381436 -504714 -138855 -452475 -643672 -410865
7352 -410865 -453626 -539926 -221117 -196313 -280686 -91932 -82408 -54219 -180662 -327676 -64405
7341 -64405 292348 320211 270200 -79872 -235704 -342773 249378 -5182 -8388 41617 -274936
7330 -274936 -286337 -405078 -452712 -359733 -173095 -176314 -449307 -360348 -375423 -210293 -237399
7319 -237399 -412642 -389776 -238481 -433223 -448697 -54735 -177565 -232032 -171949 35434
$$ packed form
7394b06215k9167o2170r5677K02525J9774j86519J6947J69969J30290R9107j46544
7383h7680j60597j35867L43043J68665m04800K04918P9160J09309j12725k59021
7373b55595N9855l42320K14252r1245K58638K80332J69490j96343l35675J37905
7363a00706j70363N6213m484j21261n6313J5478j23278L65859l13620j91197K32807
7352d10865m2761q6300L18809K4804q4373J88754R524K8189j26443j47014K63271
7341f4405L56753K7863n0011l50072j55832j07069N92151k54560l206N0005l16553
7330b74936j1401j18741m7634R2979J86638l219k72993Q8959j5075J65130k7106
7319b37399j75243K2866J51295j94742j5474L93962j22830n4467O0083K07383
$$ plain form
7309 35434 -330728 -297734 -327661 -239750 -340542 -114158 -477362 -583509 -133259 -259473
7299 -259473 -292660 -470806 -553282 -173731 109053 -139502 -142860 -283762 -200174 -119468 -204686
7288 -204686 -207600 -149779 -148020 -75672 182676 188569 -58254 -341750 -287343 -720269 -643738
7277 -643738 -380427 -214840 -91340 -306418 -593778 -244690 -134091 -458579 -222815 -91071
7267 -91071 -421004 -425587 -353901 -613038 -582671 -617655 -540420 -380306 -306007 -316198 -417510
7256 -417510 -202705 -339488 -192167 47987 -572780 -561303 -575210 -513964 -474376 -345123
7246 -345123 -258216 10898 241046 59426 -14833 -229813 -9298 -181601 -313820 -329344
7236 -329344 -571013 -380394 -260610 -415859 -205933 -129173 -163576 -114085 -85516 -271215
$$ packed form
7309C5434l66162L2994k9927Q7911j00792K26384l63204j06147M50250j26214
7299b59473l3187j78146q2476L79551K82784k48555l358j40902Q3588Q0706q5218
7288b04686k914N7821J759P2348K58348N893k46823k83496N4407m32926P6531
7277f43738K63311J65587J23500k15078k87360L49088J10599l24488K35764J31744
7267i1071l29933m583P1686k59137L0367l4984P7235J60114P4299j0191j01312
7256d17510K14805j36783J47321K40154o20767J1477j3907O1246L9588J29253
7246c45123Q6907K69114K30148j81620p4259k14980K20515j72303j32219j5524
7236c29344k41669J90619J19784j55249K09926P6760l4403M9491K8569j85699
$$ plain form
7226 -271215 -290408 -149708 64716 -155652 -200123 -181066 -234316 -283103 -466177 -544918 -427148
7215 -427148 -480715 -638021 -750098 -291216 -472699 -638002 -363862 -303970 -246504 -426953
7205 -426953 -346933 -289580 -278169 -386091 -286804 -132455 -237568 -558730 -512929 -388029 -329862
7194 -329862 -470825 -411654 -443979 -247407 -447277 -170050 27277 89396 36260 -240668
7184 -240668 -311717 -294271 -116610 -281596 -243737 -259487 -346097 -190120 38276 68933 -364511
7173 -364511 -425032 -560325 -504069 -321037 -154495 -66537 -69161 -274532 -170741 -130233 -286240
7162 -286240 -316755 -153252 -536516 -454966 -121749 -41465 -317415 -542032 -524228 -360152
7152 -360152 -133440 -191280 -428817 -361810 -135827 5438 -61162 -231337 -214128 -505677
$$ packed form
7226b71215j9193J40700K14424k20368m4471J9057n3250m8787j83074p8741J17770
7215d27148n3567j57306j12077M58882j81483j65303K74140N9892N7466j80449
7205d26953Q0020N7353J1411j07922R9287J54349j05113l21162M5801J24900N8167
7194c29862j40963N9171l2325J96572j99870K77227J97327O2119n3136k76928
7184b40668p1049J7446J77661j64986L7859j5750q6610J55977K28396L0657m33444
7173c64511o0521j35293N6256J83032J66542Q7958k624k05371J03791M0508j56007
7162b86240l0515J63503l83264Q1550L33217Q0284k75950k24617J7804J64076
7152c60152K26712n7840k37537O7007K25983J41265o6600j70175J7209k91549
$$ plain form
7142 -505677 -388033 -254335 -181954 -247727 -141532 -446889 -499299 -58173 -33178 -400030
7132 -400030 -398510 66119 111764 -177385 -572307 -319227 -390088 -468623 -1763 -59958 -8427
7121 -8427 -68770 -278773 -421887 -368492 -124524 49941 115913 -333767 -511908 -286658 -61732
7110 -61732 -312680 -536079 -455405 -327567 -382111 -355759 -270145 -263282 -367750 -598918 -547995
7099 -547995 -148860 -83945 -166627 3406 -108548 -249930 -534534 -211242 -464015 -204571
7089 -204571 -115846 -36869 212074 280822 -66705 -175640 -370824 -512003 -158186 399615
7079 399615 519137 105659 27655 -24476 -189674 -80200 26173 75653 185927 242387
7069 242387 23481 172095 286224 438105 204100 66752 273225 508031 444536 395082
$$ packed form
7142e05677J17644J33698P2381o5773J06195l05357n2410M41126K4995l66852
7132d00030J520M64629M5645k89149l94922K53080p0861p8535M66860n8195N1531
7121h427o0343k10003j43114N3395K43968J74465O5972m49680j78141K25250K24926
7110f1732k50948k23399Q0674J27838n4544K6352Q5614O863j04468k31168N0923
7099e47995L99135O4915q2682J70033j11954j41382k84604L23292k52773K59444
7089b04571Q8725P8977K48943O8748l47527j08935j95184j41179L53817N57801
7079C99615J19522m13478p8004n2131j65198J09474J06373M9480J10274N6460
7069B42387k18906J48614J14129J51881k34005j37348K06473K34806o3495m9454
$$ plain form
7059 395082 192506 105355 183983 531124 435425 417780 739997 517066 531583 1038182 1063627
7048 1063627 1027933 951288 858981 621512 542191 448520 664574 731467 442260 621228 886067
7037 886067 779255 538610 720566 659481 921582 880685 741068 623616 468899 172660
7027 172660 413738 510339 779842 595660 527956 454792 389951 178420 499377 160485
7017 160485 151248 226053 227234 270396 132482 103087 -112588 -350475 35682 -4764 -152955
7006 -152955 -103196 -439681 -222638 -129661 11282 -48432 -43731 -175182 -239525 -72565 -332835
6995 -332835 -437391 -310702 76238 -29901 22090 -63262 -282923 -157496 -285881 -168494
6985 -168494 31735 -85673 35943 -70349 90638 207503 -169977 -299474 -258914 -77521
$$ packed form
7059C95082k02576q7151P8628L47141r5699j7645L22217k22931J4517N06599K5445
7048A063627l5694p6645r2307k37469p9321r3671K16054O6893k89207J78968K64839
7037H86067j06812k40645J81956o1085K62101m0897j39617j17452j54717k96239
7027A72660K41078R6601K69503j84182o7704p3164o4841k11531L20957l38892
7017A60485r237P4805J181M3162j37914k9395k15675k37887L86157m0446j48191
7006a52955M9759l36485K17043R2977J40943n9714M701j31451o4343J66960k60270
6995c32835j04556J26689L86940j06139N1991q5352k19661J25427j28385J17387
6985a68494K00229j17408J21616j06292J60987J16865l77480j29497M0560J81393
$$ plain form
6975 -77521 66027 21977 -34185 75800 -31101 -508539 -246274 5213 -234245 174959
6965 174959 8963 206071 101771 -131568 63760 -190964 -224659 -460187 -663818 -219525
6955 -219525 48332 -116468 12351 -3248 -68975 150174 282576 86599 -170917 -248015
6945 -248015 -546606 -616905 -312581 -151897 -349502 -176358 33087 -49218 -76496 -244173
6935 -244173 -103041 -150524 -84700 -151846 -39284 256117 -44627 -174713 -93895 -71270 104378
6924 104378 21448 27191 19944 131904 100700 -1811 25212 -298614 -9941 178267 -35541
6913 -35541 71746 -21819 -569925 -54483 -43161 -159040 -192966 106186 108791 33433 -135674
6902 -135674 -241571 89641 56349 -125105 -115199 -72466 400438 463457 373189 369175 363267
$$ packed form
6975g7521J43548m4050n6162J09985j06901m77438K62265K51487k39458M09204
6965A74959j65996J97108j04300k33339J95328k54724l3695k35528k03631M44293
6955b19525K67857j64800J28819j5599o5727K19149J32402j95977k57516p7098
6945b48015k98591p0299L04324J60684j97605J73144K09445q2305k7278j67677
6935b44173J41132m7483O5824o7146J12562K95401l00744j30086Q0818K2625J75648
6924A04378q2930N743p247J11960l1204j02511K7023l23826K88673J88208k13808
6913c5541J07287r3565n48106N15442J1322j15879l3926K99152K605p5358j69107
6902a35674j05897L31212l3292j81454R906M2733M72904O3019r0268m014n908
$$ plain form
6891 363267 86811 84768 -69432 13989 50217 120767 -586 -228134 -288058 -243634 -14928
6880 -14928 2656 -155756 -236097 -158179 -183689 -69755 -298282 -148844 -144552 -292269 -391137
6869 -391137 -291847 -190176 -207808 -192749 -80067 -169858 -223462 -176188 15752 -91963 10920
6858 10920 -273801 -308706 -335314 -126932 193843 -123237 -52255 56704 -291335 -47358
6848 -47358 -253563 -281783 73351 203746 121704 -107491 74515 104785 139662 -202503 -174474
6837 -174474 157142 270358 171470 -366 229156 290620 238513 -87829 -88498 318266 363872
6826 363872 461182 189678 75273 223658 237590 417419 313313 437182 446041 480307 495877
6815 495877 152678 -20210 354658 429299 136596 -125718 -139401 18373 163446 122049
$$ packed form
6891C63267k76456k043j54200Q3421L6228P0550j21353k27548n9924M4424K28706
6880a4928J7584j58412q0341P7918k5510J13934k28527J49438M292j47717r8868
6869c91137R9290J01671j7632J5059J12682q9791n3604M7274J91940j07715J02883
6858A0920k84721l4905k6608K08382L20775l17080P0982J08959l48039K43977
6848d7358k06205k8220L55134J30395q2042k29195J82006L0270L4877l42165K8029
6837a74474L31616J13216r8888j71836K29522O1464n2107l26342o69M06764M5606
6826C63872R7310k71504j14405J48385J3932J79829j04106J23869Q859L4266J5570
6815D95877l43199j72888L74868P4641k92703k62314j3683J57774J45073m1397
$$ plain form
6805 122049 210427 156672 36012 40734 -117998 283145 229460 -10481 272654 75162 140008
6794 140008 170682 -50752 -88618 -1116 47372 76376 -84120 -149631 21624 -127639 -223102
6783 -223102 279649 200206 -142287 47234 176732 410253 184537 189921 226905 277823 394117
6772 394117 709390 522784 675515 426739 281258 346339 364069 483764 67749 283828
6762 283828 602509 255773 92242 280819 303858 417979 359923 456456 151278 72903
6752 72903 268889 547051 786358 359792 51745 158668 154180 535976 452753 298527
6742 298527 600398 293886 320175 407662 790569 436615 312417 395039 545878 553642 679199
6731 679199 700456 437573 285332 468808 665418 479950 735798 866260 678522 590262
$$ packed form
6805A22049Q8378n3755j20660M722j58732M01143n3685k39941K83135j97492O4846
6794A40008L0674k21434l7866Q7502M8488K9004j60496o5511J71255j49263r5463
6783b23102N02751p9443l42493J89521J29498K33521k25716N384L6984N0918J16294
6772C94117L15273j86606J52731k48776j45481O5081J7730J19695m16015K16079
6762B83828L18681l46736j63531J88577K3039J14121n8056R6533l05178p8375
6752G2903J95986K78162K39307m26566l08047J06923m488L81796q3223j54226
6742B98527L01871l06512K6289Q7487L82907l53954j24198Q2622J50839P764J25557
6731F79199K1257k62883j52241J83476J96610j85468K55848J30462j87738q8260
$$ plain form
6721 590262 519557 481203 629697 550908 426470 607517 588432 375559 634907 853900
6711 853900 705252 659981 897288 754277 688340 806556 675175 360200 451083 803957
6701 803957 714778 570614 545089 559007 575477 683910 722913 623980 633494 634804 682908 359968
6689 359968 566933 806964 765415 348928 655373 782250 1097711 957995 853335 1007602
6679 1007602 1135323 1131506 864585 775155 589326 888426 818203 516189 608394 857196
6669 857196 706238 664019 752881 818425 378597 380690 840414 843676 753704 654380 563105
6658 563105 697968 664546 770662 769835 583402 601800 576904 457539 746065 838478 924531
6647 924531 591407 647101 660035 683000 944342 964895 980900 1134689 1091742 979390 663071
$$ packed form
6721E90262p0705l8354J48494p8789j24438J81047j9085k12873K59348K18993
6711H53900j48648m5271K37307j43011o5937J18216j31381l14975R0883L52874
6701H03957q9179j44164k5525J3918J6470J08433L9003r8933R514J310M8104l22940
6689C59968K06965K40031m1549m16487L06445J26877L15461j39716j04660J54267
6679A007602J27721l817k66921q9430j85829K99100p0223l02014R2205K48802
6669H57196j50958m2219Q8862O5544m39828K093M59724L262q9972r9324r1275
6658E63105J34863l3422J06116q27j86433J8398k4896j19365K88526R2413Q6053
6647I24531l33124N5694J2934K2965K61342K0553J6005J53789m2947j12352l16319
$$ plain form
6636 663071 721263 810686 920335 948874 880746 949518 549840 919337 968969 768919 599849
6625 599849 523671 576086 925580 1079002 1140245 1087915 814616 572256 956126 1377405
6615 1377405 1486682 1102047 683320 936050 1164662 1323672 1097437 995167 1446063 1201545
6605 1201545 1182350 1094121 1042831 1001874 1234645 1365919 1354648 1137780 1062742 1082065 977186
6594 977186 769384 1188056 1379481 1126287 1046037 1015053 1411416 1426025 1472522 1575300
6584 1575300 1807603 1467450 1248712 1065640 1030567 999677 1131361 1426267 1406149 1345988
6574 1345988 1394258 1075985 1131033 982857 914176 1132265 1379380 1131593 656422 931357
6564 931357 1283439 1387252 1237934 999278 1239979 1260335 1198659 1191528 1195186 1089619 1335415
$$ packed form
6636F63071N8192Q9423J09649K8539o8128O8772l99678L69497M9632k00050j69070
6625E99849p6178N2415L49494J53422O1243n2330k73299k42360L83870M21279
6615A377405J09277l84635m18727K52730K28612J59010k26235j02270M50896k44518
6605A201545j9195q8229n1290m0957K32771J31274j1271k16868p5038J9323j04879
6594I77186k07802M18672J91425k53194q0250l0984L96363J4609M6497J02778
6584A575300K32303l40153k18738j83072l5073l0890J31684K94906k0118o0161
6574A345988M8270l18273N5048j48176o8681K18089K47115k47787m75171K74935
6564I31357L52082J03813j49318k38656K40701K0356o1676p131L658j05567K45796
$$ plain form
6553 1335415 1373146 1261399 1434690 1837148 1710105 1519455 1366023 1642922 1763824 1634201
6543 1634201 1698208 1581805 1485283 1574888 1129077 941840 1121079 1239583 1532802 1680814
6533 1680814 1628458 1579696 1941240 1763757 1617328 1436729 1410501 1291863 1366357 1388729
6523 1388729 1470681 1345398 1382275 1511282 1465527 1540143 1469390 1570126 1498949 1471619 1621209
6512 1621209 1355986 1535335 1567804 1441938 1708795 1583770 1359514 1605162 1284426 1359711
6502 1359711 1779786 1842143 1850722 1651089 1386775 1380969 1581422 1874477 1726831 1660710 1376184
6491 1376184 1408148 1797983 1885726 1545264 1428528 1841931 1860276 1740070 1913751 2006879
6481 2006879 1577449 1670993 1641276 1865460 2170754 1824919 1824629 1653531 1609749 1699150 2145517
$$ packed form
6553A335415L7731j11747J73291M02458j27043j90650j53432K76899J20902j29623
6543A634201O4007j16403r6522Q9605m45811j87237J79239J18504K93219J48012
6533A680814n2356m8762L61544j77483j46429j80599k6228j18638P4494K2372
6523A388729Q1952j25283L6877J29007m5755P4616p0753J00736p1177k7330J49590
6512A621209k65223J79349L2469j25866K66857j25025k24256K45648l20736P5285
6502A359711M20075O2357Q579j99633k64314n806K00453K93055j47646o6121k84526
6491A376184L1964L89835Q7743l40462j16736M13403J8345j20206J73681R3128
6481B006879m29430R3544k9717K24184L05294l45835k90j71098m3782Q9401M46367
$$ plain form
6470 2145517 2044090 1496622 1818532 1972273 1797328 1860256 1948865 1695396 1901424 2010138
6460 2010138 1846857 1789595 1877800 1883515 2084112 2261079 2533120 2325869 1944176 2250610
6450 2250610 2236141 2353133 2280723 2172543 2207505 1961379 2106949 2374355 2569500 2375966
6440 2375966 2068046 1994824 2012216 2091329 1932298 2142903 2497855 2199052 1912069 2124932
6430 2124932 2357484 2407880 2491344 2319164 2423624 2410404 2335629 2357912 2433316 2709674 2695870
6419 2695870 2644393 2599343 2824708 3011272 2623849 2288139 2290161 2420457 2387873 2568470
6409 2568470 2762325 2600973 2508869 2697888 2771178 2614764 2546781 2419468 2574140 2576770
6399 2576770 2578796 2534303 2691406 2635714 2537601 2922699 2843657 3297071 3123554 3035165 3236760
$$ packed form
6470B145517j01427n47468L21910J53741j74945O2928Q8609k53469K06028J08714
6460B010138j63281n7262Q8205N715K00597J76967K72041k07251l81693L06434
6450B250610j4469J16992p2410j08180L4962k46126J45570K67406J95145j93534
6440B375966l07920p3222J7392P9113j59031K10605L54952k98803k86983K12863
6430B124932K32552N0396Q3464j72180J04460j3220p4775K2283P5404K76358j3804
6419B695870n1477m5050K25365J86564l87423l35710K022J30296l2584J80597
6409B568470J93855j61352r2104J89019P3290j56414o7983j27313J54672K630
6399B576770K026m4493J57103n5692r8113L85098p9042M53414j73517q8389K01595
$$ plain form
6388 3236760 3187755 3237309 2891327 3166479 3381792 3255959 3176847 3272608 3328351 3529725
6378 3529725 3448864 3363496 3306435 3670127 3968433 3884905 3240193 3378341 3664224 3449973
6368 3449973 3584264 3599508 3785522 3850593 3649166 3722224 3646621 3873755 4076359 4229255
6358 4229255 4114640 4255187 4138519 4035943 4126125 3945962 4323715 4480116 4455999 4496538
6348 4496538 4715550 4343627 4240062 4230416 4061469 3960015 4441185 4440287 4103764 4077659 4112308
6337 4112308 4366377 4498162 4371357 4452117 4422982 4613105 4713266 4527649 4519862 4576207
6327 4576207 4560649 4838630 4635291 4703778 4823962 5137961 5081959 4639152 4955604 5199832
6317 5199832 4821070 4672066 4915738 5232832 5138567 4805876 4690197 4623562 4683403 4775036
$$ packed form
6388C236760m9005M9554l45982K75152K15313j25833p9112R5761N5743K01374
6378C529725q0861q5368n7061L63692K98306q3528o44712J38148K85883k14251
6368C449973J34291J5244J86014O5071k01427P3058p5603K27134K02604J52896
6358D229255j14615J40547j16668j02576R0182j80163L77753J56401k4117M0539
6348D496538K19012l71923j03565r646j68947j01454M81170q98l36523k6105L4649
6337D112308K54069J31785j26805Q0760k9135J90123J00161j85617p787N6345
6327D576207j5558K77981k03339O8487J20184L13999n6002m42807L16452K44228
6317E199832l78762j49004K43672L17094r4265l32691j15679o6635N9841R1633
$$ plain form
6307 4775036 5021535 4909045 5067423 5250923 5301062 5280696 5226310 5480801 5104226 4971318
6297 4971318 4839540 5282890 5456320 5481355 5570345 5575578 5840443 5886739 5743013 5419524
6287 5419524 5431006 5723691 6212812 6050176 6013317 6152700 6289511 6347228 6444363 6139347
6277 6139347 6272834 6691550 6385329 6196073 6171151 6509409 6902861 6767968 7185915 7150441
6267 7150441 6883740 7274633 7303207 7393463 7230604 6907087 6928442 6943782 7042794 6930597
6257 6930597 6987164 6863177 6675773 6803849 6685425 6565923 6225915 6296800 6688267 6498164
6247 6498164 6673219 6724105 6658700 6830940 6965335 6807464 6975920 6647676 6607441 6664345
6237 6664345 6453566 6804148 6736301 6572559 6818075 6773944 6445530 6524988 6728006 6753205
$$ packed form
6307D775036K46499j12490J58378J83500N0139k0366n4386K54491l76575j32908
6297D971318j31778M43350J73430K5035Q8990N233K64865M6296j43726l23489
6287E419524J1482K92685M89121j62636l6859J39383J36811N7717R7135l05016
6277F139347J33487M18716l06221j89256k4922L38258L93452j34893M17947l5474
6267G150441k66701L90893K8574R0256j62859l23517K1355J5340R9012j12197
6257F930597N6567j23987j87404J28076j18424j19502l40008P0885L91467j90103
6247F498164J75055N0886o5405J72240J34395j57871J68456l28244m0235N6904
6237F664345k10779L50582o7847j63742K45516m4131l28414P9458K03018K5199
$$ plain form
6227 6753205 6852593 7101522 7161678 6964714 6969215 7105607 7015657 6929207 6916434 6739119 6843955
6216 6843955 6729437 6695055 6573840 6504255 6242094 6336719 6686157 6831592 6851543 6981825
6206 6981825 7163574 6739862 6607458 6868034 6951981 7084921 7155611 7223122 6810810 6859252
6196 6859252 6943704 6981118 7274359 7169402 7261154 7160316 7196524 7103006 6803860 6814542 6986751
6185 6986751 7031365 6775143 6950319 7172837 7113232 7215223 6885921 6916941 6923269 7255733
6175 7255733 7419756 7335174 7166034 6944657 7052791 7100402 7314875 7632029 7776059 7751149
6165 7751149 7677155 7614057 7472589 7413777 7333732 7336183 7412492 7564686 7671102 7895285 7870636
6154 7870636 7848290 7850609 8038628 8279406 8438336 8240400 8058396 8273787 8156680 8249904
$$ packed form
6227F753205R9388K48929O0156j96964M501J36392q9950q6450j2773j77315J04836
6216F843955j14518l4382j21215o9585k62161R4625L49438J45435J9951J30282
6206F981825J81749m23712j32404K60576Q3947J32940P0690O7511m12312M8442
6196F859252Q4452L7414K93241j04957R1752j00838L6208r3518k99146J0682J72209
6185F986751M4614k56222J75176K22518n9605J01991l29302L1020O328L32464
6175G255733J64023q4582j69140k21377J08134M7611K14473L17154J44030k4910
6165G751149p3994o3098j41468n8812q0045K451P6309J52194J06416K24183k4649
6154G870636k2346K319J88019K40778J58930j97936j82004K15391j17107R3224
$$ plain form
6144 8249904 8499861 8354195 8529072 8728597 8756745 8980789 9133969 8776360 8701390 8943087
6134 8943087 9289331 9468473 9350425 9356994 9769631 9968752 9819815 9888548 9853769 10115409
6124 10115409 9960436 9928095 10297868 10203741 10320019 10429208 10876230 11208613 10847074 11131401
6114 11131401 11536581 11718809 11667150 11727461 12200762 12268691 12275795 12515933 12639877 13023762
6104 13023762 13357722 13329781 13589516 13807251 13762663 14130365 14429465 14356416 14978910 15233624
6094 15233624 15287857 15362259 15741611 16085825 16428074 16645131 16949236 17220076 17528074 18020565
6084 18020565 18200182 18336024 18481165 18692430 19226242 19490209 19871795 20537931 20708296
6075 20708296 21495342 22064548 22290653 22682691 23212829 23897707 24446640 25046838 25652147
$$ packed form
6144H249904K49957j45666J74877J99525K8148K24044J53180l57609p4970K41697
6134H943087L46244J79142j18048O569M12637J99121j48937O8733l4779K61640
6124A0115409j54973l2341L69773r4127J16278J09189M47022L32383l61539K84327
6114A1131401M05180J82228n1659O0311M73301O7929P104K40138J23944L83885
6104A3023762L33960k7941K59735K17735m4588L67702K99100p3049O22494K54714
6094A5233624N4233P4402L79352L44214L42249K17057L04105K70840L07998M92491
6084A8020565J79617J35842J45141K11265N33812K63967L81586O66136J70365
6075B0708296P87046N69206K26105L92038N30138O84878N48933O00198O05309
$$ plain form
6066 25652147 26644798 27237957 27848775 28825036 29333061 30093865 31151672 32291090 33442762
6057 33442762 34794731 36112674 37071802 38837137 40435192 41858805 43390713 45407857
6049 45407857 47652350 49258452 51431688 54187976 57083902 60110840 63165462 66324583
6041 66324583 70169688 74205768 78626050 83034169 87500884 92757621 98622686 104234027
6033 104234027 110246248 116225525 122415190 128358228 133505435 138409565 142785320 146425508
6025 146425508 149054619 150558924 150939870 150024524 147747053 144146447 139694604 134428213
6017 134428213 129205401 123621875 117452158 111307241 105713892 99694104 93985847 88664173
6009 88664173 83991442 79207050 75044504 71033315 67476538 64316253 61150491 58314856
$$ packed form
6066B5652147R92651N93159O10818R76261N08025P60804J057807J139418J151672
6057C3442762J351969J317943R59128J765335J598055J423613J531908K017144
6049D5407857K244493J606102K173236K756288K895926L026938L054622L159121
6041F6324583L845105M036080M420282M408119M466715N256737N865065N611341
6033A04234027O012221N979277O189665N943038N147207M904130M375755L640188
6025A46425508K629111J504305L80946r15346k277471l600606m451843n266391
6017A34428213n222812n583526o169717o144917n593349o019788n708257n321674
6009H8664173m672731m784392m162546m011189l556777l160285l165762k835635
$$ plain form
6001 58314856 55641844 52914089 50523193 48584107 46741034 45250656 43386377 41573919
5993 41573919 40128890 38652106 37383665 36217200 34975125 33787465 32633838 31591087
5985 31591087 30733754 29903406 29265193 28523498 27559887 26814578 26194234 25536656 24782857
5976 24782857 24159631 23896440 23637453 23296206 22825645 22167188 21737715 21351765 20813032
5967 20813032 20468741 20383734 20017161 19899598 19552434 19032599 18839675 18605604 18376789 18228866
5957 18228866 17785388 17849713 17475527 17204181 16912245 16417496 16478935 16593237 16161235 15577118
5947 15577118 15488156 15720448 15420985 15233286 14794890 14779123 14651848 14800102 14906418 14930472
5937 14930472 14551173 14676268 14774449 14277422 14226872 14288681 14213286 14164685 13931611 14219301
$$ packed form
6001E8314856k673012k727755k390896j939086j843073j490378j864279j812458
5993D1573919j445029j476784j268441j166465j242075j187660j153627j042751
5985C1591087q57333q30348o38213p41695r63611p45309o20344o57578p53799
5976B4782857o23226k63191k58987l41247m70561o58457m29473l85950n38733
5967B0813032l44291q5007l66573j17563l47164n19835j92924k34071k28815j47923
5957A8228866m43478O4325l74186k71346k91936m94749O1439J14302m32002n84117
5947A5577118q8962K32292k99463j87699m38396j5767j27275J48254J06316K4054
5937A4930472l79299J25095R8181m97027n0550O1809p5395m8601k33074K87690
$$ plain form
5927 14219301 13995428 13585868 13453345 13284474 13399687 13402237 13341430 13362670 13156821 13247520
5917 13247520 13395604 13542405 13330667 13244906 13091794 12956416 13214829 13064001 13096124 13121173
5907 13121173 13332576 13146445 12999240 13145215 13087057 12948100 13197690 13524020 13868141 13681770
5897 13681770 13412512 13399795 13445333 13770593 13928713 13893155 14312056 14426662 14484641 14771261
5887 14771261 14651090 14686290 14936808 15101223 15454953 15525872 15785293 15618287 15535255 15439568
5877 15439568 16082576 16131112 16161963 16683187 16639881 17014342 17165059 17294457 16973465 17376606
5867 17376606 17267158 17331798 17470426 17736252 17953670 18004308 18056055 18319226 18701797 18560254
5857 18560254 18736217 18805176 18706644 19139168 19155914 19125389 19467928 19408399 19463825 19628142
$$ packed form
5927A4219301k23873m09560j32523j68871J15213K550o0807K1240k05849R0699
5917A3247520J48084J46801k11738q5761j53112j35378K58413j50828L2123K5049
5907A3121173K11403j86131j47205J45975n8158j38957K49590L26330L44121j86371
5897A3681770k69258j2717M5538L25260J58120l5558M18901J14606N7979K86620
5887A4771261j20171L5200K50518J64415L53730P0919K59421j67006q3032r5687
5877A5439568O43008M8536L0851N21224m3306L74461J50717J29398l20992M03141
5867A7376606j09448O4640J38628K65826K17418N0638N1747K63171L82571j41543
5857A8560254J75963O8959r8532M32524J6746l0525L42539n9529N5426J64317
$$ plain form
5847 19628142 19651147 19457556 19772180 20163815 20199403 20354210 20780642 20735037 20559688 20420993
5837 20420993 20356565 20488019 20378505 20183279 20592412 20612782 20436830 20498929 20546436 20265238
5827 20265238 20638411 20683051 20772861 20775776 21018317 21230378 21166619 20757354 20818587 20522304
5817 20522304 20509621 20315904 20533864 20574070 20520789 20446385 20318174 19953842 19741080 19757001
5807 19757001 19755218 19704071 19286461 19105172 18740027 18710603 18371038 18252401 18360689 18273645
5797 18273645 18082091 18072439 18053733 18049249 17900131 17869904 17690147 17247139 17100278 17053458 16752482
5786 16752482 16742586 16627531 16357334 16317797 16139784 15898876 15612577 15553881 15770443 15694238
5776 15694238 15782409 15440191 15710287 15798400 15873371 15793629 15596382 15603310 15911316 16012814
$$ packed form
5847A9628142K3005j93591L14624L91635L5588J54807M26432m5605j75349j38695
5837B0420993o4428J31454j09514j95226M09133K0370j75952O2099M7507k81198
5827B0265238L73173M4640Q9810K915K42541K12061o3759m09265O1233k96283
5817B0522304j2683j93717K17960M0206n3281p4404j28211l64332k12762J5921
5807A9757001j783n1147m17610j81289l65145k9424l39565j18637J08288q7044
5797A8273645j91554r652j8706m484j49118l0227j79757m43008j46861m6820l00976
5786A6752482r896j15055k70197l9537j78013k40908k86299n8696K16562p6205
5776A5694238Q8171l42218K70096Q8113P4971p9742j97247O928L08006J01498
$$ plain form
5766 16012814 15883437 15924612 15953570 16061820 16159232 15980320 16009059 16287320 16367139 16341475
5756 16341475 16781637 16736683 16973297 17247509 17535619 17948037 18039539 18083320 18060115 18353395
5746 18353395 18284384 18695502 19375180 19462971 19942075 20793215 21347973 22293282 23549802 24636936
5736 24636936 25693396 26193360 26527449 26072622 24816685 23542292 22606916 22144602 21386306
5727 21386306 20849964 20176790 19454637 19273113 19297835 19505880 18990378 18586120 18552720 18449064
5717 18449064 18311656 18321048 18188512 18147098 17685579 17529795 17367016 17260675 17294946 17567477
5707 17567477 17947830 17865208 17664600 17589563 17989724 17997208 17879802 18248609 18292446 17927784
5697 17927784 17750332 17792313 18095704 18293044 18400795 18406820 18254886 18096546 18626183 18497081
$$ packed form
5766A6012814j29377M1175K8958J08250R7412j78912K8739K78261P9819k5664
5756A6341475M40162m4954K36614K74212K88110M12418R1502M3781k3205K93280
5746A8353395o9011M11118O79678Q7791M79104Q51140N54758R45309J256520J087134
5736B4636936J056460M99964L34089m54827j255937j274393r35376m62314p58296
5727B1386306n36342o73174p22153j81524K4722K08045n15502m04258l3400j03656
5717A8449064j37408R392j32536m1414m61519j55784j62779j06341L4271K72531
5707A7567477L80353q2622k00608p5037M00161P484j17406L68807M3837l64662
5697A7927784j77452M1981L03391J97340J07751O025j51934j58340N29637j29102
$$ plain form
5687 18497081 18439693 18448907 18383036 18423939 18405159 18254994 18322466 18517912 18433377 18624544 18769693
5676 18769693 18285422 17854017 18062484 18165067 18381413 18530577 18520270 18758704 19032265 18921486
5666 18921486 18665272 18678372 18814353 19325557 19253792 19296257 19244993 19152919 19446046 19451576 19299084
5655 19299084 19222153 19413778 19379214 19554737 19478099 19354316 19682363 19828461 20100555 19883200
5645 19883200 19581060 19746954 20148516 19872363 19766873 19991768 20477447 20437457 20530888 20901590
5635 20901590 20781569 20842929 20835015 20798558 20689813 20839664 20965278 21108217 21252264 21381110
5625 21381110 21928036 22031482 21867483 21539721 21774667 21912642 21769780 21650835 21870281
5616 21870281 22017981 21896411 22192094 22166701 22321184 22462303 22596076 22235144 22228414 22349621
$$ packed form
5687A8497081n7388R214o5871M0903j8780j50165O7472J95446q4535J91167J45149
5676A8769693m84271m31405K08467J02583K16346J49164j0307K38434K73561j10779
5666A8921486k56214J3100J35981N11204p1765M2465n1264r2074K93127N530j52492
5655A9299084p6931J91625l4564J75523p6638j23783L28047J46098K72094k17355
5645A9883200l02140J65894M01562k76153j05490K24895M85679l9990R3431L70702
5635B0901590j20021O1360p914l6457j08745J49851J25614J42939J44047J28846
5625B1381110N46926J03446j63999l27762K34946J37975j42862j18945K19446
5616B1870281J47700j21570K95683k5393J54483J41119J33773l60932o730J21207
$$ plain form
5606 22349621 22529001 23040494 22924858 22713893 22812966 23236469 23649169 23606237 23678434 23796966
5596 23796966 24165870 24355581 24318218 24275308 24364328 24493151 24794951 24883027 24885546 25132726
5586 25132726 25533568 25163733 25244613 25326002 25239207 25809710 26087355 26107918 26007835 25960737
5576 25960737 25663913 25941216 26309985 26644649 26825153 26875273 26717010 27202785 27615278 27504474
5566 27504474 27188353 27349004 27194403 27424742 27661267 28015131 28356823 28366774 28646905 28425905
5556 28425905 28569175 28826026 29199314 29381602 29649288 29632936 29736829 29920796 30085455 30222820
5546 30222820 30430290 30393395 30807883 31168440 31172345 31281239 31185379 31411410 31540593 31758482
5536 31758482 31961815 31939285 32237516 32390704 32663895 32792705 33262837 33369912 33591385 33917244
$$ packed form
5606B2349621J79380N11493j15636k10965R9073M23503M12700m2932P2197J18532
5596B3796966L68904J89711l7363m2910Q9020J28823L01800Q8076K519K47180
5586B5132726M00842l69835Q0880Q1389q6795N70503K77645K0563j00083m7098
5576B5960737k96824K77303L68769L34664J80504N0120j58263M85775M12493j10804
5566B7504474l16121J60651j54601K30339K36525L53864L41692R951K80131k21000
5556B8425905J43270K56851L73288J82288K67686j6352J03893J83967J64659J37365
5546C0222820K07470l6895M14488L60557L905J08894r5860K26031J29183K17889
5536C1758482K03333k2530K98231J53188K73191J28810M70132J07075K21473L25859
$$ plain form
5526 33917244 33814464 34212865 34718316 35089835 35210510 35351353 35627015 35747646 35693198 35622471
5516 35622471 36068595 36334064 35955227 35798900 36058861 35856816 36399506 36917093 36771983
5507 36771983 36610594 36879616 36931740 37245254 37601123 37885503 38568582 38732160 39025381 39371168
5497 39371168 39539338 39806008 39990913 40162320 40428391 40617346 40918784 41300624 41482845
5488 41482845 41627199 41812563 42078229 42906655 43460691 43976159 44419786 44985056 45862427
5479 45862427 46502887 47354730 48285549 49402255 50535494 51549622 52884108 54233924 56027453
5470 56027453 57508282 58609846 59675686 60867075 61320586 61705862 61945580 62309828 62590001
5461 62590001 63278083 63842166 64800377 65237438 65600859 65809375 65401535 65344916 65150870 65085043
$$ packed form
5526C3917244j02780L98401N05451L71519J20675J40843K75662J20631n4448p0727
5516C5622471M46124K65469l78837j56327K59961k02045N42690N17587j45110
5507C6771983j61389K69022N2124L13514L55869K84380O83079J63578K93221L45787
5497C9371168J68170K66670J84905J71407K66071J88955L01438L81840J82221
5488D1482845J44354J85364K65666Q28426N54036N15468M43627N65270Q77371
5479D5862427O40460Q51843R30819J116706J133239J014128J334486J349816J793529
5470E6027453J480829J101564J065840J191389M53511L85276K39718L64248K80173
5461F2590001O88082N64083R58211M37061L63421K08516m07840n6619j94046o5827
$$ plain form
5451 65085043 65041415 64755535 64925831 65247320 65310900 65586207 65762948 65539804 65136539 64779536
5441 64779536 64154798 63597635 63604151 63459744 63519107 63608627 63285762 63338137 63692567 63728547
5431 63728547 62784332 61890368 61124925 60162887 59049916 58285295 57682043 56925049 56266265
5422 56266265 56096367 55943666 55688034 55438928 55099621 54766691 54826415 55032569 55085111 55093636
5412 55093636 54964159 55244692 55654494 55790732 55876259 55902011 56040572 56391555 56410861 56113854
5402 56113854 56037055 56083638 56018277 56116008 56453246 56411695 56512595 56838208 57336445 57502609
5392 57502609 57599432 57878100 58260359 58529804 58637240 59074326 59491051 59798575 60197456 60443835
5382 60443835 61024051 61008093 61005067 61466084 61774155 61901176 62150494 62572271 63211678 63624497
$$ packed form
5451F5085043m3628k85880J70296L21489O3580K75307J76741k23144m03265l57003
5441F4779536o24738n57163O516j44407N9363Q9520l22865N2375L54430L5980
5431F3728547r44215q93964p65443r62038j112971p64621o03252p56994o58784
5422E6266265j69898j52701k55632k49106l39307l32930N9724K06154N2542Q525
5412E5093636j29477K80533M09802J36238Q5527K5752J38561L50983J9306k97007
5402E6113854p6799M6583o5361R7731L37238m1551J00900L25613M98237J66164
5392E7502609R6823K78668L82259K69445J07436M37086M16725L07524L98881K46379
5382F0443835N80216j5958l026M61017L08071J27021K49318M21777O39407M12819
$$ plain form
5372 63624497 63934871 64482648 64560964 64857134 65444674 65843210 66178983 66627851 67361240 68299728
5362 68299728 68718963 69213823 69985598 70020095 70616008 71233705 71923945 72761206 73704695 74385766
5352 74385766 75283140 76194409 77102817 78243270 79408301 80424689 81612433 82888871 84365543
5343 84365543 85849032 87401907 89188526 91067467 93003854 95122962 97333097 99784193
5335 99784193 102664467 105436866 108679398 112072578 116076466 120476325 125711741 131524574
5327 131524574 138022002 144208671 148595973 150180418 147588935 142742722 138062640 134757642
5319 134757642 132398067 130869361 129714942 129108534 129068718 128794713 129162143 129606637 130186234
5310 130186234 131388758 133039465 134467707 136154137 137841829 140326611 143087382 145805332
$$ packed form
5372F3624497L10374N47777P8316K96170N87540L98536L35773M48868P33389R38488
5362F8299728M19235M94860P71775L4497N95913O17697O90240Q37261R43489O81071
5352G4385766Q97374R11269R08408J140453J165031J016388J187744J276438J476672
5343H4365543J483489J552875J786619J878941J936387K119108K210135K451096
5335I9784193K880274K772399L242532L393180M003888M399859N235416N812833
5327A31524574O497428O186669M387302J584445k591483m846213m680082l304998
5319A34757642k359575j528706j154419o06408l9816k74005L67430M44494N79597
5310A30186234J202524J650707J428242J686430J687692K484782K760771K717950
$$ plain form
5302 145805332 148151246 150468446 152964544 155353465 156997882 158300790 158543399 158229256
5294 158229256 157260447 155550369 153472163 150779614 148047170 145542889 142831365 140562714
5286 140562714 138458709 136439134 134935599 133488003 132490982 131671036 131006342 130646046 130135514
5277 130135514 130420131 130616726 130427009 130638278 130855610 130809221 130792020 130603579 130107664 129526513
5267 129526513 128668339 127585488 126417102 125148140 123820662 122473098 121310406 120364930
5259 120364930 119145975 117950315 116263598 113679574 110535628 107634929 104998768 102616827
5251 102616827 100726562 98791094 96755762 95219676 93400668 91661601 89667663 88034800
5243 88034800 86660532 85598868 84307018 83133513 81958494 81004899 80014041 79036587 78520695
$$ packed form
5302A45805332K345914K317200K496098K388921J644417J302908K42609l14143
5294A58229256r68809j710078k078206k692549k732444k504281k711524k268651
5286A40562714k104005k019575j503535j447596r97021q19946o64694l60296n10532
5277A30135514K84617J96595j89717K11269K17332m6389j7201j88441m95915n81151
5267A29526513q58174j082851j168386j268962j327478j347564j162692r45476
5259A20364930j218955j195660j686717k584024l143946k900699k636161k381941
5251A02616827j890265j935468k035332j536086j819008j739067j993938j632863
5243H8034800j374268j061664j291850j173505j175019r53595r90858r77454n15892
$$ plain form
5234 78520695 77768462 76740004 75753154 74700379 74060888 73742173 73158811 72510759 71786289
5225 71786289 71297949 70618769 70319926 70055986 69453079 69027768 68429250 67905222 67958978 68054254
5215 68054254 67435384 67120255 66841830 66630360 66328880 65995467 65898652 65795632 65542838 65215773
5205 65215773 65056283 64919629 64508247 64149112 64265472 64106701 63553581 63505648 63895897 63616550
5195 63616550 63267845 63204501 63468529 63832926 63881861 64075018 64195206 64656088 65066675 65224918
5185 65224918 65730701 66098200 66800224 67438696 68465658 69528093 70843884 72246908 74034221
5176 74034221 76480372 79545762 82725431 85860865 89753503 94149913 98395676 100699522
5168 100699522 100591042 97752492 93139911 87849356 82604888 77982952 74147012 71436064
$$ packed form
5234G8520695p52233j028458r86850j052775o39491l18715n83362o48052p24470
5225G1786289m88340o79180k98843k63940o02907m25311n98518n24028N3756R5276
5215F8054254o18870l15129k78425k11470l01480l33413r6815j03020k52794l27065
5205F5215773j59490j36654m11382l59135J16360j58771n53120m7933L90249k79347
5195F3616550l48705o3344K64028L64397M8935J93157J20188M60882M10587J58243
5185F5224918N05783L67499P02024O38472J026962J062435J315791J403024J787313
5176G4034221K446151L065390L179669L135434L892638M396410M245763K303846
5168A00699522j08480k838550m612581n290555n244468m621936l835940k710948
$$ plain form
5160 71436064 69019570 66728520 65458566 63947022 62458886 61193294 60140360 59129381
5152 59129381 58190007 57407242 56767429 55809542 54965693 54429771 53545349 53222681 53091686
5143 53091686 52644486 51998279 51391203 51131158 50728068 50153038 49716420 49490028 49285308
5134 49285308 48688362 48135743 48285012 47897746 47505869 47170404 46882346 46688597 46383405
5125 46383405 45997678 45751184 45475524 45058536 44848959 44654585 44948423 44871971 44413871 44140965
5115 44140965 43917092 43691336 43691787 43425177 43157221 42942318 42817362 42451084 42471583 42319569
5105 42319569 41687852 41540856 41447179 40940641 40763147 40443471 40111338 39940988 39817309 39496174
5095 39496174 39395556 39290547 39180175 38970213 38754596 38419467 38544468 38392632 38032617
$$ packed form
5160G1436064k416494k291050j269954j511544j488136j265592j052934j010979
5152E9129381r39374p82765o39813r57887q43849n35922q84422l22668j30995
5143E3091686m47200o46207o07076k60045m03090n75030m36618k26392k04720
5134D9285308n96946n52619J49269l87266l91877l35465k88058j93749l05192
5125D6383405l85727k46494k75660m16988k09577j94374K93838p6452m58100k72906
5115D4140965k23873k25756M51k66610k67956k14903j24956l66278K0499j52014
5105D2319569o31717j46996r3677n06538j77494l19676l32133j70350j23679l21135
5095C9496174j00618j05009j10372k09962k15617l35129J25001j51836l60015
$$ plain form
5086 38032617 37766803 37966005 37961840 37718838 37475850 37279011 37561052 37521537 37248094 37067162
5076 37067162 36774798 36400395 36036672 36115236 36127050 35903170 35577362 35390389 35211744 35361114
5066 35361114 35647682 35566854 35446663 35355179 35491531 35182558 35213339 35256195 35181564 35140718
5056 35140718 35163150 34968247 35093988 35274433 35123239 34697251 34896963 34659703 34470155 34419686
5046 34419686 34341981 34103328 34025871 33933160 33863604 34130231 33831366 33660255 33517702 33305957
5036 33305957 33404355 33350329 32967397 32785381 32758969 32859198 32676355 32717266 32965141 33007620
5026 33007620 32824169 32511953 32657242 32866413 32709842 32874861 32884600 32776817 33033245 33040562
5016 33040562 33188383 33348771 33323906 33135162 32849869 32926292 32713778 33245265 33641205 33436367
$$ packed form
5086C8032617k65814J99202m165k43002k42988j96839K82041l9515k73443j80932
5076C7067162k92364l74403l63723P8564J1814k23880l25808j86973j78645J49370
5066C5361114K86568q0828j20191r1484J36352l08973L0781M2856p4631m0846
5056C5140718K2432j94903J25741J80445j51194m25988J99712k37260j89548n0469
5046C4419686p7705k38653p7457r2711o9556K66627k98865j71111j42553k11745
5036C3305957R8398n4026l82932j82016k6412J00229j82843M0911K47875M2479
5026C3007620j83451l12216J45289K09171j56571J65019R739j07783K56428P317
5016C3040562J47821J60388k4865j88744k85293P6423k12514N31487L95940k04838
$$ plain form
5006 33436367 33426365 33490875 33452120 33588059 34054568 34129144 34094375 33982205 34247475 34495777
4996 34495777 34663703 34588597 34699921 35048034 35047841 35514851 35990212 36483791 36771949 37132336
4986 37132336 37845214 38261399 38458714 38675933 39046240 39385442 39720100 39946578 40635651
4977 40635651 41088097 41865960 42609466 43092408 43664845 44185666 45119590 46247852 46917739
4968 46917739 48486029 49675321 51023317 52538613 53711164 55138877 56645628 58632061
4960 58632061 60414400 62417774 64519737 66262703 68106008 70401742 72520961 74711170
4952 74711170 76658287 78370376 80012730 81901127 83530212 84836834 86243332 87312967
4944 87312967 88330241 89391378 90526333 91133730 92014895 92964861 93761419 94548581 95771837
$$ packed form
5006C3436367j0002O4510l8755J35939M66509P4576l4769j12170K65270K48302
4996C4495777J67926p5106J11324L48113j93M67010M75361M93579K88158L60387
4986C7132336P12878M16185J97315K17219L70307L39202L34658K26478O89073
4977D0635651M52446P77863P43506M82942N72437N20821R33924J128262O69887
4968D6917739J568290J189292J347996J515296J172551J427713J506751J986433
4960E8632061J782339K003374K101963J742966J843305K295734K119219K190209
4952G4711170J947117J712089J642354J888397J629085J306622J406498J069635
4944H7312967J017274J061137J134955O07397Q81165R49966P96558P87162J223256
$$ plain form
4935 95771837 96949923 98318511 99849683 101436493 103583292 105127340 106834644 108711372
4927 108711372 110582662 112144656 113948776 115615114 116428177 117201057 117910434 117828546 117073222
4918 117073222 115779880 113926144 112134041 110289167 108219839 105686757 103081415 100765574
4910 100765574 98444237 96375252 93839498 91832007 89944497 88457596 87112537 85847745
4902 85847745 84755847 83873225 82567488 81480733 80972993 80102105 79296689 78627960 77655571
4893 77655571 76467303 75279654 74112750 72774748 71306519 69990585 68587533 67221869
4885 67221869 65740985 64274879 62422089 61200250 60182068 58652310 57355755 56191438
4877 56191438 54912208 53674761 52380778 51360864 50210795 49017900 47892237 46992903
$$ packed form
4935I5771837J178086J368588J531172J586810K146799J544048J707304J876728
4927A08711372J871290J561994J804120J666338Q13063P72880P09377q1888p55324
4918A17073222j293342j853736j792103j844874k069328k533082k605342k315841
4910A00765574k321337k068985k535754k007491j887510j486901j345059j264792
4902H5847745j091898q82622j305737j086755n07740q70888q05416o68729r72389
4893G7655571j188268j187649j166904j338002j468229j315934j403052j365664
4885F7221869j480884j466106j852790j221839j018182j529758j296555j164317
4877E6191438j279230j237447j293983j019914j150069j192895j125663q99334
$$ plain form
4869 46992903 46376228 45615322 44909170 43955077 43019845 42508637 41896203 40640639 39625041
4860 39625041 38981363 38011630 37078130 36226551 35814360 35235005 34466921 34001171 33221126
4851 33221126 32306627 31898891 31183848 30815856 30623793 30161566 30054896 29923480 29401597
4842 29401597 29315576 28970191 28638135 28446112 28030711 28055942 27671113 27795547 27207061 27181885
4832 27181885 27259983 27157664 27079863 26884957 26705332 26522893 26468207 26683768 26519346 26486588
4822 26486588 26319440 26135915 25898164 25806323 26215420 26390674 26217550 26409727 26328399 26304026
4812 26304026 26667426 26827406 27092238 26999741 27298788 27752738 27674296 27954791 28029874 28001847
4802 28001847 28059110 28160070 28733461 29112574 29146407 29106486 29546383 29818841 30040998 30290246
$$ packed form
4869D6992903o16675p60906p06152r54093r35232n11208o12434j255564j015598
4860C9625041o43678r69733r33500q51579m12191n79355p68084m65750p80045
4851C3221126r14499m07736p15043l67992j92063m62227j06670j31416n21883
4842B9401597q6021l45385l32056j92023m15401K5231l84829J24434n88486k5176
4832B7181885P8098j02319p7801j94906j79625j82439n4686K15561j64422l2758
4822B6486588j67148j83525k37751r1841M09097J75254j73124J92177q1328k4373
4812B6304026L63400J59980K64832r2497K99047M53950p8442K80495P5083k8027
4802B8001847N7263J00960N73391L79113L3833l9921M39897K72458K22157K49248
$$ plain form
4792 30290246 30711770 30745961 31161619 31476867 31677503 31933720 32300315 32785955 33304778 33521410
4782 33521410 33947862 34650075 35053355 35550382 35812812 36294313 37434096 38029088 38606559
4773 38606559 39119292 40251024 41486634 42409721 43284227 44332898 45361895 46619321 47854938
4764 47854938 48896483 50891243 52745700 54358956 56523297 58349173 60327350 62634057
4756 62634057 65150272 67694941 70682896 74221588 77759638 81698551 86354922 91047906
4748 91047906 96677004 102813106 109649541 117500557 125895121 135317595 146086807 157793895
4740 157793895 171155389 186232945 202623856 221469343 241932935 264060366 286560872
4733 286560872 308035674 325945611 337101572 339824243 332751230 316447988 293924414
$$ packed form
4792C0290246M21524L4191M15658L15248K00636K56217L66595M85640N18823K16632
4782C3521410M26452P02213M03280M97027K62430M81501J139783N94992N77471
4773C8606559N12733J131732J235610R23087Q74506J048671J028997J257426J235617
4764D7854938J041545J994760J854457J613256K164341J825876J978177K306707
4756F2634057K516215K544669K987955L538692L538050L938913M656371M692984
4748I1047906N629098O136102O836435P851016Q394564R422474J0769212J1707088
4740A57793895J3361494J5077556J6390911J8845487K0463592K2127431K2500506
4733B86560872K1474802J7909937J1155961K722671p073013j6303242k2523574
$$ plain form
4726 293924414 269515459 245141799 222935266 203487366 186332013 171428590 158199313
4719 158199313 147137923 137548147 128907538 121445670 114642499 108331009 103434014 98700279
4711 98700279 93955708 89671090 85773992 82269355 79196595 76040531 72994998 69940647
4703 69940647 67282209 64993978 62582453 60554705 58520939 56393541 54325269 52733730
4695 52733730 51151819 49630978 48198088 46912599 45600993 44223946 43296715 41964951
4687 41964951 41220721 40284655 39602326 39185219 38370639 37846448 37409698 36728884 36340465
4678 36340465 35976076 35932815 35612959 35400127 35081605 34852921 34505009 34319155 34488917 34330812
4668 34330812 33889237 33309731 32880458 32419287 31939041 31483785 30939796 30437905 30226765
$$ packed form
4726B93924414k4408955k4373660k2206533j9447900j7155353j4903423j3229277
4719A58199313j1061390r589776q640609p461868o803171o311490m896995m733735
4711I8700279m744571m284618l897098l504637l072760l156064l045533l054351
4703F9940647k658438k288231k411525k027748k033766k127398k068272j591539
4695E2733730j581911j520841j432890j285489j311606j377047r27231j331764
4687D1964951p44230r36066o82329m17107q14580n24191m36750o80814l88419
4678C6340465l64389m3261l19856k12832l18522k28684l47912j85854J69762j58105
4668C4330812m41575n79506m29273m61171m80246m55256n43989n01891k11140
$$ plain form
4659 30226765 29891856 29784918 29559706 28863426 28474640 28092198 27808284 27682996 27033933
4650 27033933 26739504 26466687 25732260 24956674 24315773 23798346 23269159 22814027 22796505 22415949
4640 22415949 22114227 21342107 20967714 20937247 20493898 20231345 20063416 19773277 19416208 18856791
4630 18856791 18710696 18530255 18239638 17991844 17762443 18035373 18295481 18147958 18044590
4621 18044590 18164457 18170485 18044560 17716674 17712920 18024108 18060962 17948518 18068889 17935893
4611 17935893 17656863 17634819 17507595 17288060 16948429 16463963 16198484 15854581 15428234 15124129
4601 15124129 15061848 14903202 14744613 14464871 14183999 13763059 13604834 13353757 13060465 13030818
4591 13030818 12886392 12934471 12628003 12317523 12336962 12301709 12081397 11786074 11914473 11798332
$$ packed form
4659C0226765l34909j06938k25212o96280l88786l82442k83914j25288o49063
4650B7033933k94429k72817p34427p75586o40901n17427n29187m55132j7522l80556
4640B2415949l01722p72120l74393l0467m43349k62553j67929k90139l57069n59417
4630A8856791j46095j80441k90617k47794k29401K72930K60108j47523j03368
4621A8044590J19867O028j25925l27886l754L11188L6854j12444J20371j32996
4611A7935893k79030k2044j27224k19535l39631m84466k65479l43903m26347l04105
4601A5124129o2281j58646j58589k79742k80872m20940j58225k51077k93292k9647
4591A3030818j44426M8079l06468l10480J9439l5253k20312k95323J28399j16141
$$ plain form
4581 11798332 11659800 11438346 11219087 11154652 11089587 11157070 10835938 10636419 11063570 10763381
4571 10763381 10701045 10587986 10398920 10473143 10568563 10600579 10603058 10708210 10483030 10516457 10390387
4560 10390387 10190424 9980830 9979820 10095922 9967916 10125710 9894717 10122468 9997713 9748914
4550 9748914 9607548 9349180 9127908 9196715 9213114 8881440 9168140 8961208 8813972 8647101
4540 8647101 8606082 8452359 8541417 8345462 8370773 8441645 8422673 8145429 8046290 7979294 8246611
4529 8246611 8073302 8199603 8212293 8017312 7753764 7603416 7805946 7672966 7570988 7546965
4519 7546965 7695870 7540402 7096930 7162076 6809591 7036091 7137261 7007323 7146477 7066495
4509 7066495 7324843 7561356 7175649 7286006 7538038 7248689 7141250 7164804 7020084 7069313
$$ packed form
4581A1798332j38532k21454k19259o4435o5065O7483l21132j99519M27151l00189
4571A0763381o2336j13059j89066P4223R5420L2016K479J05152k25180L3427j26070
4560A0390387j99963k09594j010J16102j28006J57794k30993K27751j24755k48799
4550I748914j41366k58368k21272O8807J6399l31674K86700k06932j47236j66871
4540H647101m1019j53723Q9058j95955K5311P0872j8972k77244r9139o6996K67317
4529H246611j73309J26301J2690j94981k63548j50348K02530j32980j01978k4023
4519G546965J48905j55468m43472O5146l52485K26500J01170j29938J39154p9982
4509G066495K58348K36513l85707J10357K52032k89349j07439K3554j44720M9229
$$ plain form
4499 7069313 6869511 6917755 6998611 6854788 7132269 7051827 7283452 7247772 7069636 6964981
4489 6964981 6794559 6849391 6825163 6986526 7198188 6876238 6940660 7200489 7283744 7146334
4479 7146334 7290210 7323251 7300823 7493298 7350003 7104231 7344141 7589393 7525579 7360696
4469 7360696 7111078 6966896 6940273 6925279 7324260 7318952 7576072 7520659 7118422 7247832
4459 7247832 7433140 7200401 7073800 7144964 7435945 7343778 7072714 7139080 7665133 7848522
4449 7848522 7753534 7707081 7973271 8126806 7929834 7816007 8110933 8160095 8362218 8384558
4439 8384558 8501460 8503618 8473116 8654164 8793417 8710331 8726264 8847163 8905673 9010722 9349965
4428 9349965 9548621 9625336 9570353 9729891 9674478 9756698 10402655 10463223 10601904 10876816
$$ packed form
4499G069313j99802M8244Q0856j43823K77481q0442K31625l5680j78136j04655
4489F964981j70422N4832k4228J61363K11662l21950O4422K59829Q3255j37410
4479G146334J43876L3041k2428J92475j43295k45772K39910K45252o3814j64883
4469G360696k49618j44182k6623j4994L98981n308K57120n5413m02237J29410
4459G247832J85308k32739j26601P1164K90981r2167k71064O6366N26053J83389
4449G848522r4988m6453K66190J53535j96972j13827K94926M9162K02123K2340
4439H384558J16902K158l0502J81048J39253q3086J5933J20899N8510J05049L39243
4428I349965J98656P6715n4983J59538n5413Q2220O45957O0568J38681K74912
$$ plain form
4418 10876816 11077582 11037271 11046167 11289816 11546255 11759769 12260676 12831182 12981927 13039290
4408 13039290 13427512 13766910 14421850 14708861 15089628 15393260 16039361 16423012 16571663
4399 16571663 16962567 17240391 17966634 18796089 19226833 19823318 21343299 22067396 22724769
4390 22724769 24265505 25864204 27354729 29561546 32169149 34785972 37542304 40509232
4382 40509232 43888044 47100711 49920139 52842956 55495084 58063216 61517803 65146450
4374 65146450 69331953 73355279 76493286 78363848 79548263 80347496 81804726 83756610
4366 83756610 86419906 89022094 90585914 90286678 88179704 84815861 81778522 79211492
4358 79211492 77772171 76861991 75488689 73250151 69950074 66020845 61782413 57882857
$$ packed form
4418A0876816K00766m0311Q896K43649K56439K13514N00907N70506J50745N7363
4408A3039290L88222L39398O54940K87011L80767L03632O46101L83651J48651
4399A6571663L90904K77824P26243Q29455M30744N96485J519981P24097O57373
4390B2724769J540736J598699J490525K206817K607603K616823K756332K966928
4382D0509232L378812L212667K819428K922817K652128K568132L454587L628647
4374F5146450M185503M023326L138007J870562J184415P99233J457230J951884
4366H3756610K663296K602188J563820k99236k106974l363843l037339k567030
4358G9211492j439321r10180j373302k238538l300077l929229m238432l899556
$$ plain form
4350 57882857 54343312 51973879 49290305 46838012 44424804 41292112 38081266 34673099
4342 34673099 31827102 29307088 26979948 25319550 23974552 22752432 21608553 20544322
4334 20544322 19662048 18868233 18286298 17498957 16869934 16564924 15590481 14943923 14318934
4325 14318934 14244937 13798045 13327409 12911467 12462507 12412228 12121747 11720999 11532250 11357001
4315 11357001 11005415 10664174 10307616 10301271 10297861 10277230 10040004 9687732 9681626 9490943 9267874
4304 9267874 9310351 9142296 8959633 8707901 8642310 8506308 8584252 8598914 8456596 8080033
4294 8080033 8055073 7836119 7684506 7414374 7328194 7235839 6969555 6930995 7081578 7204637
4284 7204637 6982982 6863854 6656357 6995848 6995804 6833518 6900417 6726339 6749037 6633937 6260223
$$ packed form
4350E7882857l539545k369433k683574k452293k413208l132692l210846l408167
4342C4673099k845997k520014k327140j660398j344998j222120j143879j064231
4334B0544322q82274p93815n81935p87341o29023l05010r74443o46558o24989
4325A4318934p3997m46892m70636m15942m48960n0279k90481m00748j88749j75249
4315A1357001l51586l41241l56558o345l410k0631k37226l52272o106j90683k23069
4304I267874M2477j68055j82663k51732o5591j36002P7944J4662j42318l76563
4294H080033k4960k18954j51613k70132q6180r2355k66284l8560J50583J23059
4284G204637k21655j19128k07497L39491m4j62286O6899j74078K2698j15100l73714
$$ plain form
4273 6260223 5973016 6072457 6138156 6059375 5769344 5626091 5616635 5410380 5380256 5423157 5517138
4262 5517138 5137097 5102288 5755878 5928780 5666733 5403690 5279368 5469124 5232124 5250120
4252 5250120 5159432 5056111 5121077 5427718 5452252 5000581 4980940 5274675 5236015 5273179 5355436
4241 5355436 5241484 5398069 5487444 5290996 5234153 4893388 5130433 5080382 4972891 4779186
4231 4779186 4812542 5020157 4829877 4902611 4958552 4947068 4934471 4840369 4428656 4480669 4479800
4220 4479800 4516630 4625347 4687587 4590010 4636883 4647605 4562971 4495141 4283544 4157518 4176209
4209 4176209 3812503 3726380 3875213 3905883 3614190 3599525 3884202 4108012 3903830 3840577
4199 3840577 4038801 3676596 3626163 3870521 3855497 3607993 3465822 3356983 3384335 3523062
$$ packed form
4273F260223k87207R9441O5699p8781k90031j43253r456k06255l0124M2901R3981
4262E517138l80041l4809O53590J72902k62047k63043j24322J89756k37000J7996
4252E250120r0688j03321O4966L06641K4534m51671j9641K93735l8660L7164Q2257
4241E355436j13952J56585Q9375j96448n6843l40765K37045n0051j07491j93705
4231D779186L3356K07615j90280P2734N5941j1484j2597r4102m11713N2013q69
4220D479800L6830J08717O2240r7577M6873J0722q4634o7830k11597j26026J8691
4209D176209l63706q6123J48833L0670k91693j4665K84677K23810k04182o3253
4199C840577J98224l62205n0433K44358j5024k47504j42171j08839K7352J38727
$$ plain form
4189 3523062 3669982 3483746 3419303 3035190 3208242 3321653 3824480 3710371 3314151 3319298
4179 3319298 3267659 3276370 3517872 3425301 3305376 3238463 3293317 3190144 3348408 3427582 3176132
4168 3176132 3325493 3500707 3273194 3169630 2895074 3010199 3382813 3295948 3176296 3213704
4158 3213704 3401130 3350159 3417771 3330250 3581503 3775833 3748556 3291861 3272875 3274856 3411653
4147 3411653 3454430 3365258 3236647 3473026 3490606 3252799 3047427 3171705 3253238 3417844
4137 3417844 3656551 3861971 3512345 3513863 3584666 3790584 3649012 3381312 3374249 3345150 3242670
4126 3242670 3552425 3375888 3663902 3584312 3632254 3583189 3638494 3824406 3732235 3613084
4116 3613084 3840892 3969342 3889975 3927270 4015865 4388062 4131600 3947132 3585903 3827766
$$ packed form
4189C523062J46920j86236o4443l84113J73052J13411N02827j14109l96220N147
4179C319298n1639Q711K41502r2571j19925o6913N4854j03173J58264P9174k51450
4168C176132J49361J75214k27513j03564k74556J15125L72614q6865j19652L7408
4158C213704J87426n0971O7612q7521K51253J94330k7277m56695j8986J981J36797
4147C411653M2777q9172j28611K36379J7580k37807k05372J24278Q1533J64606
4137C417844K38707K05420l49626J518P0803K05918j41572k67700p063k9099j02480
4126C242670L09755j76537K88014p9590M7942m9065N5305J85912r2171j19151
4116C613084K27808J28450p9367L7295Q8595L72197k56462j84468l61229K41863
$$ plain form
4106 3827766 4023090 4132783 4200037 4363110 4528947 4567621 4558805 4320930 4401116 4583861
4096 4583861 4500168 4518859 4550502 4585342 4771844 4582977 4645183 5188043 5233490 5106972 5086191
4085 5086191 5184259 5203493 5261421 5290875 5188258 5137873 5418644 4989324 5045390 5344525 5669208
4074 5669208 5491592 5483206 5503467 5643245 5834346 5920105 6119853 6473021 6618305 6641185
4064 6641185 6839464 6906951 7033262 7186533 7543596 7675014 7746320 7900799 8109979 8342733
4054 8342733 8414224 8498510 8850395 9242673 9382346 9472870 9737442 10150433 10286661 10591375
4044 10591375 10860754 11379699 11988351 12311025 12844480 13322735 13801271 14237941 14579924
4035 14579924 15263990 15842470 16751711 17408066 17703008 18495060 19535529 20288739 21089062
$$ packed form
4106C827766J95324J09693O7254J63073J65837L8674q816k37875Q0186J82745
4096D583861q3693J8691L1643L4840J86502j88867O2206N42860M5447j26518k0781
4085E086191R8068J9234N7928K9454j02617n0385K80771m29320N6066K99135L24683
4074E669208j77616q386K0261J39778J91101Q5759J99748L53168J45284K2880
4064F641185J98279O7487J26311J53271L57063J31418P1306J54479K09180K32754
4054H342733P1491Q4286L51885L92278J39673R0524K64572M12991J36228L04714
4044A0591375K69379N18945O08652L22674N33455M78255M78536M36670L41983
4035A4579924O84066N78480R09241O56355K94942P92052J040469P53210Q00323
$$ plain form
4026 21089062 21886511 22792792 23971250 24873965 25725660 26536982 27424599 28370001 29219044
4017 29219044 30293957 31230953 32231981 32942722 33758520 34904139 36180421 36819355 37570900
4008 37570900 38554059 39417159 40265289 40683120 41564069 42052207 42145110 42235324 42954063 43440035
3998 43440035 43390874 43503223 43712402 43578206 43060505 42753704 43084483 42617557 42020154 41500760
3988 41500760 40981212 40342083 39731493 38766367 37950326 37140002 36455624 35607406 34839514
3979 34839514 33940454 33039821 32182511 31109606 30371913 29659678 28463096 27559195 26820300
3970 26820300 26057389 24883807 23869016 23413515 22617478 21730535 21191684 20594700 19691521
3961 19691521 19018196 18489314 18085316 17470937 16855524 16108552 15815275 15455477 15280038
$$ packed form
4026B1089062P97449R06281J178458R02715Q51695Q11322Q87617R45402Q49043
4017B9219044J074913R36996J001028P10741Q15798J145619J276282O38934P51545
4008C7570900R83159Q63100Q48130M17831Q80949M88138R2903R0214P18739M85972
3998D3440035m9161J12349K09179j34196n17701l06801L30779m66926n97403n19394
3988D1500760n19548o39129o10590r65126q16041q10324o84378q48218p67892
3979C4839514q99060r00633q57310j072905p37693p12235j196582r03901p38895
3970B6820300p62911j173582j014791m55501p96037q86943n38851n96984r03179
3961A9691521o73325n28882m03998o14379o15413p46972k93277l59798j75439
$$ plain form
3952 15280038 14904518 14096870 13654997 13509734 13269079 13381210 12834714 12207840 11981245
3943 11981245 12220771 11739714 11813107 11707556 11237737 11021907 10761183 10902677 10705633 10448374
3933 10448374 10227949 10382321 10448643 10311487 9848887 10133649 9992801 9888440 9323107 9444356
3923 9444356 9524291 9544844 9492126 9135813 9240016 9152015 8831489 8664452 9044540 8871381
3913 8871381 8630693 8450779 8602389 8993813 8899169 8748169 9077696 8875155 8858993 8870265
3903 8870265 9118284 9275548 9433651 9253263 9220877 9644646 9822387 9870215 9530014 9862054
3893 9862054 10160672 10069961 10390929 10662614 10995007 10933978 11046042 11493302 12057375 12247420
3883 12247420 12208713 12496523 12770432 12899943 12827427 13241721 13915412 14254719 14302179 14537257
$$ packed form
3952A5280038l75520q07648m41873j45263k40655J12131n46496o26874k26595
3943A1981245K39526m81057P3393j05551m69819k15830k60724J41494j97044k57259
3933A0448374k20425J54372O6322j37156m62600K84762j40848j04361n65333J21249
3923I444356P9935K0553n2718l56313J04203q8001l20526j67037L80088j73159
3913H871381k40688j79914J51610L91424r4644j51000L29527k02541j6162J1272
3903H870265K48019J57264J58103j80388l2386M23769J77741M7828l40201L32040
3893I862054K98618r0711L20968K71685L32393o1029J12064M47260N64073J90045
3883A2247420l8707K87810K73909J29511p2516M14294O73691L39307M7460K35078
$$ plain form
3873 14537257 14556153 14760861 15112483 15648533 15899278 15606279 15854371 15983353 16256145 16588778
3863 16588778 16702282 17122104 17149475 17524066 17856908 18189395 18331059 18566404 18685149 19102912
3853 19102912 19751816 19725384 20226187 21076742 21697743 22238938 23108720 24005265 24486089 25617714
3843 25617714 26816201 27829481 29157591 30428386 31864776 33399706 34886260 36490733
3835 36490733 38677792 40624977 42942896 44982321 47264227 50134086 52989086 55695549
3827 55695549 58398423 61043787 63946248 66563390 69405915 71872402 74016844 76043079
3819 76043079 78201798 80163038 81446685 82480705 83182577 83501858 83805572 84150754 83228426
3810 83228426 82766388 81785078 80591798 79199875 77519996 75453904 73435882 71384791
$$ packed form
3873A4537257J8896K04708L51622N36050K50745k92999K48092J28982K72792L32633
3863A6588778J13504M19822K7371L74591L32842L32487J41664K35345J18745M17763
3853A9102912O48904k6432N00803Q50555O21001N41195Q69782Q96545M80824J131625
3843B5617714J198487J013280J328110J270795J436390J534930J486554J604473
3835C6490733K187059J947185K317919K039425K281906K869859K855000K706463
3827E5695549K702874K645364K902461K617142K842525K466487K144442K026235
3819G6043079K158719J961240J283647J034020P01872L19281L03714L45182r22328
3810H3228426m62038r81310j193280j391923j679879k066092k018022k051091
$$ plain form
3802 71384791 69302832 66871189 64335377 62116627 59554847 57168594 54567539 51881242
3794 51881242 49588052 47232902 45238068 42756825 40772155 38927423 37270786 35736356
3786 35736356 33874925 32378476 31104186 30131291 28928240 27711186 26376054 25666127
3778 25666127 24742543 23732306 22997575 22396070 21841768 21604046 21130618 20658557 20359160
3769 20359160 20137758 19687185 19257284 18870002 18696485 18688552 18223868 18105521 18073590 17667751
3759 17667751 17258037 16862557 16807489 16648641 16587081 16105777 16041814 15806984 15653955 15498880
3749 15498880 15055072 15180974 15126833 14779710 14601723 14068862 13851736 13878638 13437073 13538607
3739 13538607 13326870 13315884 12935188 12902901 12702377 12556800 12785502 12184985 12257822 12162971
$$ packed form
3802G1384791k081959k431643k535812k218750k561780k386253k601055k686297
3794E1881242k293190k355150j994834k481243j984670j844732j656637j534430
3786C5736356j861431j496449j274290r72895j203051j217054j335132p09927
3778B5666127r23584j010237p34731o01505n54302k37722m73428m72061k99397
3769B0359160k21402m50573m29901l87282j73517p933m64684j18347l1931m05839
3759A7667751m09714l95480n5068j58848o1560m81304o3963k34830j53029j55075
3749A5498880m43808J25902n4141l47123j77987n32861k17126K6902m41565J01534
3739A3538607k11737j0986l80696l2287k00524j45577K28702o00517P2837r4851
$$ plain form
3729 12162971 11945883 12115897 11757956 11573059 11747312 11271993 11128907 11239717 11101400
3720 11101400 11272447 11118572 11320350 11151455 11235414 11354262 11443090 11392913 11285714 11438036
3710 11438036 11601700 11710370 11767478 11791631 12137603 12730633 13079032 13587712 13808723 14016993
3700 14016993 14374993 15001946 15360429 15656012 16204544 16623715 16513893 16764490 17235327
3691 17235327 17533076 17357938 16903448 16993150 16868121 17010620 16929560 16984438 16933621 16725333
3681 16725333 16616937 16484150 16081959 15779214 15459386 15093459 14862891 14301823 13828048
3672 13828048 13495432 12951985 12763261 12511968 12160319 11931548 11717718 11661872 11698502 11597283
3662 11597283 11499314 11232517 11649571 11894290 11902132 12086345 12042529 12009520 12260929 12524662
$$ packed form
3729A2162971k17088J70014l57941j84897J74253m75319j43086J10810j38317
3720A1101400J71047j53875K01778j68895Q3959J18848Q8828n0177j07199J52322
3710A1438036J63664J08670N7108K4153L45972N93030L48399N08680K21011K08270
3700A4016993L58000O26953L58483K95583N48532M19171j09822K50597M70837
3691A7235327K97749j75138m54490Q9702j25029J42499q1060N4878n0817k08288
3681A6725333j08396j32787m02191l02745l19828l65927k30568n61068m73775
3672A3828048l32616n43447j88724k51293l51649k28771k13830n5846L6630j01219
3662A1597283r7969k66797M17054K44719P842J84213m3816l3009K51409K63733
$$ plain form
3652 12524662 12577152 12862958 12827466 12930642 13229600 13587323 13766712 14254117 14475773 15119737
3642 15119737 15684045 15887916 16015641 16471005 16727978 16736645 17127079 17421978 17607851 17947970
3632 17947970 18024922 18357597 18854519 19016519 19055874 19583123 19734224 19709336 19954949 20430543
3622 20430543 20322738 19795320 20204125 20127659 19741954 19830594 19715104 19572882 19673969 19839725
3612 19839725 19570018 19595412 20022779 19427087 19102956 19552871 19759330 19871771 19811554 19934143
3602 19934143 20072566 20159449 20297878 20529041 20712109 20974836 21449933 21787923 21982465 22605243
3592 22605243 23117437 23763260 24631957 25301354 26274807 27458586 28419239 29398282 30723048
3583 30723048 31780986 32765960 34287279 35887845 37456848 39174789 40734603 42630049
$$ packed form
3652A2524662N2490K85806l5492J03176K98958L57723J79389M87405K21656O43964
3642A5119737N64308K03871J27725M55364K56973Q667L90434K94899J85873L40119
3632A7947970P6952L32675M96922J62000L9355N27249J51101k4888K45613M75594
3622B0430543j07805n27418M08805p6466l85705Q8640j15490j42222J01087J65756
3612A9839725k69707K5394M27367n95692l24131M49915K06459J12441o0217J22589
3602A9934143J38423Q6883J38429K31163J83068K62727M75097L37990J94542O22778
3592B2605243N12194O45823Q68697O69397R73453J183779R60653R79043J324766
3583C0723048J057938R84974J521319J600566J569003J717941J559814J895446
$$ plain form
3575 42630049 44057969 45541211 47270365 48893658 50805773 52597635 54047603 55890218
3567 55890218 57381619 58868195 60465852 61886596 63284835 64609772 65951797 66865870
3559 66865870 68048261 69061213 69987010 70529047 71198952 72056373 72663810 73026135 73375424
3550 73375424 73638253 73635510 73469585 73295845 73174937 72848064 72480406 72288625 71960067 71359815
3540 71359815 70678105 69824939 69050807 67867624 66732919 65140349 63765993 62358477 60531535
3531 60531535 58888627 57195410 55561003 54165219 52371834 50858399 48942064 46896419
3523 46896419 45321769 43683467 42196827 40608756 38719848 37361351 35873162 34369899
3515 34369899 32802031 31297526 30096614 29181168 27694766 26638667 25999003 25232219 24402683
$$ packed form
3575D2630049J427920J483242J729154J623293J912115J791862J449968J842615
3567E5890218J491401J486576J597657J420744J398239J324937J342025R14073
3559F6865870J182391J012952R25797N42037O69905Q57421O07437L62325L49289
3550G3375424K62829k743j65925j73740j20908l26873l67658j91781l28558o00252
3540G1359815o81710q53166p74132j183183j134705j592570j374356j407516j826942
3531F0531535j642908j693217j634407j395784j793385j513435j916335k045645
3523D6896419j574650j638302j486640j588071j888908j358497j488189j503263
3515C4369899j567868j504505j200912r15446j486402j056099o39664p66784q29536
$$ plain form
3506 24402683 23748094 23202618 22683496 22469045 22120339 21620529 20845642 20680406 20586990 20359827
3496 20359827 20059988 19995816 19756966 19337983 19070563 18663752 18506687 18623638 18507221 18376504
3486 18376504 18367103 17979055 18071072 18115851 17581060 17009093 16896928 16977063 16915296 16779719
3476 16779719 16222147 15895809 15381577 14874985 14283939 14133560 13791741 13657712 13327164
3467 13327164 13131165 12994773 12390143 12040835 11434207 11235406 10779806 10418131 10241162
3458 10241162 9777414 9326564 9192705 9114549 8646203 8855417 8632742 8533685 8246808 7792296
3448 7792296 7839682 7730450 7579351 7444001 7533996 7463305 7187506 7065616 6847733 6916182
3438 6916182 6797167 6401504 6226460 6402717 6065462 6416578 6483260 6365198 6242217 6062930
$$ packed form
3506B4402683o54589n45476n19122k14451l48706m99810p74887j65236r3416k27163
3496B0359827k99839o4172k38850m18983k67420m06811j57065J16951j16417j30717
3486A8376504r401l88048R2017M4779n34791n71967j12165Q0135o1767j35577
3476A6779719n57572l26338n14232n06592n91046j50379l41819j34029l30548
3467A3327164j95999j36392o04630l49308o06628j98801m55600l61675j76969
3458A0241162m63748m50850j33859p8156m68346K09214k22675r9057k86877m54512
3448G792296M7386j09232j51099j35350Q9995p0691k75799j21890k17883O8449
3438F916182j19015l95663j75044J76257l37255L51116O6682j18062j22981j79287
$$ plain form
3428 6062930 5891039 5801920 6003906 5988511 5641381 6010507 6142212 5987496 5797462 5812254
3418 5812254 5832363 5443138 5326851 5093955 4942180 4775147 5268455 5083833 4598233 4611533
3408 4611533 4581475 4423979 4362343 4256252 4295372 4528211 4471035 4303369 4269855 4256706 4156098
3397 4156098 4053390 3913912 3700383 3879050 3713165 3681647 3846334 3781923 3539731 3464448
3387 3464448 3776805 3602303 3665373 3790408 3808461 3936983 3785879 3883085 3747003 3685483
3377 3685483 3569827 3183927 3140151 3229811 2968676 3207023 3130050 3119451 3218194 2930824
3367 2930824 2744878 2880857 2609010 2782369 2878495 2756274 2899052 2926472 2906605 2977782
3357 2977782 3012911 3037085 2825031 2682155 2383306 2685320 2814242 2598625 2775072 3006943
$$ packed form
3428F062930j71891q9119K01986j5395l47130L69126J31705j54716j90034J4792
3418E812254K0109l89225j16287k32896j51775j67033M93308j84622m85600J3300
3408D611533l0058j57496o1636j06091L9120K32839n7176j67666l3514j3149j00608
3397D156098j02708j39478k13529J78667j65885l1518J64687o4411k42192p5283
3387C464448L12357j74502O3070J25035J8053J28522j51104R7206j36082o1520
3377C685483j15656l85900m3776Q9660k61135K38347p6973j0599R8743k87370
3367B930824j85946J35979k71847J73359R6126j22221J42778K7420j9867P1177
3357B977782L5129K4174k12054j42876k98849L02014J28922k15617J76447K31871
$$ plain form
3347 3006943 3076210 2978416 2841863 2931075 2921878 2867509 2774390 2736674 2805257 2591736 2679874
3336 2679874 2724987 2940343 2925906 2881103 2699314 2584599 2608282 2766181 2684224 2365135
3326 2365135 2467636 2513023 2279355 2292423 2313015 2105654 2482026 2435947 2342584 2506183
3316 2506183 2370276 2351461 2373209 1932044 2115830 2271149 2020704 1894779 2127692 2336145
3306 2336145 2255606 2180259 1930232 2045543 2148048 1982843 1998928 2427107 2318897 2203048
3296 2203048 2004867 2331847 2326526 2224877 2275632 2307706 2366547 2546635 2578590 2762397 2844018
3285 2844018 2651561 2511133 2695495 2816558 2676406 2482766 2067834 2006890 2025919 2483997
3275 2483997 2772060 2566438 2391826 2623836 2840460 2896260 2925619 2906704 2941877 2787777
$$ packed form
3347C006943O9267r7794j36553Q9212r197n4369r3119l7716O8583k13521Q8138
3336B679874M5113K15356j4437m4803j81789j14715K3683J57899q1957l19089
3326B365135J02501M5387k33668J3068K0592k07361L76372m6079r3363J63599
3316B506183j35907j8815K1748m41165J83786J55319k50445j25925K32913K08453
3306B336145q0539p5347k50027J15311J02505j65205J6085M28179j08210j15849
3296B203048j98181L26980n321j01649N0755L2074N8841J80088L1955J83807Q1621
3285B844018j92457j40428J84362J21063j40152j93640m14932o0944J9029M58078
3275B483997K88063k05622j74612K32010K16624N5800K9359j8915L5173j54100
$$ plain form
3265 2787777 3130853 3082187 3167073 3094896 2906838 2793612 2913800 3003014 2932313 2828690
3255 2828690 2844292 2908071 2958824 2809384 2887168 2546780 2483765 2741778 3089797 3269059
3245 3269059 3344430 3146317 3070695 3319722 3068172 2964360 2767367 2538287 2486277 2697419
3235 2697419 3076241 3027787 2711843 2914407 2656532 2871230 3099433 3435434 3460124 3475030
3225 3475030 3411649 3536035 3458799 3242264 3197952 3315791 3511343 3573945 3813710 3986154
3215 3986154 4180506 4172245 4180487 4303258 4265036 4447023 4799061 5055680 5191645 4931850
3205 4931850 4576217 4719662 4551752 4332159 4048661 3892786 3570859 3463761 3537958 3488931
3195 3488931 3338256 2824772 2871688 2738241 2559952 2636719 2937893 2988675 2573656 2354288
$$ packed form
3265B787777L43076m8666Q4886p2177j88058j13226J20188Q9214p0701j03623
3255B828690J5602O3779N0753j49440P7784l40388o3015K58013L48019J79262
3245C269059P5371j98113p5622K49027k51550j03812j96993k29080n2010K11142
3235B697419L78822m8454l15944K02564k57875K14698K28203L36001K4690J4906
3225C475030o3381J24386p7236k16535m4312J17839J95552O2602K39765J72444
3215C986154J94352q261Q242J22771l8222J81987L52038K56619J35965k59795
3205D931850l55633J43445j67910k19593k83498j55875l21927j07098P4197m9027
3195C488931j50675n13484M6916j33447j78289P6767L01174N0782m15019k19368
$$ plain form
3185 2354288 2382674 2384915 2207042 2388629 2570717 2407370 2370149 2378211 2265537 2449913 2556954
3174 2556954 2313705 2361160 2270640 2383716 2300132 2516463 2386274 1975865 2083593 1990380
3164 1990380 2046612 2115430 2090201 1753903 1663787 1804637 1635005 1884107 1887405 1806935 2072557
3153 2072557 1705530 1762840 1774605 1284304 1699891 1907039 1732093 1723264 1979102 2291689
3143 2291689 1967156 1928505 1808281 1688952 1724000 1838502 1926022 1770990 1797724 1730354
3133 1730354 1667167 2101635 2321913 2252647 2285117 2193206 2032119 2273835 2479268 2226050
3123 2226050 2153354 1956861 2052107 2088048 2284059 2545067 2104849 1988099 1781630 1766114
3113 1766114 1450807 1647772 1668234 1759776 1886363 1630211 1638112 1457539 1472027 1289425
$$ packed form
3185B354288K8386K241j77873J81587J82088j63347l7221Q062j12674J84376J07041
3174B556954k43249M7455r0520J13076q3584K16331j30189m10409J07728r3213
3164A990380N6232O8818k5229l36298r0116J40850j69632K49102L298q0470K65622
3153B072557l67027N7310J1765m90301M15587K07148j74946q829K55838L12587
3143B291689l24533l8651j20224j19329L5048J14502Q7520j55032K6734o7370
3133A730354o3187M34468K20278o9266L2470r1911j61087K41716K05433k53218
3123B226050p2696j96493R5246L5941J96011K61008m40218j16750k06469j5516
3113A766114l15307J96965K0462R1542J26587k56152P901j80573J4488j82602
$$ plain form
3103 1289425 1169291 1427372 1582436 1745159 1668077 1383068 1302061 1129717 984025 1205452
3093 1205452 1208609 1255773 1340020 970087 877615 857090 1221165 1306945 1280128 1110409 1001602
3082 1001602 1076179 1363461 1132945 1231130 1074379 1263597 1321746 1417965 1543557 1305506
3072 1305506 1299536 1062097 955568 988362 1112165 1408802 1455880 1385598 1029933 779295
3062 779295 790728 993322 1025525 1032386 1073046 861318 1209188 1251444 891715 833794 1119164
3051 1119164 1192514 833798 720843 970520 865603 845586 749752 641379 716792 750474
3041 750474 794926 975507 927699 740496 629594 893013 1175897 1235265 1098594 1060830
3031 1060830 970916 1051254 983340 838312 808771 853498 926546 1069279 825426 748623 599207
$$ packed form
3103A289425j20134K58081J55064J62723p7082k85009q1007j72344j45692K21427
3093A205452L157M7164Q4247l69933r2472k0525L64075Q5780k6817j69719j08807
3082A001602P4577K87282k30516R8185j56751J89218N8149R6219J25592k38051
3072A305506n970k37439j06529L2794J23803K96637M7078p0282l55665k50638
3062G79295J1433K02594L2203O861M0660k11728L47870M2256l59729n7921K85370
3051A119164P3350l58716j12955K49677j04917k0017r5834j08373P5413L3682
3041G50474M4452J80581m7808j87203j10902K63419K82884N9368j36671l7764
3031A060830q9914Q0338o7914j45028k9541M4727P3048J42733k43853p6803j49416
$$ plain form
3020 599207 768874 989458 1312457 1094221 1122974 1080308 927761 956697 896399 1042150
3010 1042150 875740 944051 1097158 861124 731028 950233 956034 909250 1054469 787843
3000 787843 966454 1154028 794284 896507 833190 807768 878413 895698 857861 802488 851757
2989 851757 822359 551488 793658 935804 978432 961691 878153 789171 976949 936993 629300
2978 629300 459897 683086 672241 440815 644869 866452 850711 1079134 753178 661890
2968 661890 849443 905433 880952 828779 656418 378536 361807 448551 554299 835533 647541
2957 647541 613480 590071 689740 710752 658659 725126 1167488 1152680 841208 550224 608238
2946 608238 757320 906616 1184963 1135095 746889 750470 810885 622372 693320 677177 686016
$$ packed form
3020E99207J69667K20584L22999k18236K8753m2666j52547K8936o0298J45751
3010A042150j66410O8311J53107k36034j30096K19205N801m6784J45219k66626
3000G87843J78611J87574l59744J02223o3317k5422P0645J7285l7837n5373M9269
2989H51757k9398k70871K42170J42146M2628j6741q3538q8982J87778l9956l07693
2978F29300j69403K23189j0845k31426K04054K21583j5741K28423l25956r1288
2968F61890J87553N5990k4481n2173j72361k77882j6729Q6744J05748K81234j87992
2957F47541l4061k3409R9669K1012n2093O6467M42362j4808l11472k90984N8014
2946F08238J49082J49296K78347m9868l88206L581O0415j88513P0948j6143Q839
$$ plain form
2935 686016 447255 455500 604739 739016 500570 664960 847609 994592 708538 906046
2925 906046 749666 830959 949513 1008287 1108737 815767 462063 508942 582560 357771
2915 357771 418684 406913 757379 923842 893196 942439 1055118 912836 653402 720277 890945
2904 890945 895691 813764 1037779 890183 1008070 699714 628205 1220528 1126431 946879 1135785
2893 1135785 1093727 1050419 1265983 1025918 1098941 1262175 1366548 1218474 968571 941495
2883 941495 558751 759888 888389 792019 885131 1099454 1217723 1256408 1090273 1197218
2873 1197218 1357218 1165339 1077865 1329508 1574029 1239949 1391551 1629185 2061816 1705281
2863 1705281 1516539 1574542 1689798 1924682 1770313 1821395 1578289 1574082 1480288 1297408
$$ packed form
2935F86016k38761Q245J49239J34277k38446J64390J82649J46983k86054J97508
2925I06046j56380Q1293J18554N8774J00450k92970l53704M6879P3618k24789
2915C57771O0913j1771L50466J66463l0646M9243J12679j42282k59434O6875J70668
2904H90945M746q1927K24015j47596J17887l08356p1509N92323r4097j79552J88906
2893A135785m2058m3308K15564k40065P3023J63234J04373j48074k49903k7076
2883I41495l82744K01137J28501r6370R3112K14323J18269L8685j66135J06945
2873A197218J60000j91879q7474K51643K44521l34080J51602K37634M32631l56535
2863A705281j88742N8003J15256K34884j54369N1082k43106m207r3794j82880
$$ plain form
2853 1297408 1421224 1332853 946715 866145 1423146 1421116 1154367 1219972 851518 1256685
2843 1256685 1340168 1250509 1173422 1022147 815506 832867 593136 621102 778706 618864
2833 618864 502224 708319 906118 941320 1238739 978249 1187727 1429642 986544 625648
2823 625648 623477 716244 384856 469518 873610 728122 829520 653984 670965 543579 702694
2812 702694 684962 874813 656722 363156 461258 393297 484624 427216 697161 606797 678873
2801 678873 894676 370924 344254 335606 555590 627991 902666 780754 605492 401351
2791 401351 538144 484291 501587 638232 400756 305254 156638 463535 239282 187286
2781 187286 231673 305029 259325 226102 368503 613089 493626 307780 410205 628625
$$ packed form
2853A297408J23816q8371l86138q0570N57001k030k66749O5605l68454M05167
2843A256685Q3483q9659p7087j51275k06641J7361k39731K7966J57604j59842
2833F18864j16640K06095J97799L5202K97419k60490K09478K41915m43098l60896
2823F25648k171R2767l31388Q4662M04092j45488J01398j75536J6981j27386J59115
2812G02694j7732J89851k18091k93566R8102o7961R1327n7408K69945r0364P2076
2801F78873K15803n23752k6670q648K19984P2401K74675j21912j75262k04141
2791D01351J36793n3853J7296J36645k37476r5502j48616L06897k24253n1996
2781A87286M4387P3356m5704l3223J42401K44586j19463j85846J02425K18420
$$ plain form
2771 628625 494131 67774 284337 366379 362148 442468 107963 161612 72763 222174 304104
2760 304104 640687 630223 296956 293210 123147 143796 291217 254068 320163 479743 339875
2749 339875 246216 75828 99762 329372 319553 308951 482358 1261 -196562 215716 316558
2738 316558 525026 553877 282145 64420 328229 239479 152777 -16534 -255410 122793
2728 122793 435074 285535 119635 46296 322827 392053 204166 363907 575470 288266
2718 288266 208111 -27806 81891 422928 225950 362447 383645 512513 267827 93272
2708 93272 14091 185166 160288 132655 143691 -45760 -32041 148719 253065 126613 193402
2697 193402 137602 38986 72677 -98815 -195024 65500 206348 71212 71907 229469 147978
$$ packed form
2771F28625j34494m26357K16563Q2042m231Q0320l34505N3649q8849J49411Q1930
2760C04104L36583j0464l33267l746j70063K0649J47421l7149O6095J59580j39868
2749C39875r3659j70388K3934K29610r819j0602J73407m81097j97823M12278J00842
2738C16558K08468K8851k71732k17725K63809q8750q6702j69311k38876L78203
2728A22793L12281j49539j65900p3339K76531O9226j87887J59741K11563k87204
2718B88266q0155k35917J09697L41037j96978J36497K1198J28868k44686j74555
2708I3272p9181J71075k4878k7633J1036j89451J3719J80760J04346j26452O6789
2697A93402n5800r8616L3691j71492r6209K60524J40848j35136O95J57562q1491
$$ plain form
2686 147978 101072 399989 358102 433726 403759 203837 176732 322831 342895 427369 215557
2675 215557 501351 446435 475351 178725 -33806 367612 524676 321854 -175513 -144820
2665 -144820 163555 249164 361477 289610 76439 61619 222682 93322 -45962 76220
2655 76220 18890 226214 210563 348557 241484 -106657 92571 392141 6893 24604
2645 24604 -94789 -56860 -147737 -199978 -235209 -228686 -476836 -68334 343677 246406 184889
2634 184889 387874 48243 -176030 -25484 109063 325358 302525 108158 95382 201576
2624 201576 -87100 -161791 170430 378659 29992 150925 510418 364430 -90956 126529
2614 126529 426527 203479 256002 144829 219123 421602 562065 376518 41132 -260786
$$ packed form
2686A47978m6906K98917m1887P5624k9967j99922k7105J46099K0064Q4474k11812
2675B15557K85794n4916K8916k96626k12531M01418J57064k02822m97367L0693
2665a44820L08375Q5609J12313p1867k13171j4820J61063j29360j39284J22182
2655G6220n7330K07324j5651J37994j07073l48141J99228K99570l85248J7711
2645B4604j19393L7929r0877n2241l5231O523k48150M08502M12011r7271o1517
2634A84889K02985l39631k24273J50546J34547K16295k2833j94367j2776J06194
2624B01576k88676p4691L32221K08229l48667J20933L59493j45988m55386K17485
2614A26529K99998k23048N2523j11173P4294K02479J40463j85547l35386l01918
$$ plain form
2604 -260786 -216677 -322261 -236246 -316783 -220939 278663 418442 388874 -29537 -33670 207353
2593 207353 48241 47233 -45731 33899 149890 -148162 -240411 -415604 -240367 -193573 -28679
2582 -28679 -70158 -438698 -199433 -28536 -225574 -239461 -624271 -287753 88274 104068
2572 104068 137319 -65477 147319 351493 126889 345310 474812 180550 -94211 -169137
2562 -169137 -115754 -285152 -347117 -270635 -323933 -35091 94210 127426 123989 165187 115586
2551 115586 78318 67500 -263849 -227834 -139843 -82571 161735 61752 -57467 -196883 -20953
2540 -20953 27562 57027 -7070 -17141 15271 7971 200276 30334 5261 196257 180354
2529 180354 79332 -70410 289264 59643 -22823 -22567 -175836 -175446 -151324 -347187 -495627
$$ packed form
2604b60786M4109j05584Q6015q0537R5844M99602J39779k9568m18411m133K41023
2593B07353j59112j008r2964P9630J15991k98052r2249j75193J75237M6794J64894
2582b8679m1479l68540K39265J70897j97038j3887l84810L36518L76027J5794
2572A04068L3251k02796K12796K04174k24604K18421J29502k94262k74761p4926
2562a69137N3383j69398o1965P6482n3298K88842J29301L3216l437M1198m9601
2551A15586l7268j0818l31349L6015Q7991N7272K44306r9983j19219j39416J75930
2540b0953M8515K9465o4097j0071L2412p300J92305j69942k5073J90996j5903
2529A80354j01022j49742L59674k29621q2466K56j53269L90K4122j95863j48440
$$ plain form
2518 -495627 -263835 -367271 -428231 -186200 105818 -48102 -186485 -224716 -277010 -316945
2508 -316945 11663 53631 -67502 -154322 72630 451979 2148 54466 44046 -22021 57493
2497 57493 -34599 84864 -115456 -91590 152762 205720 255594 133546 68488 212927 16428
2486 16428 17382 -5248 31830 214149 394290 649525 446329 184506 99941 -63941 -167781
2475 -167781 -317893 -173867 55098 -285129 -170765 113677 -25686 196813 417478 392913
2465 392913 311251 331542 212947 -116678 -267612 -300293 -165056 163206 -147971 -240321
2455 -240321 -170968 -535611 -469794 -382558 -117104 -1268 -81652 126832 -148914 -55188 -71347
2444 -71347 -154781 30689 125507 104969 100662 -323206 -52797 6052 -261701 -464021 -269687
$$ packed form
2518d95627K31792j03436o0960K42031K92018j53920j38383l8231n2294l9935
2508c16945L28608M1968j21133q6820K26952L79349m49831N2318j0420o6067P9514
2497E7493r2092J19463k00320K3866K44352N2958M9874j22048o5058J44439j96499
2486A6428R54k2630L7078J82319J80141K55235k03196k61823q4565j63882j03840
2475a67781j50112J44026K28965l40227J14364K84442j39363K22499K20665k4565
2465C92913q1662K0291j18595l29625j50934l2681J35237L28262l11177r2350
2455b40321O9353l64643O5817Q7236K65454J15836q0384K08484k75746R3726j6159
2444g1347q3434J85470R4818k0538m307m23868K70409N8849k67753k02320J94334
$$ plain form
2433 -269687 4571 -225764 -257969 168900 91358 -193974 -253888 -155803 -336634 -178410
2423 -178410 105851 75844 195014 218350 150547 -61206 166006 377816 152714 -250133
2413 -250133 -347969 -73465 -321354 -200385 -137309 -310366 -84709 -459331 -458039 -259846
2403 -259846 6894 177445 153865 265624 394459 65413 -236429 -305671 -379861 -351574
2393 -351574 -421087 -507954 -592507 -467513 -423455 -395244 -413360 36389 252978 151784 414054
2382 414054 337613 40937 156464 -49382 -331372 -526892 -535835 -445826 -198338 -199460 -259619
2371 -259619 -27934 -276830 -341703 -358775 -403033 -144862 -368047 -584655 -251916 -91678
2361 -91678 17492 -189598 -6678 49450 265889 242666 346750 423763 479967 499195 402928
$$ packed form
2433b69687K74258k30335l2205M26869p7542k85332n9914R8085j80831J58224
2423a78410K84261l0007J19170K3336o7803k11753K27212K11810k25102m02847
2413b50133r7836K74504k47889J20969O3076j73057K25657l74622J292J98193
2403b59846K66740J70551k3580J11759J28835l29046l01842o9242p4190K8287
2393c51574o9513q6867q4553J24994M4058K8211j8116M49749K16589j01194K62270
2382D14054p6441k96676J15527k05846k81990j95520q943R0009K47488j122o0159
2371b59619K31685k48896o4873j7072m4258K58171k23185k16608L32739J60238
2361i1678J09170k07090J82920N6128K16439k3223J04084P7013N6204J9228r6267
$$ plain form
2350 402928 290182 276858 26431 -19210 -44155 -324986 -174293 -3266 300970 194981
2340 194981 -7528 -63634 -552385 -128032 122382 271108 276499 482363 438948 205550
2330 205550 212254 -9211 -6332 135629 83705 313086 56977 11466 -28077 22617 -121222
2319 -121222 -81448 -42790 -301332 -536308 -171595 31735 124517 -141008 -277111 -133933
2309 -133933 -156266 -178844 -203420 -183953 -206178 -68065 242426 128793 -191093 -23475 -319564
2298 -319564 17596 -165242 -266204 -256996 -326345 -430647 -336453 -286267 110904 105907 137999
2287 137999 501950 415495 224778 204532 245359 -29298 -52719 50932 128214 268319 -95622
2276 -95622 -47167 -90822 -150626 -132447 56593 65573 -92879 -455357 -310617 -1681 138572
$$ packed form
2350D02928j12746j3324k50427m5641k4945k80831J50693J71027L04236j05989
2340A94981k02509n6106m88751M24353K50414J48726N391K05864m3415k33398
2330B05550O704k21465K879J41961n1924K29381k56109m5511l9543N0694j43839
2319a21222L9774L8658k58542k34976L64713K03330R2782k65525j36103J43178
2309a33933k2333k2578k4576J9467k2225J38113L10491j13633l19886J67618k96089
2298c19564L37160j82838j00962R208o9349j04302R4194N0186L97171m997L2092
2287A37999L63951q6455j90717k0246M0827k74657k3421J03651P7282J40105l63941
2276i5622M8455m3655n9804J8179J89040Q980j58452l62478J44740L08936J40253
$$ plain form
2265 138572 54462 128529 -317166 -294752 -41873 28732 -74225 -171215 -270937 -230521 -240781
2254 -240781 -287942 -55984 229035 231454 156712 89694 50933 309846 172051 -11096 -217923
2243 -217923 -330498 -74339 -99628 -190442 -273505 -181558 293589 247075 -333 -34124 -150516
2232 -150516 -153621 -4614 201389 7336 -147970 -162377 -522534 -199349 107050 252857
2222 252857 -151610 -275997 28725 7522 -152205 -19843 -241038 -87378 92109 78595
2212 78595 192903 14022 120727 345655 493449 525707 221792 297047 146515 159287
2202 159287 338412 409421 225904 -208891 1885 229586 191160 182251 50424 236980
2192 236980 444519 171180 297192 469861 284754 121380 147947 364674 361262 132491
$$ packed form
2265A38572q4110P4067m45695K2414K52879P0605j02957r6990r9722M0416j0260
2254b40781m7161K31958K85019K419p4742o7018l8761K58913j37795j83147k06827
2243b17923j12575K56159k5289r0814q3063R1947M75147m6514k47408l3791j16392
2232a50516l105J49007K06003j94053j55306j4407l60157L23185L06399J45807
2222B52857m04467j24387L04722k1203j59727J32362k21195J53660J79487j3514
2212G8595J14308j78881J06705K24928J47794L2258l03915P5255j50532J2772
2202A59287J79125P1009j83517m34795K10776K27701l8426q909j31827J86556
2192B36980K07539k73339J26012J72669j85107j63374K6567K16727l412k28771
$$ plain form
2182 132491 261758 373471 540668 643969 609882 626059 808576 464046 452584 630966
2172 630966 648684 558076 701240 799280 746315 443226 79775 453209 663500 867318
2162 867318 563348 445064 359354 476560 687294 814041 686212 559064 948138 1112503
2152 1112503 708759 594398 493030 649461 989647 747459 763980 980228 860229 771282
2142 771282 1052929 1146907 1210239 1625705 1568351 1619268 1656356 1608288 1566234 1473527 1438135
2131 1438135 1456419 1595809 1805138 1739160 1718243 1964081 1894078 1765615 2210817 2220849
2121 2220849 2016583 2364722 2485638 2736029 2831184 2663119 2862370 3433152 3905611 3887653
2111 3887653 3943294 4124620 4411371 4681217 5164648 5941665 6155104 6757402 7424415 8006137
$$ packed form
2182A32491J29267J11713J67197J03301l4087J6177J82517l44530j1462J78382
2172F30966J7718r0608J43164R8040n2965l03089l63451L73434K10291K03818
2162H67318l03970j18284q5710J17206K10734J26747j27829j27148L89074J64365
2152A112503m03744j14361j01368J56431L40186k42188J6521K16248j19999q8947
2142G71282K81647R3978O3332M15466n7354N0917L7088m8068m2054r2707l5392
2131A438135J8284J39390K09329o5978k0917K45838p0003j28463M45202J0032
2121B220849k04266L48139J20916K50391R5155j68065J99251N70782M72459j7958
2111C887653N5641J81326K86751K69846M83431P77017K13439O02298O67013N81722
$$ plain form
2101 8006137 8827668 9416483 9907200 10694266 11986059 13074248 14075949 15811890 18467622
2092 18467622 20905506 23966844 28462592 34152343 40181657 45465777 48557878 46697288
2084 46697288 40324577 32378861 26180510 21806685 18667538 16478767 14521543 13095637
2076 13095637 12018251 11315533 10481575 9887146 9468958 8854499 8545272 7826307 6961015
2067 6961015 6507336 6251163 5640969 5309382 5110420 5146040 4748517 4281846 4322323 4342717
2057 4342717 3752344 3369073 3573334 3085258 3041540 2861155 2608784 2465770 2640870 2867919
2047 2867919 2424197 2586837 2469710 2380756 2165617 2070022 1973563 2071364 2052852 1805605
2037 1805605 1722948 1660030 1754299 1450799 1499172 1493188 1384243 1383648 1569662 1469384 1068181
$$ packed form
2101H006137Q21531N88815M90717P87066J291793J088189J001701J735941K655732
2092A8467622K437884L061338M495748N689751O029314N284120L092101j860590
2084D6697288o372711p945716o198351m373825l139147k188771j957224j425906
2076A3095637j077386p02718q33958n94429m18188o14459l09227p18965q65292
2067F961015m53679k56173o10194l31587j98962L5620l97523m66671M0477K0394
2057D342717n90373l83271K04261m88076m3718j80385k52371j43014J75100K27049
2047B867919m43722J62640j17127q8954k15139r5595r6459R7801j8512k47247
2037A805605q2657o2918R4269l03500M8373n984j08945n95J86014j00278m01203
$$ plain form
2026 1068181 1232203 1528834 1246364 1237652 1089119 880352 1040878 1384726 1620195 955488
2016 955488 960822 1031620 788812 822370 894094 1211742 1221783 810824 789366 871377 1039023
2005 1039023 875627 853725 997576 1213879 800684 764310 895999 705448 843941 661136
1995 661136 627387 468800 517601 483305 575752 376541 465946 883742 911301 515442 230968
1984 230968 318036 566661 672710 789563 528605 395723 385102 324449 745916 419385
1974 419385 141053 116796 -96363 108621 -15460 173348 518095 339405 186744 377143
1964 377143 123851 149417 373573 473654 237835 418096 603612 471013 582709 779572
1954 779572 468187 33825 174396 182441 254290 544947 293745 178468 488724 347681
$$ packed form
2026A068181J64022K96631k82470q712j48533k08767J60526L43848K35469o64707
2016I55488N334P0798k42808L3558P1724L17648J0041m10959k1458Q2011J67646
2005A039023j63396k1902J43851K16303m13195l6374J31689j90551J38493j82805
1995F61136l3749j58587M8801l4296R2447j99211Q9405M17796K7559l95859k84474
1984B30968Q7068K48625J06049J16853k60958j32882j0621o0653M21467l26531
1974D19385k78332k4257k13159K04984j24081J88808L44747j78690j52661J90399
1964C77143k53292K5566K24156J00081k35819J80261J85516j32599J11696J96863
1954G79572l11385m34362J40571Q045P1849K90657k51202j15277L10256j41043
$$ plain form
1944 347681 241486 455551 640531 138303 441338 485424 296385 378492 264170 301724
1934 301724 377200 201307 57091 181613 29491 -213498 181567 399687 201817 459886
1924 459886 375050 195317 418330 228880 -352 14079 -58982 384905 195476 349725
1914 349725 424847 318661 447040 148809 89820 13130 -144299 -3668 324879 259539
1904 259539 110442 30727 -186035 178838 474879 128437 298844 354131 666583 532455
1894 532455 275094 339939 332953 4775 -11049 -38944 217379 28451 37364 -26018 -269944
1883 -269944 -182915 -283924 39097 23931 -312246 -43546 -210353 -228347 197404 -209575
1873 -209575 -402310 -139585 -138301 -280971 -120330 -68840 -80140 -53074 118849 75490 -218989
$$ packed form
1944C47681j06195K14065J84980n02228L03035M4086j89039Q2107j14322L7554
1934C01724P5476j75893j44216J24522j52122k42989L95065K18120j97870K58069
1924D59886q4836j79733K23013j89450k29232J4431p3061M43887j89429J54249
1914C49725P5122j06186J28379k98231n8989p6690j57429J40631L28547o5340
1904B59539j49097p9715k16762L64873K96041l46442J70407N5287L12452j34128
1894E32455k57361O4845o986l28178j5824k7895K56323j88928Q913o3382k43926
1883b69944Q7029j01009L23021j5166l36177K68700j66807j7994M25751m06979
1873b09575j92735K62725J284j42670J60641N1490j1300K7066J71923m3359k94479
$$ plain form
1862 -218989 -41964 44434 242750 514450 163079 158898 -202369 -122236 -172667 -205726 -57319
$$ packed form
1862b18989J77025Q6398J98316K71700l51371m181l61267Q0133n0431l3059J48407
$$ [...]
##END NTUPLES=NMR SPECTRUM
##END=
