##TITLE=1H_CA-9013-1
 DMSO
 8 sc, 
 31.05.2022
##JCAMPDX= 6.0         $$ Bruker NMR JCAMP-DX V2.0
##DATA TYPE= NMR SPECTRUM
##DATA CLASS= NTUPLES
##ORIGIN= UXNMR, Bruker Analytische Messtechnik GmbH
##OWNER= root
$$ XWIN-NMR		Version 3.5
$$ Wed Jun  1 14:22:35 2022 Russian Standard Time (UT+4h)  she@DPX200
##.OBSERVE FREQUENCY= 200.13135
##.OBSERVE NUCLEUS= ^1H
##.ACQUISITION MODE= SIMULTANEOUS
##.ACQUISITION SCHEME= undefined
##.AVERAGES= 8
##.DIGITISER RES= 18
##SPECTROMETER/DATA SYSTEM= spect
##.PULSE SEQUENCE= zg30
##.SOLVENT NAME= DMSO
##.SHIFT REFERENCE= (INTERNAL, DMSO, 0, 15.7546)
##AUDIT TRAIL= $$ (NUMBER, WHEN, WHO, WHERE, WHAT)
$$ ##TITLE= Audit trail, XWIN-NMR		Version 3.5
$$ ##JCAMPDX= 5.01
$$ ##ORIGIN= Bruker BioSpin GmbH
$$ ##OWNER= she
$$ F:/spectra/data/she/nmr/H-F/1/pdata/1/auditp.txt
$$ ##AUDIT TRAIL=  $$ (NUMBER, WHEN, WHO, WHERE, WHAT)
(   1,<2022-06-01 14:21:01.98 +0400>,<she>,<DPX200>,
      <created by zg, POWCHK disabled, PULCHK disabled
       configuration hash MD5:
       00 E9 B6 7A A2 85 ED C7 34 08 36 98 17 FE 4E 26
       data hash MD5: 16K
       4F 34 B8 C5 45 D0 55 3B 4A 88 64 5C 9B 92 88 51>)
(   2,<2022-06-01 14:21:08.01 +0400>,<she>,<DPX200>,
      <Start of raw data processing
       efp BC_mod = 2 LB = 0.24 FT_mod = 6 PKNL = 1 PHC0 = -18040.31 PHC1 = 15.40074 SI = 16K 
       data hash MD5: 16K
       F5 CF FC 9F 86 6B 33 2F 11 35 29 EE 02 BC F9 1C>)
(   3,<2022-06-01 14:21:45.43 +0400>,<she>,<DPX200>,
      <pk PHC0 = 0.8037009 PHC1 = -4.2 
       data hash MD5: 16K
       6E 3E 54 D7 37 78 48 E8 CF 52 7F 44 6E 4D D0 9E>)
(   4,<2022-06-01 14:21:49.70 +0400>,<she>,<DPX200>,
      <abs ABSG = 5 
       data hash MD5: 16K
       A2 A2 9D 46 97 D7 5C E6 BC 55 F8 AC E4 9A 34 9F>)
$$ ##END=
$$ 
$$ hash MD5
$$ FE 2A F8 78 CB 1D B4 75 7B B2 95 FF 2C 17 64 0E
##$RELAX= 
##$RELAX= 
##$RELAX= 
##$RELAX= 
##$RELAX= 
##$RELAX= 
$$ Bruker specific parameters
$$ --------------------------
##$DU= <F:/spectra>
##$EXPNO= 1
##$NAME= <H-F>
##$PROCNO= 1
##$TYPE= <nmr>
##$USER= <she>
##$AMP= (0..31)
100 100 100 100 100 100 100 100 100 100 100 100 100 100 100 100 100 100 
100 100 100 100 100 100 100 100 100 100 100 100 100 100 
##$AQSEQ= 0
##$AQ_mod= 1
##$AUNM= <au_zg>
##$AUTOPOS= <>
##$BF1= 200.13
##$BF2= 200.13
##$BF3= 200.13
##$BF4= 200.13
##$BF5= 200.13
##$BF6= 200.13
##$BF7= 200.13
##$BF8= 200.13
##$BYTORDA= 1
##$CFDGTYP= 0
##$CFRGTYP= 5
##$CHEMSTR= <none>
##$CNST= (0..31)
1 1 145 1 1 1 1 1 1 1 1 1 1 1 1 1 1 1 1 1 1 1 1 1 1 1 1 1 1 1 1 1 
##$CPDPRG= <>
##$CPDPRG1= <>
##$CPDPRG2= <>
##$CPDPRG3= <>
##$CPDPRG4= <mlev>
##$CPDPRG5= <mlev>
##$CPDPRG6= <mlev>
##$CPDPRG7= <mlev>
##$CPDPRG8= <mlev>
##$CPDPRGB= <>
##$CPDPRGT= <>
##$D= (0..31)
0 1.2 0 0 0 0 0 0 0 0.06 0 0.03 0 0 0 0 0.0002 0 0 0 0 0 0 0 0 0 0 0 0 
0 0 0 
##$DATE= 1654078861
##$DBL= (0..7)
120 120 120 120 120 120 120 120 
##$DBP= (0..7)
150 150 150 150 150 150 150 150 
##$DBP07= 0
##$DBPNAM0= <>
##$DBPNAM1= <>
##$DBPNAM2= <>
##$DBPNAM3= <>
##$DBPNAM4= <>
$$ [...]
##$SUBNAM2= <"">
##$SUBNAM3= <"">
##$SUBNAM4= <"">
##$SUBNAM5= <"">
##$SUBNAM6= <"">
##$SUBNAM7= <"">
##$SUBNAM8= <"">
##$SUBNAM9= <"">
##$SW= 18.05172834244
##$SWIBOX= (0..15)
0 0 2 0 0 0 0 0 0 0 0 0 0 0 0 0 
##$SW_h= 3612.71676300578
##$TD= 16384
##$TD0= 1
##$TE= 0
##$TE2= 300
##$TE3= 300
##$TEG= 300
##$TL= (0..7)
0 120 120 120 120 120 120 120 
##$TP= (0..7)
150 150 150 150 150 150 150 150 
##$TP07= 0
##$TPNAME0= <>
##$TPNAME1= <>
##$TPNAME2= <>
##$TPNAME3= <>
##$TPNAME4= <>
##$TPNAME5= <>
##$TPNAME6= <>
##$TPNAME7= <>
##$TPOAL= (0..7)
0.5 0.5 0.5 0.5 0.5 0.5 0.5 0.5 
##$TPOFFS= (0..7)
0 0 0 0 0 0 0 0 
##$TUNHIN= 0
##$TUNHOUT= 0
##$TUNXOUT= 0
##$USERA1= <user>
##$USERA2= <user>
##$USERA3= <user>
##$USERA4= <user>
##$USERA5= <user>
##$V9= 5
##$VALIST= <valist>
##$VCLIST= <CCCCCCCCCCCCCCC>
##$VD= 0
##$VDLIST= <DDDDDDDDDDDDDDD>
##$VPLIST= <PPPPPPPPPPPPPPP>
##$VTLIST= <TTTTTTTTTTTTTTT>
##$WBST= 1024
##$WBSW= 4
##$XGAIN= (0..3)
0 0 0 0 
##$XL= 0
##$YL= 0
##$YMAX_a= 352445
##$YMIN_a= -512450
##$ZGOPTNS= <>
##$ZL1= 120
##$ZL2= 120
##$ZL3= 120
##$ZL4= 120
##$ABSF1= 15.73147
##$ABSF2= -2.320379
##$ABSG= 5
##$ABSL= 3
##$ALPHA= 0
##$AQORDER= 0
##$ASSFAC= 0
##$ASSFACI= 0
##$ASSFACX= 0
##$ASSWID= 0
##$AUNMP= <proc_1d>
##$AZFE= 0.1
##$AZFW= 0.1
##$BCFW= 0
##$BC_mod= 2
##$BYTORDP= 0
##$COROFFS= 0
##$CY= -3
##$DATMOD= 1
##$DC= 0
##$DFILT= <>
##$DTYPP= 0
##$F1P= 0
##$F2P= 0
##$FCOR= 1
##$FTSIZE= 16384
##$FT_mod= 6
##$GAMMA= 0
##$GB= 0
##$INTBC= 1
##$INTSCL= 0
##$ISEN= 128
##$LB= 0.24
##$LEV0= 0
##$LPBIN= 0
##$MAXI= 10000
##$MC2= 0
##$MEAN= 0
##$ME_mod= 0
##$MI= 1.114404
##$NCOEF= 0
##$NC_proc= -5
##$NLEV= 6
##$NOISF1= 3.799351
##$NOISF2= 2.8
##$NSP= 0
##$NTH_PI= 0
##$NZP= 0
##$OFFSET= 15.7546
##$PC= 1
##$PHC0= -18039.51
##$PHC1= 11.20074
##$PH_mod= 1
##$PKNL= yes
##$PPARMOD= 0
##$PSCAL= 0
##$PSIGN= 0
##$REVERSE= no
##$SF= 200.130003390436
##$SI= 16384
##$SIGF1= 3
##$SIGF2= 2
##$SINO= 5.538805
##$SIOLD= 16384
##$SREGLST= <1H.CDCl3>
##$SSB= 0
##$STSI= 16384
##$STSR= 0
##$SW_p= 3612.71676300578
##$SYMM= 0
##$S_DEV= 0
##$TDeff= 16384
##$TDoff= 0
##$TI= <>
##$TILT= no
##$TM1= 0
##$TM2= 0
##$TOPLEV= 0
##$USERP1= <user>
##$USERP2= <user>
##$USERP3= <user>
##$USERP4= <user>
##$USERP5= <user>
##$WDW= 1
##$XDIM= 16384
##$YMAX_p= 290459050
##$YMIN_p= -202906
$$ End of Bruker specific parameters
$$ ---------------------------------
##NTUPLES= NMR SPECTRUM
##VAR_NAME=  FREQUENCY,     SPECTRUM/REAL,   SPECTRUM/IMAG
##SYMBOL=    X,             R,               I
##VAR_TYPE=  INDEPENDENT,   DEPENDENT,       DEPENDENT
##VAR_FORM=  AFFN,          ASDF,            ASDF
##VAR_DIM=   16384,         16384,           16384
##UNITS=     HZ,            ARBITRARY UNITS, ARBITRARY UNITS
##FACTOR=    0.220516191357247, 1,           1
##FIRST=     3152.96806560483, 0,            0
##LAST=      -459.748697400953, 0,           0
##MIN=       -459.748697400953, -202906,     0
##MAX=       3152.96806560483, 290459050,    0
$$ Real data points
##PAGE= N=1
##DATA TABLE= (X++(R..R)), XYDATA
$$ [...]
8500g7448k922L6766O5947l7282n9627j6823N4593K0623N3607M755l8087R79m2349
$$ -77448 -80370 -43604 22343 -14939 -74566 -91389 -36796 -16173 37434 42189 4102 5081 -37268
8487c7268j1667M8222k6093k6198P4498P2230l523p8135Q47O947q7092J0757L8998
$$ -37268 -48935 -713 -26806 -53004 21494 93724 90201 12066 12913 19860 -67232 -56475 -17477
8474a7477l6148j1475M2356k6802O5269l00n9341l6104R0369K8272n9140J2552
$$ -17477 -53625 -65100 -22744 -49546 15723 15423 -43918 -80022 10347 38619 -20521 -7969
8462g969n8264P4258k7687j6450M2432J1152o7459O8528j30605N7640R0182m3868
$$ -7969 -66233 8025 -19662 -36112 6320 17472 -49987 18541 -112064 -54424 35758 -8110
8450h110k0514N0472L3111m3468o898m1008K5509l8108J5665p219O1242r9270
$$ -8110 -28624 21848 54959 11491 4593 -36415 -10906 -49014 -33349 -40568 20674 -78596
8438g8596L51J34393j1074K1872j03014K7935P1909n467L5430n5488l1044K6014
$$ -78596 -78245 56148 45074 66946 -36068 -8133 63776 58309 93739 38251 7207 33221
8426C3221N4405k7592o706n082J05619k9465m4969P913R260J05860j05741o9771
$$ 33221 87626 60034 53328 48246 153865 124400 79431 87344 96604 202464 96723 26952
8414B6952N1472J0748p7048R521L9571J7922l4648l1050K5169J8610L5538l289
$$ 26952 78424 89172 12124 21645 61216 79138 44490 13440 38609 57219 92757 89468
8402H9468o2649K1931J6446j0346k1832q8962K6233M9630R957N5882k8859O450
$$ 89468 26819 48750 65196 54850 33018 -55944 -29711 19919 29876 85758 56899 63349
8390F3349K7333j4705k121Q2211j8460o6284o049J14010O3407k9030j8905J9185
$$ 63349 90682 75977 73856 156067 137607 71323 65274 179284 242691 213661 194756 213941
8378B13941k9590N2926m813p8460L3132o5464o0456M0431k921o4739P8717n449
$$ 213941 184351 237277 232464 154004 187136 121672 61216 101647 98726 33987 112704 107255
8366A07255m8987O7735O1322l6120p1578j2939m0594K2162O12j0447K8955l2088
$$ 107255 58268 126003 187325 151205 79627 66688 26094 48256 48868 38421 67376 35288
8354C5288J09488K0183r9757j1042j7942k4328J9276j9709J5378Q550M8489K8775
$$ 35288 144776 164959 65202 54160 36218 11890 31166 11457 26835 35385 83874 112649
8342A12649o579l8888k537p2706O7246L8421j9970N869k1245N3760p487K8883
$$ 112649 106070 67182 64645 -8061 59185 97606 77636 83505 62260 116020 108533 137416
8330A37416q2221J5045K4671p1878R5488n204n1791k5910N939q491p606o7569
$$ 137416 55195 70240 94911 23033 118521 113317 61526 35616 41555 33064 25458 -42111
8318d2111k4867L8084R9465p758o7217K3000Q9165o1122j10697N6394n5077M7905
$$ -42111 -66978 -28894 70571 62813 -4404 18596 107761 46639 -64058 -7664 -62741 -14836
8306a4836k4597l5433Q4733j7440J164k5685M0196k0545l9288k1939j5342M9389
$$ -14836 -39433 -74866 9867 -7573 -6409 -32094 8102 -12443 -51731 -73670 -89012 -39623
8294c9623P916P995Q9973j6440j31424O650L7244O4338o4627p4686O3113P2115
$$ -39623 -31707 -23712 66261 49821 -81603 -74953 -37709 26629 -37998 -112684 -49571 22544
8282B2544q1453J4756n16N79j5500K3927Q783O1671o3159o1095l6651O2911j304
$$ 22544 -58909 -44153 -44669 -44090 -59590 -35663 -26880 34791 -28368 -89463 -126114 -63203 -64507
8269f4507N0414k5930m7234J7240J7917Q539J3912M5856o0737J8348K1708n918
$$ -64507 -14093 -40023 -87257 -70017 -52100 -43561 -29649 16207 -44530 -26182 -4474 -10392
8257a0392j0690L2785j4596j1591K5976L503p7529M8509M1262K6814l8337K5690
$$ -10392 -21082 11703 -2893 -14484 11492 14995 -62534 -14025 27237 54051 15714 41404
8245D1404k4905K5192k786Q857r7469n2635k2932Q1697J3475k7026N166m7117
$$ 41404 16499 41691 38905 47762 -49707 -102342 -125274 -43577 -30102 -57128 -51962 -99079
8233i9079Q5505j0316M1033J4781j8422m7914L327O2315k8440k4510M1952m9018
$$ -99079 -13574 -23890 17143 31924 13502 -34412 -31085 31230 2790 -21720 20232 -28786
8221b8786o9873K7656L857L6650m6249K7369m0435q730k564R139P3623J0570k9361
$$ -28786 -98659 -71003 -67146 -30496 -76745 -49376 -89811 -98541 -101105 -91966 -18343 -7773 -37134
8208c7134l8661n439P4124p894l06j4011k1863K3745l741r3212O5312Q6862p3858
$$ -37134 -75795 -81234 -7110 -15004 -15310 -29321 -51184 -27439 -31180 -124392 -59080 27782 -46076
8195d6076L3989p6718M9843j63944O8322K4268P1587M0926k5068k4603P399Q4793
$$ -46076 -12087 -88805 -38962 -202906 -134584 -110316 -38729 2197 -22871 -47474 -40075 44718
8183D4718o2204r2043P4305N2133J1903p3510n9905l0554J8946r936l3065j7331
$$ 44718 -17486 -109529 -35224 16909 28812 -44698 -104603 -135157 -116211 -126147 -159212 -176543
8171a76543K6650K4549K7213R7507j4817p462j09764M5123L8279m3605p1822Q4862
$$ -176543 -149893 -125344 -98131 -624 -15441 -22903 -132667 -87544 -49265 -92870 -164692 -79830
8159g9830n2128k8372O8542N3218J3860k8280J5891N8362J2791p674m5308k1325
$$ -79830 -131958 -160330 -91788 -38570 -24710 -52990 -37099 21263 34054 26380 -18928 -40253
8147d0253N1648q023L4639J4510l8849J4709M475p3725j6508k5203k8242L9769
$$ -40253 11395 3372 38011 52521 13672 28381 32856 -40869 -57377 -82580 -110822 -71053
8135g1053N0851L9929j7383L0782K1755J190j7583J0924N3236j5941r3278Q885
$$ -71053 -20202 19727 2344 33126 54881 56071 38488 49412 102648 86707 -6571 2314
8123B314J6982l865n8149O6242L8270n2822J458K6511L4643k1680o8756l0032
$$ 2314 19296 15431 -42718 23524 61794 8972 10430 36941 71584 49904 -18852 -48884
8111d8884o707j8605j1508o683P7435R4969l9237J057j0586J1425j123J3884O0638
$$ -48884 -55591 -74196 -85704 -92387 -14952 80017 40780 41837 31251 42676 41553 55437 116075
8098A16075l4229k5395n4838J5868o4370L6255J0267j8586J2882K0645l1995o415
$$ 116075 81846 56451 1613 17481 -46889 -10634 -367 -18953 -6071 14574 -17421 -23836
8086b3836J03924n7760l4060M7252j8137K6541p0807l5820j1722N0940K2013p810
$$ -23836 80088 22328 -11732 35520 17383 43924 -26883 -62703 -74425 -23485 -1472 -9282
8074i282j0458j7793K8530O8708p6947l1074M6012K4492k5827q3041O7225M0976
$$ -9282 -19740 -37533 -9003 59705 -17242 -48316 -2304 22188 -3639 -86680 -19455 21521
8062B1521P577q7946O9483J5922m6673m477j0562O5150O1026m697J7330N0932
$$ 21521 29098 -58848 10635 26557 -20116 -24593 -35155 29995 91021 86324 103654 154586
8050A54586R543o3241p4616N1180N1618j5985j2504j8265j8357K5741M629j2512
$$ 154586 164129 100888 26272 77452 129070 113085 100581 82316 63959 89700 94329 81817
8038H1817L9911J327M1056m555J6758l9682j2135J4233j02215J2048M1520l8982
$$ 81817 121728 123055 164111 159556 176314 136632 124497 138730 36515 48563 90083 51101
8026E1101j01158P5299M405J7386K1015j1813n5995R228P7962N9167l9165r069
$$ 51101 -50057 25242 29647 47033 68048 56235 240 9468 87430 146597 107432 98363
8014I8363q9007r2876Q7225q82p42L1918K4284L062m4641n894m4968n7430O0352
$$ 98363 9356 -83520 3705 2823 2081 33999 58283 61345 16704 10810 -34158 -91588 -31236
8001c1236O1675K7430n1482m9041M7791L6693l0691J9798l902K0984k3537O1174
$$ -31236 30439 57869 6387 -42654 5137 41830 11139 30937 27035 48019 24482 85656
7989H5656L7052j14966j09426J7777K0024K9208M752l5815N3250k8166J5681N5556
$$ 85656 122708 7742 -101684 -83907 -63883 -34675 -29923 -65738 -12488 -40654 -24973 30583
7977C0583o4949k8177M5540L9840n4991m2429J5812Q9688M8406p2864n9162N865
$$ 30583 -34366 -62543 -17003 22837 -32154 -74583 -58771 30917 79323 6459 -52703 -46838
7965d6838L4809M4491P035l7868k5479K3239L0361m123j213Q578J5388l9009m4410
$$ -46838 -12029 32462 39497 1629 -23850 -611 29750 25627 24414 32992 48380 9371 -35039
7952c5039M0488p24k7136O982L8131J0478m2338K7213P3364k5348m7693k3618
$$ -35039 5449 4725 -22411 -15429 22702 33180 -9158 18055 91419 66071 18378 -5240
7940e240j15273N5611L7659M9617N31q152j6010l7831R891n2528J0664M3148L1065
$$ -5240 -120513 -64902 -27243 22374 22905 14753 -1257 -39088 -29197 -81725 -71061 -27913 3152
7927C152l5072l0139L6081N3137m0048n885p153L730R048N3329r3205j0460L4078
$$ 3152 -31920 -62059 -25978 27159 -12889 -18774 -25927 -22197 -13149 40180 -53025 -63485 -29407
7914b9407m2821j4974l3404M2455P1176K2677J1261k1418l9431m7200M8049N0029
$$ -29407 -72228 -87202 -120606 -78151 -6975 15702 26963 5545 -33886 -81086 -33037 16992
7902A6992o343J8515L9183m6394L4269r0207j8438R0997j9800J3108J7470J9813
$$ 16992 10649 29164 68347 21953 56222 -33985 -52423 38574 18774 31882 49352 69165
7890F9165l7811k9628l5725P5856k2977m1475j2537j5864l3371L3218J7566J0830
$$ 69165 31354 1726 -33999 41857 18880 -22595 -35132 -50996 -84367 -51149 -33583 -22753
7878b2753k380J1142P062J22853q277j38132m1281K4876j2078P2617O6434o4989
$$ -22753 -25133 -13991 -6929 115924 107647 -30485 -71766 -46890 -58968 13649 80083 15094
7866A5094m4017L2023L2874P2264n3301k5091K6623L585M5005m0574m2495n415
$$ 15094 -28923 3100 35974 108238 54937 29846 56469 60054 105059 64485 21990 16575
7854A6575L3902l1508N2547n651J794p0343k1077K6570j6034R5928l1683J8828
$$ 16575 50477 18969 71516 65865 67659 -2684 -23761 2809 -13225 82703 51020 69848
7842F9848r129m5047j6350N8185M4115j5025O442M481o8752R7l5686N293O5982
$$ 69848 60719 15672 -678 57507 101622 86597 93039 97520 28768 28865 -6821 -1528 64454
7829F4454k3641m5863q745L6704L1919J2511j8454k5935K0679j5219k58k9144
$$ 64454 40813 -5050 -13795 22909 54828 67339 48885 22950 43629 28410 28152 -992
7817i92l481J01038l145L5939l0602p882J9113k2646m6650j0941K3198K8480L2729
$$ -992 -4473 96565 93420 129359 98757 90875 109988 87342 40692 29751 52949 81429 114158
7804A14158L7314P831l0099j3357k1071N5057P717j02146L1536N0281J8541q2730
$$ 114158 151472 159303 129204 115847 94776 149833 157550 55404 86940 137221 155762 73032
7792G3032Q775N8379M8345p5477M0940k9323j03382L5087k9606N4348J157m5667
$$ 73032 81807 140186 188531 113054 153994 124671 21289 56376 26770 81118 82275 36608
7780C6608P6807K3192j4294l0070j357N0560k7531j0433O0787K4987L6993m2834
$$ 36608 113415 136607 122313 92243 90886 141446 113915 103482 164269 189256 226249 183415
7768A83415J0639J1368m0246j3930k5663j815M0437K0154m635l8948J839M2754
$$ 183415 194054 205422 165176 151246 125583 123768 164205 184359 179724 140776 142615 185369
7756A85369l5164J8862K1512m9386M0237m7027k7418J4666R1270N3018Q731o5637
$$ 185369 150205 169067 190579 141193 181430 134403 106985 121651 212921 265939 274670 209033
7744B09033o1207O3342J4726k5872m589Q8651o2040O963k9722L642O702m1259
$$ 209033 147826 211168 225894 200022 195433 284084 222044 229007 199285 202927 209629 168370
7732A68370L3053N7970j2826k5984J3078L8115j6316J2426O9997l8869k6008M4649
$$ 168370 201423 259393 246567 220583 233661 271776 255460 267886 337883 299014 273006 317655
7720C17655l3456j9632J7574J0136J048l1439r487L5804L8698J9995j9084M9101
$$ 317655 284199 264567 282141 292277 293325 261886 252399 288203 326901 346896 327812 376913
7708C76913m7465M6849K1360M8953k4188n758J5365L5019j7595n2567L1153L2548
$$ 376913 329448 376297 397657 446610 422422 416664 432029 467048 449453 396886 428039 460587
7696D60587L688j15308K95O8570J5232M3954k3928k5076N9273K7645p9917J5090
$$ 460587 464275 348967 349262 417832 433064 477018 453090 428014 487287 514932 435015 450105
7684D50105J18182J9182k3598k1018J1101J6709j5170L5973L0145j0991K5457
$$ 450105 568287 587469 563871 542853 553954 570663 555493 591466 621611 610620 636077
7673F36077K4373O926Q2273K9429q590m42J3171K6885J0010l992J3376R3063J9652
$$ 636077 660450 667376 749649 779078 770488 770046 783217 810102 820112 816120 829496 922559 942211
7660I42211P6821n2444M0721K2852Q8562L4127p0707q192Q7407M6121M1219P6077
$$ 942211 1019032 966588 1007309 1030161 1118723 1152850 1082143 1073951 1161358 1207479 1248698 1324775
7648A324775R70L5660K3426J4756m8800R5332L0913O6822j476m1307J44339R7949
$$ 1324775 1325745 1361405 1384831 1399587 1350787 1446119 1477032 1543854 1542378 1501071 1645410 1743359
7636A743359j2999J0154R6673O1672P9128M4903R2078L5773M3274M7659R0537
$$ 1743359 1730360 1740514 1837187 1898859 1977987 2022890 2114968 2150741 2194015 2241674 2332211
7625B332211J07826N4730R1703J13771k9994J18247J21248J28743R7351Q2699
$$ 2332211 2440037 2494767 2586470 2700241 2670247 2788494 2909742 3038485 3135836 3218535
7615C218535N4310J08907J57690J33438J66951J70500J41769J46312K26319K56039
$$ 3218535 3272845 3381752 3539442 3672880 3839831 4010331 4152100 4298412 4524731 4780770
7605D780770K96370K41503K18595L57002L45399L25389M07534M29315N03162M73534
$$ 4780770 5077140 5318643 5537238 5894240 6239639 6565028 6972562 7401877 7905039 8378573
7595H378573O84273O23636O51015P99127Q98149R73349J001280R87890R99015
$$ 8378573 9062846 9686482 10337497 11136624 12034773 13008122 14009402 14997292 15996307
7586A5996307J093292J121341R23046P76208M39568K0960l38086m67679o21762
$$ 15996307 17089599 18210940 19133986 19910194 20349762 20370722 20032636 19564957 18943195
7577A8943195q27881p14271n75935m02392l21823j85943l2569R6666K20288L59300
$$ 18943195 18115314 17401043 16825108 16422716 16100893 15914950 15882381 15979047 16199335 16558635
7567A6558635M77709M62596N31599O83066O43807M63530J65651j1120l30815p51719
$$ 16558635 17036344 17498940 18030539 18713605 19357412 19820942 19986593 19975473 19644658 18892939
7557A8892939j055271j242936j289813j284081j153321j142512j066540q05922
$$ 18892939 17837668 16594732 15304919 14020838 12867517 11725005 10658465 9852543
7549I852543q08794o28263o05233o09096m51441l45685l98438l68311k05652l38316
$$ 9852543 9043749 8415486 7810253 7201157 6749716 6404031 6005593 5637282 5431630 5093314
7539E093314k99366k76606k04885k06745j63527k20557j56655j40600q7451j50211
$$ 5093314 4793948 4517342 4312457 4105712 3942185 3721628 3564973 3424373 3336922 3186711
7529C186711j86155p1790j92074q2628k6069j05302k6932j41346j20901J3609
$$ 3186711 3000556 2928766 2736692 2654064 2627995 2522693 2495761 2354415 2233514 2247123
7519B247123j29304m2266n5124r4320J8982n6083o8220n4589l3995o9459j37826
$$ 2247123 2117819 2075553 2020429 1926109 1945091 1889008 1820788 1766199 1732204 1662745 1524919
7508A524919q4594M2067p1535k7026p9367J9489N8595j79358o459o0388l4002
$$ 1524919 1440325 1482392 1410857 1383831 1304464 1323953 1382548 1203190 1196731 1136343 1102341
7497A102341R723k4693k7133K5319k6227k8886K5755q4910p1141k4798k8211J1178
$$ 1102341 1112064 1087371 1060238 1085557 1059330 1030444 1056199 971289 900148 875350 847139 858317
7485H58317J8401n3115o7675p8978M5132M8243n5873K0993k3765r0144l1119j9937
$$ 858317 876718 823603 755928 676950 722082 770325 714452 735445 711680 621536 590417 570480
7473E70480R615l664J5163n380M6338o4346n1917l2034O399Q662l6118n6818m14
$$ 570480 580095 576431 591594 586214 632552 568206 516289 484255 490654 499316 463198 406380 405966
7460D05966k6017M1536M6761l0346j1095J1248K4995j8926k7650o7521k1097J5153
$$ 405966 379949 421485 468246 437900 426805 438053 463048 444122 416472 348951 327854 343007
7448C43007j5210q349N4702o6708P9429o3240N5476p918n4161l2466L4987O8194
$$ 343007 327797 319448 374150 307442 386871 323631 379107 371189 317028 284562 319549 387743
7436C87743q937J5415o0894m3457L9820p03P119p1344J0826J0079M948n6892K602
$$ 387743 378806 394221 333327 289870 329690 328987 336106 264762 275588 285667 290615 233723 236325
7423B36325K1534o7576N9224o4478N0495L3935p2405J3601L847m0577O4784Q0924
$$ 236325 257859 190283 249507 185029 235524 269459 197054 210655 214502 173925 238709 319633
7411C19633n7847o7055p5018N8490P708k0683L8949J5352k6188l8707j1937k3621
$$ 319633 261786 194731 119713 178203 185911 165228 204177 219529 193341 154634 142697 119076
7399A19076M094K7719J133q6442N3477L5435L7531O1187r8382l5702m676L8271
$$ 119076 123170 150889 152022 65580 119057 154492 192023 253210 154828 119126 114450 152721
7387A52721M5311n6701j7407K3842j91k0639k3562j4119L5520L7486J4388m0293
$$ 152721 198032 141331 123924 147766 147575 126936 103374 89255 124775 162261 176649 136356
7375A36356o1392r368N2850n4948L7191M0874j0252p0769J0625L4258l0333O3998
$$ 136356 74964 65596 118446 63498 100689 141563 131311 60542 71167 105425 75092 139090
7363A39090p827p6609L2998l9576l285J23205j0281l7533L3241l9595j9177j6171
$$ 139090 131263 54654 87652 48076 44791 167996 157715 120182 153423 113828 94651 78480
7351G8480l505n8202K3928N8562K8093L0098P618j5484n8259L1168o56p2622M7583
$$ 78480 74975 16773 40701 99263 127356 157454 165072 149588 91329 122497 121841 49219 96802
7338I6802R8788p3725K6778m3371K9303j8209n6697k5972l2426O8532l2043l8700
$$ 96802 195590 121865 148643 105272 134575 116366 59669 33697 1271 69803 37760 -940
7326i40L949J19662k4281n7281K1658L558J441n4655l5568L7695J7522p738j06221
$$ -940 3009 122671 98390 41109 62767 66325 67766 13111 -22457 15238 32760 25022 -81199
7313h1199p819M5762J1716K6778J6999P9025k4060n4357l002n2071O9681J7751
$$ -81199 -89018 -43256 -31540 -4762 12237 91262 67202 12845 9843 -42228 27453 45204
7301D5204K4491m5092L0804K413q605l6110R898J5341M845K111m5416L6722K0167
$$ 45204 69695 24603 55407 57820 49215 13105 23003 38344 43189 45300 -116 36606 56773
7288E6773J1010r5729n2035J3937N5051N3972k857k8890n0749K7621O9802p6157
$$ 56773 67783 -27946 -79981 -66044 -10993 42979 40122 11232 -39517 -11896 57906 -18251
7276a8251r393K2404N127m692N4683J8725k8467j6619o3325M8492P3108k3283
$$ -18251 -27644 -5240 -113 -4805 49878 68603 40136 23517 -39808 8684 81792 58509
7264E8509p523J7099k4116J3719p00o3550j312N1447K0991j8077R16L5451l2229
$$ 58509 50986 68085 43969 57688 56988 -6562 -7874 43573 64564 46487 47403 82854 50625
7251E0625k0895k2878n3050L2014O3487K9855q8260L4573k9349J6671l8877K2488
$$ 50625 29730 6852 -46198 -14184 49303 79158 -9102 25471 -3878 12793 -26084 -3596
7239c596j5480L2337L2184k2683k5717L22k4297O5091o7739m3738J4752p375P5040
$$ -3596 -19076 13261 45445 22762 -2955 -2633 -26930 38161 -29578 -73316 -58564 -65939 9101
7226I101Q821J0947l5892k3250M4391J2883j6550L3691q4013k8089L2915l4579
$$ 9101 17922 28869 -7023 -30273 14118 27001 10451 44142 -39871 -67960 -35045 -69624
7214f9624O9657J7664k4604m8934j9205P7987L8452m4791L9472J289k5173l3834
$$ -69624 33 17697 -6907 -55841 -75046 2941 41393 -3398 36074 37363 12190 -21644
7202b1644L9918j0628k9703M7964m6565J3301m2482m3661K7592L7321m8851j5551
$$ -21644 18274 7646 -22057 25907 -20658 -7357 -49839 -93500 -65908 -28587 -77438 -92989
7190i2989N0505R815n7033N8864N1107j13144N3616M0227n4277N7874r370K2251
$$ -92989 -42484 -32669 -89702 -30838 20269 -92875 -39259 968 -53309 4565 -4805 17446
7178A7446j12624M9650O6171l4342M3190p621j27884K9016N5625j9069m1923M3734
$$ 17446 -95178 -45528 20643 -13699 29491 21870 -106014 -76998 -21373 -40442 -82365 -38631
7166c8631j4396O6331l3513k0793M6584o7215P8L8247N8850K2273p8217q1016
$$ -38631 -53027 13304 -20209 -41002 5582 -61633 -61555 -23308 35542 57815 -20402 -101418
7154a01418Q2794O2317n4214n9400L8892l4569J5868M1L3059o060p243J853M1473
$$ -101418 -18624 43693 -10521 -69921 -31029 -65598 -49730 -49689 -16630 -22690 -29933 -28080 13393
7141A3393P6246n4265p6837K1962J9530J1369M6322j09715k0238N3753N2776m5912
$$ 13393 89639 35374 -41463 -19501 29 11398 57720 -51995 -72233 -18480 34296 -11616
7129a1616j7957K4787q259m7174M5128L3286N0974k9309o6669k4638P1578Q278
$$ -11616 -29573 -4786 -13045 -60219 -15091 18195 69169 39860 -26809 -51447 20131 28409
7117B8409K0072n1104Q166j9334k5298m9424J4206N5286j5802r8665L3072J06464
$$ 28409 48481 -2623 5543 -13791 -39089 -88513 -74307 -19021 -34823 -133488 -100416 6048
7105F048P5955J1183p1180k3149o7546L8178k821j641K1021m9193M7079L9238
$$ 6048 82003 93186 22006 -1143 -68689 -30511 -33332 -34973 -13952 -63145 -16066 23172
7093B3172o9762M4064L4983M6341L1307k6866j9981l8610j5606k2174p3926M3502
$$ 23172 -46590 -2526 32457 78798 110105 83239 63258 24648 9042 -13132 -87058 -43556
7081d3556J7405N5743p7711l560n1315Q9723K6778l5889O3357J18560q9828k7229
$$ -43556 -26151 29592 -48119 -51679 -102994 -13271 13507 -22382 40975 159535 69707 42478
7069D2478o6208l6816M7747l56L1751n0984o7661K9504M959M265p5311K9019j3841
$$ 42478 -23730 -60546 -12799 -13155 18596 -32388 -100049 -70545 -65586 -61321 -136632 -107613 -121454
7056a21454p9485M6753k891M0778J06597j04154M68J22513j8582k6212k705k5700
$$ -121454 -200939 -154186 -157077 -116299 -9702 -113856 -113388 9125 -9457 -35669 -38374 -64074
7044f4074R861m2058n8291M2978M5050P3156p436n7085M4523P9216O006p128r6990
$$ -64074 -54213 -96271 -154562 -111584 -66534 6622 -814 -57899 -13376 65840 71846 64718 -32272
7031c2272P575M7411J6676m3746p9712j0271N6664J686j4632L8073k489m373O0168
$$ -32272 -24697 22714 39390 -4356 -84068 -94339 -37675 -35989 -50621 -12548 -15037 -19410 40758
7018D0758q9368j0164J4014O7348n0800p6769J29249K5087j7830l3387N3503m9549
$$ 40758 -48610 -58774 -44760 22588 -28212 -104981 24268 49355 31525 -1862 51641 2092
7006B092p663K7304q7669L0043l9661J3544L2144n9648M2532M4736J1203L4799
$$ 2092 -5571 21733 -65936 -35893 -75554 -62010 -29866 -89514 -46982 -2246 8957 43756
6994D3756m1141L6442j2274j2201p529j3237k8352l3048L8291L8092m5221N9804
$$ 43756 2615 39057 26783 14582 7053 -6184 -34536 -67584 -29293 8799 -36422 23382
6982B3382O3118j20097j5926M329k9002k6929J9927K197k5552L0092o510m2034
$$ 23382 86500 -33597 -49523 -45194 -74196 -101125 -81198 -79001 -104553 -74461 -80971 -123005
6970a23005K092K0423O9878L5177K5456N719o7422o524l2506m5867N5576Q3797
$$ -123005 -120913 -100490 -30612 4565 30021 35740 -31682 -38206 -70712 -116579 -61003 22794
6958B2794k6126j7079o9439q3717O6959Q4172j3197J5318j991K5132L6827O3580
$$ 22794 -3332 -20411 -89850 -173567 -106608 -22436 -35633 -20315 -22306 2826 39653 103233
6946A03233o9973l6185K1227k7657l4010P4106m5078J3894r2263L50N7931J7945
$$ 103233 33260 -2925 18302 -9355 -43365 30741 -14337 -443 -92706 -92356 -34425 -16480
6934a6480j5195K8663O9208n3826k6663O2526m6666q2429L1947M9508J06131j12173
$$ -16480 -31675 -3012 66196 12370 -14293 48233 1567 -80862 -48915 593 106724 -5449
6922e449n4543J415K0161p1467L0725o614L6092N8735q2403J392M7458O9436p5540
$$ -5449 -59992 -58577 -38416 -109883 -79158 -85772 -49680 9055 -73348 -71956 -24498 44938 -30602
6909c0602K4825n168j3299P3237j33416L2632O879M9994L366J7039j3481r653
$$ -30602 -5777 -10945 -24244 48993 -84423 -51791 -44912 5082 8448 25487 12006 2353
6897B353L8179k0457p8561K6862L9518j4468N9591n5337o7120K0338o024K1771
$$ 2353 40532 20075 -58486 -31624 7894 -6574 53017 -2320 -69440 -49102 -55126 -33355
6885c3355O4594K9888k8498K0313o0626n1535l699J5100K3781M3824L2358l5576
$$ -33355 31239 61127 32629 52942 -7684 -59219 -62918 -47818 -24037 19787 52145 16569
6873A6569j3239p0561o5747L6385L8143L6585P5492J7886k6527q8940p0658J01149
$$ 16569 3330 -67231 -132978 -96593 -58450 -21865 53627 71513 44986 -43954 -114612 -13463
6861a3463j18833o2386M8122O3259m6726J35324L6511k9925J02516n3953o5747
$$ -13463 -132296 -194682 -146560 -83301 -130027 5297 41808 11883 114399 60446 -5301
6850e301j8200P3547n4583j5210k8389J02685K4265L7053n2280p2000j2553L0890
$$ -5301 -23501 50046 -4537 -19747 -48136 54549 78814 115867 63587 -8413 -20966 9924
6838I924n0673n1858P1522Q1166n9735l2055O5458n0682r1291j7968n918R9602
$$ 9924 -40749 -92607 -21085 60081 346 -31709 33749 -16933 -108224 -126192 -132110 -32508
6826c2508Q4934l3592N5806p874Q521k7251R24l1716p9400N2014m1683K7906k7364
$$ -32508 52426 18834 74640 66766 75287 48036 48960 17244 -62156 -10142 -51825 -23919 -51283
6813e1283l0162R166k1886J2704P8404j0192p7368K4261P0310K8385m3017L647
$$ -51283 -81445 -72279 -94165 -81461 -3057 -13249 -90617 -66356 3954 32339 -10678 -7031
6801g031J2222k3804m5877m4315O0699Q0243R055L3161m0758m3766K7785K4979
$$ -7031 5191 -18613 -64490 -108805 -48106 32137 41192 74353 33595 -10171 17614 42593
6789D2593k9928n5344L0455L9575k9626M93p1929k7846L4699j9800P1900M4416
$$ 42593 12665 -42679 -12224 27351 -2275 -1782 -73711 -101557 -66858 -86658 -14758 29658
6777B9658l9593K6135J6079O2993o53m2009o6529p6198M8009r517r107O505O4528
$$ 29658 -9935 16200 32279 95272 94619 52610 -13919 -90117 -42108 -51625 -60732 -54227 10301
6764A0301q6076m2167P1346j7136m8533j7078J07594k1353p965M6027M1788j0763
$$ 10301 -75775 -117942 -46596 -63732 -112265 -129343 -21749 -43102 -51067 -5040 36748 25985
6752B5985m9120j7331q911m5500L5232N2615k4497L2008l2744l3551O8709k2136
$$ 25985 -23135 -40466 -49377 -94877 -59645 -7030 -31527 481 -32263 -65814 2895 -19241
6740a9241o2745O9015J9885L4901K0934j4140O675l3759k4384K559l7587M4487
$$ -19241 -81986 -12971 6914 41815 62749 48609 55284 21525 -2859 -300 -37887 6600
6728F600o5135r7382P4559J15527K7124r1559L2854K2175o3934m5044P1903l9705
$$ 6600 -58535 -155917 -81358 34169 61293 -30266 2588 24763 -39171 -84215 -12312 -52017
6716e2017N097J4929N9058R685p0780J9655n0200j0491J9080J3779N0474J2496
$$ -52017 -46920 -31991 27067 36752 -34028 -14373 -64573 -75064 -55984 -42205 8269 20765
6704B0765k4831k6290n2092J4754M5724j5761N2933r005o8559j4543K2165N1407
$$ 20765 -4066 -30356 -82448 -67694 -21970 -37731 15202 6197 -62362 -76905 -54740 -3333
6692c333k0895q588J4131J3749O128k6259O5421j8177p7151M5572l0204L9773
$$ -3333 -24228 -32816 -18685 -4936 1192 -25067 40354 22177 -54974 -9402 -39606 167
6680A67k1818l3129O8353J2425K7159o2253J5317l3920k5808J2783J9285O6169
$$ 167 -21651 -54780 13573 25998 53157 -9096 6221 -27699 -53507 -40724 -21439 44730
6668D4730k2404K5365K8914N415o1136o4289m7708K2180K7538L6577k2244K484
$$ 44730 22326 47691 76605 82020 20884 -43405 -91113 -68933 -41395 -4818 -27062 -24578
6656b4578Q3270m7203k1486P0614K2255J3635l1055n6168L665j7743J16446M56
$$ -24578 58692 11489 -9997 60617 82872 96507 65452 9284 12949 -4794 111652 112108
6644A12108n1602j9179p1644j3456j3207j3713j2571N9039m1054J04904J2617
$$ 112108 60506 41327 -30317 -43773 -56980 -70693 -83264 -24225 -65279 39625 52242
6633E2242q7615K7853L1719K398M3476l4834j3167l230k6893k2624N9787o259
$$ 52242 -35373 -7520 24199 26597 70073 35239 22072 18842 -8051 -30675 29112 22853
6621B2853J0260j8391j6704l9245K4845J5988p7616L7719O9724j7081n0596L599
$$ 22853 33113 14722 -1982 -41227 -16382 -394 -78010 -40291 29433 12352 -38244 -34645
6609c4645P3722j0035q5544n439j708N9532k259N2783j9513K7960j11961m116
$$ -34645 39077 29042 -56502 -61941 -63649 -4117 -6376 46407 26894 54854 -57107 -61223
6597f1223o4825P6438K0907M97K3344q9487Q6165O969l6261k4728p072P9745j7465
$$ -61223 -126048 -49610 -28703 -28206 -4862 -94349 -8184 -1215 -37476 -62204 -69276 10469 -6996
6584f996k435K9655j04689K2983N5804q0459P8741Q763L640o0969O9976R5038
$$ -6996 -9431 20224 -84465 -61482 -5678 -86137 -7396 1367 5007 -55962 14014 109052
6572A09052p1259O334l819k2638m0750N5548M392o8133q2213O4921j9418m954
$$ 109052 37793 44127 40308 17670 -23080 32468 36860 -31273 -113486 -48565 -67983 -72937
6560g2937P574Q299L5500J10698M589l4403K8887l9600J0710J4251p0972O1713
$$ -72937 -65363 -57064 -21564 89134 93723 59320 88207 48607 59317 73568 2596 64309
6548F4309l6524l0982k2724J0180K0819L021l4620L6275L7248n6449k2422K5427
$$ 64309 27785 -3197 -25921 -15741 5078 8099 -26521 9754 47002 -9447 -31869 -6442
6536f442n757m0134L9531L3061k5607Q5091o656r198N6195o7927o6781l612L0635
$$ -6442 -12199 -52333 -12802 20259 -5348 79743 73087 63889 120084 52157 -14624 -18236 12399
6523A2399l3824K1490J35105j4669j00140R1210p6706P49k8130K1595L6834l4211
$$ 12399 -21425 65 135170 120501 20361 111571 34865 35614 7484 29079 65913 31702
6511C1702p710N3514m0774j1426m7041L9877O7409J8554j03041k3778L5789O883
$$ 31702 23992 77506 36732 25306 -21735 18142 85551 104105 1064 -22714 13075 19958
6499A9958P4136P4384n000p3972q9114L885j7909L4670O0918P2435k6340n0574
$$ 19958 94094 168478 163478 89506 392 4277 -13632 21038 81956 154391 128051 77477
6487G7477k8441q221K1892j099l8455J4325k2343j5986L5493L394J8403j7636
$$ 77477 49036 40815 62707 61608 23153 37478 15135 -851 34642 38036 56439 38803
6475C8803l949o6970L6154j0893P223O7819K9141n8324K0200J6009n2025q7172
$$ 38803 34854 -32116 4038 -6855 368 68187 97328 39004 59204 75213 23188 -63984
6463f3984O9966j0897N9291J9451K9912l0813m832j6599O3017l2482o6565M1278
$$ -63984 5982 -4915 54376 73827 103739 72926 68094 51495 114512 82030 15465 56743
6451E6743o687n6366P1026k0352n9575P3851n9095k3506K5123m0025M2178o59
$$ 56743 50056 -6310 64716 44364 -15211 58640 -455 -23961 1162 -38863 3315 2656
6439B656p262O3867j7428p6489k1504J7344L1319Q1576L4282J3100o9456o663
$$ 2656 -4606 59261 41833 -34656 -56160 -38816 -7497 74079 108361 121461 52005 45342
6427D5342L3064j08008N3704m0290m8047J54704J1934O7605p2229j386Q403q4674
$$ 45342 78406 -29602 24102 -16188 -64235 90469 102403 170008 97779 96393 104796 20122
6415B0122L9344j7955J05677L8410n8486N0280j73243L4253N2136p4268M8367
$$ 20122 59466 41511 147188 185598 127112 177392 4149 38402 90538 16270 64637
6404F4637L2435m7852J4422l6562j3309O4809k1606m8981m4384O7887M2514m2264
$$ 64637 97072 49220 63642 27080 13771 78580 56974 7993 -36391 31496 74010 31746
6392C1746o8404N4287M9287j0142m2661K9595l774J2668R3611m4102n0646P2965
$$ 31746 -36658 17629 66916 56774 14113 43708 39934 52602 146213 102111 51465 124430
6380A24430O013J1311n0117M8060k3013m0421J043j481p5183L8844N1968l3564
$$ 124430 130443 141754 91637 139697 116684 76263 77306 75825 642 39486 91454 57890
6368E7890p446O3624N2123j12023l4339J687M487L0487m7553o8930J84826p1221
$$ 57890 50444 114068 166191 54168 19829 21516 26003 56490 8937 -59993 124833 53612
6356E3612l2339K5879J8997k7689l7164O0730k3028L6113m901q3130J13472O215
$$ 53612 21273 47152 66149 38460 1296 62026 38998 75111 70210 -12920 100552 106767
6344A06767j9899k3134L7048K7482l3211L581k2274m9428M7330J8394l8292n5078
$$ 106767 86868 63734 100782 128264 95053 98634 76360 26932 74262 92656 54364 -714
6332g14K0094J0830q897n93l4836R745O2904L829L0975m7092J9448O6938M1867
$$ -714 19380 30210 21313 20720 -14116 -4371 58533 62362 93337 46245 65693 132631 174498
6319A74498n786l9746j9566N1337k7060n715J6105l5344q6327q796K6911J5059
$$ 174498 168712 128966 109400 160737 133677 127962 144067 108723 22396 13600 40511 55570
6307E5570J08764l793k0108q6430l5765r318Q2752J1105n6803O8198P700K4431
$$ 55570 164334 160541 140433 54003 18238 8920 91672 102777 45974 114172 121872 146303
6295A46303K8784q0699l6877N0146N9501N3717l8099L3807K9623j41505p4673
$$ 146303 175087 94388 57511 107657 167158 220875 182776 216583 246206 104701 30028
6284C0028O2190M7075l8999n1738P464J3956k6736Q6010o5674O1235P0033q8346
$$ 30028 92218 139293 100294 48556 56020 69976 43240 129250 63576 124811 194844 106498
6272A06498J1650R5628p3702j4468r6025Q8940m8947k303l3640N0565Q4315J9953
$$ 106498 118148 213776 140074 125606 29581 118521 69574 67271 33631 84196 168511 188464
6260A88464K2427m2271j2439M2982K3966q8499J7034L7301n471l9228m3872k1912
$$ 188464 210891 168620 156181 199163 223129 134630 151664 188965 183494 144266 100394 78482
6248G8482P0164n9994K7034L8272j3565k4039Q5447j2484k7389K2582J8966m2529
$$ 78482 148646 88652 115686 153958 140393 116354 201801 189317 161928 184510 203476 160947
6236A60947m5007l5923K3135R3494n56O228L1509o2514m9938M1743j5876L7778
$$ 160947 115940 80017 103152 196646 196090 202318 233827 171313 121375 163118 147242 185020
6224A85020J0713M6398N000j7608q6652J4184P3557L5622n0514K36N6123L8700
$$ 185020 195733 242131 247131 229523 142871 157055 230612 266234 215720 215956 272079 310779
6212C10779K4756j08833m3855k0495K5137M0840p5474L8703k2217K2754j5603
$$ 310779 335535 226702 182847 162352 187489 228329 152855 191558 169341 192095 176492
6201A76492Q085J16522o3328m4407O521K7610k2806K0482j2954K2330J399j1009
$$ 176492 184577 301099 237771 193364 199885 227495 204689 225171 212217 234547 235946 224937
6189B24937P9908l4925n1492K1845N3229N0370k7705k7310k1457q2122O2015M9775
$$ 224937 304845 269920 218428 240273 293502 343872 316167 288857 267400 185278 247293 297068
6177B97068n2769k909L1948j4742j1934L9776o4512J244P820k1297M1320O7002
$$ 297068 244299 241390 273338 258596 246662 286438 221926 223170 230990 209693 251013 318015
6165C18015k4698L4827j0518n6592K5481N7487L8051q596p3976m1862L7720N8880
$$ 318015 293317 328144 317626 261034 286515 344002 382053 373457 299481 257619 295339 354219
6153C54219L845j20746j4195K1628K791R9397q570j8587n5158l7208J4420Q8072
$$ 354219 358064 237318 223123 244751 247542 346939 338369 319782 264624 227416 241836 329908
6141C29908m9626l71j5588J4040l877L1437k4568M116M7809R2l6918n6179j0654
$$ 329908 280282 279911 264323 278363 274486 305923 281355 285471 333280 333372 296454 240275 229621
6128B29621M5626j9350L5219o2531n9749M3909K2682j362J0143j5085L8715K6120
$$ 229621 275247 255897 291116 228585 168836 212745 235427 234065 244208 229123 267838 293958
6116B93958K1908J9306q9464q714J5773j9872Q7857K5735p8033P604o2041L8604
$$ 293958 315866 335172 245708 236994 252767 232895 320752 346487 268454 276058 214017 252621
6104B52621K5526j4949n3437K5428L2472k2867q4922R1400K2270j6845l4616P177
$$ 252621 278147 263198 209761 235189 267661 244794 159872 251272 273542 256697 222081 229258
6092B29258l7047O2147J3585r895m2900k1638o45R976M8354L4603m6401m7742
$$ 229258 192211 254358 267943 258048 215148 193510 192865 202841 251195 285798 239397 191655
6080A91655N4226L053r042j8480n1857o216Q8436j0137m5750N0761O8369J9445
$$ 191655 245881 248934 239892 221412 169555 163339 251775 241638 195888 246649 315018 334463
6068C34463j9206m2802j4511K6346O2644o806p947r8891M6725P0073j02871n1251
$$ 334463 315257 272455 257944 284290 346934 340128 332181 233290 280015 350088 247217 195966
6056A95966N8597o5185l3415n9812M3929Q9956r3293o5206q873J02736k7056O9219
$$ 195966 254563 189378 155963 96151 140080 230036 136743 71537 62664 165400 138344 207563
6044B07563J00768M2768j53097J4078M6331m2271O0761P3638K5995l3063j8773
$$ 207563 308331 351099 198002 212080 258411 216140 276901 350539 376534 343471 324698
6033C24698l4984m7451O4478r561J1411K9850l5346l0914L2885J8430o330O8788
$$ 324698 289714 242263 306741 297180 308591 338441 303095 272181 305066 323496 317166 385954
6021C85954r1090O294P860K8360R098q505n3229j0852J88665l7373k2832M3427
$$ 385954 294864 301158 309018 337378 346476 337971 284742 273890 462555 425182 402350 445777
6009D45777n5826K3807k377M4864m7178j0238L8289K7580m2199j00614n6445M7175
$$ 445777 389951 413758 411381 456245 409067 398829 437118 464698 422499 321885 265440 312615
5997C12615J16416K603J4196L9616L2598q6653m6462P4863J4360k383M175O6466
$$ 312615 429031 431634 445830 485446 518044 431391 384929 459792 474152 471769 475944 542410
5985E42410k0963r1567o74M7594Q7258k0258m99L8765m0020j2833M0046j1159
$$ 542410 521447 429880 429206 476800 564058 543800 543301 582066 542046 529213 569259 558100
5973E58100J2365L7701n9130K1582k2453n425L5588J2213R493P2961N5772K8740
$$ 558100 570465 608166 549036 570618 548165 542740 578328 590541 600034 672995 728767 757507
5961G57507l4850m0706L0944M6125J9145k259J9965L9290l197l5867k1725M8268
$$ 757507 722657 681951 712895 759020 778165 775906 795871 835161 831964 796097 774372 822640
5949H22640k8570l3981l902J7548L3344N63J00732m3616N0426j0362L4664L8586
$$ 822640 794070 760089 756187 773735 807079 807642 908374 864758 915184 904822 939486 978072
5937I78072L4271j9182n8069N6755P2118m5361J9479O2417L2430N8241m6331N2072
$$ 978072 1012343 993161 935092 991847 1063965 1018604 1038083 1100500 1132930 1191171 1144840 1196912
5925A196912l972K7963p8604J33960J5119Q559O2405L6898O0101j7109k4951J22988
$$ 1196912 1192940 1220903 1142299 1276259 1291378 1299937 1362342 1399240 1459341 1442232 1417281 1540269
5913A540269J05369k4387J16362Q1559J9288Q533K1964J09552O8465J14772J13772
$$ 1540269 1645638 1621251 1737613 1819172 1838460 1846993 1868957 1978509 2046974 2161746 2275518
5902B275518K6263J52035P1223J67293J12157R0912N9747K10856Q0459Q9071J13586
$$ 2275518 2301781 2453816 2525039 2692332 2804489 2895401 2955148 3166004 3246463 3335534 3449120
5891C449120J20161J29542R1595J42377N1720J33907R2088J86792Q8615J78336
$$ 3449120 3569281 3698823 3790418 3932795 3984515 4118422 4210510 4397302 4485917 4664253
5881D664253K02256K60246J11035J60628K84375K35729K40738M6197K35959K80311
$$ 4664253 4866509 5126755 5237790 5398418 5682793 5918522 6159260 6205457 6441416 6721727
5871F721727J72749J56432K10682J59031J54173J85756K24564J27154L1349J38307
$$ 6721727 6894476 7050908 7261590 7420621 7574794 7760550 7985114 8112268 8143617 8281924
5861H281924K41462K36627K03324K18051J85836J35888K23415J49953J79965J96030
$$ 8281924 8523386 8760013 8963337 9181388 9367224 9503112 9726527 9876480 10056445 10252475
5851A0252475J29569J30326K1894J72668N4836J05454N379j4487O3679N8435P1769
$$ 10252475 10382044 10512370 10534264 10706932 10761768 10867222 10872601 10858114 10921793 10980228 11051997
5840A1051997P7996J43687J49138J20593J68688J71246J73906Q1100J6272M6629
$$ 11051997 11129993 11273680 11422818 11543411 11712099 11883345 12057251 12138351 12154623 12201252
5830A2201252J14686j7653j36262r2536J533k18791j97581l2164r6540j36098
$$ 12201252 12315938 12298285 12162023 12069487 12071020 11852229 11654648 11622484 11525944 11389846
5820A1389846j75390r0784n9345K3039k8060j687M9523M5299p5318r3884j39120
$$ 11389846 11214456 11123672 11064327 11087366 11059306 11057619 11107142 11152441 11077123 10983239 10844119
5809A0844119o0147j09449q3002j07294j04053j69987k56182l25890j85830j67313
$$ 10844119 10783972 10674523 10591521 10484227 10380174 10210187 9954005 9628115 9442285 9274972
5799I274972k61537k22044j22575j48433j34629j36494j36422k15862j42828k23419
$$ 9274972 9013435 8791391 8668816 8520383 8385754 8249260 8112838 7896976 7754148 7530729
5789G530729j97630k30364k53708k51529k44469k00547j78563k07326k39771j64957
$$ 7530729 7333099 7102735 6849027 6597498 6353029 6152482 5973919 5766593 5526822 5361865
5779E361865j04614k13798l18950j33736j47824j69222j31176r1648j29865j43091
$$ 5361865 5257251 5043453 4724503 4590767 4442943 4273721 4142545 4050897 3921032 3777941
5769C777941j17865j21978j23707n7958k16155j65222j99998j37314j12801j19781
$$ 3777941 3660076 3538098 3414391 3356433 3140278 2975056 2775058 2637744 2524943 2405162
5759B405162l6539o2197j75333o5758L1348j11914j38204r0363j25511j906O109
$$ 2405162 2368623 2306426 2131093 2065335 2096683 1984769 1846565 1756202 1630691 1628785 1634894
5748A634894l6627k7759o6632q5484J5076j5130l3945N7354r9816m7676m53j2462
$$ 1634894 1598267 1570508 1503876 1418392 1433468 1418338 1384393 1441747 1341931 1294255 1293802 1281340
5736A281340K44r0504j1330j8118o2894l6209P0975k0583o3584p1186j4739O1336
$$ 1281340 1281584 1191080 1179750 1161632 1098738 1062529 1133504 1112921 1049337 978151 963412 1024748
5724A024748L0335r6150j4959R3061n3499n3256M123M9354m2325l3849o2198m900
$$ 1024748 1055083 958933 943974 1037035 983536 930280 934403 983757 941432 907583 845385 840485
5712H40485k3037j3715j6118J0371k4024J7358q383r713k1859M524P2388l3520
$$ 840485 817448 803733 787615 797986 773962 791320 782937 773224 751365 755889 828277 794757
5700G94757o3650N7119o542j17444n2001k2614K2596K3134n344J648O8048m3450
$$ 794757 731107 788226 781684 664240 612239 589625 612221 635355 630011 631659 699707 656257
5688F56257N172L4308K2964j71q3559N3655n7888n905L7210m8421k3407K6863
$$ 656257 661429 695737 718701 718530 634971 688626 630738 624833 662043 613622 590215 617078
5676F17078J2262k3258K0025O8504j5750n8119P9725o4011l7516p4482O5833L6076
$$ 617078 629340 606082 626107 694611 678861 620742 700467 636456 598940 524458 590291 626367
5664F26367M1523j2343m9729J0392N3370M0871o9941j6951L1014K4815J2720k9698
$$ 626367 667890 655547 605818 616210 669580 710451 640510 623559 654573 679388 692108 662410
5652F62410j0849k2792p967P207J2461k5665J6120N3657m5244L7679O1202o9970
$$ 662410 651561 628769 620802 628009 640470 614805 630925 684582 639338 677017 738219 668249
5640F68249R616k9490L8862O8146j2382P0708J8359q5270k849J1648M0052O5681
$$ 668249 677865 648375 687237 755383 743001 813709 832068 746798 743949 755597 795649 861330
5628H61330l7564q625j3108k5015Q2199o070O987k5392r7800P5774L9303k0645
$$ 861330 823766 815141 802033 777018 859217 853147 860134 834742 736942 812716 852019 831374
5616H31374r624R4712o145l2965m0998l7449J4887J4355K7763M8208p3182m7897
$$ 831374 821750 916462 910317 877352 836354 798905 813792 828147 855910 904118 830936 783039
5604G83039N9531j3667P8094O5990n1038N1903K0226p5366K7966Q1655n5626Q0688
$$ 783039 842570 828903 906997 972987 921949 973852 994078 918712 946678 1028333 972707 1053395
5592A053395J1645o2744n8316O8785O7595j8917k2418M101O6304R8054k8027k4571
$$ 1053395 1065040 1002296 943980 1012765 1080360 1061443 1039025 1043126 1109430 1207484 1179457 1154886
5580A154886K7833J4485M396L6898J4494m0435M2321Q653M8750J18740r5659k9296
$$ 1154886 1182719 1197204 1201600 1238498 1252992 1212557 1254878 1263531 1312281 1431021 1335362 1306066
5568A306066L2818k6296N7960L1373J2693M5514L5878N6847J1131M9558j1142
$$ 1306066 1338884 1312588 1370548 1401921 1414614 1460128 1496006 1552853 1563984 1613542 1602400
5557A602400j3528M066L3815L0577P7602N8707k2416N2421n2390M8702J18651
$$ 1602400 1588872 1592938 1626753 1657330 1734932 1793639 1771223 1823644 1771254 1819956 1938607
5546A938607N4028L8149M1012M2L0974J13558P6540m7899O9720R2036P2263N8162
$$ 1938607 1992635 2030784 2071796 2071838 2102812 2216370 2292910 2245011 2314731 2406767 2479030 2537192
5534B537192J51895L6665L9247R7570Q298J63309J56375Q8941R9415J80199J47936
$$ 2537192 2689087 2725752 2764999 2862569 2870867 3034176 3190551 3279492 3378907 3559106 3707042
5523C707042J12831J50910J57831J54563K28367K44352J56400K17310K40529K09649
$$ 3707042 3819873 3970783 4128614 4283177 4511544 4755896 4912296 5129606 5370135 5579784
5513E579784J65963J45532K9628p7221j07533p1040R822j9830J5541J13815J03819
$$ 5579784 5745747 5891279 5920907 5843686 5736153 5665113 5674935 5655105 5670646 5784461 5888280
5502E888280J38969J18577J55117J85689J46531K38620K63614J14198K15450L21517
$$ 5888280 6027249 6145826 6300943 6486632 6633163 6871783 7135397 7249595 7465045 7786562
5492G786562L17675K32615K12426J70166Q8701N3377K5608J28210K02470K31895
$$ 7786562 8104237 8336852 8549278 8719444 8808145 8861522 8887130 9015340 9217810 9449705
5482I449705K63881L64736M65260M49549M96139N60886O62505P83041Q13610R42102
$$ 9449705 9713586 10078322 10543582 10993131 11489270 12050156 12712661 13495702 14309312 15251414
5472A5251414J132852J140108J069809J264504J450044J549630J795511J838454
$$ 15251414 16384266 17524374 18594183 19858687 21308731 22858361 24653872 26492326
5464B6492326J859083J728900J335445P82021L75289j9602j30255n9162J64488
$$ 26492326 28351409 30080309 31415754 32197775 32573064 32553462 32423207 32364045 32528533
5455C2528533L36705N51024Q09630O68779M53469o164l79311o22783p13279p21810
$$ 32528533 32865238 33416262 34225892 34894671 35348140 35341976 34962665 34339882 33626603 32904793
5445C2904793m80914j39583l507N4506J64183O3816l16367o52758q96682j069071
$$ 32904793 32423879 32284296 32280789 32335295 32499478 32563294 32246927 31594169 30697487 29628416
5435B9628416j022339q53657o42087m34861j15264m0032J11230J21393k02104
$$ 29628416 28606077 27752420 27110333 26675472 26560208 26520176 26631406 26752799 26550695
5426B6550695o33620j165982j542727j701466j684264j565513j505161j242336
$$ 26550695 25917075 24751093 23208366 21506900 19822636 18257123 16751962 15509626
5418A5509626j050621r70866p88250o81340o87217n61383l54574l68491k91108
$$ 15509626 14459005 13488139 12699889 12018549 11331332 10769949 10415375 10046884 9755776
5409I755776l24010k68595j71365j65369j42459j04073m5330R541q5659r9322
$$ 9755776 9431766 9163171 8991806 8826437 8683978 8579905 8534575 8544116 8458457 8359135
5399H359135j81347j50732k47179l41244k53333k10637k69410k29779j70677j48618
$$ 8359135 8177788 8027056 7779877 7438633 7185300 6974663 6705253 6475474 6304797 6156179
5389F156179p6787r4016j60414K580j6246o6290r859N3398J1398k1396P3875P3541
$$ 6156179 6079392 5985376 5824962 5827542 5811296 5745006 5735147 5788545 5799943 5778547 5852422 5925963
5377E925963M9598K6963j15765q8765p9929k28536k48048j66613j81447j73737
$$ 5925963 5975561 6002524 5886759 5797994 5718065 5489529 5241481 5074868 4893421 4719684
5367D719684q0194j15563r5023j09718r4500j14554N4166J6460M295n1474p2316
$$ 4719684 4639490 4523927 4428904 4319186 4224686 4110132 4164298 4180758 4185053 4133579 4061263
5356D061263l5977l4821j21662J7887J46682O1436r9942j4603J28345J9334Q026
$$ 4061263 4025286 3990465 3868803 3886690 4033372 4094808 3994866 3980263 4108608 4127942 4135968
5345D135968P6607J03474J09645R6787O9544N1354J06671J67556J55829K30119
$$ 4135968 4212575 4316049 4425694 4522481 4592025 4643379 4750050 4917606 5073435 5303554
5335E303554L15958K52965L50083L40716M29967M21196M64395N93471Q56282Q91332
$$ 5303554 5619512 5872477 6222560 6563276 6993243 7414439 7878834 8472305 9328587 10219919
5325A0219919J015781O79338l45809j007463j181483j137321r21111n73018m69051
$$ 10219919 11235700 11915038 11569229 10561766 9380283 8242962 7321851 6748833 6279782
5316F279782m66117l67224j81857j51046j87111l8675j29304m0678q5140o9747
$$ 6279782 5813665 5446441 5264584 5113538 4926427 4887752 4758448 4717770 4632630 4562883
5306D562883j1138m3642L2750J710K9527o7710o1502m4722Q7427O608k5233L4668
$$ 4562883 4551745 4508103 4540853 4542563 4572090 4504380 4442878 4398156 4485583 4492191 4466958 4501626
5294D501626Q0075N0398M4500K8722m7127J4266M9264J524M2116M9242O9832R1760
$$ 4501626 4581701 4632099 4676599 4705321 4658194 4672460 4721724 4723248 4765364 4814606 4884438 4976198
5282D976198J2265P0598J90322P2355K1119J00472J75931L6421N4224Q7219J37996
$$ 4976198 4988463 5059061 5249383 5321738 5342857 5443329 5619260 5655681 5709905 5797124 5935120
5271E935120k8233K135J73620J69023J34645J12987J07896J35473J69307J31885
$$ 5935120 5906887 5909022 6082642 6251665 6386310 6499297 6607193 6742666 6911973 7043858
5261G043858R9834K23517L12518K82278K68437K45513K04509K17493K29221K50651
$$ 7043858 7143692 7367209 7679727 7962005 8230442 8475955 8680464 8897957 9127178 9377829
5251I377829K21641K55616K88135K55586K40912K19867K72737K77760J94065K99267
$$ 9377829 9599470 9855086 10143221 10398807 10639719 10859586 11132323 11410083 11604148 11903415
5241A1903415L39570L19450L83019K66114K81829L87633K93944L27152L65925
$$ 11903415 12242985 12562435 12945454 13211568 13493397 13881030 14174974 14502126 14868051
5232A4868051M30358L72923L40990L44840M28495M05562M79837N12677N45767
$$ 14868051 15298409 15671332 16012322 16357162 16785657 17191219 17671056 18183733 18729500
5223A8729500O34414O40679N61394N32699O66606O38856O40268P67073Q22316
$$ 18729500 19363914 20004593 20565987 21098686 21765292 22404148 23044416 23811489 24633805
5214B4633805R42667R47092Q87890J028434J132332J142417J346089J411480J361230
$$ 24633805 25576472 26523564 27411454 28439888 29572220 30714637 32060726 33472206 34833436
5205C4833436J571502J678064J883904K037548K236245K443576K774614L016238
$$ 34833436 36404938 38083002 39966906 42004454 44240699 46684275 49458889 52475127
5197E2475127L473481L901679M277145M899982N579823O391427P400022Q556718
$$ 52475127 55948608 59850287 64127432 69027414 74607237 80998664 88398686 96955404
5189I6955404R558334J0516085J1526229J2635569J3942426J5402163J7263685
$$ 96955404 106513738 117029823 128556052 141191621 155134047 170536210 187799895
5182A87799895J9434980K1713013K3236696K2009964J5074341J190161j4405699
$$ 187799895 207234875 228947888 252184584 274194548 289268889 290459050 276053351
5175B76053351k5244064k9741673k9038349k5299647k1091514j7645346j4512263
$$ 276053351 250809287 221067614 192029265 166729618 145638104 127992758 113480495
5168A13480495j1962924r867752q241779o977868n899414n116894m466896m048201
$$ 113480495 101517571 91649819 83408040 76430172 70530758 65413864 60946968 56898767
5160E6898767l606261l122527k939729k584656k361330k196902k020915j747744
$$ 56898767 53292506 50169979 47230250 44645594 42284264 40087362 38066447 36318703
5152C6318703j627624j591362j339686j389931j322388j240147j168733j138580
$$ 36318703 34691079 33099717 31760031 30370100 29047712 27807565 26638832 25500252
5144B5500252j080017r29075r32934q44638p88220q04145p80473o40229o04677
$$ 25500252 24420235 23491160 22558226 21713588 20925368 20121223 19340750 18700521 18095844
5135A8095844o61936o37255n74159m85606n02943m64188l81863m13954l32620
$$ 18095844 17433908 16796653 16222494 15736888 15233945 14769757 14387894 13973940 13641320
5126A3641320l13169l25049l37272l50707l10783k30131l53506l28136j36425
$$ 13641320 13328151 13003102 12665830 12315123 12004340 11774209 11420703 11092567 10956142
5117A0956142k51993l02866k52534k71229j78255k33716k38246k57248j81341
$$ 10956142 10704149 10401283 10148749 9877520 9699265 9465549 9227303 8970055 8788714
5108H788714j71340k48949j01229j68533j76652j28921j66063j20844j83073j71150
$$ 8788714 8617374 8368425 8267196 8098663 7922011 7793090 7627027 7506183 7323110 7151960
5098G151960j45630k18167j90451r1055k10600k44952r3265j26021j27085j26826
$$ 7151960 7006330 6788163 6597712 6506657 6296057 6051105 5957840 5831819 5704734 5577908
5088E577908n5971j53723r3550j22837j86095n4464j38910j12113j85294r7025
$$ 5577908 5521937 5368214 5274664 5151827 4965732 4911268 4772358 4660245 4474951 4377926
5078D377926l3371m5812j02608m6436J6251p1048p2910j14009r2008R01m5816
$$ 4377926 4344555 4298743 4196135 4149699 4165950 4094902 4021992 3907983 3815975 3816876 3771060
5067C771060j04104l7649n380J1719q5696o2334k4328L0473r7284m8110j2335
$$ 3771060 3666956 3629307 3623927 3635646 3549950 3487616 3463288 3493761 3396477 3348367 3336032
5056C336032o3003m7354R5011r3755j8846n0448j29669n0156K4783j10927k2523
$$ 3336032 3273029 3225675 3320686 3226931 3208085 3157637 3027968 2977812 3002595 2891668 2869145
5045B869145J0436l5145k9982j3763p819l5787N7713m0266j4854k223n4133m5545
$$ 2869145 2879581 2844436 2814454 2800691 2792872 2757085 2814798 2774532 2759678 2757455 2703322 2657777
5033B657777J4878l6047O5023j2923m6946j1399L0128n6628m7365O278n0542O637
$$ 2657777 2672655 2636608 2701631 2688708 2641762 2630363 2660491 2603863 2556498 2562776 2512234 2518871
5021B518871o3624J3102k5687n0045j4343L3211k9620K8935K9354j7686K5021
$$ 2518871 2455247 2468349 2442662 2392617 2378274 2411485 2381865 2410800 2440154 2422468 2447489
5010B447489M5545P0855k3794k0398l0877P379j5035M1135m116N1130M115o3515
$$ 2447489 2493034 2563889 2540095 2519697 2488820 2496199 2481164 2522299 2518183 2569313 2573428 2509913
4998B509913O080J28785P9609j350N1689j15082q937Q9694J8897k1327N615K8724
$$ 2509913 2515993 2644778 2724387 2723037 2774726 2659644 2650707 2740401 2759298 2737971 2743586 2772310
4986B772310O8266Q6365P7202J02214Q8384P7445J12235M9089j5104K5464J27692
$$ 2772310 2840576 2926941 3004143 3106357 3194741 3272186 3384421 3433510 3418406 3443870 3571562
4975C571562J52843m8401K4677N7151J20166J74366J66556P3740M8312J11601
$$ 3571562 3724405 3676004 3700681 3757832 3877998 4052364 4218920 4292660 4340972 4452573
4965D452573J95097K01589J08393J39433J41712P1644J06011R2941J26108J50171
$$ 4452573 4647670 4849259 4957652 5097085 5238797 5310441 5416452 5509393 5635501 5785672
4955E785672J38981J79535M9042J28070J37882L3792M5231J331K9703J18876P0233
$$ 5785672 5924653 6104188 6153230 6281300 6419182 6452974 6498205 6499536 6529239 6648115 6718348
4944F718348O6000J18421l5176M2794m754k3280q300J7614L0062k6891K5450O0643
$$ 6718348 6784348 6902769 6867593 6910387 6905633 6882353 6874053 6891667 6921729 6894838 6920288 6980931
4932F980931J8378K0299M9155R550Q6841M8367P7830J28101J66423N8393J02344
$$ 6980931 6999309 7019608 7068763 7078313 7165154 7213521 7291351 7419452 7585875 7644268 7746612
4921G746612P4198O1575J33239J68585J54449J26152K12883J34403J32868J27869
$$ 7746612 7820810 7882385 8015624 8184209 8338658 8464810 8677693 8812096 8944964 9072833
4911I072833K49713K12061J97801K03080J89478N8364L8833J98803K03737J37092
$$ 9072833 9322546 9534607 9732408 9935488 10124966 10183330 10222163 10420966 10624703 10761795
4901A0761795O1263K2038P8346R1365J046o8172k9751R9156k3482p5814j15369
$$ 10761795 10823058 10845096 10923442 11014807 11015853 10947681 10917930 11017086 10993604 10917790 10802421
4890A0802421p7769r4389o200j20165k44750q7828j77044j94239r9429j10527
$$ 10802421 10724652 10630263 10624063 10503898 10259148 10171320 9994276 9800037 9700608 9590081
4880I590081j10484l8995j56715p6526j10009j38537L711m7377r5690j02702n6044
$$ 9590081 9479597 9440602 9283887 9207361 9097352 8958815 8962526 8915149 8819459 8716757 8660713
4869H660713k9126m1671O0999r587l7669L8239L8328m274n8196N7132K365n5106
$$ 8660713 8631587 8589916 8650915 8641328 8603659 8641898 8680226 8675952 8617756 8674888 8677253 8622147
4857H622147m939n0341r2174n42j40525j7337q4923r4160p3860j71414l8888j83152
$$ 8622147 8617208 8566867 8474693 8474151 8333626 8316289 8231366 8137206 8063346 7891932 7853044 7669892
4845G669892j66312k53831j07309j30463k02890j60549k32911k45231j45845j94684
$$ 7669892 7503580 7249749 7142440 7011977 6809087 6648538 6415627 6170396 6024551 5829867
4835E829867k47653j05678j51207k44278j91337j27786j81711n1700k19346k04389
$$ 5829867 5582214 5476536 5325329 5081051 4889714 4761928 4580217 4528517 4309171 4104782
4825D104782j29040j75625q3705p2233k21955k01714K784j58450j51223m512j48187
$$ 4104782 3975742 3800117 3716412 3644179 3422224 3220510 3223294 3064844 2913621 2909109 2760922
4814B760922j39664k1399k3401o6384n0284p9547J6959O829l4824m3354m1166
$$ 2760922 2621258 2599859 2576458 2510074 2459790 2380243 2397202 2404031 2369207 2325853 2284687
4803B284687q2152l5408o520p9219J9085m3720L9924l0038p861l6921m9365J8132
$$ 2284687 2202535 2167127 2160607 2081388 2100473 2056753 2096677 2066639 2058778 2021857 1972492 1990624
4791A990624M8018j6261j359l0024L7710j745q2572M3070M0949m6297k1842J20168
$$ 1990624 2038642 2022381 2021022 1990998 2028708 2026963 1944391 1987461 2028410 1982113 1960271 2080439
4779B080439O5522m4538q5596O7912J3580J4622O3574J00343L870K3976K3050
$$ 2080439 2145961 2101423 2015827 2083739 2097319 2111941 2175515 2275858 2279728 2303704 2326754
4768B326754J5811J2524K9954J5783P0037M7294J8226O4721J13722J41380N6162
$$ 2326754 2342565 2355089 2385043 2400826 2470863 2518157 2536383 2601104 2714826 2856206 2912368
4757B912368L7433K8125J33730J79816J29312O5190J43206J14963J15343J23837
$$ 2912368 2949801 2977926 3111656 3291472 3420784 3485974 3629180 3744143 3859486 3983323
4747C983323J07969J34560J36058J29111K7867J4526Q3134Q3627L7589N3760k8216
$$ 3983323 4091292 4225852 4361910 4491021 4518888 4533414 4616548 4700175 4737764 4791524 4763308
4736D763308J71444Q9766L7147Q7616K2554Q0930J50304J01181P5546N5604R558
$$ 4763308 4934752 5024518 5061665 5149281 5171835 5252765 5403069 5504250 5579796 5635400 5644958
4725E644958j476R2238M3083J20322P4850J10074M8825L8412O8976l315O265M0035
$$ 5644958 5643482 5735720 5778803 5899125 5973975 6084049 6132874 6171286 6240262 6236947 6243212 6283247
4713F283247k2972j1524N4578O5280M4917N8938J8028P1857K03353P2097N3634
$$ 6283247 6260275 6248751 6303329 6368609 6413526 6472464 6490492 6562349 6765702 6837799 6891433
4702F891433P4649J49305J04435K03155J54836J67686J30189J39882J88303K09871
$$ 6891433 6966082 7115387 7219822 7422977 7577813 7745499 7875688 8015570 8203873 8413744
4692H413744J59894J78206J10598J87865J03546K13522J33797K6051J14997J68360
$$ 8413744 8573638 8751844 8862442 9050307 9153853 9367375 9501172 9527223 9642220 9810580
4682I810580P267Q9437R940J1516L8773L8563o4599j06659l3103j7043j26631
$$ 9810580 9817847 9907284 9917224 9928740 9967513 10006076 9941477 9834818 9801715 9784672 9658041
4671I658041j43647j62327q3678j22532j28739j29711p3160j74662j35649n7228
$$ 9658041 9514394 9352067 9268389 9145857 9017118 8887407 8814247 8639585 8503936 8446708
4661H446708o0016J8377p3174l923o1128O248m7635k032m735p7041n502N1571
$$ 8446708 8386692 8405069 8331895 8327972 8266844 8273092 8225457 8223425 8218690 8141649 8136147 8187718
4649H187718j0799n9973J6357O3379j8701Q4590R7857n5973k8389J13985n4934
$$ 8187718 8176919 8116946 8133303 8196682 8177981 8262571 8360428 8304455 8276066 8390051 8335117
4638H335117J3599k477o237O342l4610r7998j09207q3785r3991r2684j39029o4331
$$ 8335117 8348716 8346239 8340002 8346344 8311734 8213736 8104529 8020744 7926753 7834069 7695040 7630709
4626G630709j13474j75609j00797j77846j75653k00524j62432j60932j98228j60253
$$ 7630709 7517235 7341626 7240829 7062983 6887330 6686806 6524374 6363442 6165214 6004961
4616F004961j04157j42906j77669j35369j72814j46790j50609j13738j13227r1249
$$ 6004961 5900804 5757898 5580229 5444860 5272046 5125256 4974647 4860909 4747682 4656433
4606D656433m1491j53622j24665j5064l5349p1350l7788r1658R082j8584q0863
$$ 4656433 4614942 4461320 4336655 4321591 4286242 4214892 4177104 4085446 4094528 4075944 3995081
4595C995081l4430J1027o7398M7099k6320n7154q9341m8083L0451j45784m7895
$$ 3995081 3960651 3971678 3904280 3951379 3925059 3867905 3778564 3730481 3760932 3615148 3567253
4584C567253o0261j04768l4970k0506q2501j30547j97085p1113q2080r5581l4160
$$ 3567253 3506992 3402224 3367254 3346748 3264247 3133700 2936615 2865502 2783422 2687841 2653681
4573B653681j46579j25198j18212n7587n9771K7450j01076j36836m7404r57q6781
$$ 2653681 2507102 2381904 2263692 2206105 2146334 2173784 2072708 1935872 1888468 1887511 1800730
4562A800730j07024q9899J694k7844j1834q1559o4887J3301l2314n4082o592m5652
$$ 1800730 1693706 1603807 1605501 1577657 1565823 1484264 1419377 1432678 1400364 1346282 1339690 1294038
4550A294038k1488k5071J0196J206j1781k4801o6194n4411j07760J03095R3q2943
$$ 1294038 1272550 1247479 1257675 1258881 1247100 1222299 1156105 1101694 993934 1097029 1097122 1014179
4538A014179n2213l2626J3147Q3060m9924k9188Q497k0850m899l4759M4354Q1491
$$ 1014179 961966 929340 942487 1025547 975623 946435 954932 934082 929183 894424 938778 1020269
4526A020269j06911q6289M1835O8682l0993o799r876m571l9016N8529n1942l5903
$$ 1020269 913358 827069 868904 937586 906593 899794 889918 885347 846331 904860 852918 817015
4514H17015J6623L483o0050j0778k9469J4061m6270O0700L1472n8025j681l3714
$$ 817015 833638 837121 777071 766293 736824 750885 704615 765315 796787 738762 737081 703367
4502G03367K0847o507L7286p87R979m9128K4212R140L4890L6405m1306N1142L5325
$$ 703367 724214 717707 754993 754206 764185 715057 739269 748409 783299 819704 778398 829540 864865
4489H64865J775n0219l7136k8733l4563l35R7324K5727K399J3985k6043m2147
$$ 864865 866640 816421 779285 750552 715989 715654 812978 838705 841104 855089 829046 786899
4477G86899O400P070n3349M1631K5134m4262J6949O5218k3206J5031J02310N2186
$$ 786899 793299 800369 747020 788651 813785 769523 786472 851690 828484 843515 945825 998011
4465I98011r0637j2249m4361L1594N5134p683K6104O8278q765p0963l9732J22906
$$ 998011 907374 895125 850764 882358 937492 929809 955913 1024191 1015426 944463 904731 1027637
4453A027637M9412m9540p1352P820J08449j4727K8984Q7980J1038M7671m0551
$$ 1027637 1077049 1027509 956157 963977 1072426 1057699 1086683 1174663 1185701 1233372 1192821
4442A192821L3536L4275j3688j7144n0055J16808Q0392P3954j5646l0206N0376
$$ 1192821 1226357 1260632 1246944 1229800 1179745 1296553 1376945 1450899 1435253 1405047 1455423
4431A455423N4412M8101O3287L0523J9555J3486L7177O615J4842M8867J23182
$$ 1455423 1509835 1557936 1621223 1651746 1671301 1684787 1721964 1728579 1743421 1792288 1915470
4420A915470O612N2928M4207N7288J14560j5052N533J11579P7250Q2315L3598
$$ 1915470 1922082 1975010 2019217 2076505 2191065 2176013 2181546 2293125 2370375 2452690 2486288
4409B486288L98Q2883J93793N8083j4634N2192J79189J47927N7122O6491J34789
$$ 2486288 2486686 2569569 2763362 2821445 2806811 2859003 3038192 3186119 3243241 3309732 3444521
4398C444521J84600K00115J63067J69075K76172K72999L95553L17210K52468M07062
$$ 3444521 3629121 3829236 3992303 4161378 4437550 4710549 5106102 5423312 5675780 6082842
4388F082842M23232N05224N57259O12746P19693O50938P66011P66619Q48209N23518
$$ 6082842 6506074 7011298 7568557 8181303 8900996 9551934 10317945 11084564 11932773 12456291
4378A2456291N06877O14958O87697Q71507J006893Q01105O23295L23614J68652
$$ 12456291 12963168 13578126 14265823 15137330 16144223 16945328 17568623 17892237 18060889
4369A8060889J44736K09264M87896N05315N15688L65672k08134o81033q04337
$$ 18060889 18205625 18414889 18902785 19408100 19923788 20289460 20081326 19400293 18595956
4360A8595956p59906n09496l28566l17891l47190m62825q08997r33286j005129
$$ 18595956 17836050 17326554 16997988 16680097 16332907 15870082 15061085 14127799 13122670
4351A3122670r18579o88666o28008m95910o46218o92901o57945p18849o52377
$$ 13122670 12204091 11515425 10887417 10391507 9745289 9052388 8394443 7675594 7023217
4342G023217o10747m92179m44308m19259l75844k13207j81441k33865k03014j55481
$$ 7023217 6412470 5920291 5475983 5056724 4680880 4467673 4286232 4052367 3849353 3693872
4332C693872j56108j39378j89745j18151k6025j97720m3383l8428o8272p8561
$$ 3693872 3537764 3398386 3208641 3090490 3064465 2866745 2823362 2784934 2716662 2638101
4322B638101p3257l2230k0257o6563j19572j08430L2362K8666j26940j16781j8748
$$ 2638101 2564844 2532614 2512357 2445794 2326222 2217792 2250154 2278820 2151880 2035099 2016351
4311B016351k2572k5837o2114j30503M2837m1380N178n8011j2056P3795p3514
$$ 2016351 1993779 1967942 1905828 1775325 1818162 1776782 1781960 1723949 1711893 1785688 1712174
4300A712174j44999j1145K55n5561K7838M3926o9165m1817r168k7046k1035l7022
$$ 1712174 1567175 1556030 1556285 1500724 1528562 1572488 1503323 1461506 1452338 1425292 1404257 1367235
4288A367235o8352o28M5850m1051l6725J07428n2563k1663O7769l3903p2407m9696
$$ 1367235 1298883 1298255 1344105 1303054 1266329 1373757 1321194 1299531 1367300 1333397 1260990 1211294
4276A211294j0500k3256j09743N091J9946o8747n3843r638M1612R573M9624j0130
$$ 1211294 1200794 1177538 1067795 1072886 1092832 1024085 970242 960604 1002216 1011789 1061413 1051283
4264A051283r9267k7823M2m4591O705j24Q4199j0842o892j34499M979J2605m996
$$ 1051283 952016 924193 924235 879644 886349 886225 970424 959582 952690 818191 823170 835775 830779
4251H30779O7506j6087k9287k1403J2619J9919P104J8119L4769m1080l7293j3386
$$ 830779 898285 882198 852911 831508 844127 864046 871150 889269 924038 882958 845665 832279
4239H32279P5115l8413p0946M3710L8906N0858p3379j03643Q6793j3405q726O1071
$$ 832279 907394 868981 798035 841745 880651 931509 858130 754487 841280 827875 819149 880220
4227H80220m6887l0273O0082J5421j2137m6588o8994R889K7030M8210k6380K5370
$$ 880220 833333 803060 863142 878563 866426 819838 750844 760733 787763 835973 809593 834963
4215H34963L4350m9213K6019l0758P2584o9275k9629N6715N0002p696j5317K3956
$$ 834963 869313 820100 846119 815361 887945 818670 789041 845756 895758 888062 872745 896701
4203H96701r0310j9917M2071K1061j0566M512R7432J3771j0064k8737N3131K439
$$ 896701 806391 786474 828545 849606 839040 843552 940984 954755 944691 915954 969085 971524
4191I71524M4069l1388n4335M6721J3138q174M0118K5625j7152p6955Q5316O9639
$$ 971524 1015593 984205 929870 976591 989729 981555 1021673 1047298 1030146 953191 1038507 1108146
4179A108146j0219N19K3529Q3018p6629j03411M7750M8995N8159L2624N696M9897
$$ 1108146 1097927 1098446 1121975 1204993 1128364 1024953 1072703 1121698 1179857 1212481 1218177 1268074
4167A268074j9915L309J0593K1575j1835L4348k0491J2456k2723Q4480Q493k1930
$$ 1268074 1248159 1251468 1262061 1283636 1271801 1306149 1285658 1298114 1275391 1359871 1368364 1346434
4155A346434j6637K7799N0059M5995k0890P486r690M837m4323N8804L7924L5542
$$ 1346434 1329797 1357596 1407655 1453650 1432760 1440246 1430556 1435393 1391070 1449874 1487798 1523340
4143A523340m023Q6128M9320L9745K6230l5836l1925N7662N4905J9169n4023J7447
$$ 1523340 1519317 1605445 1654765 1694510 1720740 1684904 1652979 1710641 1765546 1784715 1730692 1748139
4131A748139P1599O3424M2551N0511J3371o1870J43424Q5722k7925M5302J07642
$$ 1748139 1819738 1883162 1925713 1976224 1989595 1927725 2071149 2156871 2128946 2174248 2281890
4120B281890l1171L8807J59514N8085J8146k3385M7604k120Q1490N6208N5588
$$ 2281890 2250719 2289526 2449040 2507125 2525271 2501886 2549490 2547370 2628860 2685068 2740656
4109B740656R1184K2181J55141M9807K8000M9849j3057K7807J47412O9192j0224
$$ 2740656 2831840 2854021 3009162 3058969 3086969 3136818 3123761 3151568 3298980 3368172 3357948
4098C357948J4433N6843J6301J10328Q6859J10631Q1054J5292J36256M1062O4033
$$ 3357948 3372381 3429224 3445525 3555853 3642712 3753343 3834397 3849689 3985945 4027007 4091040
4087D091040J02166M5905J01004J06426O8445Q0188M9711P7740J30717J44303
$$ 4091040 4193206 4239111 4340115 4446541 4514986 4595174 4644885 4722625 4853342 4997645
4077D997645J19861J39498O9033O2821J65677J05706J67904J03332Q7605J92668
$$ 4997645 5117506 5257004 5326037 5388858 5554535 5660241 5828145 5931477 6019082 6211750
4067F211750K04381J70726J82102J88019K09858J72182K12483K08118K84256K35796
$$ 6211750 6416131 6586857 6768959 6956978 7166836 7339018 7551501 7759619 8043875 8279671
4057H279671K69424K15427L38074L50908L39679L07439M50670L81180L09696L98924
$$ 8279671 8549095 8764522 9102596 9453504 9793183 10100622 10551292 10932472 11242168 11641092
4047A1641092M20723M51734M70481N59161N53642N96753O63799O93982O66798
$$ 11641092 12061815 12513549 12984030 13543191 14096833 14693586 15357385 16051367 16718165
4038A6718165P08710P93622Q03205Q86636R38159R80281R49199J004730J052093
$$ 16718165 17426875 18220497 19023702 19910338 20848497 21828778 22777977 23782707 24834800
4029B4834800J081962J109105J186502J191698J182193J105554J271862J220787
$$ 24834800 25916762 27025867 28212369 29404067 30586260 31691814 32963676 34184463
4021C4184463J276036J325123J388936J243912J144163J294845J093223J139683
$$ 34184463 35460499 36785622 38174558 39418470 40562633 41857478 42950701 44090384
4013D4090384J101148J049704R49595R08609Q56729P91814P43000O68227N17400
$$ 44090384 45191532 46241236 47190831 48099440 48956169 49747983 50490983 51159210 51676610
4004E1676610M17031L26618K54786J64648L8203j45140j53363l24724l77019m76582
$$ 51676610 52093641 52420259 52675045 52839693 52877896 52732756 52579393 52254669 51877650 51401068
3994E1401068n62764o86589q07236q07546p58716r19815r85330r97635j187634
$$ 51401068 50838304 50151715 49344479 48536933 47778217 46858402 45873072 44875437 43687803
3985D3687803j178786j182717j241218j210156j291854j234839j268675j225493
$$ 43687803 42509017 41326300 40085082 38874926 37583072 36348233 35079558 33854065
3977C3854065j229446j290598j207434j074869j155946j170003j126824j031180
$$ 33854065 32624619 31334021 30126587 29051718 27895772 26725769 25598945 24567765
3969B4567765r70345r91517j029584r13463q17271p65607p85080p36786p44382
$$ 24567765 23597420 22605903 21576319 20662856 19845585 19079978 18294898 17558112 16813730
3960A6813730p34757n75696n74438n60589n12973m57650m53376m58196l86504
$$ 16813730 16078973 15503277 14928839 14368250 13855277 13397627 12944251 12486055 12099551
3951A2099551l49979m11094l02983k36915k63606k74756k93873k02433j66910
$$ 12099551 11749572 11338478 11035495 10798580 10534974 10260218 9966345 9763912 9597002
3942I597002j79874r5757j07188j90547j94373k14414j55515q9899j31233k675
$$ 9597002 9417128 9321371 9214183 9023636 8829263 8614849 8459334 8369435 8238202 8235527
3932H235527q6203J226k0679j65329J342L4570o3880p2661n6412K6765O897N268
$$ 8235527 8149324 8150550 8129871 7964542 7965884 8000454 7936574 7863913 7807501 7834266 7841163 7846431
3920G846431p746j6592J9421M2027l2273k4205Q9335L0704O838P9835J26566R3375
$$ 7846431 7838685 7822093 7841514 7883541 7851268 7827063 7916398 7947102 7953940 8033775 8160341 8253716
3908H253716O4417P3646M2611J75167R2207J16208J68530L1413K25667K45135
$$ 8253716 8318133 8391779 8434390 8609557 8701764 8817972 8986502 9017915 9243582 9488717
3898I488717J11703J97392K37223K08211K53324K18574K29175K98690L70970L18661
$$ 9488717 9600420 9797812 10035035 10243246 10496570 10715144 10944319 11243009 11613979 11932640
3888A1932640L21192L04716K92034M63765L79223L46784M54311M52914L93590
$$ 11932640 12253832 12558548 12850582 13314347 13693570 14040354 14494665 14947579 15341169
3879A5341169L98783L56717L56505L34089L42423L80987L53608L72909K65104
$$ 15341169 15739952 16096669 16453174 16787263 17129686 17510673 17864281 18237190 18502294
3870A8502294K88168M07839L50846K40073L20380L11138L29018L09997K74821
$$ 18502294 18790462 19198301 19549147 19789220 20109600 20420738 20749756 21059753 21334574
3861B1334574K59392K92136L93185L64113M51058M86813M24783M87682N26271
$$ 21334574 21593966 21886102 22279287 22643400 23094458 23581271 24006054 24493736 25020007
3852B5020007N75121N14621O79994O84808P64271Q72069R56991J098876J102539
$$ 25020007 25595128 26109749 26789743 27474551 28238822 29110891 30067882 31166758 32269297
3843C2269297J248317J321847J533018J594423J775750J932941K019793K220014
$$ 32269297 33517614 34839461 36372479 37966902 39742652 41675593 43695386 45915400
3835D5915400K337061K532583K775758K948776K987331L186442L386601L500054
$$ 45915400 48252461 50785044 53560802 56509578 59496909 62683351 66069952 69570006
3827F9570006L640538L624455L750709L810677L781412L682369L508373L428618
$$ 69570006 73210544 76834999 80585708 84396385 88177797 91860166 95368539 98797157
3819I8797157L187155K843833K447564K082953J788362J293819R17957M06215
$$ 98797157 101984312 104828145 107275709 109358662 111147024 112440843 113358800 113765015
3811A13765015m4792l85282p82665j182260j500830j878677k106271k360891k658165
$$ 113765015 113720223 113334941 112552276 111370016 109869186 107990509 105884238 103523347 100865182
3802A00865182k905800l068954l267125l326085l462703l596939l520016l542634
$$ 100865182 97959382 94890428 91623303 88297218 84834515 81237576 77717560 74174926
3794G4174926l455107l427779l400929l235928l149356k959293k761734k679995
$$ 74174926 70719819 67292040 63891111 60655183 57505827 54546534 51784800 49104805
3786D9104805k524014k413531k251172k039812j787704j775685j663260j430822
$$ 49104805 46580791 44167260 41916088 39876276 38088572 36312887 34649627 33218805
3778C3218805j341638j253949j132043j032392r53680q72212q61868o73340o12600
$$ 33218805 31877167 30623218 29491175 28458783 27505103 26632891 25771023 25097683 24485083
3769B4485083n37569o30547n21427m26758m14450l68327k83702l66607l80602
$$ 24485083 23947514 23316967 22795540 22368782 21954332 21586005 21302303 20935696 20555094
3760B0555094l24118l39296k63851l74564l14812l69380l14475k49099l49711
$$ 20555094 20230976 19891680 19627829 19253265 18938453 18569073 18254598 18005499 17655788
3751A7655788l28231l19908l56065k91915l13502k64370l49651l15490l33074
$$ 17655788 17327557 17007649 16651584 16359669 16046167 15781797 15432146 15116656 14783582
3742A4783582k96373l22271l09170l64661l71813l65153m09589l66015j94985
$$ 14783582 14487209 14164938 13855768 13491107 13119294 12754141 12344552 11978537 11783552
3733A1783552k75809k70296l54439l07272k75519k58519k35804j70719k28690
$$ 11783552 11507743 11237447 10883008 10575736 10300217 10041698 9805894 9635175 9406485
3724I406485k24547j45468k24742k29071j29593j21491j12417j90271k24952j10168
$$ 9406485 9181938 9036470 8811728 8582657 8453064 8331573 8219156 8028885 7803933 7693765
3714G693765n4926m7313r0064j26713l9150p2260m8094m2583m9763q7154m5352
$$ 7693765 7638839 7591526 7501462 7374749 7335599 7263339 7215245 7172662 7122899 7035745 6990393
3703F990393o7564o7190M1392m4794n3883o748K5612o1666O4821l4204n6033o4317
$$ 6990393 6922829 6855639 6897031 6852237 6798354 6791606 6817218 6755552 6820373 6786169 6730136 6665819
3691F665819M6651J7531L0396q5380j070L5288l5264J0647k4553j0007N2160J0057
$$ 6665819 6712470 6730001 6760397 6675017 6673947 6709235 6673971 6684618 6660065 6650058 6702218 6712275
3679F712275J9305K8248L1741j1371J101k8809R2796K9049J15383J58085L1067
$$ 6712275 6731580 6759828 6791569 6780198 6781299 6752490 6845286 6874335 6989718 7147803 7178870
3668G178870n642K0205Q9834J33282J06538O2615O5000J58048J74413J71464J40908
$$ 7178870 7173228 7193433 7283267 7416549 7523087 7585702 7650702 7808750 7983163 8154627 8295535
3657H295535J80416J26276J70662K47776J26941K31078K83819J85144K98469L26862
$$ 8295535 8475951 8602227 8772889 9020665 9147606 9378684 9662503 9847647 10146116 10472978
3647A0472978L47602L81595K44328L98461L97791L50050M54130M68424L86324
$$ 10472978 10820580 11202175 11446503 11844964 12242755 12592805 13046935 13515359 13901683
3638A3901683L83709M21602M18188L43541M64367L77874L99345N06198L60523
$$ 13901683 14285392 14706994 15125182 15468723 15933090 16310964 16710309 17216507 17577030
3629A7577030L15282K65345L04903L65467L17160L80430J84153K13163J33510
$$ 17577030 17892312 18157657 18462560 18828027 19145187 19525617 19709770 19922933 20056443
3620B0056443J46785J40407K04995O5675J4298J30861M4785J33246J25547J01587
$$ 20056443 20203228 20343635 20548630 20614305 20628603 20759464 20804249 20937495 21063042 21164629
3610B1164629J54500J23898J49932K20297K13609K18356L30344L20745L91743
$$ 21164629 21319129 21443027 21592959 21813256 22026865 22245221 22575565 22896310 23288053
3601B3288053L77017N67045N77362N66986P21524Q03360R43785R07921J010337
$$ 23288053 23665070 24232115 24809477 25376463 26097987 26901347 27845132 28753053 29763390
3592B9763390J219523J262987J278518J399685J603223J661227J723279J848992
$$ 29763390 30982913 32245900 33524418 34924103 36527326 38188553 39911832 41760824
3584D1760824J751484J888843J982391K021658J997948K007619K001342K009677
$$ 41760824 43512308 45401151 47383542 49405200 51403148 53410767 55412109 57421786
3576E7421786J946665J956230J862464J854371J819811J768388J608916J668295
$$ 57421786 59368451 61324681 63187145 65041516 66861327 68629715 70238631 71906926
3568G1906926J584966J468043J378539J164096J076537R63090Q36004P75873N84889
$$ 71906926 73491892 74959935 76338474 77502570 78579107 79542197 80378201 81154074 81738963
3559H1738963M51506L04526J77991J76053O5730q6445j90277l46140m32128n36492
$$ 81738963 82190469 82494995 82672986 82849039 82914769 82828324 82638047 82291907 81859779 81323287
3549H1323287n26556n95284p39614q24541q01051r77145j229730j129914j284289
$$ 81323287 80796731 80201447 79461833 78637292 77836241 76859096 75629366 74499452 73215163
3540G3215163j511469j550334j670399j709741j840957j898449j832169j905139
$$ 73215163 71703694 70153360 68482961 66773220 64932263 63033814 61201645 59296506
3532E9296506j941200j869249j924932j950716j794226j914684j817058j908430
$$ 59296506 57355306 55486057 53561125 51610409 49816183 47901499 46084441 44176011
3524D4176011j872137j808632j787399j709040j640262j541754j453640j348451
$$ 44176011 42303874 40495242 38707843 36998803 35358541 33816787 32363147 31014696
3516C1014696j281535j189283j133782r03391r12904p92890o72974o52874m81494
$$ 31014696 29733161 28543878 27410096 26506705 25593801 24800911 24127937 23475063 22993569
3507B2993569m99321m52719l31422k52611l26213k94754j99000j07274k15451
$$ 22993569 22494248 22041529 21710107 21457496 21131283 20836529 20637529 20530255 20314804
3498B0314804j47525j42697j89590k52672j86733o7330j13121j14082k00406j45574
$$ 20314804 20167279 20024582 19834992 19582320 19395587 19328257 19215136 19101054 18900648 18755074
3488A8755074j66049k33731j15886j80139k64647l58824m38741l74011l13971
$$ 18755074 18589025 18355294 18239408 18059269 17794622 17435798 16997057 16623046 16309075
3479A6309075l52186n07745m58201l39974m22111m40456l59799l40076m95111
$$ 16309075 15956889 15449144 14990943 14650969 14228858 13788402 13428603 13088527 12593416
3470A2593416l51288n19549m63150l48873m04016l85429l70285l72926m24161
$$ 12593416 12242128 11722579 11259429 10910556 10506540 10121111 9750826 9377900 8953739
3461H953739k82633k81002l53832l18653k69143k48110k85358k12162j36617j68334
$$ 8953739 8671106 8390104 8036272 7717619 7448476 7200366 6915008 6702846 6566229 6397895
3451F397895j83814k12394j40659j03511p6729j85092k13086j26052n6671j46492
$$ 6397895 6214081 6001687 5861028 5757517 5680788 5495696 5282610 5156558 5099887 4953395
3441D953395j55667j28329r5513l9839k10270o6994j7326m1641q524r9490j22268
$$ 4953395 4797728 4669399 4573886 4534047 4323777 4256783 4239457 4197816 4189292 4089802 3967534
3430C967534j68624j6049r2158q4151m4949j30672m2802k5705j19891l4832m6610
$$ 3967534 3798910 3782861 3690703 3606552 3561603 3430931 3388129 3362424 3242533 3207701 3161091
3419C161091n1521R614J3739j44415p9532r4801k1724o4876l9832k2342l9099
$$ 3161091 3109570 3119184 3132923 2988508 2908976 2814175 2792451 2727575 2687743 2665401 2626302
3408B626302j4871k3525J505l785q5615o2219q5203J9751n9726j9026m4243k1659
$$ 2626302 2611431 2587906 2589411 2585626 2500011 2437792 2352589 2372340 2312614 2293588 2249345 2227686
3396B227686J9239m6272P0418q7476p0229m6410k7948l1064n0148J5043k0485
$$ 2227686 2246925 2200653 2271071 2183595 2113366 2066956 2039008 2007944 1957796 1972839 1952354
3385A952354k8458k4900l0360n2192K8996M127p1842j304k6971Q236r401K1471
$$ 1952354 1923896 1898996 1868636 1816444 1845440 1849567 1777725 1776421 1749450 1757686 1748285 1769756
3373A769756k5323m7541n2567k983r1135j855N0069j7239r7393j2644j5567j5775
$$ 1769756 1744433 1696892 1644325 1641342 1550207 1548352 1598421 1581182 1483789 1471145 1455578 1439803
3361A439803K1143L781j0970n7155O659k1406J0312P9400j01152J311L3285R114
$$ 1439803 1460946 1464727 1453757 1396602 1403261 1381855 1392167 1471567 1370415 1371726 1405011 1414125
3349A414125l7414m2170m0647j21423K9063K0878L8352N1342n1393n5513j4014
$$ 1414125 1376711 1334541 1293894 1172471 1201534 1222412 1260764 1312106 1260713 1205200 1191186
3338A191186k0991l1465k5359J6671J0594l8075k9313J20087n1905m4651J02069
$$ 1191186 1170195 1138730 1113371 1130042 1140636 1102561 1073248 1193335 1141430 1096779 1198848
3327A198848k8968p7032j4759K8695l2666l9133j6883L6351k5645p8867J19413
$$ 1198848 1169880 1092848 1078089 1106784 1074118 1034985 1018102 1054453 1028808 949941 1069354
3316A069354J6739l0081M9649j25421l9128m849Q1121j6730m0524m897J2326Q4995
$$ 1069354 1086093 1056012 1105661 980240 941112 936263 1017384 1000654 960130 955233 967559 1052554
3304A052554n337O640j5811l0814o0785j1164K6209K1312N3238J6286L6839K6509
$$ 1052554 1047217 1053857 1038046 1007232 946447 935283 961492 982804 1036042 1052328 1089167 1115676
3292A115676j5358K5640p6807j2787K2852m6814J03003N4768p8133J3821q343
$$ 1115676 1100318 1125958 1049151 1036364 1059216 1012402 1115405 1170173 1092040 1105861 1097518
3281A097518l0496K5744k3331N7834m9491N6733K6357N161N1234p2204k7699O994
$$ 1097518 1067022 1092766 1069435 1127269 1077778 1134511 1160868 1166029 1217263 1145059 1117360 1124354
3269A124354j3417q327j3266J4552N1099o0185m635K7846m9886j1603L9888j08986
$$ 1124354 1110937 1102610 1089344 1103896 1154995 1094810 1090175 1118021 1068135 1056532 1096420 987434
3257I87434l8475N7982k1403L6765q642m6611j0257p7033L6352M122n9126q120
$$ 987434 948959 1006941 985538 1022303 1013661 967050 956793 879760 916112 920234 861108 852988
3245H52988J683Q7594m96j6044K7721l4097k4755o3431n2947L745O7932M4164
$$ 852988 854671 942265 941769 925725 953446 919349 894594 831163 778216 781961 849893 894057
3233H94057l7688Q785k1354P188K263p6267m0500K6665K9969k9244k8890N4322
$$ 894057 856369 865154 843800 850988 853251 776984 736484 763149 793118 763874 734984 789306
3221G89306K892k3524J41023k3121l4533J1912l807O5278r6J8519O747O787J742
$$ 789306 792198 768674 909697 886576 852043 863955 860148 925426 925330 943849 950596 957383 959125
3208I59125p8356Q6485P8062k9105l012K4701n7804j06178j17309l5255n7263
$$ 959125 880769 967254 1045316 1016211 1013199 1037900 980096 873918 756609 721354 664091
3197F64091L4549O7607j5348k4731o6703J5013Q994j11359m7024l2931N1217Q3346
$$ 664091 698640 766247 750899 726168 659465 674478 683472 572113 525089 492158 543375 626721
3185F26721n5750l4397J2173q4469K8079J5571o7599K8050J1004j9584q9093L2672
$$ 626721 570971 536574 548747 464278 492357 507928 440329 468379 479383 459799 370706 403378
3173D03378L0219N2908L0268k8861q3711K5850M9333l0726o6714p2923M8775N2143
$$ 403378 433597 486505 516773 487912 404201 430051 479384 448658 381944 309021 357796 409939
3161D09939k4645L676j5087m6569J5468n0403j5680N79o426J0028J7572m0640
$$ 409939 385294 388970 373883 327314 342782 292379 276699 277278 270852 280880 298452 257812
3149B57812M592K7463L9112K3722m3631m1753N1040K6108p0452m370K2463P3661
$$ 257812 262404 289867 328979 352701 309070 267317 318357 344465 274013 269643 292106 365767
3137C65767J03749n5741j8433K3782L3890N3455m4797p20K3598n975m5857J9566
$$ 365767 469516 413775 395342 419124 453014 506469 461672 460952 484550 478575 432718 452284
3125D52284K0237n5700r5366J6681m3407J0018O525J8319M0410O2896q034o7431
$$ 452284 472521 416821 321455 338136 294729 304747 311272 329591 370001 432897 424863 357432
3113C57432p89L5352q0048J8586j7210j9551j406l0057K3720o9515L3360K5276
$$ 357432 356643 391995 311947 330533 313323 293772 292366 262309 286029 216514 249874 275150
3101B75150k3886K326o3044N8907N1941n6302K5153k325J3285j0935m5573N8263
$$ 275150 251264 253590 190546 249453 301394 245092 270245 267920 281205 270270 224697 282960
3089B82960n2611j5337M4912o4440J0381k6830m2430k9628j2071R2056K9120j7783
$$ 282960 230349 215012 259924 195484 205865 179035 136605 106977 94906 186962 216082 198299
3077A98299K5796K0146M6226k5333M039j376q1332O1394n724m2398j6391L0003
$$ 198299 224095 244241 290467 265134 269173 267797 186465 247859 242135 199737 183346 213349
3065B13349M360J20541k9930J1927R337j23258o5464J220R3664l8854q6569N0555
$$ 213349 217709 338250 308320 320247 329584 206326 140862 142082 235746 196892 110323 160878
3053A60878k7608L531K7898K4557N7438q4909M8436m5038j8432j11829l651O9390
$$ 160878 133270 136801 164699 189256 246694 161785 210221 165183 146751 34922 31271 100661
3041A00661O9831M4598k4424o3710k5978J523P3927m450j6318k8340N937j8775
$$ 100661 170492 215090 190666 126956 100978 102501 176428 171978 155660 127320 133257 114482
3029A14482P6240L2549l7579j1666k2282N0603M9915l42M373l0695q662r9488
$$ 114482 190722 223271 185692 174026 151744 202347 252262 251920 256293 225598 216936 117448
3017A17448N368K4748J1202r876J5058k8896l2208J597j8224L3637l0830K2093
$$ 117448 122816 147564 158766 148890 163948 135052 102844 104441 86217 119854 89024 111117
3005A11117J6470K9860M1428p7045k7253L1518m4510O2581K8155N4280p3460P814
$$ 111117 127587 157447 198875 121830 94577 126095 81585 144166 172321 226601 153141 160955
2993A60955j143O774Q6508n0861n4129R360K4231L8061n5381m132j1417k9437
$$ 160955 159812 166586 253094 202233 148104 157464 181695 219756 164375 160243 148826 119389
2981A19389o7443J3471J9749n7824R4564l4163p057l4670K2254J44272J3662j06179
$$ 119389 51946 65417 85166 27342 121906 87743 80686 46016 68270 212542 226204 120025
2969A20025n5696o852L0975J5544L637J3433k7609N2317n2719J9110R9990p2522
$$ 120025 64329 57477 88452 103996 107633 121066 93457 145774 93055 112165 212155 139633
2957A39633j01389J02720J0958j8882N8467k6159l7525P561L6690r1375l8128
$$ 139633 38244 140964 151922 133040 191507 165348 127823 135384 172074 80699 42571
2946D2571N3796P25o322k4558O7427j13409J131O3584k6692M8873k4880l8224
$$ 42571 96367 97092 90770 66212 133639 20230 21361 84945 58253 107126 82246 44022
2934D4022O2521N7072m8675O0k2311k1150J6459O648K9370m912R383J6498j4321
$$ 44022 106543 163615 114940 115000 92689 71539 87998 94646 124016 119104 128487 144985 130664
2921A30664m3930M2204J7058L2746q492K1060N9204m695p4361r4797K8378J4919
$$ 130664 86734 128938 145996 178742 170250 191310 250514 245819 171458 76661 105039 119958
2909A19958O298N2095j4578n8613N6668J2789j035l7341n7840m4539J21108Q2664
$$ 119958 126256 178351 163773 105160 161828 174617 173582 136241 78401 33862 154970 237634
2897B37634j4543p8311J6854O0119o141J8227q2025L0166o0976J16727L6122q1583
$$ 237634 223091 144780 161634 221753 215612 233839 151814 181980 121004 237731 273853 192270
2885A92270j7739P615M191N0033j882o1286n2494J689N0971l4134o4661O3417
$$ 192270 174531 182146 186337 236370 234488 173202 120708 122397 173368 139234 74573 137990
2873A37990L1923J8480M5019M3046J799J8618K413K0005K2432p4950k389k8699
$$ 137990 169913 188393 233412 276458 278257 296875 299288 319293 341725 266775 264386 235687
2861B35687K2147O3750K7220q7356k3249l8819O583K0430m98r5987j9330L9641
$$ 235687 257834 321584 348804 261448 238199 199380 205963 226393 225895 129908 110578 150219
2849A50219K3369j253K0761J0748p6481l2339N511j455R306N3398P9370l6549
$$ 150219 173588 172335 193096 203844 127363 95024 100535 99080 108386 161784 241154 204605
2837B04605J1183K4889j6852n7298M0291j3735R061n5988K4533R2664m9760o4446
$$ 204605 215788 240677 223825 166527 206818 193083 202144 146156 170689 263353 213593 149147
2825A49147K5880J8992p6007L0747l1291n8614K6852r669j84N397m4568k2815
$$ 149147 175027 194019 118012 148759 117468 58854 85706 76037 75853 81250 36682 13867
2813A3867R0903Q9426P8732l7445l0532K9413k0527m8920j07876l5504P7385M4779
$$ 13867 104770 194196 272928 235483 204951 234364 213837 164917 57041 21537 98922 143701
2801A43701p09k0735J8303l4362N797k5671J1141M8859n7397o9577J4762l4312
$$ 143701 142992 122257 140560 106198 111995 86324 97465 146324 88927 19350 34112 -200
2789b00n042M9481K8395O1961k8811J446l9587n1330n0514j1485J684Q1049K8105
$$ -200 -5242 44239 72634 134595 105784 107230 67643 16313 -34201 -45686 -44002 37047 65152
2776F5152j4044j10375O4316j7757k0692R5005J4410K4150L8011L2454k0836k0202
$$ 65152 51108 -59267 5049 -12708 -33400 61605 76015 100165 138176 170630 149794 129592
2764A29592m1704M883K7251n6158K668P4440l5920o9818k0410l8681L0269N2006
$$ 129592 87888 92771 120022 63864 66532 140972 105052 35234 14824 -23857 6412 58418
2752E8418J9315l1773K738K9447j4513p601m4822k2551O4292l9886k8731O9512
$$ 58418 77733 45960 48698 78145 63632 56031 11209 -11342 52950 13064 -15667 53845
2740E3845L9266J6094J56j00431m4350R9231N2574m8879K0428m8443J2957M676
$$ 53845 93111 109205 109361 8930 -35420 63811 116385 67506 87934 39491 52448 57124
2728E7124j8154J03186j8289r3465M8507J5082j1077m4972l2926L4221K360q3392
$$ 57124 38970 142156 123867 30402 78909 93991 82914 37942 5016 39237 41597 -41795
2716d1795k1744O1025J5055L8765l0337M532k0183O4879k4029l4724K3278q3607
$$ -41795 -63539 -2514 12541 51306 20969 25501 5318 70197 46168 11444 34722 -48885
2704d8885l0203N6252O515k6940L58n0614N3831k2547J8320K298j1744j248K3875
$$ -48885 -79088 -22836 -16321 -43261 -42903 -93517 -39686 -62233 -43913 -41615 -53359 -54607 -30732
2691c0732K0728n2008K2208N0816N203m5433M1675m4274L5149J02793R995l0226
$$ -30732 -10004 -62012 -39804 11012 16215 -29218 12457 -31817 3332 106125 116120 85894
2679H5894m6445j07398k4999M4655Q3506o607q4838J2364P4934l0646J02052j4294
$$ 85894 39449 -67949 -92948 -48293 35213 28606 -56232 -43868 31066 420 102472 88178
2667H8178j10198n8557N4943R698m102k2496k5199N4171M8875k256k6478L2370
$$ 88178 -22020 -80577 -25634 -15936 -20038 -42534 -67733 -13562 35313 33057 6579 38949
2655C8949l8608k493J7809j2191p8378J5215l6389M9148J9701j6871Q878n322
$$ 38949 341 -2152 15657 3466 -74912 -59697 -96086 -46938 -27237 -44108 -35230 -40552
2643d0552K1829j860j069p8232K4804q966M6720M3058k1763k179l694M9942K1547
$$ -40552 -18723 -20583 -21652 -99884 -75080 -84046 -37326 5732 -16031 -18210 -21904 28038 49585
2630D9585L3629n88m744m0513L1116P518o9647L5071j2788n4917N0307k2748j9697
$$ 49585 83214 82626 77882 37369 68485 76003 6356 41427 28639 -26278 24029 1281 -18416
2617a8416N2423n5624p9273J16023l1809k7816k303j8588J20570m175l3943K8074
$$ -18416 34007 -21617 -100890 15133 -16676 -44492 -46795 -65383 55187 51012 17069 45143
2605D5143j1115l7759J531k6548N806l6754P2600N4652p0708R292K7928l2242
$$ 45143 34028 -3731 -2200 -28748 -22942 -59696 12904 67556 -3152 6140 34068 1826
2593A826k3646N0662n9717J1527k7163o4410Q4963O5897k6768o3233K8582j1632
$$ 1826 -21820 28842 -30875 -19348 -46511 -110921 -25958 39939 13171 -50062 -21480 -33112
2581c3112L417j702N8069M835K845J8297j17369l9828j69L6612O1772L3350K4591
$$ -33112 -29695 -31397 26672 31507 34352 52649 -64720 -104548 -104717 -68105 -6333 27017 51608
2568E1608q5385K4628K6641k6881q2091N4256M7284J0901o786k0056P8469M7746
$$ 51608 -33777 -9149 17492 -9389 -91480 -37224 10060 20961 14175 -5881 72588 120334
2556A20334n5155m0060n3580o0033O1961K6685K7780Q259q061o4365L8655M1831
$$ 120334 65179 25119 -28461 -88494 -26533 152 27932 36191 28130 -36235 2420 44251
2544D4251n6371j1301N8898j51858L400R6446P5453L7622j7964n7109L1882L0845
$$ 44251 -12120 -23421 35477 -116381 -112981 -16535 58918 96540 78576 21467 53349 84194
2532H4194K0609K2338r7275n9578j7643J11365k0262n2385k8190p413N4594j3122
$$ 84194 104803 127141 29866 -29712 -47355 64010 43748 -8637 -36827 -44240 10354 -2768
2520b768O2226M1113j6190j8263j01736L109l1961Q4704j7822o8184Q7956J3220
$$ -2768 59458 100571 84381 66118 -35618 -32509 -64470 20234 2412 -65772 22184 35404
2508C5404l3682l366j2218L28l6062j3047j2486K0034P8753j592m3506n2733Q1
$$ 35404 1722 -1644 -13862 -13534 -49596 -62643 -75129 -55095 23658 22066 -21440 -74173 -74092
2495g4092L5854J07729j9746j8107j31857o227P7608K3194J4590n141r950j5830
$$ -74092 -38238 69491 49745 31638 -100219 -106446 -28838 -5644 8946 3805 -6145 -21975
2483b1975n4209K6348Q0446J7178m8j7720K7783k4201M30L9314j1221o6789N4881
$$ -21975 -76184 -49836 30610 47788 47740 30020 57803 33602 34032 73346 62125 -4664 50217
2470E0217L4578r653J4691j19417L1412J8492o3249K8929K278J7850L7098j9792
$$ 50217 84795 75142 89833 -29584 1828 20320 -42929 -14000 -11722 6128 43226 23434
2458B3434k3754P606m219M1633J1737L1921P317n8805Q3170l2022q3893l4835
$$ 23434 -320 7286 3067 44700 56437 88358 95675 36870 120040 88018 4125 -30710
2446c0710k4237J00114l6190o7799K3252n0099J2014P9311l5750n613p49K0572
$$ -30710 -54947 45167 8977 -58822 -35570 -85669 -73655 5656 -30094 -35707 -36456 -15884
2434a5884r77R2048P6546n3174j10783K745P4277l2238k6504n0753J0623K2781
$$ -15884 -16861 75187 151733 98559 -12224 -9479 64798 32560 6056 -44697 -34074 -11293
2422a1293L2406l4637J6579M4814J5411m5662k011K3696Q192j2240j0686l359
$$ -11293 21113 -13524 3055 47869 63280 17618 15607 39303 47495 35255 24569 21210
2410B1210n2253R7938N6178p3338o0091M255Q9973K9806r6389M2456q555o4388
$$ 21210 -31043 66895 123073 49735 -10356 -6101 83872 113678 17289 59745 51190 -13198
2398a3198K6390R0698K4811k2204m2959K879L407R912q3932o3762M0512N7450
$$ -13198 13192 103890 128701 106497 63538 66417 69824 79736 -4196 -67958 -27446 30004
2386C0004N2622p7094l5043J11113J8738o5776P6572M7259j51356n6867K9092
$$ 30004 82626 5532 -29511 81602 100340 34564 111136 158395 7039 -49828 -20736
2375b0736k3572k7644M6242l5755O7367N2301o1483M0931o6270j6261J00954O6470
$$ -20736 -44308 -71952 -25710 -61465 5902 58203 -3280 37651 -28619 -44880 56074 122544
2363A22544N2905p7922n161l6723L0377n94m8160K411o1970j6112l2574M1357
$$ 122544 175449 97527 92366 55643 86020 85426 37266 39677 -22293 -38405 -70979 -29622
2351b9622O1046Q8982p2146n2350O8143j5842l7649N1037k0318N5814o5594j6158
$$ -29622 31424 120406 48260 -4090 64053 48211 10562 61599 41281 97095 31501 15343
2339A5343J9656j7383o86j4521R136j9702J611P2652P0018j10817q8088J0891
$$ 15343 34999 17616 16930 2409 11545 -8157 -6546 66106 136124 25307 -62781 -51890
2327e1890J7802K5354k9076J260K0400O6843N2755m3013k6857K133O6357K0811
$$ -51890 -34088 -8734 -37810 -36550 -16150 50693 103448 60435 33578 35711 102068 122879
2315A22879m6190r3064l490J1795J1800R9509L932r8345l0366Q0030n634n7219
$$ 122879 76689 -16375 -19865 -8070 3730 103239 107171 8826 -21540 58490 52856 -4363
2303d363l5670O3751J3169r235K1579j6301P9325k9094j1862J7347k35l2937j2882
$$ -4363 -40033 23718 36887 27652 49231 32930 112255 83161 71299 88646 88411 55474 42592
2290D2592p366r783k0316L2286M7370n3239r074O53M3859k5595L7513j4024m4932
$$ 42592 35226 25443 5127 37413 84783 31544 22470 23123 66982 41387 78900 64876 19944
2277A9944o3231l4151P0861M1296r5764L9431J35659M687o1700n9734m136M0512
$$ 19944 -43287 -77438 -6577 34719 -61045 -21614 114045 118732 57032 -2702 -6838 33674
2265C3674R9522r0552K1256J15397n1312o8134k534L5799K036q2045J5699o378
$$ 33674 133196 42644 63900 179297 127985 59851 57317 93116 95152 13107 28806 22428
2253B2428p9490J1369Q7033K1312K8514J3209j11969k1980K9230J20093j08966
$$ 22428 -57062 -45693 41340 62652 91166 104375 -7594 -29574 -344 119749 10783
2242A0783k4467L4162O7011j2579L1895R3322j608j4950j22483p5561R0691Q6332
$$ 10783 -13684 20478 87489 74910 106805 200127 198519 183569 61086 -14475 76216 162548
2230A62548p7821Q4458p7971n8376L5275O7618n3050m8241L8081j0224l7104n1717
$$ 162548 84727 169185 91214 32838 68113 135731 82681 34440 72521 62297 25193 -26524
2218b6524P9038l800l352J16362j1880m0083j2353J1155K0094r4494O986M5162
$$ -26524 52514 48714 45362 161724 149844 109761 97408 108563 128657 34163 41149 86311
2206H6311k1823L1184p6912M9889L7293o882j2530j836l9954L19R1048j9006k250
$$ 86311 64488 95672 18760 68649 105942 99060 86530 84694 44740 45059 136107 117101 114851
2193A14851M5806J7344K6543m5256o9941R07M4223N7576n025l3993K0612o397
$$ 114851 160657 178001 204544 159288 89347 90254 134477 192053 187028 153035 173647 167250
2181A67250o4895K1959J7437N9247J0180j802l8619j6535k7656Q9261o106K5074
$$ 167250 102355 124314 141751 200998 211178 209376 170757 154222 126566 215827 209721 234795
2169B34795L3419j7081M14l2342n0359k7603P6388L3071K646n8340Q0838N7185
$$ 234795 268214 251133 251547 219205 168846 141243 217631 250702 253348 195008 275846 333031
2157C33031L2633L8371o7746k6625L2808k5284L5263l2407l5206J18040R2336
$$ 333031 365664 404035 336289 309664 342472 317188 352451 320044 284838 402878 495214
2146D95214n5397M3805k0260m9022P6320K4959k010k959l9312o937O7081M2393
$$ 495214 439817 483622 463362 414340 490660 515619 513609 510650 471338 464401 531482 573875
2134E73875M6933p567l5449K6774K9295n174L3149M6862K2616P5618n7217N2395
$$ 573875 620808 613241 577792 604566 633861 628687 661836 708698 731314 806932 749715 802110
2122H02110L7610n0357M7948N9783Q6469M8429P0782j5498J19579R9673J2759
$$ 802110 839720 789363 837311 897094 983563 1031992 1102774 1087276 1206855 1306528 1319287
2111A319287L010Q7114K8426M3722J61367J21955J08232J67410J96099J68434
$$ 1319287 1322297 1409411 1437837 1481559 1642926 1764881 1873113 2040523 2236622 2405056
2101B405056J64459J49123L33367K69338K84502L39638M33551M29219L94013N46167
$$ 2405056 2569515 2718638 3052005 3321343 3605845 3945483 4379034 4808253 5202266 5748433
2091E748433O43941Q16113Q21935J050291J338285J527356J644346N06371j216393
$$ 5748433 6392374 7208487 8030422 9080713 10418998 11946354 13590700 14097071 12880678
2082A2880678j727901j854261j733446j223895r58745o96414n67013m96184m03653
$$ 12880678 11152777 9298516 7565070 6341175 5382430 4686016 4119003 3622819 3219166
2073C219166k04913j34964j50229j49298j51011j78706j52677j73903j34732q1902
$$ 3219166 3014253 2879289 2729060 2579762 2428751 2250045 2097368 1923465 1788733 1706831
2063A706831j42144j71277j8307n429j13444j9775n6742j17952m9202k2011r7837
$$ 1706831 1564687 1393410 1375103 1369674 1256230 1236455 1179713 1061761 1012559 990548 892711
2052H92711L0954k1278J4235m9416m1517r9028m2721N0523J6691q279o450l8579
$$ 892711 923665 902387 916622 867206 825689 726661 683940 734463 751154 742875 736425 697846
$$ [...]
##END NTUPLES=NMR SPECTRUM
##END=
