##TITLE=1H_CA-9007-3x
 DMSO
 8 sc, 
 6.05.2022
##JCAMPDX= 6.0         $$ Bruker NMR JCAMP-DX V2.0
##DATA TYPE= NMR SPECTRUM
##DATA CLASS= NTUPLES
##ORIGIN= UXNMR, Bruker Analytische Messtechnik GmbH
##OWNER= root
$$ XWIN-NMR		Version 3.5
$$ Fri May  6 15:57:28 2022 Russian Standard Time (UT+4h)  she@DPX200
##.OBSERVE FREQUENCY= 200.1313499996
##.OBSERVE NUCLEUS= ^1H
##.ACQUISITION MODE= SIMULTANEOUS
##.ACQUISITION SCHEME= undefined
##.AVERAGES= 8
##.DIGITISER RES= 18
##SPECTROMETER/DATA SYSTEM= spect
##.PULSE SEQUENCE= zg30
##.SOLVENT NAME= DMSO
##.SHIFT REFERENCE= (INTERNAL, DMSO, 0, 15.7546)
##AUDIT TRAIL= $$ (NUMBER, WHEN, WHO, WHERE, WHAT)
$$ ##TITLE= Audit trail, XWIN-NMR		Version 3.5
$$ ##JCAMPDX= 5.01
$$ ##ORIGIN= Bruker BioSpin GmbH
$$ ##OWNER= she
$$ F:/spectra/data/she/nmr/H-F/1/pdata/1/auditp.txt
$$ ##AUDIT TRAIL=  $$ (NUMBER, WHEN, WHO, WHERE, WHAT)
(   1,<2022-05-06 15:56:14.56 +0400>,<she>,<DPX200>,
      <created by zg, POWCHK disabled, PULCHK disabled
       configuration hash MD5:
       00 E9 B6 7A A2 85 ED C7 34 08 36 98 17 FE 4E 26
       data hash MD5: 16K
       4B 2B DA 26 52 AF 44 BB 85 E4 F5 47 3D F0 72 18>)
(   2,<2022-05-06 15:56:16.60 +0400>,<she>,<DPX200>,
      <Start of raw data processing
       efp BC_mod = 2 LB = 0.24 FT_mod = 6 PKNL = 1 PHC0 = -18032.64 PHC1 = 12.80075 SI = 16K 
       data hash MD5: 16K
       F3 BB B2 66 F0 2A 93 B5 97 8B 12 36 26 B9 53 13>)
(   3,<2022-05-06 15:56:39.42 +0400>,<she>,<DPX200>,
      <pk PHC0 = -2.61442 PHC1 = -1.2 
       data hash MD5: 16K
       93 04 D4 55 54 04 C0 4F 91 61 AF B4 97 B2 C5 91>)
(   4,<2022-05-06 15:56:42.65 +0400>,<she>,<DPX200>,
      <abs ABSG = 5 
       data hash MD5: 16K
       72 1B 8E E8 4C 28 72 EC 92 37 8D 30 F4 E4 8D 77>)
$$ ##END=
$$ 
$$ hash MD5
$$ 18 59 DA 26 20 68 8C 90 4B 6E 00 C1 44 4C EC C7
##$RELAX= 
##$RELAX= 
##$RELAX= 
##$RELAX= 
##$RELAX= 
##$RELAX= 
$$ Bruker specific parameters
$$ --------------------------
##$DU= <F:/spectra>
##$EXPNO= 1
##$NAME= <H-F>
##$PROCNO= 1
##$TYPE= <nmr>
##$USER= <she>
##$AMP= (0..31)
100 100 100 100 100 100 100 100 100 100 100 100 100 100 100 100 100 100 
100 100 100 100 100 100 100 100 100 100 100 100 100 100 
##$AQSEQ= 0
##$AQ_mod= 1
##$AUNM= <au_zg>
##$AUTOPOS= <>
##$BF1= 200.13
##$BF2= 200.13
##$BF3= 200.13
##$BF4= 200.13
##$BF5= 200.13
##$BF6= 200.13
##$BF7= 200.13
##$BF8= 200.13
##$BYTORDA= 1
##$CFDGTYP= 0
##$CFRGTYP= 5
##$CHEMSTR= <none>
##$CNST= (0..31)
1 1 145 1 1 1 1 1 1 1 1 1 1 1 1 1 1 1 1 1 1 1 1 1 1 1 1 1 1 1 1 1 
##$CPDPRG= <>
##$CPDPRG1= <>
##$CPDPRG2= <>
##$CPDPRG3= <>
##$CPDPRG4= <mlev>
##$CPDPRG5= <mlev>
##$CPDPRG6= <mlev>
##$CPDPRG7= <mlev>
##$CPDPRG8= <mlev>
##$CPDPRGB= <>
##$CPDPRGT= <>
##$D= (0..31)
0 1.2 0 0 0 0 0 0 0 0.06 0 0.03 0 0 0 0 0.0002 0 0 0 0 0 0 0 0 0 0 0 0 
0 0 0 
##$DATE= 1651838173
##$DBL= (0..7)
120 120 120 120 120 120 120 120 
##$DBP= (0..7)
150 150 150 150 150 150 150 150 
##$DBP07= 0
##$DBPNAM0= <>
##$DBPNAM1= <>
##$DBPNAM2= <>
##$DBPNAM3= <>
##$DBPNAM4= <>
$$ [...]
##$SUBNAM2= <"">
##$SUBNAM3= <"">
##$SUBNAM4= <"">
##$SUBNAM5= <"">
##$SUBNAM6= <"">
##$SUBNAM7= <"">
##$SUBNAM8= <"">
##$SUBNAM9= <"">
##$SW= 18.0517283424761
##$SWIBOX= (0..15)
0 0 2 0 0 0 0 0 0 0 0 0 0 0 0 0 
##$SW_h= 3612.71676300578
##$TD= 16384
##$TD0= 1
##$TE= 0
##$TE2= 300
##$TE3= 300
##$TEG= 300
##$TL= (0..7)
0 120 120 120 120 120 120 120 
##$TP= (0..7)
150 150 150 150 150 150 150 150 
##$TP07= 0
##$TPNAME0= <>
##$TPNAME1= <>
##$TPNAME2= <>
##$TPNAME3= <>
##$TPNAME4= <>
##$TPNAME5= <>
##$TPNAME6= <>
##$TPNAME7= <>
##$TPOAL= (0..7)
0.5 0.5 0.5 0.5 0.5 0.5 0.5 0.5 
##$TPOFFS= (0..7)
0 0 0 0 0 0 0 0 
##$TUNHIN= 0
##$TUNHOUT= 0
##$TUNXOUT= 0
##$USERA1= <user>
##$USERA2= <user>
##$USERA3= <user>
##$USERA4= <user>
##$USERA5= <user>
##$V9= 5
##$VALIST= <valist>
##$VCLIST= <CCCCCCCCCCCCCCC>
##$VD= 0
##$VDLIST= <DDDDDDDDDDDDDDD>
##$VPLIST= <PPPPPPPPPPPPPPP>
##$VTLIST= <TTTTTTTTTTTTTTT>
##$WBST= 1024
##$WBSW= 4
##$XGAIN= (0..3)
0 0 0 0 
##$XL= 0
##$YL= 0
##$YMAX_a= 163165
##$YMIN_a= -318000
##$ZGOPTNS= <>
##$ZL1= 120
##$ZL2= 120
##$ZL3= 120
##$ZL4= 120
##$ABSF1= 15.73147
##$ABSF2= -2.320379
##$ABSG= 5
##$ABSL= 3
##$ALPHA= 0
##$AQORDER= 0
##$ASSFAC= 0
##$ASSFACI= 0
##$ASSFACX= 0
##$ASSWID= 0
##$AUNMP= <proc_1d>
##$AZFE= 0.1
##$AZFW= 0.1
##$BCFW= 0
##$BC_mod= 2
##$BYTORDP= 0
##$COROFFS= 0
##$CY= -3
##$DATMOD= 1
##$DC= 0
##$DFILT= <>
##$DTYPP= 0
##$F1P= 0
##$F2P= 0
##$FCOR= 1
##$FTSIZE= 16384
##$FT_mod= 6
##$GAMMA= 0
##$GB= 0
##$INTBC= 1
##$INTSCL= 0
##$ISEN= 128
##$LB= 0.24
##$LEV0= 0
##$LPBIN= 0
##$MAXI= 10000
##$MC2= 0
##$MEAN= 0
##$ME_mod= 0
##$MI= 1.114404
##$NCOEF= 0
##$NC_proc= -8
##$NLEV= 6
##$NOISF1= 3.799351
##$NOISF2= 2.8
##$NSP= 0
##$NTH_PI= 0
##$NZP= 0
##$OFFSET= 15.7546
##$PC= 1
##$PHC0= -18035.26
##$PHC1= 11.60075
##$PH_mod= 1
##$PKNL= yes
##$PPARMOD= 0
##$PSCAL= 0
##$PSIGN= 0
##$REVERSE= no
##$SF= 200.130003390027
##$SI= 16384
##$SIGF1= 3
##$SIGF2= 2
##$SINO= 5.538805
##$SIOLD= 16384
##$SREGLST= <1H.CDCl3>
##$SSB= 0
##$STSI= 16384
##$STSR= 0
##$SW_p= 3612.71676300578
##$SYMM= 0
##$S_DEV= 0
##$TDeff= 16384
##$TDoff= 0
##$TI= <>
##$TILT= no
##$TM1= 0
##$TM2= 0
##$TOPLEV= 0
##$USERP1= <user>
##$USERP2= <user>
##$USERP3= <user>
##$USERP4= <user>
##$USERP5= <user>
##$WDW= 1
##$XDIM= 16384
##$YMAX_p= 315792506
##$YMIN_p= -2042549
$$ End of Bruker specific parameters
$$ ---------------------------------
##NTUPLES= NMR SPECTRUM
##VAR_NAME=  FREQUENCY,     SPECTRUM/REAL,   SPECTRUM/IMAG
##SYMBOL=    X,             R,               I
##VAR_TYPE=  INDEPENDENT,   DEPENDENT,       DEPENDENT
##VAR_FORM=  AFFN,          ASDF,            ASDF
##VAR_DIM=   16384,         16384,           16384
##UNITS=     HZ,            ARBITRARY UNITS, ARBITRARY UNITS
##FACTOR=    0.220516191357247, 1,           1
##FIRST=     3152.96806559838, 0,            0
##LAST=      -459.748697407397, 0,           0
##MIN=       -459.748697407397, -2042549,    0
##MAX=       3152.96806559838, 315792506,    0
$$ Real data points
##PAGE= N=1
##DATA TABLE= (X++(R..R)), XYDATA
$$ [...]
6509B005176M7882J0544L45457j63809k80403j55547J02452J76962J70210M69925
6499B728849l67257M58320j37035l9742n5407j39003j51738M40341l006l26252
6489B408070J09664M651j85661l4847Q4592L4153O09507n5462l33380k00248M04427
6478B845466k04872r5528K130J44724k82187J05087L81141J40755J0121J33999
6468C180836n8579j72055J3939K75183l68009M1101K80433J71089P801n4809j03002
6457C213928j72276n07532J45555j90179n1269K75200N14842j78387j72013J04453
6447B982322j41820r8552N42379M41317k91604J27447m71506o5294l39865p469
6437B677355N4866J44978J30656j28917k3101p1341K61749K23974R7801J38405
$$ plain form
6509 2005176 2053058 2063602 2409059 2245250 1964847 1809300 1911752 2088714 2258924 2728849
6499 2728849 2361592 2819912 2682877 2643135 2587728 2448725 2296987 2737328 2734322 2408070
6489 2408070 2517734 2522385 2336724 2301877 2386469 2420622 3030129 2974667 2641287 2441039 2845466
6478 2845466 2640594 2545066 2547196 2691920 2409733 2514820 2895961 3036716 3046837 3180836
6468 3180836 3122257 2950202 2964141 3239324 2871315 2912416 3192849 3363938 3371739 3316930 3213928
6457 3213928 3041652 2534120 2679675 2489496 2438227 2713427 3228269 3049882 2877869 2982322
6447 2982322 2840502 2741950 3284329 3725646 3434042 3561489 3089983 3024689 2684824 2677355
6437 2677355 2732221 2877199 3007855 2878938 2855837 2784496 3046245 3270219 3368020 3506425
6427C506425l012J64145J72772m05989j75378k18941p2693P8644O4215K81233
6417C391421j02479K29483L81974j64058q32495J77856m1621j99968L37226M89555
6407C666894k68149J54604l60788o8064J97258l1911J69816j06933M7792L00183
6397C700702R5792j09249K13836J21439j8662J11610l8902j08977J42953l61265
6387C749277k29878J70134k77314o5285Q5097K04408q2186j79432M77913K01308
6377D054042j54729M8613R6941J3940k14721k02151L42124J38018j47049L841
6367C978869J06538J42416l79842j12736J49077L83963l7438j40482L79581L2817
6357D502763k98645P9235n780K37496K6632J42024J36127n76452N4494L89360
$$ plain form
6427 3506425 3503413 3667558 3840330 3434341 3258963 3040022 2967329 3045973 3110188 3391421
6417 3391421 3288942 3518425 3900399 3736341 2903846 3081702 3040081 2840113 3177339 3666894
6407 3666894 3398745 3553349 3192561 3124497 3321755 3289844 3459660 3352727 3400519 3700702
6397 3700702 3796494 3687245 3901081 4022520 4003858 4115468 4076566 3967589 4110542 3749277
6387 3749277 3519399 3689533 3412219 3346934 3432031 3636439 3554253 3374821 3852734 4054042
6377 4054042 3899313 3947926 4044867 4058807 3844086 3641935 3984059 4122077 3975028 3978869
6367 3978869 4085407 4227823 3847981 3735245 3884322 4268285 4230847 4090365 4469946 4502763
6357 4502763 4204118 4283353 4277573 4515069 4541701 4683725 4819852 4243400 4297894 4687254
6347D687254r2916R273k44337K6019K56362k24268P5212J72963L51102P4294l19877
6336D771081o7889K43521O3395R6707K95700j9794m07165L20152K25505K58841
6326E780054L20493m22909p2028k32375K51094O80534k07199k85652k53411L5060
6316E593661J69533N35377k7617q6583k25781l19541L34893Q1493j62119L71292
6306F264608K21405K22166p7648k18260J15865k44467J09849K24442j77988K4045
6296F464017N879K23541K29141p5407m10500N45664M29057J38845L54183q2117
6286G822303N6043P9640L14145k18531k21080o6708K13478K30253J28106L3716
6276H371365P674M90584R9866L18982j65221j58388L611L05278O2640J83393M27304
$$ plain form
6347 4687254 4594338 4603611 4359274 4385293 4641655 4417387 4492599 4665562 5016664 5090958 4771081
6336 4771081 4703192 4946713 5010108 5106815 5402515 5382721 4975556 5295708 5521213 5780054
6326 5780054 6100547 5677638 5605610 5373235 5624329 6304863 6097664 5812012 5558601 5593661
6316 5593661 5763194 6298571 6270954 6184371 5958590 5639049 5973942 6055435 5893316 6264608
6306 6264608 6486013 6708179 6630531 6412271 6528136 6283669 6393518 6617960 6439972 6464017
6296 6464017 6469896 6693437 6922578 6847171 6436671 6982335 7411392 7550237 7904420 7822303
6286 7822303 7878346 7957986 8272131 8053600 7832520 7765812 7979290 8209543 8337649 8371365
6276 8371365 8379039 8869623 8969489 9288471 9123250 8964862 8968473 9273751 9336391 9519784 9947088
6265I947088J90763l21347N378J78885N31912K05235K47742O3821p3070O41491
6255A1617898j74653K87151J49459P6389M23776M07231M37237O50100j59162K89007
6245A4004433R13952r5615L15404O15416K67444Q3905P13754L97528J12462O320
6235A7335003P98246J016050M70445R04347M97133P16750J128567O51996R13431
6226B4431968J406179J110109Q28741J056442J006802L52219R91068J082837P96490
6217C3062855N69277P69235N94528M67536L27943P26215P8722K33297K64964p1697
6207C7022875K32356Q4306Q3502M81J17674L12522k89235o66144p27391o66057
6197C5504889p68405q27283p43879n91495q24834j073051o47112o31519m32041
$$ plain form
6265 9947088 10137851 9816504 9821882 10000767 10532679 10737914 10985656 11049477 10976407 11617898
6255 11617898 11443245 11730396 11879855 11956244 12380020 12787251 13224488 13874588 13715426 14004433
6245 14004433 14918385 14822770 15138174 15753590 16021034 16104939 16818693 17216221 17328683 17335003
6235 17335003 18133249 19149299 19619744 20524091 21021224 21737974 22866541 23518537 24431968
6226 24431968 25838147 26948256 27776997 28833439 29840241 30192460 31183528 32266365 33062855
6217 33062855 33632132 34401367 34995895 35463431 35791374 36517589 36596311 36829608 37094572 37022875
6207 37022875 37255231 37339537 37423039 37423520 37541194 37853716 37564481 36898337 36170946 35504889
6197 35504889 34736484 33909201 33165322 32573827 31748993 30675942 30028830 29397311 28965270
6188B8965270m56185m21684l6741n08789l03805j3773j44427m24688K1015k86129
6178B6390064J79421K48823P34373K66081J09797O08973J27115N22193O59195
6169B9846035J129824O65128N01348J012970J238513J197590J116513J094241
6161C7802162J194587J277216J568768J328165Q86557J618765J659402J054492
6153D8390114J148248R73679P36417N24220N15953J78660K95959p5638n84035
6144E2103577J21675N12502N0493k33086l80917j111667j15669j012559j423445
6135D8510904o79507j016663j384283j393403j246427j562809j552760j719697
6127C7955355j283901j598421j643481j251716o08400j323630j336535r45625
$$ plain form
6188 28965270 28509085 28087401 28050660 27541871 27238066 27224293 27079866 26655178 26676193 26390064
6178 26390064 26569485 26818308 27552681 27818762 27928559 28537532 28664647 29186840 29846035
6169 29846035 30975859 31640987 32142335 33155305 34393818 35591408 36707921 37802162
6161 37802162 38996749 40273965 41842733 43170898 44057455 45676220 47335622 48390114
6153 48390114 49538362 50512041 51248458 51772678 52288631 52467291 52763250 52687612 52103577
6144 52103577 52225252 52737754 52788247 52555161 52174244 51062577 50946908 49934349 48510904
6135 48510904 47831397 46814734 45430451 44037048 42790621 41227812 39675052 37955355
6127 37955355 36671454 35073033 33429552 32177836 31569436 30245806 28909271 27963646
6119B7963646j087908j013918p37131r36643o45779j058678k84867j56504j010871
6110B1031347o43505k55352m03252L6173k32089l56766o33591m72025j77867j38929
6100A7754144P812j20521o2432l17504M8614l25604l47486q7922m51148J87237
6090A6285190K49054k03216q9935l00578j29955l54809L29520j75169j70209K48577
6080A5688470p9728j07293k21714J86116J05487J27000j12910K84452j24852l4094
6070A5710934k80150m09288J97526J23684P5079j09677J28241k11387M24717O8911
6060A5718590l4904L46767j11967k36068K86577k28148o2176O631O9596Q6641
6050A5841539j72608J48522K56774O0178q3842o6799J17596j83821M19879J94014
$$ plain form
6119 27963646 26875738 25861820 25124689 24188046 23542267 22483589 22198722 22042218 21031347
6110 21031347 20387842 20132490 19729238 19765411 19533322 19176556 18542965 18070940 17893073 17754144
6100 17754144 17761956 17641435 17579003 17261499 17310113 16984509 16637023 16549101 16097953 16285190
6090 16285190 16534244 16331028 16241093 15940515 15810560 15455751 15785271 15610102 15439893 15688470
6080 15688470 15608742 15501449 15279735 15465851 15571338 15698338 15585428 15869880 15745028 15710934
6070 15710934 15430784 15021496 15219022 15342706 15417785 15308108 15436349 15224962 15649679 15718590
6060 15718590 15683686 16030453 15918486 15682418 15968995 15740847 15678671 15685302 15754898 15841539
6050 15841539 15668931 15817453 16074227 16134405 16050563 15983764 16101360 15917539 16337418 16531432
6040A6531432J74737p3313m11914O56194J21186N01687k32808J05677O9906q6929
6030A7355855l0783L7579J32614L99162J08842M67863j11120L7151R2213k35369
6020A8254007K7104L48857Q1621j5128L89319J65816j71386J31461M77077K84487
6010A9973235N78102j24857J05644M67204o1969K28929K21845k66765L28518K02988
6000B1652874N50140L97988K1486J57070L03535J90956M75816P74046L34465K21141
5990B5079517J23087M97072P08248J53165N03454J35015N19168N66166Q52351
5981B9137243N09235N04491J062353N30149M61735J307317Q95412P28388O90494
5972C5826817R11464R44268J805437J110714Q69047J140813R89689J298067J173814
$$ plain form
6040 16531432 16706169 16632856 16220942 16877136 16998322 17500009 17267201 17372878 17442784 17355855
6030 17355855 17325072 17362651 17495265 17894427 18003269 18471132 18360012 18397163 18489376 18254007
6020 18254007 18281111 18629968 18711589 18696461 19085780 19251596 19080210 19211671 19688748 19973235
6010 19973235 20551337 20426480 20532124 20999328 20937359 21166288 21388133 21121368 21449886 21652874
6000 21652874 22203014 22601002 22622488 22779558 23083093 23274049 23749865 24523911 24858376 25079517
5990 25079517 25202604 25699676 26407924 26561089 27064543 27199558 27718726 28284892 29137243
5981 29137243 29646478 30150969 31213322 31743471 32205206 33512523 34407935 35136323 35826817
5972 35826817 36738281 37682549 39487986 40598700 41467747 42608560 43598249 44896316 46070130
5963D6070130Q89902R83466J231420Q67643R10091Q29057L75309M58658J76094
5954E2791770j47862r2649q3622J89226k46685j25413m11625m71487m96063l39606
5944E0565984j00262l54774J84657N40452k08270L56089k38142L6099M46560K88184
5934E1516577J322460J216661Q00727M80993O95301Q69472N34881R35372O91075
5925E9063519N15560M61510M33586M69050J72641k95704j70780l01565j94312
5916F0153505k01609j85367j80465m40785k99988J10930J68687k62820R1586l05627
5906E8648047M75091O22707K94971L07887L90869L58195P55231Q73868N94266
5897F3321132J361642M24913M82230R90832O23098K33445Q8868N47520P58790
$$ plain form
5963 46070130 46960032 47943498 49174918 50042561 50952652 51781709 52157018 52615676 52791770
5954 52791770 52643908 52551259 52467637 52656863 52410178 52284765 51873140 51401653 50905590 50565984
5944 50565984 50465722 50110948 50295605 50836057 50627787 50983876 50745734 50781833 51228393 51516577
5934 51516577 52839037 54055698 54856425 55337418 56032719 56902191 57437072 58372444 59063519
5925 59063519 59579079 60040589 60474175 60943225 61115866 60820162 60649382 60347817 60153505
5916 60153505 59951896 59766529 59586064 59145279 58845291 58956221 59124908 58862088 58953674 58648047
5906 58648047 59123138 59745845 60040816 60348703 60739572 61097767 61852998 62726866 63321132
5897 63321132 64682774 65107687 65589917 66580749 67203847 67437292 67526160 68073680 68832470
5888F8832470j36778l2920O01553N33457L4933K26433K64619K64676J34071K83401
5878G1005915P65895O03635N80095N74537N71504M67473N15881J304216J070338
5869G7459489J86203M12315M66769R87645J466551P94143P27088R29598R59081
5860H4388882J108364P41054P8822N5592j39245m46578k52280q42794j86772n03860
5850H4001185o09249m31996o27327o03779m77134m58534q14731k50483M4454j63514
5840G9608892p6616N0570o64468J48540m9038J12752k80012k58827o69093j76057
5830G7746643n38442m01044R252p92584j60657p53582l39725k31090n25774J37057
5820G4150054o9958o20314n10632q74208j86915O02975j09802o95256j63318p25810
$$ plain form
5888 68832470 68695692 68662772 69264325 69797782 69832715 70059148 70323767 70588443 70722514 71005915
5878 71005915 71771810 72375445 72955540 73530077 74101581 74569054 75084935 76389151 77459489
5869 77459489 77645692 78058007 78524776 79512421 80978972 81773115 82500203 83429801 84388882
5860 84388882 85497246 86238300 86317122 86372714 86233469 85786891 85534611 84691817 84505045 84001185
5850 84001185 83391936 82959940 82332613 81728834 81251700 80793166 79978435 79727952 79772406 79608892
5840 79608892 79532276 79582846 78918378 79066918 79017880 79130632 78850620 78591793 77922700 77746643
5830 77746643 77208201 76807157 76816409 76023825 75863168 75109586 74769861 74538771 74012997 74150054
5820 74150054 74080096 73459782 72949150 72074942 71888027 72491002 72381200 71685944 71522626 70796816
5810G0796816p27483o6068j16381l92492m72158q18023k86352j18912J88222m90358
5800F7496811l44419j37702r9414k05826k60305J20481m90200n12279k19652l46229
5790F5001266n36232K90822K06699m32588m0811L7552k27310J64385l8632j97310
5780F4227841Q7136M84139L34608l31228O7478Q1681J02624M1504P1133M97042
5770F5663958Q1529O66996M94457J2908M67243K34368K9054M43149M39222P10867
5760F9243751K96949M36626L19873M50075L41866M43166K14683P25006R49424
5751G3421419K07513M58590M30019J32343P08064R19057M37095M16565N45833
5742G7676498M85367K13713N11632L99274N07109P95837Q70208L87479Q58210
$$ plain form
5810 70796816 70069333 70003265 69886884 69494392 69022234 68204211 67917859 67798947 67987169 67496811
5800 67496811 67152392 67014690 66915276 66709450 66449145 66569626 66079426 65567147 65347495 65001266
5790 65001266 64465034 64755856 64962555 64529967 64489156 64526708 64299398 64463783 64425151 64227841
5780 64227841 64314977 64799116 65133724 64802496 64869974 64951655 65054279 65095783 65166916 65663958
5770 65663958 65745487 66412483 66906940 66919848 67387091 67621459 67650513 68093662 68532884 69243751
5760 69243751 69540700 69977326 70297199 70747274 71089140 71532306 71746989 72471995 73421419
5751 73421419 73628932 74087522 74517541 74649884 75357948 76277005 76714100 77130665 77676498
5742 77676498 78161865 78375578 78887210 79286484 79793593 80589430 81459638 81847117 82705327
5733H2705327P61917L18549O26753O15545P49921R33580K71680O32748N84720
5724H8200740O62613O36466L79005J4244P50290R56806J196901P71600N00283
5715I4068948Q82959M57970J04549O65665O48488M68823J254446P79017J10224
5706I9441089R07010K60500Q15431P28992O77620M45115J056986Q95696M9969
5697A05278408O21748K65180J175499N70233N04513N97697L72533N37719Q97173
5688A10820703N08257M27657O15165M58023M46794O17575O34448M98941L53177
5679A15380740P78196Q46549L55060Q18877N34958M79343N70686M1873L72766
5670A20179048j57376K23736P78358N80521L74928p1755K72055L55609L15541
$$ plain form
5733 82705327 83467244 83785793 84412546 85028091 85778012 86711592 86983272 87616020 88200740
5724 88200740 88863353 89499819 89878824 89893068 90643358 91600164 92797065 93568665 94068948
5715 94068948 94951907 95409877 95514426 96180091 96828579 97297402 98551848 99330865 99441089
5706 99441089 100348099 100608599 101424030 102153022 102830642 103275757 104332743 105228439 105278408
5697 105278408 105900156 106165336 107340835 107911068 108415581 109013278 109385811 109923530 110820703
5688 110820703 111328960 111756617 112371782 112829805 113276599 113894174 114528622 115027563 115380740
5679 115380740 116158936 117005485 117360545 118179422 118714380 119193723 119764409 119806282 120179048
5670 120179048 120021672 120245408 121023766 121604287 121979215 121907460 122179515 122535124 122850665
5661A22850665L38415L41169O07779N6511J28860j83745k60517J26395L97148
5652A24402680L46273K60178Q5703K9954R6542j2769k85428K41466K68440L49991
5642A25783030K4030m09545k46686q6060k02557L4624K58439k30673o88855j63060
5632A24072687k50795k51694M7358j20391m85900k45317q43478m31726q1943k12207
5622A21196594l14769k92689J43914m45851m57529l50218p84662k14750k89901
5613A18190139k01999q27532q50056m86502q52814p74942o79274l07495m98181
5604A12711344m38688l34566l97988j142890n59920l65014q47640n52159q89303
5595A07183176l57777n11168p03110n0117j005978m73942k31312l43943o78835
$$ plain form
5661 122850665 123189080 123530249 124138028 124194539 124323399 124139654 123879137 124005532 124402680
5652 124402680 124748953 125009131 125094834 125124788 125221330 125208561 124923133 125164599 125433039 125783030
5642 125783030 125807060 125397515 125150829 125064769 124862212 124896836 125155275 124924602 124235747 124072687
5632 124072687 123821892 123570198 123617556 123497165 123011265 122765948 121922470 121490744 121408801 121196594
5622 121196594 120881825 120589136 120733050 120287199 119829670 119479452 118694790 118480040 118190139
5613 118190139 117988140 117160608 116310552 115824050 114971236 114196294 113517020 113209525 112711344
5604 112711344 112272656 111938090 111540102 110397212 109837292 109472278 108624638 108072479 107183176
5595 107183176 106825399 106314231 105611121 105561004 104555026 104081084 103849772 103505829 102826994
5586A02826994q32245n92835p82518o83248j53974j002322j098964p47783j060853
5577I5872252l76100p45027j106920j21418k91224n02834j027028q42041n86564
5568I0273096o57078j42648o59959q06008p93133o60542l15322l23048o16752
5559H5298606l8966l25031r16228o07513n27447j09680m21899o51121n45476k79400
5549H0875845o38848M6219o38753p68225j48442n29894l44531n29171n94742p0991
5539G6658467k47487k69247m60475k91417j00595O1135o87187k6594o4576k84470
5529G4287554P8831M38793K09814P365L62945O1886J58694l76850M18415k80764
5519G5366683n7559j23162l99947k3315n82638J04134J06253m06811j72507L800
$$ plain form
5586 102826994 101994749 101401914 100619396 99936148 99782174 98779852 97680888 96933105 95872252
5577 95872252 95496152 94751125 93644205 93522787 93231563 92728729 91701701 90859660 90273096
5568 90273096 89616018 89473370 88813411 88007403 87214270 86553728 86238406 85915358 85298606
5559 85298606 85259640 84934609 84018381 83410868 82883421 82773741 82351842 81700721 81155245 80875845
5549 80875845 80236997 80283216 79644463 78876238 78727796 78197902 77853371 77324200 76729458 76658467
5539 76658467 76410980 76141733 75681258 75389841 75289246 75350381 74663194 74636600 74572024 74287554
5529 74287554 74366385 74805178 75014992 75022357 75385302 75447188 75605882 75229032 75647447 75366683
5519 75366683 75309124 75185962 74786015 74762700 74180062 74284196 74390449 73983638 73811131 73814931
5509G3814931J86502j2314K74734K23635O3103K8698P31388O04195L46979P41162
5499G7003013K17562L22625N13842J222Q0956P19009M67407O74363J110162P92036
5489H1902197L61672J258322Q07603J265475J318703J536424J272778J431945
5481I1155119K666556K202508K445993K612345L098618L245223L889467L578951
5473A14894780L414210L669752L735351L442699K601576K097063K132779J632747
5465A37620957J457233J197727J325107J664449J287635J153458J075944P08616
5457A47491126K37535J36601L08480j36655l98365m01864l12530j84484m42668
5448A46297176j335051p85670r63083j216649j937884j956694j690517j620496
$$ plain form
5509 73814931 74001433 73989119 74263853 74487488 74550591 74579289 75310677 75914872 76261851 77003013
5499 77003013 77220575 77543200 78057042 78058264 78139220 78858229 79325636 79999999 81110161 81902197
5489 81902197 82263869 83522191 84329794 85595269 86913972 88450396 89723174 91155119
5481 91155119 93821675 96024183 98470176 101082521 104181139 107426362 111315829 114894780
5473 114894780 118308990 121978742 125714093 129156792 131758368 133855431 135988210 137620957
5465 137620957 139078190 140275917 141601024 143265473 144553108 145706566 146782510 147491126
5457 147491126 147728661 147865262 148173742 148037087 147638722 147236858 146924328 146739844 146297176
5448 146297176 144962125 144176455 143213372 141996723 140058839 138102145 136411628 134791132
5440A34791132j444268j146692m99882p49203j497429j086309j535720k111954
5432A24719675k525357k754273l008234l450331k724427l163443k941718k855864
5424A01296028k295160k477297j707768j918263j322768j497322j600583j298859
5416H7178008j302761j279960o91201n54422q15313m66427k37284r009m56911
5407H1364720m8930l15654L3690j183842m68744l97525q01770n44764m25218k07594
5397G7004369l09066q26434p22265o5841R9656n44803p08124l0750j622j61524
5387G3733596j96224o94631l18568m19797q34742q39495q24980r96761p35220
5378F7873178n76882p89755r96253j176660r65689j276707j016754j096553j056576
$$ plain form
5440 134791132 133346864 132200172 131700290 130951087 129453658 128367349 126831629 124719675
5432 124719675 122194318 119440045 116431811 112981480 110257053 107093610 104151892 101296028
5424 101296028 99000868 96523571 94815803 92897540 91574772 90077450 88476867 87178008
5416 87178008 85875247 84595287 83904086 83349664 82534351 82067924 81830640 81821631 81364720
5407 81364720 81315790 81000136 81033826 79849984 79381240 78983715 78181945 77637181 77211963 77004369
5397 77004369 76695303 75868869 75146604 75080763 75180419 74635616 73927492 73896742 73895120 73733596
5387 73733596 73537372 72842741 72524173 72104376 71269634 70430139 69605159 68608398 67873178
5378 67873178 67296296 66506541 65510288 64333628 63367939 62091232 61074478 59977925 58921349
5369E8921349j412787j032094j445223j289188q72494j287059j067342r66042
5361D9549120j238016j202958j333362j028719j135689j140517q61563j587515
5353D0020781j213294n10008m51852j103519q37596j42729l84125m45121o50642
5344C4281895n64767p44101o82434n27480j77481m30961m84301j41946m11638
5335C0116786j77826m99351k62561r7455k26394m5840m54253n84026l09842J05977
5325B7565215K69414l77958m17337J36740m67617J7556K32453Q0084k73796J68326
5315B6933080K7588p731Q2310M43167j23061l3717M32635J15074o8905K62871
5305B8063311K77642L60766l5153M6940P8690K08533L62506L03724M91519l08503
$$ plain form
5369 58921349 57508562 56476468 55031245 53742057 52869563 51582504 50515162 49549120
5361 49549120 48311104 47108146 45774784 44746065 43610376 42469859 41608296 40020781
5353 40020781 38807487 38297479 37845627 36742108 35904512 35761783 35377658 34932537 34281895
5344 34281895 33717128 32973027 32290593 31763113 31585632 31154671 30670370 30528424 30116786
5335 30116786 29938960 29439609 29177048 29079593 28853199 28807359 28353106 27769080 27459238 27565215
5325 27565215 27834629 27456671 27039334 27176074 26708457 26726013 26958466 27038550 26764754 26933080
5315 26933080 26960668 26952937 27035247 27478414 27355353 27321636 27754271 27869345 27800440 28063311
5305 28063311 28340953 28701719 28666566 28713506 28792196 29000729 29363235 29666959 30158478 29849975
5295B9849975r9834J57440K10837k1176m61693L55275K28211m3186J7724K49908
5285C0443481L76466N9204K1176J68269N33300M44632M74966P3292L35268J10822
5275C3040876N37248K18162K97508M68397J56415K64256j27180P5128M08431J23148
5265C5462389N56348j6477O7659O13972N46629j97374L05898O04115K70262O01489
5255C8814910j97450l5852L36501K42238N95760j3032k74301K18525K53866l0551
5245C9910614L07587L14549n6481j09139j75685K23743K83512P37684J22426k29341
5235D1329469J22154j64492K55548o8711Q964R334J96580J27985k94051k44418
5225D1278362l5335L57923l01565o46380p6005R3568M8735k11405m45644r3836
$$ plain form
5295 29849975 29750141 29907581 30118418 30097242 29635549 29990824 30219035 30175849 30193573 30443481
5285 30443481 30819947 30879151 30900327 31068596 31601896 32046528 32521494 32594786 32930054 33040876
5275 33040876 33578124 33796286 34093794 34562191 34718606 34982862 34855682 34930810 35339241 35462389
5265 35462389 36018737 36002260 36069919 36683891 37230520 37033146 37339044 37943159 38213421 38814910
5255 38814910 38617460 38581608 38918109 39160347 39756107 39743075 39468774 39687299 39941165 39910614
5245 39910614 40218201 40532750 40476269 40367130 40191445 40415188 40698700 41436384 41558810 41329469
5235 41329469 41451623 41287131 41542679 41473968 41482932 41492266 41688846 41816831 41522780 41278362
5225 41278362 41243027 41600950 41299385 40653005 40577000 40670568 40719303 40507898 40062254 39968418
5215C9968418J4441m86919P9368k99925j92120j87028k67212l13875K0427O6307
5205C8401882r5904O4395n00867k86332k46760j33029Q45366J24463j83413K25082
5195C8214883O0496l34720k38063k06233m26545o2623l2576o87419l21645l79619
5185C5585936l66220J37668n28022p04304l15959n150q23080r8562l34836l00137
5175C2247334k10795l46146m62737k88798j89123k02821p7234n33854l63702m3944
5165B9528180n32982m38975N2959p1436m840o4989l92059m03986m32026q0257
5155B7159589l22575m86440l71881J24926R9603J11763o79583k49306M28923q7711
5145B5727308j27904k08485n5360j22903j4686J87484m4119r1553j90482l46279
$$ plain form
5215 39968418 39982859 39495940 39575308 39275383 39083263 38896235 38629023 38315148 38335575 38401882
5205 38401882 38305978 38370373 37869506 37583174 37336414 37203385 38048751 38173214 37989801 38214883
5195 38214883 38275379 37940659 37702596 37496363 37069818 37007195 36974619 36287200 35965555 35585936
5185 35585936 35219716 35357384 34829362 34125058 33809099 33803949 32980869 32882307 32547471 32247334
5175 32247334 32036539 31690393 31227656 30938858 30749735 30546914 30469680 29935826 29572124 29528180
5165 29528180 28995198 28556223 28609182 28537746 28532906 28467917 28075858 27671872 27239846 27159589
5155 27159589 26837014 26350574 25978693 26103619 26203222 26314985 25635402 25386096 25815019 25727308
5145 25727308 25599404 25390919 25335559 25212656 25197970 25385454 25341335 25249782 25059300 24713021
5135B4713021J83865j94344m3280o65919m31901l17437M5213j73021K8244j05544
5125B3038897p24526m51845j27378J06775L10395m0896l43740M15147K97163L99765
5115B2879757q6489K90138j7587N17228k8460M72402L58837Q1023J02385O90717
5105B5259951N36121J09283Q36464r8933L03026K529J1053N75472K19932J54596
5095B7909494j46009l22843p0131K46049q7944K1184j04799m36529J84171j07859
5085B7084784o4681L7641K10581q0546J30912N44919L00139l8220l2970j23984
5075B7968575k94057P484J48671K60550J75338k32261m0173k52923L22069k6895
5065B8036378k06527k11670l85179M5640k04680n4660J95011N79793o22729J48875
$$ plain form
5135 24713021 24896886 24702542 24659262 23993343 23561442 23244005 23289218 23116197 23144441 23038897
5125 23038897 22314371 21862526 21735148 21841923 22152318 22111422 21767682 22182829 22479992 22879757
5115 22879757 22793268 23083406 23065819 23583047 23554587 24026989 24385826 24466849 24569234 25259951
5105 25259951 25796072 25905355 26741819 26642886 26945912 26948441 26959494 27534966 27754898 27909494
5095 27909494 27763485 27440642 27370511 27616560 27528616 27549800 27445001 27008472 27192643 27084784
5085 27084784 27020103 27057744 27268325 27187779 27318691 27863610 28163749 28125529 28092559 27968575
5075 27968575 27674518 27682002 27830673 28091223 28266561 28034300 27994127 27741204 28063273 28036378
5065 28036378 27829851 27618181 27233002 27278642 27073962 27019302 27214313 27794106 27171377 27320252
5055B7320252k72680l25228Q67667K68970q7507j53228P15089N1599N0594K21452
5045B8656980K50880K04177J08277L29972J5512L81236P36910M37577L11074O41940
5035C2074535J024444P5886N69380M63660Q21641J027056M05538Q21109O35965
5026C7919214O93300M60213n2657J71198K12958K42455J4961J246j20259j25875
5016C9416754j94035k21326R9902L7920K54720l26629j52166J5091M01239J62062
5006C9493532o7031j07328L08150N0024j4177M96185J58468K48384O42251K13745
4996D1422203K59313J00026J47808j64060M35892K57798o35271N48837J92454
4987D2565000Q8065k82734p0536R7979K15822M29380L9262J6116l42582J47710
$$ plain form
5055 27320252 27047572 26722344 27590011 27858981 27771474 27618246 28333335 28384934 28435528 28656980
5045 28656980 28907860 29112037 29220314 29550286 29565798 29947034 30683944 31121521 31432595 32074535
5035 32074535 33098979 33174865 33744245 34207905 35029546 36056602 36462140 37283249 37919214
5026 37919214 38612514 39072727 39020070 39191268 39404226 39646681 39661642 39662888 39542629 39416754
5016 39416754 39222719 39001393 39101295 39139215 39393935 39067306 38915140 38930231 39331470 39493532
5006 39493532 39426501 39319173 39627323 39677347 39663170 40159355 40317823 40566207 41208458 41422203
4996 41422203 41681516 41781542 41929350 41765290 42201182 42458980 41823709 42372546 42565000
4987 42565000 42653065 42370331 42299795 42397774 42613596 43042976 43082238 43098354 42755772 42903482
4977D2903482M9657k44167m87182k25132M5052k30631K27744K71803m72860q52981
4967D0984785J56357K62667L56981J92426K37621K14052j72687L97842L79245
4958D3009289j93764K77004J04022J31650M21392J62326j91631L37518L6594R2368
4948D4186768k929J79027o98277k39694o0603m62685m38818m05255J64519l16431
4938D1905622j70063o80491k48156j3066l69728J67359J10990n51746J74681J80771
4928D0506173J24051J25210J51580k09305K77711O44835N56185K62720K19605
4919D2658765P4892P67713P56418L87002J035505N71472M95659J060418P32944
4910D8540788R73507N23788Q54614J333383R32877R25262O68505Q48514P68001
$$ plain form
4977 42903482 42953139 42708972 42221790 41996658 42041710 41811079 42038823 42310626 41837766 40984785
4967 40984785 41141142 41403809 41760790 41953216 42190837 42404889 42232202 42630044 43009289
4958 43009289 42815525 43092529 43196551 43328201 43749593 43911919 43720288 44057806 44094400 44186768
4948 44186768 44183839 44362866 43664589 43424895 43364292 42901607 42462789 42057534 42222053 41905622
4938 41905622 41735559 41055068 40806912 40793846 40424118 40591477 40702467 40150721 40325402 40506173
4928 40506173 40630224 40755434 40907014 40697709 40975420 41620255 42176440 42439160 42658765
4919 42658765 42733657 43501370 44257788 44644790 45680295 46251767 46747426 47807844 48540788
4910 48540788 49514295 50038083 50892697 52226080 53158957 54084219 54752724 55601238 56369239
4901E6369239P91748Q24314J442961J342080P10931P01687R36908J554070J107177
4892F5781115M96130J071167J016784M97345R78309R51987J005744P34922L98483
4883G2931986M01658R04083O92269M33301J80451J4145J15311O56830K16527J26615
4873G6673176N29550j11106N3286K35066r2297J50998K89808m8299m35906J03342
4863G7347618m16593q28717l48002q27240p48564o31728p62579n59994m11703
4854G1812498r64426o18462q57650j000810o39027o48654p17395j085929o97345
4845F4582800p18281j597412j513141j058960j141128r42325j167782j101627
4837E5342144j096486j323435j010199j059679l36127q70077m86741n33925k88649
$$ plain form
4901 56369239 57160987 57985301 59428262 60770342 61481273 62182960 63119868 64673938 65781115
4892 65781115 66277245 67348412 68365196 68862541 69840850 70792837 71798581 72533503 72931986
4883 72931986 73333644 74237727 74929996 75363297 75543748 75557893 75673204 76330034 76546561 76673176
4873 76673176 77202726 77091620 77144906 77379972 77287675 77438673 77728481 77680182 77244276 77347618
4863 77347618 76931025 76102308 75754306 74927066 74178502 73546774 72784195 72224201 71812498
4854 71812498 70848072 70229610 69371960 68371150 67732123 67083469 66366074 65280145 64582800
4845 64582800 63864519 62267107 60753966 59695006 58553878 57611553 56443771 55342144
4837 55342144 54245658 52922223 51912024 50852345 50516218 49646141 49159400 48625475 48336826
4828D8336826k46649q63226m41869O197n24451K59812m5783j15629j01661M64493
4818D6728060K06107K56855N93483K94286K79914P88344M42681O13362P51686
4809E0954778L18384Q73346M5722N34372J187152Q85412M54026L95002N27974
4800E6176168R29829Q13802J020122P64343O45965N23003J124316Q20398L82319
4791F3200265J030774R55177N58481N82135J285625P57576P44983Q69910Q59101
4782G0844027J049206P49467J167909J098188J974428J486718J595103J875971
4774H1841017J740587K490569K047350K196806L044603K805277K954499K926547
4766A02047255L410118M205116M220278M462566N093968N691265O101214O595317
$$ plain form
4828 48336826 48090177 47226951 46785082 46791279 46266828 46526640 46480857 46365228 46263567 46728060
4818 46728060 46934167 47191022 47784505 48078791 48358705 49147049 49589730 50203092 50954778
4809 50954778 51273162 52146508 52192230 52726602 53913754 54799166 55253192 55648194 56176168
4800 56176168 57105997 57919799 58939921 59704264 60350229 60873232 61997548 62817946 63200265
4791 63200265 64231039 65186216 65744697 66326832 67612457 68370033 69115016 69984926 70844027
4782 70844027 71893233 72642700 73810609 74908797 76883225 78369943 79965046 81841017
4774 81841017 83581604 86072173 88119523 90316329 93360932 96166209 99120708 102047255
4766 102047255 105457373 109662489 113882767 118345333 123439301 129130566 135231780 141827097
4758A41827097P011669P407741P605339Q085172Q344675P942955P583517N716654
4750B01524819M414396K393755J332802N32205j175434k118526k095251j974412
4742B02834354k236439j664329j492465m22289K45851J29491J221943K096942
4734B00713059J954762K064097J905020J478030L25818o44307j399395l221714
4726B03175370n050087o207207p034287p876974q010656q202451p874506p982303
4718A44936899p188420o817997o545949n974782n964647m600865m770199m281807
4710I8792233m341598l639147l503519l020608k283528k362363k368682j902386
4702G5370402j637961j676813j283478j363008j310869n93942j102193q63679
$$ plain form
4758 141827097 148838766 156246507 163851846 171937018 180281693 188224648 195808165 201524819
4750 201524819 205939215 208332970 209665772 210197977 209022543 206904017 204808766 202834354
4742 202834354 200597915 198933586 197441121 197018832 197264683 197394174 198616117 200713059
4734 200713059 202667821 204731918 206636938 208114968 208440786 207796479 206397084 203175370
4726 203175370 198125283 191918076 184883789 177006815 168996159 160793708 152919202 144936899
4718 144936899 137748479 130930482 124384533 118409751 112445104 107844239 103074040 98792233
4710 98792233 94450635 90811488 87307969 84287361 82003833 79641470 77272788 75370402
4702 75370402 73732441 72055628 70772150 69409142 68098273 67504331 66402138 65538459
4694F5538459j065084j157572m91437p66311p44561j103736m82532j79511o41775
4685E8905940p86648o2557p88152q12865l98897m94779q23606o98277j024971
4676E3015188r87058o35913j054083j061533o81748p57442o59161o07291j405502
4667D5165457p58437n46939m16925n38785l34541p25807p40897K99232n69923
4658D0832435p83883J22219J2096p25473k54821m64119m04241J20315j39942j70639
4648C8143947l47427n58042L6819j01495k09167m7051m54688N0855n9995j91748
4638C6262008k22950m32905l17050o11710n95513k86968p90288l4047n6070q45569
4628C2068938j059146n48434m15588m47330q18536m88554q29254m79671m64120
$$ plain form
4694 65538459 64473375 63315803 62824366 62058055 61313494 60209758 59727226 59547715 58905940
4685 58905940 58119292 58056735 57268583 56455718 56056821 55562042 54738436 54040159 53015188
4676 53015188 52028130 51392217 50338134 49276601 48594853 47837411 47178250 46570959 45165457
4667 45165457 44407020 43860081 43443156 42904371 42569830 41844023 41103126 41402358 40832435
4658 40832435 40048552 40170771 40182867 39457394 39202573 38738454 38334213 38454528 38314586 38143947
4648 38143947 37796520 37238478 37275297 37173802 36964635 36917584 36462896 36513751 36453756 36262008
4638 36262008 36039058 35606153 35289103 34677393 34081880 33794912 33004624 32970577 32914507 32068938
4628 32068938 31009792 30461358 30045770 29598440 28779904 28291350 27462096 26982425 26518305
4619B6518305n42550m25958p25506k29644l47044q31944m22803m00880n54779
4610B2037197j95691m57814j96247k71743m66300P5061l76272m02627k83726l94466
4600A9067372q36L9228J0386j14596k15328l64311K77977l43687j45245j53363
4590A8057597k53646p73797j89643l68264j07231m12733k40545K78728j17235
4581A5873231m65540n90572n16125p3996l74799N4018k46665m99437n78156j06921
4571A2475038k89309q5339j30215k27343j23867l44904m47334m20312M7728l11741
4561A0142402k13100j842O2126l58156L1966j69976j41113l02315J97995n364
4551I242623j65429j40181m8468l61376J57491j79053R875Q4218k21590k84538
$$ plain form
4619 26518305 25975755 25549797 24824291 24594647 24247603 23415659 22992856 22591976 22037197
4610 22037197 21841506 21383692 21187445 20915702 20449402 20524463 20148191 19745564 19461838 19067372
4600 19067372 19066536 19105764 19116150 19001554 18786226 18421915 18699892 18356205 18210960 18057597
4590 18057597 17803951 17030154 16840511 16472247 16365016 15952283 15711738 15990466 15873231
4581 15873231 15407691 14817119 14300994 14226998 13852199 13906217 13659552 13160115 12581959 12475038
4571 12475038 12185729 12100390 11970175 11742832 11618965 11274061 10826727 10406415 10454143 10142402
4561 10142402 9929302 9927460 9989586 9631430 9663396 9493420 9352307 9049992 9247987 9242623
4551 9242623 9077194 8937013 8888545 8527169 8684660 8505607 8515482 8599700 8378110 8093572
4541H093572k05627K93618l6599j66185P4572r0973l48712j60306K46725p8486
4531G621599k47641m97727N06776L14948k32852l7037j65662O3285j34781o4531
4521G126377J26748r5614k13919j93255o6245l526K74002p671l31257K4759K20891
4510F861290j29763L4245l30022r5447Q3200o3637O07516n38304k92669K34290
4500F370699N4078p4182K35618L05193j45889j06015J37574q316k98476R3811
4490F564095M68752m76430j67910j4547K48194K41960J17033P2926R3807j65176
4480F982704l50457k48576K32775J11390j05449J01601j82411K76999n2727K61361
4470G027210j76860j67989Q8251L31337K72070l47350j28224K63861p0626M56494
$$ plain form
4541 8093572 7887945 8181563 8144964 7978779 8053351 7962378 7613666 7453360 7700085 7621599
4531 7621599 7373958 6876231 7383007 7697955 7465103 7428066 7262404 7325689 7190908 7126377
4521 7126377 7253125 7157511 6943592 6750337 6684092 6680566 6954568 6946897 6615640 6640399 6861290
4510 6861290 6731527 6765772 6435750 6340303 6423503 6359866 6967382 6429078 6136409 6370699
4500 6370699 6424777 6350595 6586213 6891406 6745517 6639502 6777076 6768760 6470284 6564095
4490 6564095 7032847 6556417 6388507 6373960 6622154 6864114 6981147 7054073 7147880 6982704
4480 6982704 6632247 6383671 6616446 6727836 6622387 6723988 6541577 6818576 6765849 7027210
4470 7027210 6850350 6682361 6770612 7101949 7374019 7026669 6898445 7162306 7091680 7548174
4460G548174J42177m45148J02033L86063K60625n3287k03157M10810M45067j88913
4450H404444K75316L13726j03857p0072j80291M19708L96495j44085k06349o8069
4440I036966M67908L20792L28896N9115J00621l7198L38917P05613L80076L13648
4430A2015354l23755K36249L63055M09861L76290j87279m8690J78513N62373K86687
4420A3868658K58707O47715L72550K47353M40986J86769K46033L36463J62176
4411A6767410L05118O67577O29690L68801L19533M88657M43471N76939O98062
4402B1265258N93829J118083R77721R33563Q03317P56597J052240Q01899J242472
4393B9544979R05380J539060J401207J456759J952619K324408K206034J944782
$$ plain form
4460 7548174 7690351 7245203 7347236 7733299 7993924 7940637 7737480 8148290 8593357 8404444
4450 8404444 8679760 8993486 8889629 8819557 8639266 9058974 9455469 9311384 9105035 9036966
4440 9036966 9504874 9825666 10154562 10213677 10314298 10277100 10616017 11321630 11701706 12015354
4430 12015354 11691599 11927848 12290903 12700764 13077054 12889775 12841085 13019598 13581971 13868658
4420 13868658 14127365 14775080 15147630 15394983 15835969 16022738 16268771 16605234 16767410
4411 16767410 17072528 17740105 18369795 18738596 19058129 19546786 19990257 20567196 21265258
4402 21265258 21859087 22977170 23954891 24888454 25691771 26448368 27500608 28302507 29544979
4393 29544979 30450359 31989419 33390626 34847385 36800004 39124412 41330446 43275228
4385D3275228K445620L192096L006157L063484K853234K439635K860266L106863
4377F6242583L379216L045172K573978K721398L140481K503138K321677K334006
4369H8261649J812186J671823J307913J149618R62808N51070q96449p56930p94602
4360I3269086j921088k157227k019326k035502k562301k596553k517621l239448
4352G4220020l475297k865909l568434l289336l299427k919297k717066k951939
4344D9133315l301583l357522k567560k674327k480929j831588k124520j771639
4336B9023647j326001j273706j367457j476688q45457j246315m92969j344251
4328A9650803r18303l40517m76489n52429p09845J80417n90262n86503m64982
$$ plain form
4385 43275228 45720848 48912944 51919101 54982585 57835819 60275454 63135720 66242583
4377 66242583 69621799 72666971 75240949 77962347 81102828 83605966 85927643 88261649
4369 88261649 90073835 91745658 93053571 94203189 95165997 95717067 94820618 94063688 93269086
4360 93269086 91347998 89190771 87171445 85135943 82573642 79977089 77459468 74220020
4352 74220020 70744723 67878814 64310380 61021044 57721617 54802320 52085254 49133315
4344 49133315 45831732 42474210 39906650 37232323 34751394 32919806 30795286 29023647
4336 29023647 27697646 26423940 25056483 23579795 22734338 21488023 20995054 19650803
4328 19650803 18732500 18391983 17915494 17363065 16653220 16833637 16243375 15656872 15191890
4319A5191890k63982m45448l14805l70133l59944l15697j74374j83515r6498l05205
4309A2362289k58866o72518m07337J3005k38042k1780k53295j07594j7900j88101
4299A0209861k0920r3679k20147k77188p5097k79884K93154n88089j49686L82960
4289I181285K2005n79213j83518J14895r2440o9701m46194k78818J53355r2562
4279G729094Q2337L0607k98645K67502j46393m37622k27419M49585L01641k42190
4269G508497n69723j61077k75650K97007q9627j55614L8195j36638j18841k38503
4259F098026r8708L23104j92420l51620j33575P6900L11950o6038o602j0754k36000
4248E714263j86726j7086M85686o8953j29279k59530M6332J52701l5528j21793
$$ plain form
4319 15191890 14927908 14482460 14167655 13797522 13437578 13121881 12947507 12763992 12667494 12362289
4309 12362289 12103423 11430905 11023568 11036573 10798531 10776751 10523456 10415862 10397962 10209861
4299 10209861 10188941 10095262 9875115 9597927 9522830 9242946 9536100 8948011 8798325 9181285
4289 9181285 9203290 8624077 8440559 8555454 8463014 8393313 7947119 7668301 7821656 7729094
4279 7729094 7811431 7842038 7543393 7810895 7664502 7226880 6999461 7449046 7750687 7508497
4269 7508497 6938774 6777697 6502047 6799054 6709427 6553813 6592008 6455370 6336529 6098026
4259 6098026 5999318 6322422 6130002 5778382 5644807 5721707 6033657 5967619 5961017 5950263 5714263
4248 5714263 5527537 5510451 5996137 5927184 5797905 5538375 5584707 5737408 5701880 5580087
4238E580087j4967J94481l29193p3910R8264K89648m27730k30537J01080J34238
4228E321461j48478n7152M04681J2722M30018j27018K627j26586l98677M68160
4218E781758o3947m69763k5328O1869J603J9586k85850M51249n4229j83369j75222
4207E058357J00975L53749n06317K63334M22447J50337M2841l29074L49248L64723
4197F270620j75974K2303m15147k05942K82834q9622J06826p647R8949P9848J26851
4186F093899M06345k61951j41136K7335L18563k55877M86277j72497L6731L10924
4176F848613m73726j6557j28561q5326K93709n297K55381J09990K00216J55694
4166G154136j60771L6216K00829J50910j9121N9394m26575J26663K16905K2133
$$ plain form
4238 5580087 5565120 5759601 5430408 5356498 5454762 5744410 5316680 5086143 5187223 5321461
4228 5321461 5172983 5115831 5520512 5533234 5963252 5836234 5838861 5712275 5313598 5781758
4218 5781758 5717811 5248048 5222720 5284589 5286192 5305778 5019928 5471177 5416948 5233579 5058357
4207 5058357 5159332 5513081 5006764 5270098 5692545 5842882 5885723 5556649 5905897 6270620
4197 6270620 6094646 6116949 5701802 5495860 5778694 5689072 5795898 5788251 5887200 5967048 6093899
4186 6093899 6500244 6238293 6097157 6124492 6443055 6187178 6673455 6500958 6537689 6848613
4176 6848613 6374887 6358330 6229769 6144443 6438152 6432855 6688236 6798226 6998442 7154136
4166 7154136 6993365 7029581 7230410 7381320 7362199 7421593 6995018 7121681 7338586 7360719
4156G360719j02906O18969K09147J25259l18196m4423M0323l49813J43832L35697
4146H018608j33103J20475K38487J88955K45841l1642J0766N47165r6946m64812
4136H643794j30566L4446K42670J30149L28951k8020P6130K55424L62362J62565
4126A0077905j75080J53333O79981M6253M90025j21416L9589J56112q1769K67954
4116A1532887J01246K04364k3193P3226L14251L22166K09786M45204K79756J99939
4106A3659632J76247j22820L62427N43566q3232K55120p1846L92647K71918J84461
4096A5568120J94938j3823K51790L74335m0436M89719L32934M99202L78414l91296
4086A7643897M31337M79857J00759K08492L29403O52582K53906K03767L64252
$$ plain form
4156 7360719 7257813 7876782 8085929 8211188 7892992 7848569 7888892 7539079 7682911 8018608
4146 8018608 7885505 8005980 8244467 8433422 8679263 8647621 8658387 9205552 9108606 8643794
4136 8643794 8513228 8547674 8790344 8920493 9249444 9221424 9297554 9552978 9915340 10077905
4126 10077905 9902825 10056158 10736139 10782392 11272417 11151001 11190590 11346702 11264933 11532887
4116 11532887 11634133 11838497 11815304 11888530 12202781 12524947 12734733 13179937 13459693 13659632
4106 13659632 13835879 13713059 14075486 14619052 14535820 14790940 14719094 15111741 15383659 15568120
4096 15568120 15763058 15749235 16001025 16375360 16334924 16824643 17157577 17656779 18035193 17643897
4086 17643897 18075234 18555091 18655850 18864342 19193745 19846327 20100233 20304000 20668252
4077B0668252M63919N74584J76703J58567Q74347O76151M02457N52211M44915
4068B4992106N70121J18207J032185N36202O74681M95196O25668O96426J60553
4059B9901345M36409P85517R36158P21719P74217Q43333Q23399P48702J213787
4050C7184586J150336Q50737R55600J345853J285321J151008J437827J289162
4042D6650430J437346J547069J439263J392939J986439J820084J558199J790358
4034E9622127K186789K096907K141950K259782K532803K693969K714141K514051
4026G8762519K887885L115897L188382K705439K948495L347496L443156L326762
4018A03726031L398284L831351L612002L475267L258477L655513L457750L685365
$$ plain form
4077 20668252 21132171 21706755 21883458 22042025 22916372 23592523 23994980 24547191 24992106
4068 24992106 25562227 25680434 26712619 27248821 27923502 28418698 29044366 29740792 29901345
4059 29901345 30337754 31123271 32059429 32781148 33555365 34398698 35222097 35970799 37184586
4050 37184586 38334922 39185659 40141259 41487112 42772433 43923441 45361268 46650430
4042 46650430 48087776 49634845 51074108 52467047 54453486 56273570 57831769 59622127
4034 59622127 61808916 63905823 66047773 68307555 70840358 73534327 76248468 78762519
4026 78762519 81650404 84766301 87954683 90660122 93608617 96956113 100399269 103726031
4018 103726031 107124315 110955666 114567668 118042935 121301412 124956925 128414675 132100040
4010A32100040L318302L046394L887100L039558L156828L068655K919169K524639
4002A57060685K144206K597311K190081L040541K093731J539129J495640J473742
3994A73635066J689337J163242P42605J070372L87516R47731J400742J258424
3986A82295035J943216K866821L017089K168195Q89017j82704j209843k932630
3978A88854196n439640p015447p770829p919888p589455o800423o174428n870099
3970A34273987n546913n459974n250711n390987m850386m313701m370565l595626
3962I5495124l704987l505057l692424l676342l004969l163579k499434k206686
3954G0041646k376717k130074k172356j759369j999233j507076j778932j828554
$$ plain form
4010 132100040 135418342 138464736 142351836 145391394 148548222 151616877 154536046 157060685
4002 157060685 159204891 161802202 163992283 167032824 169126555 170665684 172161324 173635066
3994 173635066 175324403 176487645 177230250 178300622 178688138 179635869 181036611 182295035
3986 182295035 184238251 187105072 190122161 192290356 193179373 192996669 191786826 188854196
3978 188854196 183414556 176399109 168628280 160708392 153118937 146318514 140144086 134273987
3970 134273987 128727074 123267100 118016389 112625402 107775016 103461315 99090750 95495124
3962 95495124 91790137 88285080 84592656 80916314 77911345 74747766 72248332 70041646
3954 70041646 67664929 65534855 63362499 61603130 59603897 58096821 56317889 54489335
3946E4489335j206130j375816j382036j392993p32982q95157p01785j187002j255824
3937D4359610p03919l77183m82611o95048p45492m77969k68629j08738o70185
3928C9829836p21707o3800j37029j30314k70894j29105m2663l89961j6292j63001
3918C7765070k86634K25747O00820J94310L36417m0860K12450k25909K65783O20640
3908C9667834M11458k5522L74286P25559K43623M47674M62669P40894Q97601L89585
3898D4335661P48011P02557Q81310Q76359N09860J075740Q13856J049175J053217
3889E2045746P73532Q70268J084977Q84290J186760J647329J262380P76241Q10917
3880F1342440J376504J376989P26321J106067J304264J198468J039570R79848
$$ plain form
3946 54489335 53283205 51907389 50525353 49132360 48399378 47504221 46802436 45615434 44359610
3937 44359610 43655691 43278508 42795897 42100849 41355357 40877388 40608759 40500021 39829836
3928 39829836 39108129 39044329 38907300 38776986 38506092 38376987 38334324 37944363 37928071 37765070
3918 37765070 37478436 37704183 38305003 38499313 38835730 38794870 39007320 38781411 39047194 39667834
3908 39667834 40079292 40053770 40428056 41153615 41397238 41844912 42307581 43048475 43946076 44335661
3898 44335661 45083672 45786229 46667539 47543898 48053758 49129498 49943354 50992529 52045746
3889 52045746 52819278 53689546 54774523 55658813 56845573 58492902 59755282 60531523 61342440
3880 61342440 62718944 64095933 64822254 65928321 67232585 68431053 69470623 70450471
3872G0450471Q63680O63887J645460K005932R64877J458259J206559R73687J070162
3863H1302974J147739J595426J529915J767018J984864K057630J816490K433735
3855I5635791K589432K250614K562740K604585L130266L269758L524032M115837
3847A19683055M048202M746206M851900M864329N422913N540568O082713O805920
3839A62045806O898939O841957P332796P607638Q248309P840740Q437998R043043
3831B24297226R227052Q612581Q655689Q699637Q080505Q219822P883244P163836
3823B90839592N908556N097332M505495L693580K476004K162098J109849o33384
3815C15159122j127966j768982k985175l954585m118742n291953o306417o590370
$$ plain form
3872 70450471 71314151 71978038 73623498 75629430 76594307 78052566 79259125 80232812 81302974
3863 81302974 82450713 84046139 85576054 87343072 89327936 91385566 93202056 95635791
3855 95635791 98225223 100475837 103038577 105643162 108773428 112043186 115567218 119683055
3847 119683055 123731257 128477463 133329363 138193692 143616605 149157173 155239886 162045806
3839 162045806 168944745 175786702 183119498 190727136 198975445 206816185 215254183 224297226
3831 224297226 233524278 242136859 250792548 259492185 267572690 275792512 283675756 290839592
3823 290839592 296748148 301845480 306350975 310044555 312520559 314682657 315792506 315159122
3815 315159122 314031156 312262174 309276999 305322414 301203672 295911719 289605302 283014932
3807B83014932p057068p513463q268161q261590q399119q811565q691792q946198
3799B17065976q615956q916284q322761p995772q245440p744494p779304p204085
3791A52241880o975971o198549n805751n714255n477490m799323m282164m465342
3783A08523035l973940l778624l345585l419252l445098k633660k431715j697892
3775H3797269k168392k009354j786913j487367j402585k036504j365266j236263
3767G0304625r51802j070976j110182r38949r55686j120514n95003j095909j042616
3758F1422988j027524q62881r42281j416242j182580r80360n05065j372057o95095
3749E2438903q41550r47227j125330j099119p68678p27493j367231q34436r75256
$$ plain form
3807 283014932 275957864 268444401 260176240 251914650 243515531 234703966 226012174 217065976
3799 217065976 208450020 199533736 191210975 183215203 174969763 167225269 159445965 152241880
3791 152241880 145265909 139067360 133261609 127547354 122069864 117270541 112988377 108523035
3783 108523035 104549095 100770471 97424886 94005634 90560536 87926876 85495161 83797269
3775 83797269 81628877 79619523 77832610 76345243 74942658 72906154 71540888 70304625
3767 70304625 69352823 68281847 67171665 66232716 65277030 64156516 63561513 62465604 61422988
3758 61422988 60395464 59532583 58590302 57174060 55991480 55011120 54506055 53133998 52438903
3749 52438903 51597353 50650126 49524796 48425677 47656999 46929506 45562275 44727839 43752583
3740D3752583o55676n04361p12375r31203o50861j130174j197864k76031p84519
3731C6909519n99754n19326l38377p03258n54300l08251l11019o47811K339m28777
3721C2500985n96545l31051k51069J98900l71500m12542n7206k49730n0406J90973
3711C0570809N5896k99618q4793l0528k88034O97653j48864r0321O52370J9179
3701C1053749N18159M62241l49755o6765J31477K80809M03670o7766K47936k12310
3691C2401445K6870L51032m9428o60314M21783J3831n01429j31421k84999J33029
3681C1720399K11538k53960k95870n7289m93567J56300K61070j62879n00876j77873
3671C0406993q6002j22484K10386J93808j69949l03164K46960N1702J17420K01034
$$ plain form
3740 43752583 43096907 42592546 41880171 40948968 40298107 39167933 37970069 37694038 36909519
3731 36909519 36309765 35790439 35452062 34748804 34194504 33886253 33575234 32927423 32929762 32500985
3721 32500985 31904440 31573389 31322320 31521220 31149720 30737178 30679972 30430242 30379836 30570809
3711 30570809 30626705 30327087 30242294 30211766 29923732 30621385 30472521 30382200 31034570 31053749
3701 31053749 31571908 32034149 31684394 31617629 31749106 32029915 32433585 32365819 32613755 32401445
3691 32401445 32428315 32779347 32729919 32069605 32491388 32505219 32003790 31872369 31587370 31720399
3681 31720399 31931937 31677977 31382107 31324818 30831251 30987551 31248621 31085742 30584866 30406993
3671 30406993 30320991 30198507 30408893 30602701 30432752 30129588 30376548 30428250 30545670 30746704
3661C0746704J48485K36661L62226L65995j56765N5330M86425L37992N08491L30067
3651C3421611Q75646N21387K64373Q18769O06236N21164O74567Q67112J254102
3642C9824967J109400M02314J136876J041942Q20680J241323J194991O92542J132198
3633D8597233J305510J323699J439263J101392J120350R87240J181094J299400
3625E8355181J097276Q65915J546641Q65287J115127J224208J044414M34853L65564
3616F6914466R68764Q21804R81332P97698P99312N30253N96302P19220Q08939
3607G3938090L41519N11085M91860J306271J078401J201023J072982P61807P57103
3598H1460141R91159J498518J739459J080686J505951K393277K715243K025401
$$ plain form
3661 30746704 30895189 31131850 31494076 31860071 31703306 31758636 32245061 32583053 33091544 33421611
3651 33421611 34297257 34818644 35083017 35901786 36508022 37029186 37703753 38570865 39824967
3642 39824967 40934367 41336681 42473557 43515499 44336179 45577502 46772493 47465035 48597233
3633 48597233 49902743 51226442 52665705 53767097 54887447 55874687 57055781 58355181
3625 58355181 59452457 60318372 61865013 62730300 63845427 65069635 66114049 66548902 66914466
3616 66914466 67883230 68705034 69686366 70484064 71283376 71813629 72409931 73129151 73938090
3607 73938090 74279609 74790694 75282554 76588825 77667226 78868249 79941231 80703038 81460141
3598 81460141 82451300 83949818 85689277 86769963 88275914 90669191 93384434 95409835
3590I5409835K679230K620635K554314L567191L208690L432888L980268L839483
3582A21292534M347866M848973M640588M508903M833850M973067N085529N303605
3574A59834915M838718N275787N172176N382071M844594N134663M792722M585265
3566A99860911M852609M940202M608648L736262M236774L561025K614868L509022
3558B31920321L024111K523258K104841J351604J496555J582014J188093J93517
3550B45384314N95520m1783m53188o5898j119426j337814j368247j452808k270173
3541B37870497k088465k430700k871926l157857l404576l637168m125305m061264
3533B12093236m218450m617498m676439m919364m717404m888394n237460n338794
$$ plain form
3590 95409835 98089065 100709700 103264014 106831205 110039895 113472783 117453051 121292534
3582 121292534 125640400 130489373 135129961 139638864 144472714 149445781 154531310 159834915
3574 159834915 164673633 169949420 175121596 180503667 185348261 190482924 195275646 199860911
3566 199860911 204713520 209653722 214262370 217998632 222235406 225796431 228411299 231920321
3558 231920321 234944432 237467690 239572531 240924135 242420690 244002704 245190797 245384314
3550 245384314 245979834 245938051 245484863 245418965 244299539 242961725 241593478 240140670 237870497
3541 237870497 235782032 233351332 230479406 227321549 223916973 220279805 216154500 212093236
3533 212093236 207874786 203257288 198580849 193661485 188944081 184055687 178818227 173479433
3525A73479433n453420m823479n572935n390781n672070n100860m668021n045008
3517A31752859m751309m867009m699741m265604m415912m081947l331770l911954
3509I7427613k857494l145629k646675k619830k497468k269446k028081j837009
3501G7525981j700726j787194j020808j419021j083250o23562j077886j338069
3493F7475465o77279k09187p80036n20278q22647n47474p93866p74772m77318
3484F1872608n14761q00509r45645q67493m29625p84476q21736j208670o85216
3475E4814477q37376j092284j471147j455940r68167q78253j346847j104734j199737
3466D4459992p17683j216716j391923j287046j067574j178783j220609r74551
$$ plain form
3525 173479433 168026013 163202534 157629599 152238818 146566748 141465888 136797867 131752859
3517 131752859 127001550 122134541 117434800 113169196 108753284 104671337 101339567 97427613
3509 97427613 94570119 91424490 88777815 86157985 83660517 81391071 79362990 77525981
3501 77525981 75825255 74038061 73017253 71598232 70514982 69891420 68813534 67475465
3493 67475465 66798186 66588999 65808963 65288685 64466038 63918564 63124698 62349926 61872608
3484 61872608 61357847 60557338 59611693 58744200 58314575 57530099 56708363 55499693 54814477
3475 54814477 53977101 52884817 51413670 49957730 48989563 48111310 46764463 45659729 44459992
3466 44459992 43742309 42525593 41133670 39846624 38779050 37600267 36379658 35405107
3458C5405107j006853j043288r95262j143479j133976r87603p75391m86912o10003
3449B7222340l58908m38890q91833r31659n23056n89191m83918p97962l26045
3440B1880878m25166m03013J66108p02280l12408l56837o30649R8552q9525j18169
3430A9107491p65461q64594p5501m52295l68416J2078k82866j71251r0495j56039
3420A5892651k74519l51571k75424l85692m65970j39584k21826m50663K81666
3411A3609068l31679k45745l12322k64937J11380R3947K09804p14585n29916j74602
3401A1450413k50825N1688m24468m99911Q7845P1735J73521J71372m17659n5699
3391A0358012n1334m81388Q5663k38884Q4256q8203k06248l51021K56180k70790
$$ plain form
3458 35405107 34398254 33354966 32359704 31216225 30082249 29094646 28319255 27832343 27222340
3449 27222340 26863432 26424542 25532709 24601050 24077994 23488803 23004885 22206923 21880878
3440 21880878 21455712 21052699 21218807 20516527 20204119 19847282 19216633 19315185 19225660 19107491
3430 19107491 18342030 17477436 17401935 16949640 16581224 16593302 16310436 16139185 16048690 15892651
3420 15892651 15618132 15266561 14991137 14605445 14139475 13999891 13778065 13327402 13609068
3411 13609068 13277389 13031644 12719322 12454385 12565765 12659712 12869516 12154931 11625015 11450413
3401 11450413 11199588 11251276 10826808 10326897 10414742 10486477 10659998 10831370 10413711 10358012
3391 10358012 10306678 9825290 9910953 9672069 9756325 9668122 9461874 9110853 9367033 9096243
3381I096243N0213m07992l44187K76878n65616J50228r6011k73869K79547j14157
3371H051277l46563J58047j53715R9404j51356l57585L00947k25154k76613K31156
3361G329845Q870J95188k76445j52324k5797k81113q6484K67600k24232l59416
3351F395692L9819j71648o4729Q6222J03932o89448M0273K59900N0699l64198
3341E686514L7199J11901o7945J82530q5841o6892k5673p8199n2309j34753J81518
3330E688050M40363R459m17303R3434j8416j73696k2002m76507K27373K78296
3320E629051n51171k73492L56792K0170k05655R3193q731K55435K67714m7998
3310E535308m9133k38692j4141q9320j68204m76307L58492L21063j31481k15441
$$ plain form
3381 9096243 9146456 8738464 8394277 8671155 8105539 8255767 8159756 7885887 8165434 8051277
3371 8051277 7704714 7862761 7709046 7808450 7657094 7299509 7600456 7375302 7098689 7329845
3361 7329845 7338715 7533903 7257458 7105134 7079337 6798224 6711740 6979340 6755108 6395692
3351 6395692 6435511 6263863 6199134 6285356 6389288 5699840 5740113 6000013 6050712 5686514
3341 5686514 5723713 5835614 5767669 5950199 5864358 5797466 5771793 5693594 5641285 5506532 5688050
3330 5688050 6128413 6137872 5720569 5814003 5795587 5621891 5599889 5123382 5350755 5629051
3320 5629051 5077880 4804388 5161180 5181350 4975695 5068888 5060157 5315592 5583306 5535308
3310 5535308 5486175 5247483 5233342 5144022 4975818 4499511 4858003 5179066 5047585 4832144
3300D832144o4238m2878L97584J04411r8145R0420O9500q2025r289k0450j38625
3289E038409K48085J29010j93708j82727J35234K59309L82658p0075j77933n43093
3279E025169J9171J92956M82556k15969m0615k72335J16441L53751K29295J13088
3269F003508j90158j48817m8182O5277o4858P7037k02814K38253m03873o1284
3259E264089N51774j71643L58833K07941k56567M768k352j99353l09512K94830
3249E742808l21361k95015J17587Q6201m14682N14646q6003m8067J96028K24918
3239E717060j73996J67672K30851J23945L2208m50737J37035j71112j89378l8379
3229E385169k65759K22340J09019k07092N15625o0818J35392M1453N08822M26652
$$ plain form
3300 4832144 4767906 4725028 5122612 5227023 5128878 5219298 5288798 5206773 5197484 5177034 5038409
3289 5038409 5286494 5415504 5221796 5039069 5174303 5433612 5816270 5746195 5568262 5025169
3279 5025169 5044340 5237296 5719852 5503883 5463268 5190933 5307374 5661125 5890420 6003508
3269 6003508 5813350 5664533 5616351 5681628 5616770 5693807 5490993 5729246 5325373 5264089
3259 5264089 5815863 5644220 6003053 6210994 5954427 5959195 5956843 5757490 5447978 5742808
3249 5742808 5421447 5126432 5244019 5330220 4915538 5430184 5344181 5296114 5492142 5717060
3239 5717060 5543064 5710736 5941587 6065532 6097740 5647003 5784038 5612926 5423548 5385169
3229 5385169 5119410 5341750 5450769 5243677 5759302 5698484 5833876 5875329 6384151 6810803
3219F810803j37168m06543j5251K65817L6052m1389k99627N76909k5365J32996
3209F897234L54641L56865o2980j11789J06345l91041K6973j0750j73627m51456
3199F540415q7855O6384N2720j25569j46806j43294k19578k62421k37582J04883
3189E541297l16600j82584O49805P8964n73156l71277k19487J82480Q2717j60087
3179D712072k0554l66321p4097J77662P3164O5100j12906M7969m414j99497j95530
3168D102648j10437j20743K53467k30533o8104L17381J07935l10262l63850M19974
3158C997476N19737j06376k82857N6133J41865N2400j27790k60343o9336J38779
3148D059688O3050J64451N2761l9483L92295K43140l53347k35521J43222K87883
$$ plain form
3219 6810803 6673635 6267092 6251841 6517658 6553710 6512321 6212694 6789603 6764238 6897234
3209 6897234 7251875 7608740 7545760 7433971 7540316 7149275 7176248 7165498 6991871 6540415
3199 6540415 6452560 6518944 6571664 6446095 6299289 6155995 5936417 5673996 5436414 5541297
3189 5541297 5224697 5042113 5691918 5770882 5197726 4826449 4606962 4789442 4872159 4712072
3179 4712072 4691518 4325197 4251100 4428762 4501926 4567026 4454120 4502089 4497675 4298178 4102648
3168 4102648 3992211 3871468 4124935 3894402 3826298 4143679 4251614 3941352 3577502 3997476
3158 3997476 4517213 4410837 4127980 4184113 4325978 4378378 4250588 3990245 3920909 4059688
3148 4059688 4122738 4287189 4339950 4300467 4692762 4935902 4582555 4347034 4490256 4778139
3138D778139J19437j41129k62803M2147Q6803k48906j4712N0218o3789K79692
3128D625097q2505l53431k54465J13666J87100J6002n6005Q01746q5404j96535
3118D715266m24161l9223l09496n17043L8271J08909j62143j96946J17987K95435
3108C626856r8715j87950q3501J49438l8641m27659J87624J67207j22993j34219
3098C037447k23154o2425J28023k77632l4367k49897N1258K94513j52954j09883
3088B400929K20365k18444Q1925o8499R588l3284J46837K199K27487k52744j31493
3077B384866K71891k85658N9079K35661k27336J20872l17437P5332n91367K12843
3067A938746L29245m93956j15826J17972J98681k90850j3265O2595L73887o63954
$$ plain form
3138 4778139 4897576 4756447 4493644 4535791 4622594 4373688 4358976 4409194 4345405 4625097
3128 4625097 4542592 4189161 3934696 4048362 4235462 4251464 4195459 4997205 4911801 4715266
3118 4715266 4291105 4251882 3942386 3425343 3463614 3572523 3410380 3213434 3331421 3626856
3108 3626856 3528141 3340191 3256690 3406128 3367487 2939828 3127452 3294659 3171666 3037447
3098 3037447 2814293 2751868 2879891 2602259 2567892 2317995 2369253 2663766 2510812 2400929
3088 2400929 2621294 2402850 2484775 2416276 2425864 2392580 2539417 2541616 2769103 2516359 2384866
3077 2384866 2656757 2371099 2430178 2665839 2438503 2559375 2241938 2317270 1725903 1938746
3067 1938746 2267991 1774035 1658209 1776181 1974862 1684012 1670747 1733342 2107229 1443275
3057A443275J40814j81169K2717M06907K02473P7945k13535l12357J08079J20710
3047A815859m95447R3727k64199J17022O20751j7090K13630j75259k86369J00054
3037A722679K57282J08588m70106k32358K07718k13882o1001K69817J07454k62703
3027A433488j43955L03431J72770k29396l20596k3571n0191l31731N3533M87146
3017A350928M17684M11341l49560m93941R4609p9015L03423j67122j8485J45843
3007A615705K51744m32605l94295L38304L46889k9680l23951K33265k0772k57351
2997A327253m5642K9728J25457J17374l74824K05243L30408j27185m92932j00467
2987I94413k8030p2558M1899L32820K0558K05036n32351J72563L52374L01569
$$ plain form
3057 1443275 1584089 1402920 1425637 1832544 2035017 2112962 1899427 1587070 1695149 1815859
3047 1815859 1320412 1414139 1149940 1266962 1887713 1870623 2084253 1908994 1622625 1722679
3037 1722679 1979961 2088549 1618443 1386085 1593803 1379921 1318920 1588737 1696191 1433488
3027 1433488 1289533 1592964 1765734 1536338 1215742 1192171 1141980 810249 863782 1350928
3017 1350928 1768612 2179953 1830393 1336452 1431061 1352046 1655469 1488347 1469862 1615705
3007 1615705 1867449 1434844 1040549 1378853 1725742 1696062 1372111 1605376 1584604 1327253
2997 1327253 1281611 1311339 1436796 1554170 1179346 1384589 1714997 1587812 1094880 994413
2987 994413 966383 893825 935724 1268544 1289102 1494138 961787 1134350 1486724 1788293
2977A788293P5672m07867l14073J95633Q8806L22076l94674Q7946q6597k19370
2967A135845J05316L17515o0050j72933J10191l63700o1228j2943K52799L89453
2957A640265r546q97K18950m01960k04322J98805J55704m5581J06948q2562J02170
2946A677974n4721q1540K07409M2591l81854J66104L1040N2006m00563K24540
2936A482986j72525K03215K29917l86626j19334K80407J15861L82677K25155k85198
2926A956535m21575k9275L1642J00117K36036P8936j03474J78050L23259o14042
2916A736209j70572K27972L80455P2456q4773k42018k32836J37151L12959J2897
2906B149900l75832j7516J43935J72938j62291R7506r116P3001J6773N70158L8775
$$ plain form
2977 1788293 1863965 1456098 1142025 1337658 1426464 1748540 1353866 1441812 1355215 1135845
2967 1135845 1241161 1558676 1498626 1325693 1435884 1072184 1010956 998013 1250812 1640265
2957 1640265 1630719 1629822 1848772 1446812 1242490 1441295 1596999 1551418 1658366 1575804 1677974
2946 1677974 1623253 1541713 1749122 1791713 1409859 1575963 1607003 1659009 1258446 1482986
2936 1482986 1310461 1513676 1743593 1356967 1237633 1518040 1633901 2016578 2241733 1956535
2926 1956535 1534960 1505685 1537327 1637444 1873480 1952416 1848942 2026992 2350251 1736209
2916 1736209 1565637 1793609 2174064 2246520 2161747 1919729 1686893 1824044 2137003 2149900
2906 2149900 1774068 1756552 1900487 2073425 1911134 2008640 1999524 2072525 2089298 2659456 2698231
2895B698231j30688n5995p9996M45650m33373M31803k32319k68428J89041Q738
2885B572664l6251J36124K75895j54206k16827N6910M35649J4652R1360m44760
2875B731210M43728L89416L49648k7864j74247j53874j92065J08864r93M20771
2865C894594k07587k76461m3563j01807J9562K8292L75380k10399m13451J28748
2855C193308j2980K40750o8989K33702l85512k30983N3949P5114L1138j16690
2845C012807K80841J13034K24881k88361k30429m9097l18825L25019k60286k37851
2835B571733p3008L61781P9739j04338N52552l36111k27423L89983l50759j34807
2825B729342l71216n955N53403k64901L12143K15954m01515J23575k46255o29972
$$ plain form
2895 2698231 2567543 2511548 2431552 2877202 2443829 2875632 2643313 2374885 2563926 2572664
2885 2572664 2536413 2672537 2948432 2794226 2577399 2634309 3069958 3084610 3175970 2731210
2875 2731210 3174938 3564354 3914002 3886138 3711891 3558017 3365952 3474816 3473823 3894594
2865 3894594 3687007 3410546 3366983 3265176 3284738 3313030 3688410 3478011 3064560 3193308
2855 3193308 3180328 3421078 3352089 3585791 3200279 2969296 3023245 3098359 3129497 3012807
2845 3012807 3293648 3406682 3631563 3343202 3112773 3063676 2744851 3069870 2809584 2571733
2835 2571733 2498725 2860506 2940245 2835907 3388459 3052348 2824925 3214908 2864149 2729342
2825 2729342 2358126 2352171 2905574 2640673 2952816 3168770 2767255 2890830 2644575 2014603
2815B014603L08830L26290k44635l26810l54764J43708J47477m6887J00941J13667
2805B182420N0798l54369j11046j39098j60472K64816O2681j76924O5865J09847
2795A794518j87296K42880k14022J24379Q2529n1668l73280J35586K60018M0793
2785A854437K11623o6795K43384l45432n68055J32210J15223Q0449j82133n86690
2775H88221L28214L88465K92079j13331l68127j43286p9014N0078p06J2146J14761
2764A369500k99294k92731K6009J74274L61938j76513J04461K8711J10216P6741
2754A483312M6671r274m30890n3326l8113K09945l06631k2752j55320R1691J73702
2743I89015J11720k31561r2345K23562J1567k9753k99864j61493j51933M64622
$$ plain form
2815 2014603 2323433 2649723 2405088 2078278 1723514 1867222 2014699 1967812 2068753 2182420
2805 2182420 2233218 1878849 1767803 1628705 1468233 1733049 1795730 1618806 1684671 1794518
2795 1794518 1607222 1850102 1636080 1760459 1842988 1791320 1418040 1553626 1813644 1854437
2785 1854437 2066060 1999265 2242649 1897217 1329162 1461372 1576595 1657044 1474911 888221
2775 888221 1216435 1604900 1896979 1783648 1415521 1272235 1193221 1243299 1242593 1254739 1369500
2764 1369500 1070206 777475 803484 977758 1339696 1163183 1267644 1296355 1406571 1483312
2754 1483312 1529983 1520709 1089819 1036493 998380 1208325 901694 878942 723622 815313 989015
2743 989015 1100735 869174 776829 1000391 1011958 982205 682341 520848 368915 833537
2733H33537L70219m72189k40191K41592K70870l1667m98326L88982p7815n03477
2723B81535K63324J74313L64143j15819l25043J98871K55367k14362j87015K03468
2713H98782R1545N8903m1665n9761k92483L31308K167n76339J58773j2035k14646
2702C44549Q8909o05214K19511K15893j1735P2507j38735K80756r440k39955O2757
2691B79803K21548J65143j53769j2535J4282m82052J85364K84820M14036k29469
2681F87171m97724j51719N146L79139k18036k99133M67858k64285O6584k46783
2671g1782K54668j18543L51146K60301l12487o0680J07869j11701k46102m71189
2661d18500L05153J72822J42083O55637l69968j65679K6195k49714j01788J75784
$$ plain form
2733 833537 1203756 731567 491376 732968 1003838 972171 473845 862827 785012 281535
2723 281535 544859 719172 1083315 967496 642453 841324 1096691 882329 695314 898782
2713 898782 990327 1049230 1007565 947804 655321 986629 988796 412457 571230 559195 344549
2702 344549 433458 -171756 47755 263648 251913 324420 185685 466441 457001 217046 279803
2691 279803 501351 666494 512725 500190 514472 32420 217784 502604 916640 687171
2681 687171 189447 37728 42874 422013 203977 -95156 372702 108417 175001 -71782
2671 -71782 182886 64343 415489 675790 363303 302623 410492 298791 52689 -418500
2661 -418500 -113347 59475 201558 857195 487227 321548 347743 98029 -3759 172025
2651A72025j78980K40507K27494k97298J3551q1064j25792K25059k35839P0976
2641C0639J6649K71853o8463P9620l06063O31457L59525j54868k38714k67449
2631C54186M05027K32329k20108m39592N467k22915N5101r8583n63040M22283
2621f9845K12817j53222j3205M84303O9569k27393m44704J2380K07834J09089
2611A87623l86307P0199J11052l37911N86156J96757j017l31229O8145L64094
2601E27562l97849r7509R1555k56172M94903o273O0743j26613l23762J15288J87959
2590B69832j20021j14052m4594L46857k37125K63088j61243j77997J96385p961
2580B13169K78943j63062n21839M6780L46284J8560O3811j25522l01938J4002
$$ plain form
2651 172025 -6955 233552 461046 163748 177299 96235 -29557 195502 -40337 30639
2641 30639 47288 319141 250678 330298 24235 655692 1015217 860349 621635 354186
2631 354186 759213 991542 771434 331842 337309 114394 169495 70912 -492128 -69845
2621 -69845 142972 -10250 -23455 460848 530417 303024 -141680 -129300 78534 187623
2611 187623 -198684 -128485 -17433 -355344 230812 427569 426552 95323 163468 527562
2601 527562 129713 32204 123759 -132413 362490 356217 416960 290347 -33415 81873 269832
2590 269832 149811 35759 -8835 338022 100897 363985 202742 24745 221130 213169
2580 213169 492112 329050 -192789 -146009 200275 218835 282646 157124 -144814 -130812
2570a30812M33818J43340l10501L36434M30489o79677k45887J26761J37143L27623
2560E68731K10739j51461p4946J0937K22911l11552N0651j01834L4715K11166
2550F70057l3608J28331j09161k37967j76243O0861K65307k22870J00522J57821
2540F03050j65629r5265l19951K35326K84365J8472Q3364k38661j03317J1385
2530C13139o2305M5063k73561l4748L9535L98691j94201l1352J08361l9097q413
2519B61112L17148K77496m42767R8295p5969m5449J81558N7418l11170J62089
2509D79761K31817j1907L1823K43283K4757k36887j67576J86623J7207K65045
2499A063946q6669l02777l47523J12533K42244k37200j05559J41649J72324o0754
$$ plain form
2570 -130812 303006 446346 135845 472279 902768 223091 -22796 103965 241108 568731
2560 568731 779470 628009 553063 564000 786911 475359 526010 424176 458891 670057
2550 670057 636449 764780 655619 417652 241409 302270 567577 344707 445229 603050
2540 603050 437421 342156 22205 257531 541896 560368 643732 405071 301754 313139
2530 313139 250834 295897 22336 -12412 27123 425814 231613 200261 308622 269525 261112
2519 261112 578260 855756 412989 511284 435315 389866 571424 628842 317672 479761
2509 479761 711578 699671 731494 974777 999534 762647 595071 781694 798901 1063946
2499 1063946 977277 674500 326977 439510 681754 444554 338995 480644 652968 592214
2489E92214n9912k87739j47331J47351n3333J67057J39842K04674J19381J25556
2479I47760k2216k02591K46993j67893k61783K89565p021l5946k88696m3744K45997
2468G00425j25710M6723l13392n32596L77655O61151j10323q4760m08401L98608
2458F09380m93531K88484K25854l10410j92956N25537k7467q1136l10772J03563
2448C36546k4391L3900j33953L1968K45122k05076M69446J3303n4304m72265L37244
2437E77540K2222J70349o3773r4845O1572k31464j38003P5596k7413n6901j32848
2426A62032k1315j42238j9500K70015j4981O42685N6690l25843l94577J67839
2416C80807O8677o2295k38368p008J79540k40228O83703j06433P7463P0362l57210
$$ plain form
2489 592214 532302 244563 97232 244583 191250 358307 498149 702823 822204 947760
2479 947760 925544 722953 969946 802053 540270 829835 822814 786868 498172 454428 700425
2468 700425 574715 621438 308046 -224550 153105 814256 703933 619173 210772 609380
2458 609380 115849 404333 630187 319777 126821 652358 624891 543755 232983 336546
2448 336546 312155 346055 212102 244070 489192 284116 753562 766865 712561 240296 577540
2437 577540 599762 770111 706338 611493 673065 441601 303598 379194 351781 294880 162032
2426 162032 140717 -1521 -21021 248994 234013 876698 933388 607545 212968 380807
2416 380807 449484 387189 148821 141813 321353 81125 764828 658395 735858 806220 449010
2405D49010r8907K99628m627l61852k29367N8608j58654j15777L84769J2377J65195
2394D00403k34515k17036J31109L62551J12502j15590j25421k32541j22242Q2196
2384D1416J65636p5335J26785k9763o3383K55686j53376k86369K68040o7272r7843
2373H4222l676j94502J73544J69848P2543p0317j48657q3743J12321J70456m06745
2362a24706O26276l073m89631Q4132K84753J7510J4086l12128N6983r8299O269
2351F2172L61879j3356O8900j72323k14241J41740L5656M471l5975n235p3711
2340A59977j19656k1858K1335M1390R315r1924L680l0459j5047r2576P3211J85276
2328A22664q4587J49729m2791K62967j15023L35114n75976l64727J37166q0737
$$ plain form
2405 449010 350103 649731 645104 283252 53885 112493 -46161 -161938 222831 235208 400403
2394 400403 165888 -51148 79961 442512 555014 439424 314003 81462 -40780 41416
2384 41416 207052 131717 258502 228739 165356 421042 267666 -18703 249337 182065 84222
2373 84222 80546 -113956 59588 229436 301979 231662 83005 -738 111583 282039 -124706
2362 -124706 501570 498497 8866 92998 377751 395261 409347 97219 154202 55903 62172
2351 62172 424051 410695 479595 307272 93031 234771 270427 274898 238923 233688 159977
2340 159977 40321 18463 39798 81188 90503 -1421 2259 -28200 -43247 -135823 -62612 122664
2328 122664 38077 187806 145015 407982 292959 628073 52097 -312630 -175464 -256201
2318b56201k62761N81479J40086R7415J27718j52648k8655j91563j43091m74544
2308e62765L08283K57036J34435p9789k27879K64588l8182j5401R0741J11973
2298B43040r0771o1913R9507K3486l16803l80972J16327K24772M08486j59014
2288A06145P4620l04433j50872L36785M16479P9441N8765j54016m07628q4896
2278b9610L72617J820n28051k18905L68173M87130J68865K937k44606k50301l4167
2267I5902L6172K3266j6871J4098J33576n8964j62572R7830q592O2859Q9123j1122
2255B94705j53119Q651k8404r3051K37584K53781k22611k37807k33663K96396
2245A22462n2768j59837K4220M2765P7934k95224K01934K19059J61904J37559
$$ plain form
2318 -256201 -518962 62517 202603 300018 427736 275088 246433 54870 -88221 -562765
2308 -562765 -254482 2554 136989 57200 -170679 93909 55727 40326 131067 243040
2298 243040 152269 90356 189863 213349 -103454 -484426 -368099 -143327 265159 106145
2288 106145 180765 -123668 -274540 62245 478724 558165 616930 462914 55286 -29610
2278 -29610 343007 344827 -183224 -402129 -33956 453174 622039 624976 380370 130069 95902
2267 95902 132074 155340 138469 152567 286143 227179 64607 162437 153845 216704 305827 294705
2255 294705 141586 150237 121833 28782 266366 520147 297536 59729 -173934 122462
2245 122462 69694 -90143 -65923 -23158 54776 -240448 -38514 180545 342449 480008
2235D80008n21227l51144R6120O6690L68770J54236L5813K71690p9381K37356
2225G58931Q8157k48566J68040n24405p682R6774k13814j99011L66907L993M036
2214B93360k09098J32L93024r7354m031k10210k01737L84973o0900j27879j74797
2203a4517j93876J78735K54121K3701J25314J23143M9761M25801l73568k40836
2193C57779L22074k32338k04755K33742O7129J82741m63342j79204L73540k02002
2183B55364N37903R248j53075o6758l45329M36735K36245m42077J13762j164Q7671
2172F68525K87687L2718m13234m9050L14935J77410j53239J76400j36545J67412
2162A073019N4028p4134k13989M27382M00288l0149J48491J16852l68661m23085
$$ plain form
2235 480008 -41219 -392363 -296243 -229553 139217 293453 329266 600956 521575 758931
2225 758931 847088 598522 766562 242157 234475 331249 117435 -81576 285331 289324 293360
2214 293360 84262 84394 477418 380064 376033 165823 -35914 349059 288159 160280 -14517
2203 -14517 -208393 -29658 224463 248164 373478 496621 546382 972183 598615 357779
2193 357779 679853 447515 242760 476502 543631 726372 263030 83826 457366 255364
2183 255364 793267 802515 649440 582682 237353 674088 910333 468256 582018 580854 668525
2172 668525 956212 988930 575696 526646 841581 1018991 865752 1042152 905607 1073019
2162 1073019 1127047 1052913 838924 1266306 1666594 1636445 1784936 1901788 1533127 1110042
2152A110042P0510K07946L73796j5930K75179k41400M6911J73495L86747k69300
2142B117996L93803M62304k10173R980l9521Q4975o0709l21801n7904J04088L0017
2131B513055O3698L46841J82361K40160l4887J8975L36531K53539j23884k53789
2121C542600K85204p0399J21753L62178L5K52311M21611O47183k60210M90137
2111E792403L63980K14416j95919L25496M56177O65018P74503M2829L38263O44312
2101I421478R15512K89183k8006J300615P65456M30079R18863P82225J467200
2092A6262605K098987K062524K471492K439240K683855K196897J680229J281980
2084C3177809r7272p26081j673347k685747k654260k130745k019643j948656j573303
$$ plain form
2152 1110042 1180552 1388498 1762294 1746364 2021543 1780143 1827054 2000549 2387296 2117996
2142 2117996 2511799 2974103 2763930 2773910 2734389 2819364 2758655 2436854 2378950 2483038 2513055
2131 2513055 2576753 2923594 3105955 3346115 3311228 3330203 3666734 3920273 3796389 3542600
2121 3542600 3827804 3757405 3879158 4241336 4241371 4493682 4915293 5562476 5302266 5792403
2111 5792403 6156383 6370799 6174880 6500376 6956553 7621571 8396074 8438903 8777166 9421478
2101 9421478 10336990 10626173 10598167 11898782 12664238 13094317 14013180 14795405 16262605
2092 16262605 18361592 20424116 22895608 25334848 28018703 30215600 31895829 33177809
2084 33177809 33080537 32354456 30681109 27995362 25341102 23210357 21190714 19242058 17668755
2075A7668755j480776j067784j433461j392010m51164j182302r10774m49835n68715
2066H731934p59076k63277l48554j021902n76582m76165l79873l4314j4119k03635
2056D654437m70967m30473m29484K35895j46334J61208m0187n31616k16040m5732
2046B740707k09085o7924k73941k40516M56088K70747j50033l04976j13627K70174
2036B377614J10290K6142l27562q7136m39992L08223j11502j13762k8909j0319
2026A703087L8294q9213O0421n9348n25000J61480k9083k4680l18332j39916j4536
2015G63174L90149K16277m05923J91143k79873K92146n35634n17456K18800l1400
2005C01403M45200K05694k82437o4258K79924J2435k43404j0985k9022k00551
$$ plain form
2075 17668755 16187979 15120195 13686734 12294724 11843560 10661258 9750484 9300649 8731934
2066 8731934 7972858 7709581 7361027 6339125 5762543 5286378 4906505 4872191 4858072 4654437
2056 4654437 4183470 3752997 3323513 3559408 3413074 3574282 3534095 3002479 2786439 2740707
2046 2740707 2531622 2463698 2189757 1949241 2405329 2676076 2526043 2221067 2107440 2377614
2036 2377614 2487904 2514046 2186484 2099348 1659356 1967579 1856077 1742315 1713406 1703087
2026 1703087 1741381 1652168 1712589 1653241 1128241 1289721 1260638 1235958 917626 777710 763174
2015 763174 1153323 1369600 963677 1154820 874947 1167093 631459 114003 332803 301403
2005 301403 746603 952297 669860 605602 885526 897961 654557 643572 614550 413999
1995D13999J28915O9543l18155M2725L00459J58724o58090O6806L1799K6965J79972
1984D43662K15492O7740j30833M4272O5538k31092L23552j4332m02171L8176J25206
1973E45210K09457m33193l47517P1533J95558J15882L8466l63235P8813M35448
1963E46422j43627J30618J35103o5025N8106N1619l56861M17909l34065r5639
1953C44560M18302j7862k23369j94672j13731j30650L8484m5097L7015R9389m2875
1942A69494L14617k50492J39883K57213j702K80480m67308l04160J5691j25776
1932B7940K1725M32790l55479j03962j88860L02430K96078o57774O8894Q370K35958
1921H8110K63111l78006L33877k86161j03996J65138L64946r2808m83248M61487
$$ plain form
1995 413999 542914 612457 294302 337027 637486 796210 138120 204926 236725 263690 443662
1984 443662 659154 726894 596061 640333 705871 474779 798331 783999 381828 420004 545210
1973 545210 754667 321474 -26043 45490 241048 356930 395396 32161 110974 546422
1963 546422 402795 533413 668516 603491 661597 713216 356355 774264 440199 344560
1953 344560 762862 745000 521631 326959 213228 82578 121062 75965 112980 212369 169494
1942 169494 484111 233619 373502 630715 629013 909493 442185 138025 153716 27940
1932 27940 49665 482455 126976 23014 -165846 136584 432662 -225112 -156218 -147848 88110
1921 88110 351221 -26785 307092 20931 -83065 82073 447019 354211 -129037 332450
1911C32450k83341l35942J30963m422J01253j21772P1121K16424Q7396j1580j47472
1900C5078L16508Q2724l84574K66686K19210l89666J97418j85925k80319K57665
1890A34805k80157n25728P9108K43672L64652M5426J84871M3170l99920m61015
1880e71116L25050N35321P975J94335l28210l21095j74646r9986R5953L35018
1870a401j22443q2165O01044j86749l49927m52093J14039Q7865M40953R2887l43257
1859b01247J46152K12296R143l3676L48007j45422l87326m2780J7114k03572j47450
1848d28761M41931L54404n8737l49171m34630K75011k84686P810K82005P4718
1838a20106n892m64267J70991N35980k97676j8514j35745J32158j61271J78184
$$ plain form
1911 332450 49109 -286833 -155870 -160292 -59039 -180811 -109690 106734 194130 182550 35078
1900 35078 351586 434310 49736 316422 535632 145966 343384 157459 -122860 134805
1890 134805 -145352 -671080 -591972 -348300 16352 61778 246649 289819 -110101 -571116
1880 -571116 -246066 289255 297230 491565 163355 -157740 -332386 -432372 -336419 -1401
1870 -1401 -123844 -206009 395035 208286 -141641 -593734 -479695 -391830 49123 142010 -201247
1859 -201247 -55095 157201 166344 132668 480675 335253 -52073 -94853 -77739 -281311 -428761
1848 -428761 13170 367574 308837 -40334 -474964 -199953 -484639 -476829 -194824 -120106
1838 -120106 -125998 -590265 -419274 116706 -180970 -199484 -335229 -203071 -364342 -186158
1828a86158J85788j66603R3597J56243m9537k27088p0471l17563K91412J68325
1818a22055R1385K0215j58009J35992P127J59249k25409L08137O3878j59944j78612
1807e8046m46356M97338J73155m569K8140k65101P480j74483L8749L00493m10023
1796c13223J43203M26050J80350j09209o58286Q1248L01122m14856m75598M63888
1786c75311L08262J80696j6025n35839J4190K95611P7298p8820K3065N37389j88025
1775B42491k37477O0227K24295j70405l38509K96962j5010q7662O3688r157k56926
1764b27483P016M58088m67886n69583L77541M54212l9633n0725N6865k22270K06985
1753a6873k86673j53147K09269J67065j64039o8290j3693M13780l37005j7564
$$ plain form
1828 -186158 -370 -166973 -73376 82867 33330 -193758 -264229 -581792 -290380 -122055
1818 -122055 -30670 -10455 -168464 -32472 -25345 133904 -91505 216632 280510 120566 -58046
1807 -58046 -504402 -7064 166091 161522 189662 -75439 -67959 -242442 -203693 96800 -313223
1796 -313223 -170020 256030 436380 327171 -331115 -249867 51255 -363601 -839199 -375311
1786 -375311 -67049 113647 97622 -438217 -424027 -128416 -51118 -129938 -106873 430516 242491
1775 242491 5014 65241 289536 119131 -219378 77584 62574 -25088 38600 29443 -227483
1764 -227483 -220467 237621 -230265 -799848 -422307 31905 -7728 -58453 -1588 -223858 -16873
1753 -16873 -303546 -456693 -247424 -80359 -244398 -312688 -326381 87399 -249606 -267170
1743b67170L40053K88609K7016l07935J4887j54469M5761J40420J68929k61542
1733C4559r4801L4104j79736K0447J09972o1533k68728O51055j82277l5233K33962
1722B61791k25902j16981J00811l37176k67605N75738P8543N821j63727n1820
1712a40507j90001L02545J00105J44894K13198m95208j71360L87078j73539l57156
1702c79951J48471P3094p9408k48897J73679j79037j0486L27449k64241J85404
1692b53923l8515L17781M13771l61782k2340l979l60382O9142P1782j52873k13978
1681e35296Q8297j06367L02400K47423j53840J82650n00430q3658M14189Q6043
1671e8589M11363J811l4549m82311j95373k32364M04055K17443k24573k12068
$$ plain form
1743 -267170 72883 361492 388508 80573 95460 -59009 -13248 127172 296101 34559
1733 34559 -60242 -26138 -205874 -185427 -75455 -136988 -405716 245339 63062 27829 261791
1722 261791 35889 -81092 19719 -317457 -585062 -9324 69219 75040 -88687 -140507
1712 -140507 -330508 -27963 72142 217036 430234 -64974 -236334 150744 -22795 -379951
1702 -379951 -231480 -158386 -237794 -486691 -313012 -492049 -502535 -175086 -439327 -253923
1692 -253923 -292438 25343 439114 77332 54992 51013 -309369 -240227 -168445 -321318 -535296
1681 -535296 -446999 -553366 -250966 -3543 -157383 25267 -475163 -558821 -144632 -58589
1671 -58589 352774 354585 320036 -162275 -357648 -590012 -185957 31486 -193087 -405155
1661d05155N35504P30820k77620m69794m69084R8565L53477j06376j80222J86051
1651c834k86273L66935l25508q6622n227K95441o3002n2322J53810m30384q2866
1640e19852p689Q0987O6172J28568J00077J30982O5366l53561J6586q6877j70058
1629e49299L09689J24075K36459J31567L204m1951m58006K16952R2902l55085
1619b89493K00222N50241k57986k24860k72275L17149K73436l25680j40567q9217
1609b59030K2047m5396J29301K62247J89385j43976j98497M6842Q5966l79062
1599b90173R034j25172K30574K39612K8758j81148j21636j24946j99351K36548
1589b97900n7731l9256P10007p6194m91684q0413J65099R0627k65552r2338L70680
$$ plain form
1661 -405155 130349 861169 583549 113755 -355329 -256764 96713 -9663 -189885 -3834
1651 -3834 -290107 76828 -248680 -335302 -340529 -45088 -108090 -160412 -6602 -436986 -519852
1640 -519852 -527541 -446554 -380382 -251814 -151737 -20755 44611 -308950 -292364 -379241 -549299
1629 -549299 -239610 -115535 120924 252491 255695 213744 -244262 -27310 65592 -289493
1619 -289493 -89271 460970 202984 -21876 -294151 22998 296434 -29246 -169813 -259030
1609 -259030 -236983 -282379 -153078 109169 298554 154578 -43919 2923 88889 -290173
1599 -290173 -281139 -406311 -175737 63875 92633 -88515 -210151 -335097 -534448 -297900
1589 -297900 -355631 -394887 315120 238926 -252758 -333171 -168072 -77445 -342997 -435335 -64655
1578f4655L7569k15034O1338l9615q8306L39618q6260J63300k3980j80204K668
1567i3561k33803M88412K45963l73139l30080J68996K41508k57794l49617j94573
1557f87688L21779r7389R9872j9309K40478l28209Q0434N75670L04892n96317
1547a05787n61458K93729R9151K08785l45351J58630p3382J69353J75404J09372
1537A28446j45899j93350J36536j26051j38544L92970l12174P0995J67073j48804
1527a68802m95238J05945K81169K73786l7492j15924m5702J95377J51308j99766
1517e5339P12J87332k51395l35260K78853k3910k21052m892K67115l9443J78111
1506a9168o861J3802K29942j4774l06118L31617j387q3300r7628M476K39177O594
$$ plain form
1578 -64655 -27086 -242120 -180782 -220397 -308703 30915 -55345 107955 83975 -96229 -93561
1567 -93561 -327364 161048 407011 33872 -296208 -127212 114296 -143498 -493115 -687688
1557 -687688 -365909 -463298 -363426 -382735 -142257 -470466 -390032 185638 490530 -105787
1547 -105787 -667245 -373516 -274365 -65580 -410931 -252301 -325683 -156330 19074 128446
1537 128446 -17453 -210803 -74267 -200318 -338862 54108 -258066 -187071 -19998 -168802
1527 -168802 -664040 -558095 -276926 -3140 -40632 -156556 -202258 -6881 144427 -55339
1517 -55339 -54627 132705 -118690 -453950 -175097 -199007 -420059 -424951 -157836 -197279 -19168
1506 -19168 -26029 -12227 217715 202941 -103177 228440 227053 143753 46125 50601 289778 296372
1494B96372k13340k45185l39721J4197K8474j19191P40482l47551k76730k76850
1484g39043M48676N03357q123m0800j21842M2312o0756j589K02414m37103l0488
1473b42985K56470l5651k27271P3558K18400j04156M1838J12087k5812k98880
1463b32402M42044J27856k65311j15422K67556m78244N85497N7602m5293k38334
1453A05549L00436p1941j85167K46491l06905k8284J21598m21348J26184J34598
1443B1211l37969L52461L20333j21994n77777r2068J58378j03180J04507N4005
1433b22093N6508J25154j0344L79410n48784r2004N04977j6310k07376m8832R6004
1422A6310k48460j02130L6546J95468K74690K0548K38921n96342K95254J17187
$$ plain form
1494 296372 83032 -162153 -501874 -487677 -459203 -578394 162088 -185463 -462193 -739043
1484 -739043 -290367 212990 204867 164067 42225 84537 23781 22192 224606 -212497 -242985
1473 -242985 13485 -22166 -249437 -175879 42521 -61635 -19797 92290 66478 -232402
1463 -232402 209642 337498 72187 -43235 224321 -253923 331574 389176 343883 105549
1453 105549 405985 334044 148877 395368 88463 60179 181777 -239571 -113387 21211
1443 21211 -316758 35703 356036 234042 -343735 -435803 -277425 -380605 -276098 -222093
1433 -222093 -165585 -40431 -50775 328635 -220149 -312153 192824 176514 -30862 -79694 16310
1422 16310 -232150 -334280 -297734 -102266 172424 192972 431893 -164449 130805 247992
1412B47992k38302p9424M2783O48536j10010l02138r5332k72779k0530n475J19884
1401f4795L00296J18576q82k1695Q3472k98324j65818R5546m7449k22110L49397
1390A26214K20251m67182l98120K05440r8628r9069J67458J23358N5441J07301
1380e7536n1523n9645J3774j90030J42057L40642n8945L17261K0254p0560j76732
1369A69017m30690O7936K87335O9826r308Q41k46300l93377J2088M47328m11042
1358d36346m1815O9779J86519j70418J14416q1993O113l60830j20203K56247J8956
1347e59575j99K22920l6253k94175K87197J34074M5863K49533q5204k08270j6235
1336b60324M34252r1880l25786J55954K14077P6429k01419J46341J90812m05882
$$ plain form
1412 247992 9690 -69734 -26951 621585 511575 209437 114105 -158674 -179204 -184679 -64795
1401 -64795 235501 354077 353195 331500 414972 116648 -49170 46376 -1073 -223183 126214
1390 126214 346465 -120717 -518837 -313397 -412025 -511094 -343636 -220278 -164837 -57536
1380 -57536 -109059 -168704 -154930 -344960 -202903 137739 78794 396055 416309 345749 169017
1369 169017 -261673 -193737 93598 163424 154116 154957 -91343 -484720 -472632 -25304 -436346
1358 -436346 -478161 -408382 -221863 -392281 -277865 -359858 -353745 -714575 -834778 -578531 -559575
1347 -559575 -559774 -336854 -373107 -667282 -380085 -246011 -200148 49385 -35819 -244089 -260324
1336 -260324 173928 82048 -243738 -87784 126293 202722 1303 147644 338456 -67426
1326f7426J24400j87224k63953L29094L7880P9501j06505J29751j25439R1189
1316D1268q1773J12054L70145j16588l08125K05418L64292l98505l04347J11022
1306e139J31713j19268m35540j41908K01891L47874p0818j83877K11875O1232
1296a965p6722K42574J64551m00715l82678K3499K49320n6833J88563p3451j42092
1285b65949K89240J66120j624k88377o1401j24192N6082J58341l301O2674j16885
1274a29272k18667J9559M7092K56755m01257p8686J88472J1814m74228K62438
1264e15980q8274J84590M63672j39046q8887k1818o8431K92879o1175j48955O4878
1253a26547K9204L40430j13392k08230L38730N4168q2609j77495p930k4668N5223
$$ plain form
1326 -67426 56974 -130250 -394203 -65109 -27229 52272 -54233 75518 -49921 41268
1316 41268 -40505 71549 441694 325106 16981 222399 586691 188186 -116161 -5139
1306 -5139 126574 7306 -428234 -570142 -368251 -20377 -91195 -275072 -63197 -1965
1296 -1965 -78687 163887 328438 -72277 -454955 -431456 -182136 -238969 -50406 -123857 -265949
1285 -265949 23291 189411 187787 -100590 -161991 -286183 -230101 -71760 -75061 -12387 -129272
1274 -129272 -347939 -328380 -281288 -24533 -425790 -504476 -316004 -304190 -778418 -515980
1264 -515980 -604254 -419664 44008 -95038 -183925 -205743 -274174 18705 -42470 -191425 -126547
1253 -126547 -97343 243087 129695 -78535 260195 314363 231754 54259 46329 21661 76884
1242G6884Q7490q3991j7623J05685k09744k55856J90184J47331o3908k85734N1197
1231b58085k24693L77220N48130l70694j50697j29873Q9510L23169k53129J23850
1221G4708l18735L05427l79875o28314M54934K51632J41946J49962p7757j86522
1211b12594l01697k01421L05891J31006J97493K38514m48910j33018k8914J76542
1201b77108m6566M39655n24898m77258K22030K19902M3097o432J69868J44716
1191i2994P2914j92175K82939r0138m7997k88905K4889o0580R2871J3283j83390
1180d69283K59509l78090K58276K34274j79238P3066j26282L11443J82127k49232
1170h3430j69440K81000J14367l00336P9029K27504l01947l70261j82585K32207
$$ plain form
1242 76884 164374 80383 62760 168445 -41299 -297155 -106971 40360 -23548 -309282 -258085
1231 -258085 -482778 -105558 442572 71878 -78819 -208692 -119182 203987 -49142 74708
1221 74708 -244027 61400 -318475 -946789 -491855 -240223 -98277 51685 -26072 -212594
1211 -212594 -514291 -715712 -409821 -278815 -81322 157192 -291718 -424736 -453650 -277108
1201 -277108 -323674 115981 -408917 -886175 -664145 -444243 -401146 -407578 -237710 -92994
1191 -92994 -20080 -212255 70684 -19454 -67451 -356356 -331467 -392047 -299176 -285893 -469283
1180 -469283 -209774 -587864 -329588 -95314 -274552 -201486 -327768 -16325 165802 -83430
1170 -83430 -252870 28130 142497 -157839 -78810 148694 -153253 -523514 -706099 -473892
1160d73892M58638k40520m06690N4366k56106O4056O23825n6901K58056j5861
1150H971k23406l91472J30008K11436l6994J62262J06667J95615j55825m07366
1140d00104p8519k8745o2547j06069K02556L31053l78695J88872K73211K06401
1130A47414J78446j61981l08597j60799r3942J33151n2691N9823K00692K80882
1120B22398R1862n39854q3295o2281K91734j69660m67334J55808K01344J76147
1110a83131J66689q2414N9929j46565l0265J80903M7464k62731J35752l32340
1100d46709N29218Q2841l49810K44912K7405J20543k33426K77627k81865j19195
1090a48459M07505j00152k29258K6237J82496n8082j01739m2858q5382L15326
$$ plain form
1160 -473892 -15254 -255774 -662464 -608098 -864204 -800148 -176323 -233224 24832 8971
1150 8971 -214435 -605907 -475899 -264463 -301457 -139195 -32528 163087 7262 -400104
1140 -400104 -478623 -507368 -569915 -675984 -473428 -142375 -521070 -332198 -58987 147414
1130 147414 325860 163879 -144718 -305517 -399459 -266308 -318999 -259176 -58484 222398
1120 222398 314260 -225594 -308889 -371170 -79436 -249096 -716430 -560622 -359278 -183131
1110 -183131 -16442 -98856 -38927 -185492 -215757 -34854 12610 -250121 -114369 -446709
1100 -446709 82509 165350 -184460 60452 87857 208400 -25026 252601 -29264 -148459
1090 -148459 259046 158894 -70364 -44127 138369 80287 -21452 -64310 -149692 165634
1080A65634l54775l94118L8143J39496J45517K90666l14262M2693J26265M7330
1070f7411M2216K89819o8319l3697n12629K13365Q5220p7355L9194L52237l36313
1059g3673O0386L4433k0741J75343K48358m48843m89965M60759q4518m6001j6836
1048b01298j12528k85822M45897Q0881k48680L4164L44365J59923L24089o13917
1038g2926O0190p9398l10156L93531k40395k83584L67951R6084m68862o6015M54780
1027a48800L32068l87501O907J86919j87626M6896K4075J95852p7330j49435k759
1016a60734q6702j25398p0311j2389J97793L32022n1405R3731n4241n70187N1544
1005d56277J94165j66373K88499K27940k26294K63930j43474l84477K51005K45924
$$ plain form
1080 165634 -189141 -583259 -545116 -405620 -260103 30563 -283699 -241006 -114741 -67411
1070 -67411 -25195 264624 196305 162608 -350021 -136656 -51436 -128791 -89597 262640 -73673
1059 -73673 -13287 21146 405 175748 424106 -24737 -514702 -53943 -138461 -184462 -201298
1048 -201298 -313826 -599648 -153751 -72870 -321550 -287386 56979 216902 540991 -72926
1038 -72926 -12736 -92134 -402290 -8759 -249154 -532738 -164787 -68703 -537565 -603580 -148800
1027 -148800 183268 -204233 -197326 -10407 -198033 -151137 -127062 68790 -8540 -157975 -160734
1016 -160734 -247436 -372834 -443145 -455534 -257741 74281 22876 116607 62366 -507821 -456277
1005 -456277 -262112 -428485 -139986 87954 -138340 125590 -17884 -402361 -151356 94568
995I4568p4035q5898P260M79933O5485m83687k28247J6205Q3444J91792j95321
984a28501k62325j89471J62870M18185k59819R8716n063J10431P2702K13997L80669
973F12391k92527p2336J29792J22516j4889l93452q654L28658k08835k43243R8259
962E7680K2460n5657L1328o3496L19523j93256n697n1549j86241k63211l9593
951d27709J01804K97897J59531j15249j0343K91489j36801j95795K02360m90165
941c22981J6450N8567l08676M7943K30166j07117N0638M7581M842J81396k33788
930c34979J9067J740J11680K34732J01573j6420K86311L6310L2858m80l85694
919H6698k47185P8597J71270k36088j1020k24953M5214K63794K01758k80419q9518
$$ plain form
995 94568 20533 -65365 -58105 421828 487313 3626 -224621 -208416 -124972 66820 -128501
984 -128501 -390826 -580297 -417427 758 -259061 -160345 -165408 -54977 17725 231722 612391
973 612391 319864 247528 377320 499836 484947 91495 82841 411499 202664 -40579 57680
962 57680 80140 24483 55811 -7685 311838 118582 112885 61336 -124905 -388116 -427709
951 -427709 -325905 -28008 131523 16274 5931 297420 160619 -35176 167184 -322981
941 -322981 -306531 -247964 -556640 -508697 -278531 -385648 -335010 -287429 -282587 -101191 -334979
930 -334979 -315912 -314172 -202492 32240 133813 117393 403704 440014 472872 472392 86698
919 86698 -160487 -81890 89380 -146708 -157728 -382681 -337467 -73673 128085 -152334 -241852
$$ [...]
##END NTUPLES=NMR SPECTRUM
##END=
