##TITLE=1H_CA-9007-2
 CDCl3
 8 sc, 
 6.05.2022
##JCAMPDX= 6.0         $$ Bruker NMR JCAMP-DX V2.0
##DATA TYPE= NMR SPECTRUM
##DATA CLASS= NTUPLES
##ORIGIN= UXNMR, Bruker Analytische Messtechnik GmbH
##OWNER= root
$$ XWIN-NMR		Version 3.5
$$ Fri May  6 15:17:59 2022 Russian Standard Time (UT+4h)  she@DPX200
##.OBSERVE FREQUENCY= 200.1313499996
##.OBSERVE NUCLEUS= ^1H
##.ACQUISITION MODE= SIMULTANEOUS
##.ACQUISITION SCHEME= undefined
##.AVERAGES= 8
##.DIGITISER RES= 18
##SPECTROMETER/DATA SYSTEM= spect
##.PULSE SEQUENCE= zg30
##.SOLVENT NAME= CDCl3
##.SHIFT REFERENCE= (INTERNAL, CDCl3, 0, 15.7271)
##AUDIT TRAIL= $$ (NUMBER, WHEN, WHO, WHERE, WHAT)
$$ ##TITLE= Audit trail, XWIN-NMR		Version 3.5
$$ ##JCAMPDX= 5.01
$$ ##ORIGIN= Bruker BioSpin GmbH
$$ ##OWNER= she
$$ F:/spectra/data/she/nmr/H-F/1/pdata/1/auditp.txt
$$ ##AUDIT TRAIL=  $$ (NUMBER, WHEN, WHO, WHERE, WHAT)
(   1,<2022-05-06 15:16:16.48 +0400>,<she>,<DPX200>,
      <created by zg, POWCHK disabled, PULCHK disabled
       configuration hash MD5:
       00 E9 B6 7A A2 85 ED C7 34 08 36 98 17 FE 4E 26
       data hash MD5: 16K
       FE C7 21 9D 9F 6F 63 F5 54 4C DD 03 0B B0 E2 1F>)
(   2,<2022-05-06 15:16:19.37 +0400>,<she>,<DPX200>,
      <Start of raw data processing
       efp BC_mod = 2 LB = 0.24 FT_mod = 6 PKNL = 1 PHC0 = -18030.35 PHC1 = 7.600749 SI = 16K 
       data hash MD5: 16K
       21 1D 99 6E FF 07 F3 34 B0 F8 BF 9D D6 8F 65 37>)
(   3,<2022-05-06 15:16:36.79 +0400>,<she>,<DPX200>,
      <pk PHC0 = -2.642934 PHC1 = 4.400001 
       data hash MD5: 16K
       BE 38 0A 98 01 38 2E EA 6B 6E 89 CA 23 1E 02 DD>)
(   4,<2022-05-06 15:16:40.29 +0400>,<she>,<DPX200>,
      <abs ABSG = 5 
       data hash MD5: 16K
       D2 94 33 1B DD A1 CC 6D 3F 66 F4 B5 EA 26 7C 04>)
$$ ##END=
$$ 
$$ hash MD5
$$ 8F 6C AA F4 CB 92 81 68 C0 98 2A 0B D9 67 AE 75
##$RELAX= 
##$RELAX= 
##$RELAX= 
##$RELAX= 
##$RELAX= 
##$RELAX= 
$$ Bruker specific parameters
$$ --------------------------
##$DU= <F:/spectra>
##$EXPNO= 1
##$NAME= <H-F>
##$PROCNO= 1
##$TYPE= <nmr>
##$USER= <she>
##$AMP= (0..31)
100 100 100 100 100 100 100 100 100 100 100 100 100 100 100 100 100 100 
100 100 100 100 100 100 100 100 100 100 100 100 100 100 
##$AQSEQ= 0
##$AQ_mod= 1
##$AUNM= <au_zg>
##$AUTOPOS= <>
##$BF1= 200.13
##$BF2= 200.13
##$BF3= 200.13
##$BF4= 200.13
##$BF5= 200.13
##$BF6= 200.13
##$BF7= 200.13
##$BF8= 200.13
##$BYTORDA= 1
##$CFDGTYP= 0
##$CFRGTYP= 5
##$CHEMSTR= <none>
##$CNST= (0..31)
1 1 145 1 1 1 1 1 1 1 1 1 1 1 1 1 1 1 1 1 1 1 1 1 1 1 1 1 1 1 1 1 
##$CPDPRG= <>
##$CPDPRG1= <>
##$CPDPRG2= <>
##$CPDPRG3= <>
##$CPDPRG4= <mlev>
##$CPDPRG5= <mlev>
##$CPDPRG6= <mlev>
##$CPDPRG7= <mlev>
##$CPDPRG8= <mlev>
##$CPDPRGB= <>
##$CPDPRGT= <>
##$D= (0..31)
0 1.2 0 0 0 0 0 0 0 0.06 0 0.03 0 0 0 0 0.0002 0 0 0 0 0 0 0 0 0 0 0 0 
0 0 0 
##$DATE= 1651835776
##$DBL= (0..7)
120 120 120 120 120 120 120 120 
##$DBP= (0..7)
150 150 150 150 150 150 150 150 
##$DBP07= 0
##$DBPNAM0= <>
##$DBPNAM1= <>
##$DBPNAM2= <>
##$DBPNAM3= <>
##$DBPNAM4= <>
$$ [...]
##$SUBNAM2= <"">
##$SUBNAM3= <"">
##$SUBNAM4= <"">
##$SUBNAM5= <"">
##$SUBNAM6= <"">
##$SUBNAM7= <"">
##$SUBNAM8= <"">
##$SUBNAM9= <"">
##$SW= 18.0517283424761
##$SWIBOX= (0..15)
0 0 2 0 0 0 0 0 0 0 0 0 0 0 0 0 
##$SW_h= 3612.71676300578
##$TD= 16384
##$TD0= 1
##$TE= 0
##$TE2= 300
##$TE3= 300
##$TEG= 300
##$TL= (0..7)
0 120 120 120 120 120 120 120 
##$TP= (0..7)
150 150 150 150 150 150 150 150 
##$TP07= 0
##$TPNAME0= <>
##$TPNAME1= <>
##$TPNAME2= <>
##$TPNAME3= <>
##$TPNAME4= <>
##$TPNAME5= <>
##$TPNAME6= <>
##$TPNAME7= <>
##$TPOAL= (0..7)
0.5 0.5 0.5 0.5 0.5 0.5 0.5 0.5 
##$TPOFFS= (0..7)
0 0 0 0 0 0 0 0 
##$TUNHIN= 0
##$TUNHOUT= 0
##$TUNXOUT= 0
##$USERA1= <user>
##$USERA2= <user>
##$USERA3= <user>
##$USERA4= <user>
##$USERA5= <user>
##$V9= 5
##$VALIST= <valist>
##$VCLIST= <CCCCCCCCCCCCCCC>
##$VD= 0
##$VDLIST= <DDDDDDDDDDDDDDD>
##$VPLIST= <PPPPPPPPPPPPPPP>
##$VTLIST= <TTTTTTTTTTTTTTT>
##$WBST= 1024
##$WBSW= 4
##$XGAIN= (0..3)
0 0 0 0 
##$XL= 0
##$YL= 0
##$YMAX_a= 647903
##$YMIN_a= -905528
##$ZGOPTNS= <>
##$ZL1= 120
##$ZL2= 120
##$ZL3= 120
##$ZL4= 120
##$ABSF1= 15.74028
##$ABSF2= -2.311569
##$ABSG= 5
##$ABSL= 3
##$ALPHA= 0
##$AQORDER= 0
##$ASSFAC= 0
##$ASSFACI= 0
##$ASSFACX= 0
##$ASSWID= 0
##$AUNMP= <proc_1d>
##$AZFE= 0.1
##$AZFW= 0.1
##$BCFW= 0
##$BC_mod= 2
##$BYTORDP= 0
##$COROFFS= 0
##$CY= -3
##$DATMOD= 1
##$DC= 0
##$DFILT= <>
##$DTYPP= 0
##$F1P= 0
##$F2P= 0
##$FCOR= 1
##$FTSIZE= 16384
##$FT_mod= 6
##$GAMMA= 0
##$GB= 0
##$INTBC= 1
##$INTSCL= 0
##$ISEN= 128
##$LB= 0.24
##$LEV0= 0
##$LPBIN= 0
##$MAXI= 10000
##$MC2= 0
##$MEAN= 0
##$ME_mod= 0
##$MI= 1.114404
##$NCOEF= 0
##$NC_proc= -6
##$NLEV= 6
##$NOISF1= 3.799351
##$NOISF2= 2.8
##$NSP= 0
##$NTH_PI= 0
##$NZP= 0
##$OFFSET= 15.72706
##$PC= 1
##$PHC0= -18032.99
##$PHC1= 12.00075
##$PH_mod= 1
##$PKNL= yes
##$PPARMOD= 0
##$PSCAL= 0
##$PSIGN= 0
##$REVERSE= no
##$SF= 200.130008902742
##$SI= 16384
##$SIGF1= 3
##$SIGF2= 2
##$SINO= 5.538805
##$SIOLD= 16384
##$SREGLST= <1H.CDCl3>
##$SSB= 0
##$STSI= 16384
##$STSR= 0
##$SW_p= 3612.71676300578
##$SYMM= 0
##$S_DEV= 0
##$TDeff= 16384
##$TDoff= 0
##$TI= <>
##$TILT= no
##$TM1= 0
##$TM2= 0
##$TOPLEV= 0
##$USERP1= <user>
##$USERP2= <user>
##$USERP3= <user>
##$USERP4= <user>
##$USERP5= <user>
##$WDW= 1
##$XDIM= 16384
##$YMAX_p= 474863494
##$YMIN_p= -280919
$$ End of Bruker specific parameters
$$ ---------------------------------
##NTUPLES= NMR SPECTRUM
##VAR_NAME=  FREQUENCY,     SPECTRUM/REAL,   SPECTRUM/IMAG
##SYMBOL=    X,             R,               I
##VAR_TYPE=  INDEPENDENT,   DEPENDENT,       DEPENDENT
##VAR_FORM=  AFFN,          ASDF,            ASDF
##VAR_DIM=   16384,         16384,           16384
##UNITS=     HZ,            ARBITRARY UNITS, ARBITRARY UNITS
##FACTOR=    0.220516191357247, 1,           1
##FIRST=     3147.45672145393, 0,            0
##LAST=      -465.260041551848, 0,           0
##MIN=       -465.260041551848, -280919,     0
##MAX=       3147.45672145393, 474863494,    0
$$ Real data points
##PAGE= N=1
##DATA TABLE= (X++(R..R)), XYDATA
$$ [...]
8671 7204353 6931100 6680465 6501307 6425634 6323190 6146617 5974368 5775711 5633341 5532890
8661 5532890 5351446 5231977 5111342 5072396 4979764 4916435 4779555 4709558 4625846 4428841
8651 4428841 4424277 4435872 4372058 4296889 4314394 4338665 4222779 4181551 4220439 4152138 4114134
8640 4114134 4118830 4105339 4100745 4013862 4091593 4104831 4086453 4038872 3973412 3978632 3948150 3937863
8628 3937863 3974653 3925047 3854540 3908388 3941845 3978526 4066701 4057457 4036923 4000147 4044118 4022124
8616 4022124 4087072 4054898 4095731 4119749 4110231 4193759 4165950 4111870 4079310 4073982 4189192 4260993
8604 4260993 4226194 4300837 4391663 4381265 4346950 4459948 4423259 4568377 4539263 4537765 4623518
8593 4623518 4639498 4684213 4744963 4787471 4888763 4944338 4937988 4935198 5069479 5144645 5175369
8582 5175369 5303671 5290001 5341697 5384953 5338554 5549625 5498024 5564156 5693686 5717561 5816449
8571 5816449 5903370 5857095 5895876 6054549 6205948 6287154 6494029 6635123 6602737 6741760
8561 6741760 6972375 7116989 7264610 7339990 7488352 7780238 7858621 7979595 8166603 8347484
8551 8347484 8548679 8716256 8887040 9092640 9279530 9634391 9947848 10112880 10441563 10676168
8541 10676168 11011027 11342632 11664126 11972490 12312010 12620830 12982760 13397301 13773043
8532 13773043 14236119 14643391 14996900 15476493 16143310 16768758 17258975 17838333 18463944
8523 18463944 19111437 19914516 20564335 21267232 22080643 22833334 23666369 24483419 25410561
8514 25410561 26436621 27355449 28289619 29019882 29643084 30375836 31085338 31704685 32454725
8505 32454725 33060412 33821241 34650551 35543679 36491288 37376481 38195926 38963487 39649531
8496 39649531 40463490 41124449 41800789 42290379 42890565 43433280 43840400 44089324 44205548
8487 44205548 44305460 44147534 44019759 43818129 43715627 43470872 43259923 42917251 42731742 42647729
8477 42647729 42591972 42574202 42705895 42910154 43000186 43034938 42933988 42670595 42480449 42334712
8467 42334712 42177422 42187666 42204634 42316138 42245545 42377421 42561124 42757966 42958856 43262793
8457 43262793 43596179 44067693 44522982 44899497 45099702 44965458 44620051 44060060 43414050
8448 43414050 42755406 42168939 41483676 40746855 39821173 38738883 37576034 36282235 34944327
8439 34944327 33741180 32517987 31209785 30032507 28924275 27767054 26710771 25752958
8431 25752958 24866720 24133405 23391871 22629513 22012264 21327081 20745731 20089499 19616813
8422 19616813 19168483 18671784 18193720 17651901 17171222 16755297 16282545 15706071 15285363
8413 15285363 14886293 14517926 14011120 13724119 13411800 12938942 12530158 12194157 11872087
8404 11872087 11595616 11193694 10840470 10631091 10327335 10074733 9782125 9535324 9314937
8395 9314937 9157523 8999967 8727456 8556605 8415771 8281059 8086698 7923822 7758162 7570122
8385 7570122 7651974 7605173 7443726 7279938 7076990 7076385 6956490 6898450 6794427 6760591 6775982
8374 6775982 6680327 6698074 6533686 6523727 6388700 6322717 6388198 6469550 6368134 6310905 6281782
8363 6281782 6236197 6222322 6202984 6107508 6062007 6045831 6168668 6184119 6173790 6203278 6261364
8352 6261364 6296017 6302247 6343802 6300349 6361932 6514290 6640381 6683976 6693313 6805240 6879725
8341 6879725 6936411 7032968 7166377 7233870 7318966 7413513 7551113 7762480 7855516 8031191 8145770
8330 8145770 8296898 8518378 8589951 8651893 8878567 9000107 9250171 9577666 9784660 9939178
8320 9939178 10277456 10658001 10956918 11287991 11692052 12059264 12382894 12747656 13155612 13678190
8310 13678190 14190614 14711009 15325619 15733017 16039933 16301710 16513738 16691475 16747624 16765209
8300 16765209 16956921 17160215 17323826 17492062 17565067 17565351 17413239 17213586 17074086 16957401
8290 16957401 16928282 16886500 16822656 16758123 16668861 16686789 16688585 16668823 16814725 16905593 16991665
8279 16991665 17110616 17324365 17706571 18009957 18354806 18842243 19291663 19650375 20072036
8270 20072036 20534303 20989947 21562155 22230604 22715312 23115110 23506006 23475009 23439911 23410671
8260 23410671 23420576 23339068 23307099 23173426 22986528 22802272 22551638 22235858 21737910 21248864
8250 21248864 20651426 20075920 19548683 19042567 18511526 18135751 17767216 17282696 16851626
8241 16851626 16517477 16148322 15918191 15694576 15503008 15393044 15258089 15236220 15126054 15049658
8231 15049658 14947751 14967309 14937790 14941322 15029749 14974215 15031310 15011801 14902179 14720120 14534008
8220 14534008 14210943 13998803 13743005 13591916 13298358 13103297 12892157 12709167 12339694
8211 12339694 11900843 11549805 11105014 10719872 10493894 9986862 9580128 9331853 8988120
8202 8988120 8694740 8414050 8106498 7768958 7437846 7179466 7027381 6853326 6685927 6463725
8192 6463725 7112221 6773765 6290320 6057776 5855677 5649696 5506470 5428556 5201395 5130244
8182 5130244 4948690 4716427 4544802 4477465 4460940 4319988 4159810 4073608 3861680 3830757
8172 3830757 3807665 3700054 3519972 3462317 3389608 3256622 3272779 3296064 3266899 3123710 2974247
8161 2974247 2922443 2790042 2638946 2591637 2666174 2511011 2436806 2440478 2293661 2369531 2357150
8150 2357150 2278521 2292904 2256553 2134588 2152919 2173655 2072672 2098471 2097355 2083013 2115018
8139 2115018 2049951 1915814 1963885 1929328 1834782 1861382 1819230 1804414 1841389 1871878 1850245
8128 1850245 1646634 1657733 1598119 1593305 1607662 1562784 1462533 1455749 1516303 1464099 1263762
8117 1263762 1242052 1301799 1322633 1274540 1324687 1287669 1278175 1274168 1224169 1285881 1287287 1161129
8105 1161129 1080707 1077894 1031684 1055721 1161174 1228966 1190376 1167487 1245028 1221129 1125192
8094 1125192 1077549 1055224 1013942 987031 1052400 1005983 1010863 909052 984051 1082290 988082
8083 988082 939284 926888 974174 951331 974231 910708 817378 848446 877345 854916 804606 905425
8071 905425 983826 878765 802490 792827 701948 632772 691808 731085 671270 663127 651890 693401
8059 693401 695940 592600 622707 750256 660043 611157 662010 661551 585173 602376 529466 524205
8047 524205 597958 598682 629333 648845 698519 590420 572644 575063 450657 402679 480692 530343
8035 530343 498719 575857 471164 474279 541451 547484 532108 500135 514779 524072 516233 438735
8023 438735 415195 392219 414873 475953 416305 467791 445819 349724 467359 396612 334321
8012 334321 346850 268510 316137 353991 370357 376289 377824 320466 306170 358902 398450 356352
8000 356352 343594 328421 262603 193379 277526 323623 314516 414428 425687 321714 184082
7989 184082 195523 158535 170322 274702 305221 393708 325689 357439 349391 387341 254667
7978 254667 256618 354218 275934 296563 350576 275751 215024 256039 309827 370897 383477 369842
7966 369842 268173 323038 231640 204834 269888 343914 276977 282805 293480 269693 177606 89874
7954 89874 139808 157467 206506 216055 281316 354780 341706 255149 170425 151358 301254 289053
7942 289053 230532 356642 317064 213355 212371 210624 279096 247512 196485 215732 261594 272646
7930 272646 259063 333486 221590 274585 251413 239096 165572 173337 260932 215796 190485 163344
7918 163344 213196 205833 135452 186904 116470 142745 138819 144659 195933 85931 163037 257893
7906 257893 210779 213411 246989 310780 348650 343952 168900 117427 117558 169228 177741 317537
7894 317537 331739 339838 345939 374362 271620 201134 213670 174387 244961 267747 282459 232878
7882 232878 240539 181140 140344 135982 180598 116941 173867 225872 220991 212049 135179 172177
7870 172177 192213 116129 107512 42952 55562 -42359 24145 134282 194095 172597 56333
7859 56333 45447 94474 52511 38425 -71276 -29415 56748 154854 136155 49453 168238
7848 168238 69692 124949 147763 156206 169129 104989 154197 141659 59197 130637 137667 20570
7836 20570 55493 -23879 33205 85276 72561 88744 77108 135078 113797 -20222 36091 84953
7824 84953 -46424 -118292 -13245 8403 27404 -90241 -41712 -55066 50213 76315 54733
7813 54733 17804 -115130 -97174 -2917 -45990 -24635 175336 192796 103323 9049 46321
7802 46321 88966 105313 146950 129112 92399 140800 40197 102110 -10622 -23936 -37965
7791 -37965 13516 84616 5170 -102708 -73799 -56119 -33735 48205 81814 19803 53137 125924
7779 125924 -21532 -49302 -44662 -211805 -62239 -4873 -63968 -68631 -21787 -63978 -143968
7768 -143968 -78897 -132867 -111413 -126256 -106931 -95199 -72209 -31925 -48621 -43708 -26906 32039
7756 32039 89568 104912 -5825 -112441 -57860 -104375 -53610 -34336 -79519 -97239 -44061
7745 -44061 -28337 -49544 -19271 -97102 -148300 -72263 -64681 -80806 -26604 -107898 -112586 -33717
7733 -33717 48509 39934 68323 116671 24535 33218 -20974 5068 39876 -58327 -114444 -81528
7721 -81528 26688 -7169 -100457 -192415 -78158 33471 -7505 31016 43201 27392 -29561
7710 -29561 20888 -101958 -98182 -119419 -114177 -150281 -199246 -149328 6703 -2945 -100227 -107081
7698 -107081 -110589 -74084 -91523 -62109 -86225 -59927 -31371 -16365 -17753 -56325 -92712 -81060
7686 -81060 -108544 -73955 -105353 -12545 -4642 -54396 -32878 12627 30747 10372 -22751 -38616
7674 -38616 -89288 -137513 -138191 -124341 -79977 -57298 -108993 -172492 -30112 -91525 -67904 -6037
7662 -6037 1630 -68069 -161994 -59878 -84749 -79106 -178419 -159102 -61984 8916 34842 32009
7650 32009 -64574 -65164 -83324 -76563 -113344 -118489 -131931 -21836 1941 -72620 -123531 -95138
7638 -95138 -74274 56 39166 27061 -1918 -37049 -117196 -209673 -266114 -229815 -239024 -180204
7626 -180204 -76806 -49230 21360 34882 -43598 -170592 -153985 -44000 -45288 -232668 -101522
7615 -101522 -190647 -202939 -163586 -169742 -76181 -147528 -222279 -180093 -96680 30398 -15428 -185058
7603 -185058 -253513 -142461 -119388 -156289 -77917 -38752 -109724 -128612 -104097 -93532 -58850
7592 -58850 -4548 -58685 -73288 -156403 -112592 -72051 -86493 -123210 -92702 -65528 -53582 -20025
7580 -20025 -53878 -14617 -92045 -218632 -138251 -110733 -151911 -212797 -113902 -107690 -90407 -136267
7568 -136267 -117685 -116980 -177806 -224374 -222433 -102326 17580 -26938 -24352 9944 -23567 -80
7556 -80 -67033 -93592 -115666 -12758 -125232 -211283 -173590 -118193 -86795 -111753 -79672 -63099
7544 -63099 -101753 -71609 -91426 -78428 -184251 -148370 -21615 -15802 -94274 -26684 -126773
7533 -126773 -129159 -75099 -167563 -56874 54376 -42817 -65369 -61557 -37822 30223 -63299 -84630
7521 -84630 29146 -9002 -64668 -61442 -87552 -126705 -67329 -33755 7832 -123478 -176823 -67333
7509 -67333 -122207 -131716 -119283 -80177 -66734 3957 -81641 10996 -37119 -52554 -48156 -79838
7497 -79838 -133019 -51951 23494 -18462 -26975 -52000 -129144 8003 14903 77339 40450 -3773
7485 -3773 -130286 -127027 -12819 -19227 -33416 37079 -41759 -91988 -15187 -41818 -6085 -1478
7473 -1478 92660 -37491 20344 -13121 -555 -26968 12531 -21026 -42508 -88528 6582 10568
7461 10568 -11250 -8083 -4704 -21950 -84180 -190732 -98979 -117675 -53651 -6565 -73645 -44725
7449 -44725 -79635 -26546 61956 -68985 -53086 -15804 3020 -14345 -47773 755 -68531 -134353
7437 -134353 -71076 -94124 -134010 -107746 -156515 -207512 -161133 -9757 4715 -38577 79227
7426 79227 31760 -147692 -184211 -133969 -152239 -132000 -91831 -96027 -70916 -109096 -151299 -76844
7414 -76844 -85278 -172606 -130245 -111520 -95564 -108530 -84200 -26761 -83771 -105080 -33221 -113847
7402 -113847 -147483 -53804 20395 -11382 -21593 -85775 -5364 -48779 -14468 -11284 -115896 -119099
7390 -119099 -66160 -38551 -6329 -67994 -47251 -131876 2354 -754 -16469 -27436 -14141 -43963
7378 -43963 -146194 -57033 24980 40596 29545 -85200 -65134 -71612 -128747 -194542 -217784 -162673
7366 -162673 -116068 -42821 -54493 -73490 -72982 -120278 -67635 -20408 6491 27335 39401 3026
7354 3026 -23986 -79564 -36424 -54826 -61004 9246 -5853 20749 -9205 -98781 -153030 -206591
7342 -206591 -199845 -105175 -133731 -53556 -78046 46425 38410 -22279 -81697 -37499 -36118 -108944
7330 -108944 -132073 -187665 -188087 -170870 -200709 -149540 -94445 -34438 -100763 -49818 66032 47124
7318 47124 37286 102567 56203 -68955 33104 30328 -67441 -77216 -26613 39205 43325 36757
7306 36757 -81546 -125398 -176968 -47478 -41214 -101675 -72461 72127 70705 -72394 -82740
7295 -82740 -57901 -42417 -54931 -92523 -143128 -103552 40952 56325 54820 70394 8575 -14735
7283 -14735 -40732 3615 -52490 -12703 11432 11108 -8309 -19410 -71638 -10992 -94878 -93176
7271 -93176 -27932 -81692 -108356 -123834 -175358 -169407 -149917 -194732 -120703 -223820 -188682 -169286
7259 -169286 -123130 -17065 -90573 -246137 -123395 -101044 -131322 19732 49053 126529 156265
7248 156265 48966 27649 30835 24804 79209 120431 92128 -10141 -81128 -20821 -48197 -89683
7236 -89683 -86658 -160079 -117562 -45025 -128440 -178388 -94455 -170218 -280919 -160202 -32795
7225 -32795 -92071 -50156 13262 -105466 -154815 -70838 -74069 40821 66910 26252 -59281 17479
7213 17479 -24544 -41454 -90976 -76217 -53472 -49556 -69598 -174212 -111753 -22959 -2423 -72704
7201 -72704 -124718 -134821 -110548 -59883 -36652 -106450 -155205 -75136 37156 -7573 -89848 -139557
7189 -139557 -20024 -756 9774 -21896 -149361 -38476 -46361 -70664 7960 72513 -85162
7178 -85162 -182296 -83500 -75569 -15037 -31728 -3707 -106532 -66515 -51713 35109 53978 41574
7166 41574 20835 -54249 -110386 -145587 -141548 -54850 28607 -2795 46037 -4016 -144725 -125406
7154 -125406 -7176 -119580 -171658 -141893 -171622 -100173 -117125 -171273 -116831 -102376 -32853
7143 -32853 68466 46941 17525 13243 -88637 -51372 38597 30452 -76430 19236 21941 21934 17359
7130 17359 -63439 -36885 -128688 -51800 -18782 44221 6172 -89946 -4663 -50097 -88346 38703
7118 38703 -34812 -96801 -38919 -49790 -76456 -47009 -16019 -14003 80255 67656 13615 89845
7106 89845 155437 46806 -79782 -131219 -139894 -40570 27594 -110724 -151059 -186299 -94229
7095 -94229 -34515 -55401 -34458 -41925 12748 57363 7147 -20660 -119076 -53524 -43631 56940
7083 56940 25104 -89922 -13333 -6656 -14540 -103115 -40861 9330 -84545 -91097 -29462 -68257
7071 -68257 -22052 25857 78576 16800 -113326 -160985 -90168 -61232 -194912 -99925 -62861
7060 -62861 -61561 -29794 -18439 -22006 -18564 37340 -61209 -62297 -13305 14083 -73430 -25996 3692
7047 3692 53036 -71123 -95079 173 -140036 -176809 -165544 -117047 -135744 -53544 -12611 -57196
7035 -57196 72462 41772 -2077 1261 -569 -64528 -53022 20321 52782 -47677 -69446 24792
7023 24792 28482 14962 -18376 -64024 -52925 -6177 -49360 -102388 -65025 -20058 13236 84401
7011 84401 9001 -77754 742 21436 43192 -30065 -31850 -8664 -76671 -114199 -113201 -43653
6999 -43653 -4868 -72033 -67476 18092 52650 -7502 33944 34431 29820 42101 -58745 -861
6987 -861 -101945 -44808 10163 8049 18791 37106 -22008 64275 11186 -68369 -19677 26853
6975 26853 34089 -63707 -44739 5876 -45303 -128409 -113464 -74103 28835 63336 25885 18151
6963 18151 -27304 -604 48341 24280 12903 -3737 20087 -62948 -24942 -12846 -26695 -56824
6951 -56824 -7332 69113 50181 190616 155890 73233 73447 8671 -27246 -25375 15408 74276
6939 74276 73695 80526 -32966 -58395 10547 90715 49995 34096 22580 -89480 13961 17744
6927 17744 -22544 -75470 -56446 56241 50559 -49392 -107133 -87373 -48856 55192 71031 81119
6915 81119 110552 170410 158973 39882 13378 -9476 -45768 -38604 -45000 9692 26805 52606
6903 52606 25511 94441 64671 95762 118074 113416 82710 60337 75583 94201 39920 49040
6891 49040 62395 -91080 -72323 26136 158809 105548 35612 -29706 22162 -55386 -28125
6880 -28125 -78378 -91208 6312 50350 54580 77971 59912 -35991 -81378 -40082 29283 31037
6868 31037 70290 85429 -1071 61269 78451 25103 -112629 -124173 -47236 5538 49506 31894
6856 31894 69773 56619 11970 11064 -26795 -21146 8617 16131 12732 7690 39287 -14013 -62234
6843 -62234 -41034 -75458 -54792 -53823 -80635 11878 141805 121251 62105 121139 20718 -139154
6831 -139154 -67049 -43078 20846 120300 97907 -17373 -138647 -199369 -127483 -34770 -94174
6820 -94174 -26318 -20908 105192 110158 24993 15406 134510 164158 102409 -56806 -17263 -22623
6808 -22623 -7208 -23928 -80753 -65708 755 -18757 7731 79077 119561 216431 158420 36839
6796 36839 28602 36366 10115 -18678 92094 70944 37168 17733 22286 105057 41934 71750
6784 71750 160619 67513 42144 88582 98532 140230 93869 98427 95937 191816 121691 169566
6772 169566 104589 100489 103890 100061 26289 -12937 14041 18765 157791 40098 4155 60231
6760 60231 44148 32004 143345 119561 28770 -28573 37455 46874 30653 -41149 -83014 5550
6748 5550 38356 21169 175 69526 56060 133259 78789 66231 100359 72251 63858 92001
6736 92001 67371 96274 116756 164501 111925 45063 57991 103900 14470 -53590 -51175 -42116
6724 -42116 -47391 -106320 -8293 112749 98994 74597 90251 146880 50515 30059 39163 -68993
6712 -68993 -40001 72852 38765 -45129 -26274 91077 108663 106531 149488 62302 34367 30972
6700 30972 -4992 12791 59592 58645 23250 -22472 -35336 37198 132819 172344 61049 -89312
6688 -89312 -54695 -6586 60668 84077 60767 -17406 52499 77768 32 49767 39519 -88333
6676 -88333 -59217 -67781 -9 43307 39420 99607 99457 119992 27798 58122 85211 67044 77622
6663 77622 -23610 -81235 -47793 -1593 -16790 22260 84279 114076 -19021 -54193 -51706 49677
6651 49677 169181 103023 51024 99678 111101 92788 65961 -997 59149 -6259 -128585
6640 -128585 -83015 25020 12093 -31431 -37580 3681 186269 178822 96037 119732 155266 84878
6628 84878 18241 73489 55415 4937 84212 211775 29721 145979 190844 175395 208626
6617 208626 70739 -16767 -72024 -50580 19580 185969 250367 218301 209584 273195 209377
6606 209377 113412 218924 143800 114858 103572 32080 11615 7589 24970 50236 34127 48909
6594 48909 90027 27622 58661 126152 103241 36452 20215 51839 116912 134443 112220 59407
6582 59407 33929 22267 102716 56849 53291 -27253 4778 18478 -21403 29705 128035 147864
6570 147864 85968 100180 144272 69099 14505 56251 164074 123324 84176 105169 161492
6559 161492 85748 133747 184151 107894 4489 -53359 106216 178658 68666 3777 54554
6548 54554 95263 33587 9304 40438 60790 14018 64092 227624 43844 14728 102507
6537 102507 122052 155955 144668 154370 248876 123538 64215 57648 30644 46046 63144 74064
6525 74064 137748 199097 169243 146093 92017 28879 38178 119640 232249 230950 231778 164834
6513 164834 181249 241058 177952 121634 135854 182538 179829 121708 143791 114745 99519 101724
6501 101724 102771 74995 181793 182316 222004 83855 36885 44458 106210 21853 -139071 -46764
6489 -46764 48212 127904 217941 135215 90550 115643 109343 159353 186208 155859 157486 215156
6477 215156 76149 15486 115153 161906 197516 129392 129611 156840 59890 95634 167221 159818
6465 159818 41679 -8298 67534 109571 118237 120261 134716 142605 47250 165684 219118 234500
6453 234500 190786 213725 200526 146345 134336 56275 108738 214737 151020 76633 94345
6442 94345 65527 84147 158541 177915 196328 143569 111828 186729 190434 103053 132710 53754
6430 53754 79204 49165 9308 97424 135130 157917 166624 160574 86390 -5187 97450 104111
6418 104111 197960 227109 227785 225184 208565 333419 207384 144311 220207 222659 218978 180402
6406 180402 134510 107216 145671 162233 220485 193694 275737 242929 128886 102848 -10195
6395 -10195 99459 230576 262740 297299 252808 210042 96230 166326 177827 137565 195944
6384 195944 149592 107166 150957 135575 125732 98532 60497 148038 132242 179273 145314 126430
6372 126430 298967 231486 152300 22682 139180 196890 165383 240988 159289 179100 170107
6361 170107 188756 254116 263142 241246 273058 204463 209232 173478 179634 168970 187467 198835
6349 198835 286054 277774 230553 198620 285729 336450 253605 173551 235948 292442 306864 231559
6337 231559 242011 195118 184338 227054 88400 44988 162004 115627 121451 290765 374232
6326 374232 303284 321750 395153 408739 368052 303206 182816 129534 243952 228250 180256
6315 180256 252883 360010 402572 322930 292843 338778 299994 248780 249682 383818 370326 243971
6303 243971 189549 336197 377081 404791 372850 289694 340515 330277 187310 215305 335794
6292 335794 292668 263370 239647 255474 300015 348887 275606 243510 274508 272821 193370 237295
6280 237295 345244 375386 326640 378286 260047 240267 275931 369015 291528 293383 311727
6269 311727 256577 236590 140971 233637 233153 318115 225007 285738 288938 265685 273243 250718
6257 250718 187558 191040 225250 314041 322058 323295 296215 365772 324449 300514 338610 298490
6245 298490 289896 199610 270695 356804 360754 333943 270900 295980 336099 336606 392554 384665 407528
6232 407528 335984 347968 392559 399814 270047 258029 277628 247215 254364 349610 248131 266704
6220 266704 295500 219283 174803 251405 248047 179092 303484 252638 267389 326363 324504 326907
6208 326907 313999 291809 296917 317687 267793 244852 265628 251798 268282 256802 346777 267315
6196 267315 340143 291100 200803 184999 213987 219406 278596 316642 245015 191848 231628 316131
6184 316131 363519 376254 380266 325767 296390 256800 334930 368067 414179 437428 381252 352671
6172 352671 382798 210446 243912 282399 224147 301077 436707 523740 453045 392681 402842
6161 402842 555795 491101 469902 413030 388436 451864 380025 369912 332244 350794 366551
6150 366551 389559 396921 356956 371177 363119 367341 330772 332032 333975 389119 407987 477071 521526
6137 521526 387334 314512 354710 344229 420438 541697 487801 445894 422312 416007 429983
6126 429983 409804 418922 486439 575964 497847 410221 453033 509138 449074 465871 445631 415448
6114 415448 476292 538944 410071 411804 398789 381984 421636 497713 507553 504405 404295 428929
6102 428929 446746 507053 499827 439009 412985 471886 511147 462341 399886 423194 523111 488090
6090 488090 487027 580196 546700 510023 400690 457488 507788 490938 471763 508911 538123 526039
6078 526039 565478 515355 538894 608608 521162 522171 583336 604100 620899 537189 544647 509595
6066 509595 593340 610257 701177 698275 695452 673628 615750 686462 683947 626446 592322 616446
6054 616446 662318 638210 623135 630214 753704 727105 755518 840419 814967 740543 664055 742594
6042 742594 708073 701710 777014 856241 872046 844603 855688 892071 949863 925079 951030 996997
6030 996997 1015330 994468 921683 938413 1064806 1079556 1061785 1067753 1114517 1008687 955529
6019 955529 1047156 1070339 968379 1055362 1120758 1085591 1128686 1068299 1025863 1060035 1139194
6008 1139194 1172893 1082546 1151528 1139864 1063253 1180874 1261092 1242996 1245134 1241820 1235727 1274973
5996 1274973 1368836 1314840 1339971 1257412 1171280 1288065 1363308 1261729 1244755 1323314 1225362
5985 1225362 1189636 1109508 1065286 1133035 1218564 1229525 1227364 1163712 1142189 1243633 1287403
5974 1287403 1316357 1266361 1254466 1295643 1258315 1154846 1131371 1261469 1268636 1225176 1150373
5963 1150373 1075161 1152840 1020263 981393 1033907 1114269 1061675 1043147 1113148 1114812 1087780
5952 1087780 1009590 1021329 1035513 996882 982703 1064569 1073955 1068076 1031975 927163 988262 1047386
5940 1047386 1066963 1001971 945632 870674 760813 937313 922373 887210 794052 783454 877080
5929 877080 902038 822468 767628 869976 901257 896532 977071 827122 917104 915357 822868 860597
5917 860597 890097 879295 891292 851209 864660 816418 857354 881290 918684 909493 829801 915483
5905 915483 940998 1008976 1021883 847251 781204 825091 799966 937029 911553 867195 935275
5894 935275 800502 748104 848429 946480 883299 815524 894463 878635 930832 997481 993147
5883 993147 940185 972079 996926 999897 1026798 1000354 930261 980255 1066142 1028312 998269 1014780
5871 1014780 1057902 1116564 1046755 1048802 1103430 1080711 1028980 999934 976206 994192 1079860 1014576
5859 1014576 1078693 1048300 921376 1016753 1033706 1049830 1038698 1139385 1113379 1036242 1076522
5848 1076522 1074445 1134623 1023063 972055 1109545 1083258 1085111 1094132 1095041 1098320 1130791 1239237
5836 1239237 1245440 1304672 1312039 1238849 1244173 1252047 1286281 1234378 1245454 1286496 1240614 1227440
5824 1227440 1198787 1274016 1403841 1404897 1429247 1330495 1285482 1335082 1245611 1194017 1233207
5813 1233207 1295770 1395412 1412059 1303461 1264605 1290987 1341995 1414417 1339833 1232125 1312269
5802 1312269 1399078 1358685 1382838 1369867 1333948 1348450 1401407 1426874 1392604 1366423 1341469
5791 1341469 1285623 1445395 1407313 1419964 1568655 1495488 1504627 1463056 1422303 1479628 1509124
5780 1509124 1442003 1548518 1450310 1419363 1444556 1469451 1390502 1377772 1497986 1444338 1504602
5769 1504602 1523851 1593007 1643465 1577715 1564277 1567634 1517093 1481897 1454764 1493272 1551017 1570117
5757 1570117 1642113 1671528 1685120 1625781 1609243 1603748 1633137 1681381 1694643 1666628 1645618 1694621
5745 1694621 1732002 1645339 1718558 1797736 1743611 1762632 1768741 1767953 1777819 1812932 1909212 1985253
5733 1985253 1839394 1790609 1857926 1857397 1895873 1942161 1922095 1997236 1971006 1822966 1916156
5722 1916156 1912262 1874612 1945946 1956726 1918417 2020254 2052367 2106825 2164579 2146167 2277154
5711 2277154 2268641 2172652 2109004 2201897 2135024 2138295 2200795 2352026 2454358 2462352 2490320 2490643
5699 2490643 2516352 2497572 2603881 2641528 2547069 2575101 2646394 2681917 2685822 2817427 2743263
5688 2743263 2661576 2771690 2766929 2743207 2774896 2856418 2819838 2690339 2641713 2757640 2892312
5677 2892312 2908086 2920374 2936987 2919270 3034884 3021841 3052001 3078314 3116219 3074539 3033811
5666 3033811 3009145 3044976 3125772 3193746 3192387 3347554 3436912 3327156 3342911 3477699 3503808
5655 3503808 3386131 3491263 3523339 3603563 3639795 3699047 3676636 3714271 3700204 3705266 3777925
5644 3777925 3820202 3944111 4065568 4065247 4122052 4176839 4197326 4274640 4317892 4321670 4370959 4465485
5632 4465485 4447160 4485857 4567583 4590045 4518953 4525560 4703585 4862869 4839800 4855770 4898372
5621 4898372 4863438 4868135 4953069 5170407 5211217 5124856 5098735 5172505 5254915 5455423 5553086
5610 5553086 5609503 5721994 5721083 5793708 5812003 5940314 5952825 5973357 5991478 6033506 6054502
5599 6054502 6139397 6230860 6241502 6195935 6318383 6433284 6510362 6543567 6657039 6880772 6912453
5588 6912453 6896185 6918274 7033017 7298537 7353260 7367213 7486724 7565109 7641199 7662520 7751594
5577 7751594 7915951 8006454 8149637 8280539 8528867 8770011 8937923 9060899 9176808 9347158
5567 9347158 9537972 9711105 9842077 10076160 10357463 10663739 10870267 11137439 11424167 11651116
5557 11651116 11997566 12297038 12528192 12875635 13136705 13378646 13709682 14146542 14501753
5548 14501753 14841486 15245095 15684712 16168559 16595653 16987807 17432687 17786746 18131071
5539 18131071 18461863 18852467 19261535 19777459 20213345 20639210 20953767 21389044 21948110
5530 21948110 22511773 23065560 23616907 24193895 24872989 25638887 26282522 26861094 27447232
5521 27447232 28048311 28659659 29354268 29948303 30483791 30992976 31383159 31756793 32153641
5512 32153641 32565431 32931133 33301334 33948860 34427314 34793823 35184408 35600173 35933840
5503 35933840 36365805 36875368 37420970 37866234 38240910 38757002 39108998 39456020 39868519
5494 39868519 40198415 40543960 40883297 41181959 41393977 41612447 41769966 41871255 41983736
5485 41983736 42093603 42269871 42561874 42633965 42657797 42763532 42624929 42518358 42448252 42352495
5475 42352495 42238143 42299989 42215901 42108241 42002848 41798591 41633657 41623720 41542824 41577283
5465 41577283 41542421 41510036 41413391 41443192 41346839 41150212 40915684 40726385 40549350 40160197
5455 40160197 39800444 39440387 39045261 38703770 38488556 38201112 37870585 37534960 37400789
5446 37400789 37154815 37019945 36913442 36881384 36910524 36977044 37045625 37219243 37279002 37391752
5436 37391752 37581082 37655124 37727829 37865219 37999950 38194096 38437497 38691747 38846615 38996093
5426 38996093 39360092 39665250 39953171 40282347 40691080 41159288 41659604 42292543 43015174
5417 43015174 43730605 44460131 45230655 46118984 46945547 47982115 49186301 50354277 51660940
5408 51660940 52974273 54356233 55954078 57675373 59425694 61247604 63338419 65468247
5400 65468247 67688828 69853513 72028100 74006017 75899471 77808119 79535499 81196959
5392 81196959 82795358 84016693 84773639 85153394 84918614 84447838 83691153 82712034 81552418
5383 81552418 80126340 78414646 76430534 74287646 72288797 70194945 68080208 65968477
5375 65968477 63954583 62008072 60268831 58567188 56857894 55447660 54125089 52924931
5367 52924931 51817630 50680250 49698593 48717510 47903652 47084376 46412137 45678151 44883172
5358 44883172 44229435 43630399 42939337 42323714 41618809 41094150 40608574 40006934 39416846
5349 39416846 38965746 38608461 38112370 37667662 37357511 36986518 36675609 36499514 36401332 36309012
5339 36309012 36104134 36062991 36130502 36416241 36459359 36650542 36948528 37172883 37508740 37839731
5329 37839731 38193186 38674097 39080614 39626095 40157980 40730200 41434444 42148751 42845106
5320 42845106 43660294 44467913 45292056 46168580 47142014 48192435 49195759 50422700 51796095
5311 51796095 53101149 54648342 56227603 57932627 59803083 61866201 64109016 66572508
5303 66572508 69408603 72351791 75317327 78159089 80868495 83627200 86459670 89710492
5295 89710492 93398285 97144412 100441264 102443079 102986573 102395708 101409238 100523146 99660898
5286 99660898 98629317 97348067 95843488 94082673 92533934 91253253 90287266 89425228
5278 89425228 88935258 88537082 88358086 88485969 88787694 89269577 90032548 91125627 92338654
5269 92338654 93301282 93945691 94101855 93402982 92000942 90107794 88038724 85660341 83340781
5260 83340781 80842725 78082841 75273182 72357541 69490117 66686200 63985452 61273321
5252 61273321 58715538 56386707 54261662 52339232 50631313 49138743 47695702 46404438
5244 46404438 45113721 43866253 42705600 41617431 40609432 39609048 38586816 37512572
5236 37512572 36677572 35697915 34748718 34004073 33096791 32219765 31230860 30250027 29450098
5227 29450098 28738203 27880004 27168550 26376522 25623460 24924702 24304107 23732388 23171870
5218 23171870 22528242 21959988 21467752 21018898 20631640 20093134 19594138 19177223 18768973
5209 18768973 18425044 18030230 17710570 17453500 17237291 16982022 16616889 16430129 16152483
5200 16152483 15903927 15755466 15527956 15219367 15046703 14822294 14577368 14452551 14240535
5191 14240535 14174478 14028688 13954906 13751284 13442283 13301975 13207800 13002434 12871605 12795962
5181 12795962 12729210 12567933 12301421 12256437 12082795 11919083 11959041 11745644 11642741 11674891
5171 11674891 11525769 11420507 11471970 11438000 11339516 11275103 11228466 11135425 10999008 10918482 10820321
5160 10820321 10755564 10607648 10541161 10584685 10537029 10433747 10356351 10425802 10344613 10141649 10030260
5149 10030260 10040211 9937364 9775006 9698864 9673004 9628812 9530610 9533322 9437124 9359184 9299907
5138 9299907 9320762 9307725 9233238 9095189 8996668 9002978 8967794 8973930 8945361 8855138 8881740 8938137
5126 8938137 8908020 8846075 8788420 8720259 8574272 8613187 8571543 8461811 8378293 8392817 8444077
5115 8444077 8323404 8262157 8263563 8195923 8184443 8339089 8263507 8213351 8199098 8203399 8059205
5104 8059205 8008088 8024954 7991692 8039019 8076187 8053907 8084525 8147651 8151080 8071876 8021911 7961896
5092 7961896 7956820 8022252 7926125 7962933 8088466 8088630 8059519 8114954 8133034 8013184 7958635 8002636
5080 8002636 8136944 8180578 8146501 8110725 8055199 7911978 7926634 7960696 7905669 7945898 8012329
5069 8012329 8027497 8118452 8080200 8076247 8074220 8034728 8072729 8032433 8086199 8108170 8171343 8140775
5057 8140775 8203953 8237946 8153352 8185929 8142317 8305019 8421495 8473761 8471005 8495952 8519049
5046 8519049 8453883 8371893 8487818 8541529 8596536 8765915 8759598 8821784 8782123 8833350 8870904
5035 8870904 8874444 8894463 8954495 8968980 9101797 9138160 9050404 9174332 9340026 9347856 9355642
5024 9355642 9365514 9344544 9417533 9434495 9530632 9545710 9571073 9714111 9827283 9840144 9885489
5013 9885489 10039184 10115366 10188710 10225377 10303692 10327037 10446735 10413878 10516597 10572297 10640565
5002 10640565 10742492 10770094 10895322 11022129 11154157 11203215 11380813 11356336 11418863 11643773
4992 11643773 11703485 11713815 11827143 11965450 12125020 12205961 12260166 12339440 12316897 12398147 12575686
4981 12575686 12714154 12741126 12751762 12935512 13120903 13327576 13379013 13474293 13669097 13824360
4971 13824360 13989857 13963203 14169404 14259708 14335887 14514218 14639269 14711083 14878470 15127559
4961 15127559 15337182 15449676 15564675 15675617 15885431 16016738 16147448 16315691 16593015
4952 16593015 16848180 16971777 17165106 17281861 17418366 17561302 17739922 17926478 18138619
4943 18138619 18426306 18509839 18653897 18876046 18921247 19050317 19169993 19334711 19540624 19673128
4933 19673128 19838757 20017072 20093053 20335503 20580071 20836352 21094833 21370318 21491667 21650835
4923 21650835 21891062 22078536 22177761 22211944 22483710 22797433 22965660 23113988 23423072 23657934
4913 23657934 23785852 23910811 24029740 24187759 24422639 24607444 24715546 24996385 25218902
4904 25218902 25381768 25523722 25621989 25889386 26033734 26239287 26498129 26669750 26810573 26941323
4894 26941323 27139401 27401433 27612787 27742199 27982504 28090970 28340317 28556502 28752550
4885 28752550 29001662 29185999 29350210 29491126 29696117 29907668 30102975 30226111 30487503
4876 30487503 30588992 30828934 30944761 31159709 31334624 31444390 31673712 31805445 31891870 32042068
4866 32042068 32283495 32491500 32630745 32842554 32902593 33074152 33270610 33308779 33506580 33673745
4856 33673745 33819123 33788739 33981245 34065055 34250971 34342932 34527690 34538182 34691842 34789800
4846 34789800 34911755 34926764 34930876 35105621 35137752 35138397 35202429 35167686 35229233 35273413 35317922
4835 35317922 35348364 35412842 35456864 35500632 35459537 35498464 35533423 35532112 35572748 35440207 35468011
4824 35468011 35418386 35398392 35271525 35212808 35167777 35138247 35208958 35169879 34974086 34890380 34820279
4813 34820279 34736184 34680522 34549412 34355257 34319557 34192535 34111450 33944852 33867113 33760095
4803 33760095 33637328 33496314 33361237 33314251 33188983 33121896 32890807 32678359 32623415 32537398
4793 32537398 32468111 32263697 32092586 31969651 31742627 31535954 31376514 31188497 31117147 30992622
4783 30992622 30850855 30769642 30639483 30535604 30456512 30294139 30027876 29873859 29767651 29617239
4773 29617239 29538270 29323305 29282378 29102488 28943640 28800274 28733267 28607872 28389067 28393331
4763 28393331 28312241 28120690 27940561 27921509 27853034 27807104 27636380 27490490 27420034 27280103
4753 27280103 27207424 27108977 26889111 26937675 26889303 26800042 26783370 26755069 26714172 26723392 26713196
4742 26713196 26601585 26546661 26477291 26400112 26448092 26432983 26395732 26489193 26467899 26595481 26505383
4731 26505383 26367499 26476399 26626544 26736879 26780283 26945850 27114495 27160983 27278024 27302401
4721 27302401 27416087 27568211 27607769 27714280 27845144 28018849 28223019 28481393 28651564 28816982
4711 28816982 28896313 29039322 29301344 29534804 29852741 30166765 30468262 30750623 31230332 31615695
4701 31615695 32086141 32468556 32874236 33429447 33882983 34503270 35251857 35871632 36626073
4692 36626073 37234712 37851153 38492361 39130757 40016029 40848424 41785986 42444726 42876778
4683 42876778 43239416 43515513 43713649 44130886 44449228 44838380 45262695 45544786 45874263
4674 45874263 46170048 46618546 47044990 47570005 48223879 48833439 49599249 50158010 50560673
4665 50560673 50751658 50901562 51193194 51539977 51816929 52062234 52338757 52652881 53015753
4656 53015753 53348225 53748315 54322369 54872397 55494553 56142336 56971357 57964889 58953854
4647 58953854 60007484 61075731 62295240 63743016 65133129 66583996 68218199 69833739
4639 69833739 71243448 72537570 73951390 75401582 76906407 78459090 80074497 81645293
4631 81645293 82999901 83969283 84794721 85425464 86029602 86666541 87296215 88080012 88848525
4622 88848525 89673041 90618497 91516103 92439414 93393177 94308998 95219444 96209667 97389702
4613 97389702 98228528 98753591 98907438 98616309 97858263 97013647 95893007 94589044 93286482
4604 93286482 91791001 90239562 88766661 87345331 86039467 84770558 83568956 82548686
4596 82548686 81577235 80831389 80114288 79459165 78930528 78580873 78320504 77999181 77486952
4587 77486952 76971552 76372781 75571152 74633491 73511526 72446014 71275670 69832520 68516275
4578 68516275 67167850 65698308 64293124 62925443 61384079 59991649 58684658 57551003
4570 57551003 56456998 55303377 54265974 53413375 52627252 51929690 51305472 50665698 50027664
4561 50027664 49630888 49306944 48825953 48477390 48309623 48109306 47905159 47697973 47619329 47534345
4551 47534345 47439370 47385214 47383849 47510638 47539037 47684994 47843052 48124595 48350007 48654260
4541 48654260 48997398 49304406 49678169 50168180 50717088 51272708 51888860 52617454 53426125
4532 53426125 54122159 55026207 55908463 56970624 58097249 59178749 60533090 61930470 63233810
4523 63233810 64664657 66226101 67847186 69574768 71396285 73241749 75195764 77068416
4515 77068416 78942880 80703786 82377321 84007393 85640915 87447265 89095453 90499961
4507 90499961 91602876 92327941 92669713 92754131 92901914 92980611 93082030 93107715 92939442 92916045
4497 92916045 93005396 93061146 93187462 93308288 93539656 93842417 94217621 94726341 95219468 95672091
4487 95672091 96137516 96712296 97120109 97533516 97872662 98299465 98726898 99183959 99429957
4478 99429957 99487120 99554512 99770075 100079481 100473167 100829781 101004454 100933279 100583464 100216252
4468 100216252 99855593 99405076 99077536 98868807 98624037 98474759 98363996 98262825 98165117
4459 98165117 98176167 98145343 98157003 98325654 98557678 98895743 99298690 99536342 99517045 99514709
4449 99514709 99448610 99442887 99655268 99831738 100003047 100316981 100716807 101346984 102186667 103275816
4439 103275816 104618192 105937775 107478263 109462941 111833695 114718077 118079994 121631310
4431 121631310 125093452 128305564 131496941 134860887 138433792 142529617 146898049 151013724
4423 151013724 154022715 155190073 154731436 152975508 150430913 147578100 144377289 140737851
4415 140737851 136483760 131707836 126600065 121577919 116822088 112135289 107507313 102910348
4407 102910348 98571662 94645235 91131919 88044165 85199192 82655307 80210681 77982233
4399 77982233 75995978 74075522 72216701 70542557 68819020 67174986 65667608 64068358
4391 64068358 62646656 61119553 59572323 58088890 56530890 54934377 53171104 51408921
4383 51408921 49888833 48267787 46685999 45287746 43887494 42553275 41322797 39987689
4375 39987689 38754203 37575341 36415869 35342281 34282210 33238714 32429138 31569857
4367 31569857 30712503 29885081 29201392 28611173 27914051 27286799 26548530 25920638 25245708
4358 25245708 24701951 24199581 23744942 23299714 22894441 22385360 21873747 21484924 21211815
4349 21211815 20913926 20523716 20198558 19773118 19507287 19239891 18918574 18601227 18385140
4340 18385140 18090443 17791712 17509626 17377840 17109895 16841492 16688494 16520050 16273490
4331 16273490 15969339 15863670 15714008 15451737 15258017 14983758 14815302 14602093 14421128
4322 14421128 14227510 14078990 13978728 13837016 13747949 13592356 13414690 13261871 13033659 12942517
4312 12942517 12797230 12518000 12440979 12415023 12264402 12106088 12187985 12049150 11837343 11651342
4302 11651342 11582334 11458720 11342448 11373363 11241307 11146584 11044491 10826825 10763604 10665792
4292 10665792 10433327 10371171 10372894 10256287 10217026 10023314 9880965 9809949 9843266 9778712 9574543
4281 9574543 9519719 9481206 9428256 9312937 9279684 9286111 9235708 9092562 9105016 9070273 8980823
4270 8980823 8918580 8900938 8926780 8798473 8706178 8586905 8566155 8586719 8522937 8462597 8428301
4259 8428301 8408623 8417662 8409948 8234098 8166808 8127570 8209400 8152374 8021243 8056155 7968015
4248 7968015 7875508 7919036 7923206 7854778 7774322 7738184 7713888 7696038 7563457 7502020 7606883
4237 7606883 7618991 7623083 7569722 7411239 7399684 7332412 7365651 7427012 7345964 7326362 7279641
4226 7279641 7281245 7289591 7330335 7249701 7294484 7154793 7117158 7136318 7104778 7086345 7186215 7255242
4214 7255242 7212878 7109976 7131147 7051403 7085475 7211635 7149107 7122357 7186769 7234981 7250997
4203 7250997 7215858 7162396 7263984 7257364 7212283 7175864 7138555 7150854 7225687 7332755 7395781
4192 7395781 7306489 7214403 7235811 7297464 7361807 7351196 7317189 7347122 7351741 7370736 7332818 7334981
4180 7334981 7396918 7345834 7324118 7316422 7379816 7528369 7532896 7541670 7546892 7497903 7434399 7407240
4168 7407240 7431752 7543759 7587268 7688131 7645742 7620550 7631731 7607098 7698452 7769264 7763093
4157 7763093 7782579 7821835 7876230 7963314 7966544 8009536 8032992 8125234 8142234 8088811 8027753 8045070
4145 8045070 8166367 8249255 8346937 8480972 8573924 8607900 8592963 8647761 8681325 8546691 8705661
4134 8705661 8805695 8924867 8994133 8991920 9066298 9176258 9330645 9419589 9453189 9449207 9518601
4123 9518601 9621200 9686117 9821233 10027166 10143759 10223261 10193936 10243223 10340935 10282800 10259134
4112 10259134 10382686 10554604 10691924 10652734 10724130 10838713 10856750 11021550 11133956 11195012
4102 11195012 11207679 11318051 11428766 11427938 11447835 11676056 11729119 11745827 11842471 12039117 12133455
4091 12133455 12199868 12368534 12444088 12538594 12670903 12851120 13013858 13112028 13397139 13546820
4081 13546820 13594520 13846058 13981918 14154225 14380042 14547225 14758254 15016985 15190825 15348216
4071 15348216 15567439 15764356 15969220 16186767 16328221 16648675 16786054 17106447 17432038
4062 17432038 17637733 17846536 18214370 18472235 18837053 19198454 19517273 19816715 20188503
4053 20188503 20773746 21203903 21520543 21950504 22569293 23022784 23568655 24080538 24625404
4044 24625404 25158275 25798594 26498913 27206486 27969024 28679354 29416959 30297098 31167829
4035 31167829 31937308 32902172 33863122 34893351 36031453 37127876 38217531 39385662 40576688
4026 40576688 41822499 43201126 44730800 46179037 47623017 49217920 50801572 52414756
4018 52414756 54083364 56031017 57948277 59909478 61892505 63920479 66078625 68080650
4010 68080650 70353888 72643734 74970227 77337840 79675531 82113927 84518392 86971928
4002 86971928 89437545 92044206 94631347 97116103 99644068 102092501 104576524 107019694
3994 107019694 109356795 111669845 113945224 116214214 118304380 120245336 122181845 124086118
3986 124086118 125778358 127401443 128924188 130184949 131386804 132490432 133416812 134124423
3978 134124423 134691053 134986839 135097501 135119165 135096321 134963578 134555504 133890845 132984153 132085000
3968 132085000 131062824 129963177 128605436 127100789 125644766 123913822 121982321 120094037
3960 120094037 118176703 116080989 113968337 111833045 109637540 107332728 105022940 102637589
3952 102637589 100247710 97835795 95396961 93035906 90662103 88405698 85977696 83648883
3944 83648883 81366356 79026900 76809909 74595269 72435250 70347620 68295447 66324821
3936 66324821 64376387 62491983 60580255 58821010 57208045 55495176 53866511 52180337
3928 52180337 50637580 49251150 47848124 46577216 45191796 43869023 42629572 41475558
3920 41475558 40291485 39086101 38002597 37049775 36147402 35205619 34249594 33473342 32649751
3911 32649751 31761025 30959980 30234636 29602108 28791383 28169021 27572948 26961410 26479263
3902 26479263 25967794 25445898 24859661 24375301 23947573 23596444 23219493 22799458 22424570
3893 22424570 22060729 21677104 21464316 21233231 20790838 20468093 20147834 19913960 19590532
3884 19590532 19434825 19190219 18868845 18692166 18336273 18117231 17972014 17743625 17521090
3875 17521090 17376670 17188650 17141809 17026291 16853470 16659258 16581578 16517567 16226343 16172590
3865 16172590 16002149 15879090 15791807 15730487 15563540 15411826 15427514 15346673 15220796 15115627
3855 15115627 15010279 14935151 14914309 14944882 14978361 14916096 14868266 14851608 14759226 14664525 14693485
3844 14693485 14541621 14531660 14639107 14458212 14359122 14317908 14241332 14298497 14288328 14141516 14064966
3833 14064966 13918329 13973262 14025814 13963804 13945231 13821456 13682196 13548843 13549324 13525553 13440320
3822 13440320 13376153 13327184 13332635 13351379 13245698 13222634 13216855 13191426 13213651 13207302 13211621 13232127
3810 13232127 13231523 13315218 13342723 13282742 13351959 13329604 13410222 13408781 13446306 13396469 13339525 13467139
3798 13467139 13480249 13509859 13538905 13552492 13631526 13714365 13872790 13773583 13983509 14088938 13997205
3787 13997205 14056145 14144498 14193862 14275520 14490188 14452625 14572425 14596479 14721838 14838788
3777 14838788 14929176 14984752 15058035 15173949 15331762 15421825 15478922 15557228 15751239 15937121
3767 15937121 15969175 15984574 16253445 16437131 16521420 16585494 16731777 17054763 17271163 17396549
3757 17396549 17380671 17469160 17610219 17871055 18050221 18243385 18496952 18583423 18687029 18914147
3747 18914147 19184142 19502935 19752610 19823704 19974911 20211591 20504680 20670708 20921793 21145862
3737 21145862 21295893 21617576 21949320 22129990 22360885 22543254 22949750 23316371 23513773
3728 23513773 23815245 23974234 24230509 24612946 25015620 25368089 25701891 25991919 26365856
3719 26365856 26849803 27121375 27410271 27821035 28252364 28713188 29134998 29520069 29881841
3710 29881841 30392912 30907269 31473214 31875152 32314200 32838096 33432402 34019226 34540551
3701 34540551 35089640 35619496 36226176 36851372 37527389 38232950 38867713 39614182 40484676
3692 40484676 41167071 41825243 42587828 43390438 44264463 45133994 45973091 46856642 47771121
3683 47771121 48585794 49664419 50649838 51702573 52778354 53840375 54975881 56145918
3675 56145918 57496681 58778438 60017684 61348096 62773747 64067577 65441387 66858574
3667 66858574 68201021 69593125 70999145 72470565 73934867 75343756 76722077 78148312
3659 78148312 79653649 81008881 82512062 83866401 85278950 86708044 88007953 89469604
3651 89469604 90730866 92000132 93359802 94692376 95966270 97349726 98780808 100145476
3643 100145476 101560849 103101509 104625382 106273660 108028012 109624997 111501924 113397733
3635 113397733 115332408 117478696 119602305 121925420 124324558 126828397 129540575 132425959
3627 132425959 135413907 138567990 141841598 145311029 148891260 152642971 156590310 160575942
3619 160575942 164817203 169237845 173790790 178420638 183176719 188076525 193120465 198224126
3611 198224126 203362774 208642565 213956776 219225615 224607333 229844617 235169122 240606988
3603 240606988 245966205 251165840 256452649 261760016 266959002 272044193 277034222 282065088
3595 282065088 287011333 291933867 296727130 301503733 306319232 311237008 316112267 321001563
3587 321001563 326051255 331171263 336408121 341725070 347214079 352798947 358507400 364328264
3579 364328264 370313591 376608206 383038649 389581714 396185685 403029650 410081745 417192740
3571 417192740 424281704 431385006 438324125 444855651 450913198 456510324 461618876 465961144
3563 465961144 469438860 472107886 473909640 474863494 474808351 473900308 472217806 469810285 466590206
3554 466590206 462467641 457553595 452033544 445783225 438652844 430863316 422548087 413577990
3546 413577990 404145231 394422000 384329062 374063464 363792089 353703010 343564983
3539 343564983 333589840 324024352 314602974 305430969 296599697 288308446 280494111 272898474
3531 272898474 265747512 258836663 252262069 246091151 240120319 234415106 228986952 223620995
3523 223620995 218377092 213379143 208449852 203768520 199207344 194602572 190205418 185881310
3515 185881310 181701093 177620403 173477711 169502283 165600419 161708008 157940015 154177032
3507 154177032 150493894 146905625 143419220 139899072 136588495 133311027 130100527 127000043
3499 127000043 123916504 120915346 118117374 115281536 112617273 109986155 107408000 104910242
3491 104910242 102470584 100198965 97822147 95503823 93351905 91383163 89265565 87353147
3483 87353147 85372353 83510490 81846149 80126161 78482523 76978356 75505066 73933804
3475 73933804 72530848 71187806 69854741 68562757 67304747 66103325 64856174 63667264
3467 63667264 62454790 61362753 60128450 58988944 57878662 56681035 55570329 54645323
3459 54645323 53614046 52569443 51517013 50391410 49355876 48320938 47437502 46458876
3451 46458876 45548125 44575178 43587460 42702023 41920240 41010808 40088183 39225389 38481509
3442 38481509 37778337 37058597 36205795 35487101 34911543 34268203 33652792 32986635 32298406
3433 32298406 31611014 31025069 30475507 29980593 29438508 28868996 28291161 27863638 27419238
3424 27419238 26972773 26617776 26134157 25659945 25293146 24926678 24530003 24077779 23693353
3415 23693353 23315372 22972424 22598791 22326919 22045224 21637026 21279511 21031171 20795292
3406 20795292 20533169 20280489 20084906 19709857 19468809 19289678 19029492 18704365 18437511
3397 18437511 18145316 17977224 17856263 17550103 17428538 17324495 17147092 16935123 16769952
3388 16769952 16502217 16312820 16180539 15983772 15725558 15487822 15244571 15138989 15042827 14886989
3378 14886989 14747281 14630477 14371410 14360741 14192513 13888536 13821174 13818905 13570971 13389606
3368 13389606 13416296 13211502 13038574 13037079 12856303 12698997 12591136 12466888 12421535 12387392
3358 12387392 12222988 12077098 11900967 11797681 11831639 11675797 11627755 11541675 11433888 11262034
3348 11262034 11122956 10986543 11016805 11035945 10880659 10771682 10688368 10619471 10694978 10650599
3338 10650599 10504492 10461053 10474109 10420149 10428702 10258734 10239406 10242454 10181449 10232790 10265242
3327 10265242 10246408 10113284 10064911 10091202 10055097 10111781 10062398 9999054 10004318 9986606 9952050
3316 9952050 10027137 10041443 9972134 10032551 9991808 9984790 10013571 10061644 10006633 9987528 10015746 9952596
3304 9952596 9801064 9869602 9920142 9873492 9936503 9955503 9836842 9839179 9910822 9912011 9879298
3293 9879298 10006995 9954838 9997524 9942311 9980811 10057066 10164216 10116967 10063245 10139257 10215535
3282 10215535 10377101 10510672 10450726 10467999 10573149 10613957 10637874 10661626 10666404 10684529 10775377
3271 10775377 10715981 10740621 10803206 10810171 10870799 10910903 10845213 10947269 10935591 11021500 11116186
3260 11116186 11064040 11030108 11048991 11060405 11061680 11138803 11193558 11159701 11144059 11084900 11057676
3249 11057676 11011218 11033528 10802270 10719063 10572022 10406120 10311110 10183046 9956855 9662037
3239 9662037 9568810 9372262 9233601 9125055 9043991 8900577 8669746 8503906 8418380 8276328
3229 8276328 8157594 8050831 7961224 7918040 7759112 7607653 7542326 7471229 7422628 7328159 7074539
3218 7074539 7016360 6973384 6842604 6708904 6565005 6511483 6453800 6347553 6277662 6211563 6193380
3207 6193380 6136391 6034936 6018373 5936606 5896019 5820058 5737497 5663563 5571295 5509620 5406594
3196 5406594 5481816 5500119 5435927 5313820 5231796 5261706 5229635 5143170 5056150 5063541 5101726
3185 5101726 5016775 4922687 4836362 4700782 4734416 4640708 4692906 4773507 4660057 4507053 4454619
3174 4454619 4508223 4581773 4542749 4452012 4510363 4456328 4384661 4348840 4271765 4259893 4253601 4264305
3162 4264305 4181335 4129793 4223636 4155955 4068852 4063127 4071646 3968548 3890556 3850638 3840628 3774311
3150 3774311 3797340 3810581 3813060 3759950 3673769 3623595 3525900 3445507 3533962 3633254 3621662 3662467
3138 3662467 3555976 3507433 3458445 3559896 3569199 3492649 3449703 3436286 3398230 3393657 3452602
3127 3452602 3379731 3419336 3361312 3261913 3237467 3157321 3200267 3230145 3206778 3126687 3161902
3116 3161902 3209197 3183340 3215321 3222343 3171613 3133575 3133277 3171826 2982407 2946489 3001167 3010015
3104 3010015 3034464 3015101 3022714 2969983 2890282 2894361 2971747 2924088 2956582 2876999 2894650 2930088
3092 2930088 2887839 2892573 2775765 2770631 2769710 2707168 2650018 2659761 2680972 2700305 2628145 2733439
3080 2733439 2760094 2732947 2690290 2609071 2561671 2658705 2534460 2566667 2693528 2599158 2647081
3069 2647081 2658762 2603581 2648799 2555969 2502964 2677916 2611221 2467566 2409584 2481536 2464690
3058 2464690 2527674 2519421 2459404 2429681 2368382 2442230 2365567 2239078 2356945 2326573 2321475
3047 2321475 2411424 2437903 2374150 2373099 2360305 2324017 2321763 2319913 2293509 2346454 2434360 2361014
3035 2361014 2280122 2412987 2463014 2441992 2369927 2406634 2390789 2390704 2491106 2617176 2526470
3024 2526470 2534317 2534645 2578969 2550359 2550270 2664480 2636367 2690805 2737132 2804639 2859508 2781321
3012 2781321 2845386 2762376 2751698 2822892 2815492 2924410 2921419 2926030 2859319 2851785 2876554 2872506
3000 2872506 2775263 2762204 2802719 2851317 2840671 2762063 2749746 2776028 2796714 2867218 2905609
2989 2905609 2920379 2835416 2902346 2964103 2924959 2953080 3079856 3111519 3189548 3187479 3179762 3236940
2977 3236940 3233083 3237558 3260732 3243751 3334230 3383544 3317273 3241745 3283548 3402537 3359764 3284088
2965 3284088 3221610 3152318 3098607 3100168 3093168 3051172 3038529 3075330 3092932 3007354 3009062 2996217
2953 2996217 2966627 2899616 2934015 2998998 2912810 2973511 2940127 2950015 3029017 3012645 2941707 2974327
2941 2974327 2945056 2911816 2887420 2921236 2960566 2890157 2829126 2817512 2885976 2925131 2860383
2930 2860383 2907906 2848833 2822966 2782421 2709716 2720824 2708635 2704264 2684393 2536366 2512495
2919 2512495 2524658 2542922 2437724 2468575 2566163 2583831 2663439 2531523 2423830 2438962 2442033
2908 2442033 2387293 2405009 2355763 2407134 2282971 2296942 2359098 2396732 2352056 2296685 2264538
2897 2264538 2298128 2270690 2295873 2331306 2362174 2286705 2218936 2120993 2121610 2199408 2108864 2114454
2885 2114454 2078114 2083219 2032805 2060018 2071462 2068239 2056807 2131836 2220827 2176146 2096478 2015463
2873 2015463 2035025 2101237 2133513 2080004 2062794 2049864 1938891 1965232 1994285 1921618 1955924
2862 1955924 1952326 2020878 1938629 1960355 1853346 1771604 1832634 1758878 1673427 1716965 1682936
2851 1682936 1671696 1784184 1744593 1780366 1638951 1556223 1503856 1456056 1314861 1394260 1334286
2840 1334286 1268271 1352552 1436924 1528126 1347336 1369626 1285506 1214480 1297740 1336804 1238161
2829 1238161 1199024 1186599 1223589 1204902 1071091 1187417 1096639 1131223 1014875 997026 1111032
2818 1111032 1104943 1101911 988656 980788 969666 922151 885783 951385 974419 922197 1029918 1042478
2806 1042478 998782 946770 911943 901532 789579 799638 829018 831222 833236 735781 854484
2795 854484 821214 779613 750038 650888 736814 800626 806641 879067 814951 711523 708475 757283
2783 757283 777022 754353 714473 661948 701395 716922 700448 770880 734905 679692 715381 790797
2771 790797 678885 523923 626776 631845 609309 586658 586492 593458 520233 504041 576834 593712
2759 593712 628841 646983 587537 557695 541022 649676 570120 487667 574970 585659 593981 584087
2747 584087 534997 579911 541069 500200 536839 539447 533830 598009 583580 582659 602721 522392
2735 522392 491503 429394 512760 455551 517098 482304 494924 568986 528111 461617 441104 521552
2723 521552 639203 658124 580911 479789 553916 540225 545462 545047 532920 557422 498767 466949
2711 466949 475023 481814 553936 568468 522093 573495 552921 573707 565433 518245 504166 515981
2699 515981 654374 609402 507021 531901 612653 555558 540210 471324 419881 484243 479435
2688 479435 534456 498481 550887 511100 542361 547860 492021 559028 552739 534452 484470 580494
2676 580494 576959 604226 645474 552822 517304 527078 553621 667625 651801 458594 557714 585043
2664 585043 567647 590910 519373 638964 699250 779539 878051 859024 713207 660610 734968
2653 734968 755796 684413 678551 864571 777825 740541 727020 725565 633266 660421 793477 869424
2641 869424 881516 711474 848288 937827 861304 890789 957384 945874 867067 939707 993193
2630 993193 900473 887647 965706 960433 963478 1000826 969182 982462 1013886 1023784 1044682 1060925
2618 1060925 1079720 1090092 1141769 1066253 1097360 1127568 1187232 1160705 1172000 1224215 1260595
2607 1260595 1254384 1327939 1241223 1227616 1190072 1249713 1251815 1278205 1240269 1232780 1225644 1187486
2595 1187486 1203808 1276183 1247704 1326999 1338368 1235331 1141181 1225800 1325863 1192724 1132701
2584 1132701 1126475 1255940 1106458 1106050 1081159 1149563 1129706 1110079 1107006 1005036 994764 1010740
2572 1010740 979898 1060884 1109323 1119707 1036862 1053905 1060992 929848 960958 980362 944428
2561 944428 963567 1021965 1142841 997654 984285 911190 915630 960850 880305 870524 940440 860142
2549 860142 816794 724448 780045 790689 724255 643948 621856 784270 778240 740816 720152 648279
2537 648279 661939 725057 673889 721342 614791 603335 659395 599106 497577 468901 559308
2526 559308 568224 534230 586303 689188 667533 604484 535498 522997 475714 440787 493334 546234
2514 546234 480683 375512 309160 296266 334708 369976 391852 404244 498815 403081 384735
2503 384735 377518 475430 409710 314265 308743 345766 372262 295167 224987 200616 198336 263471
2491 263471 190399 209637 191344 185599 271439 195637 241323 282328 308431 216297 217092 271676
2479 271676 315826 238593 180478 227943 213004 132742 119773 161921 287721 352636 331327
2468 331327 236665 227993 195280 164137 165135 309951 320724 210057 187453 180660 178780 168368
2456 168368 224605 215748 213466 190761 184682 166837 149825 209292 234467 179942 201987 234443
2444 234443 240725 183187 161593 250765 276362 96071 70646 103637 192771 257710 358958
2433 358958 293906 324663 271350 189420 205801 273437 224890 254932 252028 108644 228909
2422 228909 168679 78787 94651 46910 158580 158912 170030 171954 122331 168766 90391 73690
2410 73690 113184 185367 186862 221441 281106 248770 109565 187333 112673 81613 168002 156117
2398 156117 36189 -74204 62483 140153 169731 103942 57564 72697 112062 122244 68925
2387 68925 149733 201904 174852 137923 239175 233034 163655 151351 118994 106191 214001 231368
2375 231368 265269 216761 125391 72167 147322 230963 202486 255287 166928 139619 128886 96710
2363 96710 143749 259348 221267 204695 243770 166620 49714 52111 182464 275673 257733
2352 257733 196124 181853 180591 224782 271780 248079 249683 220286 97224 86526 -9383 45828
2340 45828 124500 103924 122085 168024 135227 215945 218046 96647 123860 141795 233471 172643
2328 172643 222733 185407 247324 201574 223294 200485 105910 72467 79864 193068 162299 117468
2316 117468 192603 278366 236435 250482 145726 127240 199772 258499 194539 229804 153599
2305 153599 171141 207886 138151 273831 181938 62385 90240 182831 263838 231804 214022
2294 214022 197506 244071 365708 350164 231306 237682 190553 247772 253304 266170 316462 326305
2282 326305 333933 275635 298040 221294 203750 160369 187094 278121 329849 469980 431847 296980
2270 296980 403337 403536 293734 255874 340772 289779 220238 288118 364209 298114 263397 247035
2258 247035 208657 269479 222623 350718 340001 307485 338265 314528 396256 424302 479799
2247 479799 491168 425766 463662 419991 469636 495181 450680 453668 436484 399912 398122 486922
2235 486922 510095 452451 493140 600618 577365 527351 576751 490439 434848 442226 515614 495099
2223 495099 475730 572642 593694 656704 703700 586796 492355 491772 577358 606319 499101 616108
2211 616108 656008 716769 647214 691550 705862 698142 667642 779654 784730 790948 801994 732221
2199 732221 758490 707319 835284 820575 856066 817179 728058 768272 846801 838964 889841 953085
2187 953085 946286 1034706 1101223 1031808 946143 908674 1058821 1074468 1029756 1126353 1195662 1349089
2175 1349089 1294592 1245322 1302630 1359670 1360956 1400159 1465447 1478884 1501566 1633165 1637055 1672632
2163 1672632 1716813 1710300 1835641 1991039 2049605 2082420 2133470 2145797 2237660 2362797 2502630
2152 2502630 2464035 2588579 2664105 2781065 2950212 3059410 3184989 3246793 3360765 3431000
2142 3431000 3530117 3686750 3900922 4065425 4110831 4309798 4494511 4537981 4641131 4834540
2132 4834540 5095763 5282849 5538711 5754101 5965119 6274283 6525464 6813739 7154432 7550044
2122 7550044 8066633 8528881 8896071 9303818 9674084 10023008 10492320 11185345 12038119 12772559
2112 12772559 12989986 12863160 12658833 12141244 11764518 11566412 11266136 10807260 10326414
2103 10326414 9797600 9220133 8778090 8487593 8074842 7622554 7290941 6889718 6620222
2094 6620222 6323750 6168741 5967918 5763566 5586985 5465347 5421063 5318013 5110130 5045710
2084 5045710 4946079 4763195 4533938 4350070 4253556 4233081 4099807 3879449 3812866 3637877
2074 3637877 3515970 3380846 3262602 3171253 2980698 2891816 2872982 2783305 2618290 2479258
2064 2479258 2398997 2300276 2144986 2032836 2032877 1995047 1923255 1799067 1754586 1709460 1712185 1662183
2052 1662183 1557800 1459356 1435983 1474362 1442133 1345284 1240664 1199808 1230929 1251025 1068143
2041 1068143 1058651 1104412 1024268 1087920 1028018 1022099 1020907 927893 949971 989694 878808 891547
2029 891547 906967 798614 906893 913036 933608 959978 896083 763928 741657 608194 655323
2018 655323 718847 691483 718112 750980 655387 678223 590143 563105 589356 508033 428173 460400
2006 460400 557092 441888 521311 560336 531917 475373 416147 345996 376344 378245 393833 341948
1994 341948 379069 370347 384312 320494 299228 222702 351842 417495 419541 423948 456595 480034
1982 480034 389779 307723 342201 274288 240691 338620 291885 298299 313485 313767 341368 271393
1970 271393 355055 304764 272974 237019 249966 299624 228615 235646 315085 132399 193464 290190
1958 290190 354104 335332 213138 271457 281524 254287 154777 209665 195734 200636 212345 247000
1946 247000 183233 92934 94069 182956 145643 211116 173345 231861 137935 128268 150967 152771
1934 152771 157010 144373 158927 201222 159807 134631 26592 98393 161754 124854 127581 197337
1922 197337 176412 187402 179589 105397 111156 88815 44838 14284 186687 178306 128606 94030
1910 94030 62037 98461 184116 134162 122479 135771 166728 69119 -28224 59115 34838 105895
1898 105895 81710 140564 84144 11011 91042 156056 148962 24339 56438 177994 148351
1887 148351 202207 276356 193609 137071 91224 36947 87905 78569 50448 83591 48561 -16791
1875 -16791 -55392 9926 138232 112956 165773 183710 35263 44085 156006 69205 2394
1864 2394 87488 26993 -27732 -57633 -2437 99526 142551 -93487 7642 97226 -5419
1853 -5419 -35232 -98283 -6716 106153 81416 69404 193476 217111 97167 33754 26060 -5373
1841 -5373 38988 113081 148883 114154 131574 91849 23981 61712 25601 87810 61444 -71839
1829 -71839 -38302 32643 72675 3580 49655 19672 -1300 39601 -104702 -39891 57610 141509
1817 141509 151946 81765 44336 43285 25276 22093 29601 54644 82095 58604 33806 110995
1805 110995 -42836 -85370 -156097 -157331 -40917 -23523 83200 124648 -10310 -350 -7975
1794 -7975 67922 67919 39761 26714 6234 -41038 -94950 -44143 27765 17219 62900 140261 128736
1781 128736 78221 45512 4813 80262 170227 40020 -23155 -18895 30197 -7653 -45281 9112
1769 9112 -8861 48351 78715 109554 58615 9560 -116 -112664 -64737 46280 103657 57973
1757 57973 38502 -56703 -28744 -65661 61827 16157 -26800 -12139 -61401 -4068 87052 -46166
1745 -46166 52314 -4744 7525 24188 -11860 11812 72628 87523 42239 62075 -10284 4971
1733 4971 50218 13575 -7162 9966 30669 -57661 31911 38190 -4144 71975 129009 107146
1721 107146 -46150 -50980 -87279 5819 80407 135463 127055 25587 39124 -38373 -99716 -22548
1709 -22548 46189 124916 52311 59035 55621 -11144 -50020 -78842 -72952 -27282 30041 27248 90806
1696 90806 75885 86719 53719 1542 64813 -61839 -108198 -75329 50924 90010 -8483
1685 -8483 -1916 18272 8480 -3220 -1630 41993 63681 -30036 -10337 89408 34020 35101 -27179
1672 -27179 37283 68652 -59663 -36728 157842 43894 39443 73852 -43285 -93257 -128582
1661 -128582 -25822 -17390 -37571 16192 -61899 23623 66746 104017 16617 -2378 -28998 -65413
1649 -65413 -31432 23676 14432 2530 2872 -39217 37944 90021 90674 62915 -45349 -87134 -62410
1636 -62410 28024 14000 -42874 -47978 -48375 31697 -42019 -57686 -122225 -1190 80160 33579
1624 33579 -12376 -45614 -167336 -43174 123852 138313 40782 23802 20003 118291 -25194
1613 -25194 12825 7197 -28778 -84922 -87478 -44418 51365 -44398 -39952 41712 18770 -86836
1601 -86836 -70936 -2284 -89722 27902 45462 132361 108872 136664 54831 -72548 -96270
1590 -96270 -87638 82259 138328 132987 61410 45138 66267 -39487 -30897 -25725 13238 -113434
1578 -113434 -36086 -1686 108847 94563 -56439 -30048 122823 5283 -29135 -95017 -126939
1567 -126939 -102357 39474 20996 -29953 -43015 -36665 35655 45974 7709 40172 -2913 -15948
1555 -15948 22595 8298 -17357 -63375 18128 -49151 -17140 14717 -72057 11992 -73133 -120755
1543 -120755 -35341 -65342 -69609 -16217 49032 101635 75486 41725 -30799 -28875 28061 -75644
1531 -75644 -98086 -84242 -46279 -16681 -4565 -102189 -98889 -113871 67546 65616 -16242 -51779
1519 -51779 2900 18865 10319 -34850 -50279 6483 25837 4724 -11511 -12414 -3941 -42714 -60210
1506 -60210 -64759 -61650 -94105 -90558 -108867 -132733 -106273 -8452 -20790 -64877 73537 -44449
1494 -44449 -79302 -44317 -59811 -127075 -148732 -101175 -20947 -1032 -52782 -87895 14930 -22587
1482 -22587 -16953 31505 -92872 -106871 -64152 -10057 -13741 -60943 -41017 -69727 -5919 -83898
1470 -83898 -114227 47645 68913 141085 61592 -37096 -123529 -58705 -98816 -94159 -115384 -91283
1458 -91283 -40381 22826 -1615 12027 28086 43035 -72357 -88609 -23198 41466 65759 24619
1446 24619 -102107 -40468 -43135 -71473 920 -110900 -58535 -67335 -69191 -42636 -18855 -44498
1434 -44498 104814 115965 141319 114403 82237 2276 -61265 -24064 4362 7204 -39902 -117486
1422 -117486 1032 -69152 -69225 31914 20600 22113 20762 53441 -13961 -14563 9984 -87114 -77862
1409 -77862 29111 -28350 -161553 -120082 -87524 16102 -20347 -87545 -53884 -100711 -130997
1398 -130997 -28607 28296 12097 -29919 -116911 -41214 -111213 -53063 61493 17422 -19537
1387 -19537 -95813 -38863 31601 39653 -19693 -39945 -70277 -40247 -113117 -74892 29110 -143509
1375 -143509 -116921 3984 -5702 -45058 20020 16079 10057 26027 19171 21690 35649 42898 14003
1362 14003 14184 -42940 -135584 -6214 -60537 -75109 25814 4308 -13262 -35340 -79094 -200841
1350 -200841 -69830 -60000 -7444 85132 13576 38259 -19548 4085 35305 -92177 -36235
1339 -36235 -75343 29178 54181 2388 -100590 -153181 -84005 -36445 47597 5587 -14794
1328 -14794 21094 -37374 -51858 20250 35440 102301 98800 12704 58264 -17185 -74480 -15021
1316 -15021 -68996 -52032 41368 63226 -23336 82561 113885 8462 -52574 -70771 -81513
1305 -81513 -86311 118651 19828 -98147 -21019 -68896 -94122 -95622 -11292 10093 17916 -62922
1293 -62922 -103627 -40953 -50745 -117459 -19003 -40804 -102828 -28380 -10590 -49337 -28255 -13001
1281 -13001 99940 -4759 -77208 -126025 -55529 -153888 -158828 -154290 -173966 -125313 -6257 20117
1269 20117 -18374 33386 50115 -31161 -2595 -18116 61968 37660 -99784 -53091 -75855 -140799
1257 -140799 -67328 -22019 -64813 -47337 -1541 22455 85555 89780 24438 -42855 -37637 -10935
1245 -10935 -44021 -63689 -28768 47991 -46953 -77575 -42351 -91117 -141612 -47764 -103968 -76577
1233 -76577 25178 45168 -62296 22852 -29604 19703 5986 -30488 -209901 -136729 -23179
1222 -23179 -6313 19688 -9561 5310 -29918 55032 51464 14363 132736 85410 39357 47787
1210 47787 524 8727 -23398 14157 60634 -40326 118350 145936 83771 32184 13423 -5218
1198 -5218 -58154 -88904 -80481 -50201 -31512 37745 9513 -11297 -45836 -73033 -49162 -30890
1186 -30890 -28334 94146 76320 -7633 -26728 -27120 -27212 42188 -46468 -9823 -22893 -29270 -97473
1173 -97473 -118922 -11487 28140 -25554 -6817 40488 41 35601 -67721 -133313 -201638
1162 -201638 -197754 -77061 -14715 4401 13191 -23048 95803 92253 18327 150981 160706 147364
1150 147364 169357 121863 140832 60726 41056 -72603 -2666 72723 58549 75828 -4115
1139 -4115 -36062 -125086 -77739 -96898 -122656 -160506 -107261 -99965 9548 -60829 -80215 -49733
1127 -49733 -39800 -76666 32361 14458 -27237 17017 34288 27590 -100561 -141080 -112422 -93925
1115 -93925 -76193 -108127 -156284 -43951 -10284 -38485 -28341 41683 -56048 -20713 -89209 -61471
1103 -61471 -96321 -91113 -118954 -46981 -44992 -118346 -8946 -15002 -32966 -10172 10389 -57281
1091 -57281 13141 30592 -26080 -58076 -61827 -81852 13369 17877 -58201 -90703 -142302 -58398
1079 -58398 -45626 -61762 -78954 -9615 -14552 -51039 -74834 -153584 -105652 -29866 27611 -64390
1067 -64390 -74783 61409 29137 -15671 49079 34953 -41533 -132498 -11861 60697 66843 35219
1055 35219 -13238 -46597 -7898 66281 19238 -121014 -84972 33588 43858 -14333 -23468 -60115
1043 -60115 -87183 -110950 -61878 -92839 -67887 1491 20475 5245 -31346 -42154 -28304 -71178
1031 -71178 -20212 54831 3687 -40089 34449 57358 13587 4135 18850 54340 17423 109888
1019 109888 67477 51278 -49390 -100967 -116499 -68832 -63414 -54360 16878 39926 -74424 -132194
1007 -132194 -148991 -169628 -38438 19929 46842 60697 2301 -32297 -87725 -205537 -206568
996 -206568 -91661 -39210 -34493 -123331 -64790 33172 54908 75703 19895 67323 39740 48319
984 48319 42159 157902 81261 -147949 -124855 -89589 -18434 -24765 -33304 -111730 -95412 21087
972 21087 49624 -13348 78095 53531 67238 36028 -22315 109775 962 -57183 -60626 -38046
960 -38046 16702 -70611 -40392 -5248 -83519 -115439 -84406 -39857 -45059 -28287 51365 -6860
948 -6860 43870 121474 112899 126099 5482 -15167 -13591 66738 127499 16928 -7408 79785
936 79785 97421 -4491 8734 56332 -57074 -9660 51685 -53468 -63298 -106443 -45010 -6733
924 -6733 59163 21021 -76603 -20749 -132337 -131358 -103120 -15629 -24173 2256 -10045 21343 37209
911 37209 -37836 -94191 -134854 -106984 -98601 -84229 11253 77821 -11543 -6322 -49219 -136497
899 -136497 -78730 -91958 -76549 34776 50782 30749 -94143 18762 92229 99942 74418
888 74418 -60239 -61367 12916 -57962 -146132 -142323 -37408 53610 8485 -21370 -41121 -7664
876 -7664 19977 -7993 65446 43543 -73272 -16528 28297 -8594 13342 -9862 -22601 -10633
864 -10633 -47209 -68314 -36941 30894 120661 70393 57276 82372 59676 32286 5178 -60959
852 -60959 -90212 50561 137656 56598 76659 34650 -95489 -12171 27660 14005 2202 10407
840 10407 -51875 -35255 1735 -30355 -64932 -30302 -87779 -5467 49781 51777 3353 2360 -67029
827 -67029 31518 -17426 53388 74244 84957 -5867 109838 103659 82888 32467 -128360 -110568
815 -110568 -19752 -14133 -50075 -16488 -18630 49552 -7375 -35073 -58626 -60550 -115182 -38414
803 -38414 -78807 23676 59097 29336 19708 9709 -88498 -156021 -184737 -16063 39824 88126
791 88126 59845 9211 79116 105349 16975 18185 1873 -34088 -82303 -52286 -1198 11817
779 11817 -16897 -37538 -3720 -2573 17983 -21532 28733 65019 -48816 -28439 -41109 40480
767 40480 114201 68036 -4771 -2250 -14795 34117 48612 7992 7943 -20961 -56575 34851 97225
754 97225 123825 143305 139573 92538 57376 -63322 -105438 -61152 -84999 -75664 -45542 15207
742 15207 19240 75775 4108 -17667 86915 119470 71309 126385 77091 -42595 -23789 -73378
730 -73378 -23580 37576 17156 -71658 -116125 -36621 -82278 -73796 -150391 -185031 -55137 -2868
718 -2868 -63229 -88982 -192303 -191901 -86129 58006 -7703 35660 36528 11852 49413 84970
706 84970 -27019 -40560 12234 -48998 -78936 -68705 -37695 -21672 -94534 -132801 -18551 -30355
694 -30355 -148510 -134644 -22847 36813 302 129547 91127 1836 -49194 -100113 -68870
683 -68870 -77932 -31511 48941 2285 -52431 -48021 -115518 18120 -18356 31966 92740 64649
671 64649 84946 -23419 -41786 34479 65310 98410 41462 64328 112833 66230 14596 -51082
659 -51082 -67455 -74831 -39750 -45952 -84765 -74955 -6605 -22507 -40636 -24995 -5826 102991
647 102991 75459 133945 165689 98671 110027 92681 11542 59959 12950 49776 -35678 -88433
635 -88433 -66712 -70499 4792 -25721 -30086 16414 92833 198065 110507 7527 37224 -3588
623 -3588 -25111 -64343 -48499 62491 39233 -36541 -79154 -113528 -47249 41916 -7914 27322
611 27322 90271 37980 41200 34415 102117 118268 57000 34680 -80001 -123931 -23807 -5720
599 -5720 26665 12643 -24395 58166 98736 63316 127770 176150 6569 -17433 3436 15069
587 15069 9303 -11923 -69305 -2443 55413 10068 82924 56071 72226 86174 107823 87710
575 87710 47282 -51628 -108869 -14357 61935 2005 52567 16420 41949 -59460 -139300 -109325
563 -109325 -78880 -28462 9347 -2055 14517 15317 73516 129288 10749 -12645 -8380 36966
551 36966 -12326 20264 162634 94901 159820 106828 -61859 20493 116699 152747 104011 -6449
539 -6449 -51872 -18476 4342 -15501 28373 8108 -19158 -70818 -55225 -51834 -93436 14103
527 14103 20865 70468 46571 99983 49458 -71977 -56226 -24798 -38101 23144 33240 -13721
515 -13721 -65168 -74947 -65707 -119434 -149119 -62556 -62988 -62977 80104 28573 -26488 -51245 -28962
502 -28962 -20539 18240 13451 56934 69017 93787 62862 69756 39217 -39865 2034 91389 85769
489 85769 17447 -20712 -37657 -92011 -112849 10993 -26205 5507 37305 87741 -1334 -21366
477 -21366 -159587 -180888 -123474 -42626 40033 15841 -20758 -1427 819 -2960 -7428 -47356
465 -47356 45134 11558 7235 -21141 -1606 120002 132943 31596 7802 -30932 -24807 37948
453 37948 16430 112893 49222 -25573 435 -20224 -51837 78667 40240 139136 94066 39690
441 39690 -10473 -4510 16003 32261 21787 -46630 -129895 -75383 97574 15324 4901 59865
429 59865 50812 87344 76053 -27451 79984 64330 40149 -50805 -36118 -109862 -25816 4851
417 4851 -28216 53522 100141 79485 12646 34009 26800 -363 12689 46053 45306 -31207 9135
404 9135 88498 17283 6988 163714 231527 204726 174227 63419 32562 -769 -69896 24070
392 24070 49062 135560 125430 75816 58196 106871 120919 17351 47380 66975 13473 26751
380 26751 -705 77357 88374 -40808 -47230 -70107 -38339 -24571 -25631 57693 21267 48994
368 48994 102653 124295 122680 212906 56652 27277 65648 3907 39394 82467 180216 198470
356 198470 191110 110049 113406 167787 22069 31486 96663 88489 63893 -5555 25411 101322
344 101322 -15466 -3762 53056 65236 46188 61838 136036 58483 -9502 69455 40823 -22106
332 -22106 33666 46057 93570 64947 58450 21575 -8809 -19297 67184 56230 134430 111163
320 111163 33406 -11897 67548 74418 102751 91288 89110 167509 169181 65212 127473 115913
308 115913 71082 52602 8409 62586 61641 58317 -10636 28954 132510 52167 40046 66599
296 66599 104103 62033 91897 65095 43619 91613 88352 66154 6040 25055 57854 76966
284 76966 212692 161793 101415 84900 49825 32381 65944 8995 32559 61121 42989 -98
272 -98 56060 79586 78588 150115 122048 31663 -6132 96469 79004 176764 152791 -11986 15812
259 15812 133726 110354 30907 -92983 2727 -4423 35455 38624 103297 -20272 -27812 26327
247 26327 15114 51943 3146 29320 -33616 44338 44049 41644 44385 44185 118677 105464 82944
234 82944 143656 140224 18031 30363 38881 -66517 -74680 -59872 -44869 28584 14276 100405
222 100405 147206 158088 153296 108716 81093 94822 117657 92168 -28548 80677 106122 96189
210 96189 165804 139178 89426 93708 27786 94919 119810 46111 85222 77098 175658 132970
198 132970 165287 196051 129788 130862 124188 30524 94282 45608 10035 -34090 40346 50687
186 50687 -10751 -20747 16393 80070 -5012 27435 79929 130644 178053 89539 47745 123553
174 123553 90672 77344 87016 35149 18747 55404 27493 10855 78311 116887 137512 102967
162 102967 149099 89308 55252 91738 1479 76688 63960 92499 -4816 -38909 67419 28893
150 28893 86269 132570 107261 58111 76847 126586 106058 97294 47557 -13980 65774 122456
138 122456 58715 121352 55884 52986 -20558 30079 121743 98378 141500 29155 -10180 35654
126 35654 -28078 -12079 25381 -3333 34701 22796 75497 142154 42563 102668 132873 180667
114 180667 155591 55805 77485 63778 19824 18183 120211 116283 125776 35507 65819 56380
102 56380 73578 195831 127937 121818 85897 148491 143699 78396 75349 87891 166488 74489
90 74489 136878 139076 130728 138610 135310 162935 131084 62431 -2726 47671 86615 81028 105242
77 105242 114740 137207 125935 75546 61734 72954 -23320 4054 -7797 28743 56478 72775
65 72775 117375 99899 26540 44282 27285 36792 67534 123746 126666 92998 115065 102144 79637
52 79637 46834 41735 31211 24779 34900 74543 67493 59180 36291 47599 43891 32511 54158
39 54158 17158 43068 34876 66965 73073 116817 89237 53282 50206 71632 122763 94991 89665
26 89665 50047 41515 99885 136383 146873 110034 37300 93364 29923 9127 6377 41788 76378
13 76378 159129 134844 91864 137811 131431 92630 76843 84575 86727 97130 71314 86580 154204
0 154204
$$ Imaginary data points
##PAGE= N=2
##DATA TABLE= (X++(I..I)), XYDATA
16383 -2985445 -2922656 -2883537 -2929577 -2862082 -2749082 -2737437 -2667678 -2643343 -2553910 -2433576 -2392857
16372 -2392857 -2382815 -2406158 -2401760 -2282575 -2179827 -2105032 -2154877 -2135619 -2020104 -2030372 -1949569
16361 -1949569 -1927244 -1934105 -1829628 -1762249 -1730610 -1799490 -1761195 -1652935 -1574007 -1549134 -1472206
16350 -1472206 -1455595 -1398935 -1255538 -1276028 -1190398 -1118481 -1124792 -1126060 -1136096 -1079854 -981300
16339 -981300 -981470 -953723 -928428 -864361 -909932 -833122 -724130 -719214 -690428 -732773 -640158 -579493
16327 -579493 -537600 -418062 -461636 -410288 -314005 -281453 -247256 -257600 -217237 -160739 -58617
16316 -58617 -26014 -6706 -5928 114645 91036 123668 144210 135242 155010 244240 278193 314824
16304 314824 341866 382162 430747 520642 548042 524706 623626 510283 513867 657254 661302
16293 661302 743474 789002 871386 831983 821940 921113 949582 893090 949816 998027 1011557
16282 1011557 1030169 1075079 1140822 1205434 1224942 1289174 1287856 1367001 1440074 1388780 1416127
16271 1416127 1373041 1330540 1387121 1537563 1501544 1469759 1531226 1694118 1716991 1732932 1674165
16260 1674165 1675704 1751773 1791485 1778685 1722713 1812580 1949797 1970767 1907528 1968467 1994782
16249 1994782 1959581 1971822 1949175 2049196 2042182 2074182 2119320 2075831 2195014 2273196 2296507
16238 2296507 2341627 2266541 2206761 2308729 2373497 2457324 2519606 2506420 2507301 2496885 2418797
16227 2418797 2499526 2540960 2564916 2613101 2657289 2744105 2726187 2756249 2694501 2697631 2638211
16216 2638211 2597632 2687864 2671731 2694470 2752803 2812010 2823960 2906645 2958199 2924089 2850643
16205 2850643 2913088 2948686 2922686 2967431 3030234 3006488 3034222 3075805 3081387 3124418 3134669
16194 3134669 3049383 3038320 3116036 3099774 3138081 3167747 3187655 3276862 3318706 3136244 3132744
16183 3132744 3165978 3239412 3234716 3244603 3268118 3362647 3318740 3327957 3295271 3316271 3377033 3386911
16171 3386911 3428579 3445762 3445246 3401772 3418145 3476619 3465902 3487634 3534083 3562420 3507695 3505216
16159 3505216 3582497 3553555 3535161 3484158 3496771 3591785 3590562 3597093 3548003 3589026 3572828 3609654
16147 3609654 3654162 3620707 3617739 3576300 3597420 3534944 3628603 3616943 3662594 3703276 3680114
16136 3680114 3603590 3608442 3620120 3712754 3708794 3704401 3738063 3765757 3743661 3805450 3737541 3715037
16124 3715037 3730777 3713975 3773502 3766033 3747475 3716606 3809974 3794045 3737521 3743374 3746266 3734137
16112 3734137 3777787 3829681 3833121 3804615 3788782 3725687 3766731 3708645 3770474 3806310 3774701
16101 3774701 3860716 3956683 3828341 3705712 3766167 3868562 3887281 3800823 3838735 3914313 3891771
16090 3891771 3757399 3842547 3841833 3910641 3945284 3878975 3869469 3925339 3927335 3969048 3993235 4054145
16078 4054145 4047284 3943528 3907498 3918994 3862761 3852797 3877595 3811018 3942023 4087627 3982598
16067 3982598 3861887 3858150 3808093 3852039 3985495 4003037 3974538 3959386 3904681 3896628 3953470
16056 3953470 4059243 4078478 4007607 4003408 4044042 4062942 3931981 3879175 3925288 3841480 3902215
16045 3902215 3978240 3929970 3852121 3907355 3975581 3951346 3875959 3921974 3938597 3980876 3989585
16034 3989585 3952561 4061346 4085597 4087686 4042086 4060000 4002595 4048006 4060471 3987265 4078692
16023 4078692 4073688 4004258 3966592 3957824 3927304 3977009 4090175 4110401 4123380 4010688 4015160
16012 4015160 4108536 4064355 4054739 4081553 4099560 4103595 4081609 3979800 4014109 4043763 3957260
16001 3957260 4050681 4073985 3951676 4003081 4025785 4027222 4077016 4011865 4039749 4012438 3988054
15990 3988054 4119958 4114386 4050568 4058550 4032029 4058980 3965415 3954389 4016147 4022934 4010046 4086396
15978 4086396 4072451 4028729 4047700 4039729 4063148 4109798 4070033 3959379 3994515 3929557 4051676
15967 4051676 3992878 4039759 4055657 4036975 3998869 4086429 4136702 4196144 4110025 4025553 4035488
15956 4035488 4128137 4163088 4024063 4053932 4108911 4070120 4019434 4067718 4066521 4012383 4040377
15945 4040377 4138550 4132260 4152104 4041513 4023873 4035001 4083572 4000370 3922341 4024901 4049111
15934 4049111 4050279 4072733 4109228 4032478 3995075 4042080 4148038 4094728 4063218 4064794 4106033
15923 4106033 4086568 4052294 4141001 4146051 4132729 4061412 4051186 4041091 4055596 4082606 3999194
15912 3999194 3978780 4075560 4037193 4046270 4093660 4084357 4053894 3995325 4013935 4104386 3997086
15901 3997086 3877248 3949669 4025699 4065774 4047673 4028412 4048975 4015736 4062239 4111768 4060145
15890 4060145 3999835 4134407 4107250 4013264 4047936 4070280 4213077 4090699 3979651 4105027
15880 4105027 4092379 4149390 4183234 4115028 4062821 4068428 4025690 4139425 4187468 4167579 4138028
15869 4138028 4094322 4005676 3953002 3921668 4003075 3949126 3920800 3980107 3978100 3994138 3978487
15858 3978487 4009556 3948328 4050942 4035992 4067745 4058223 4056471 4068987 4075685 4101838 4094120 4084956
15846 4084956 3943362 3954335 4039291 4111231 4153338 4058382 4089607 4098273 3969666 3964529 3956538
15835 3956538 3874039 3941885 4031085 4104218 4129051 4018517 4021126 4064535 4051561 4010998 3999039
15824 3999039 4068327 4026658 4036507 4135250 4120142 4063634 4047988 4056501 4069453 4105852 4091755 4069085
15812 4069085 4108150 4083717 4009919 4041119 4062661 4078543 4111329 4160929 4180286 4147781 4125000
15801 4125000 4065800 4162078 4141031 4126489 4127423 4051672 4135975 4069175 4093202 4107743 4072954 4044603
15789 4044603 3992564 3980296 4052794 4095805 4111791 4072293 4065846 4039650 4022813 4087376 4053070
15778 4053070 3968066 3968848 4040130 3983490 4123587 4112180 4064569 4064946 4116923 4146455 4139971 4132554
15766 4132554 4013198 4022849 4008971 4039403 4129237 4167800 4107674 4108891 4175295 4182887 4137306 4033028
15754 4033028 4075290 4071230 4066216 4132941 4064890 4067573 4137881 4219856 4155031 4213854 4184877 4103309
15742 4103309 4180014 4188707 4117167 4031914 4135533 4043520 4118436 4101925 4106886 4167619 4138711
15731 4138711 4043917 4108283 4087763 4104247 4169676 4189616 4215146 4157482 4047937 3986338 4011286
15720 4011286 4029754 4030427 3971497 4000304 4070771 4166786 4197329 4144535 4147213 4152446 4031077 4065955
15708 4065955 4074305 4114687 4211522 4161792 4120081 4199863 4134971 4161552 4253544 4199940 4194325 4172917
15696 4172917 4120115 4171081 4170590 4067387 4045167 4177444 4185886 4172477 4177827 4293615 4262801
15685 4262801 4251890 4204664 4163769 4170523 4152954 4146001 4163785 4190173 4089524 4127090 4259310
15674 4259310 4233067 4196344 4202108 4123493 4117760 4095266 4058899 3941296 3978307 4151913 4139915
15663 4139915 4127417 4188429 4123294 4054560 4076824 4245008 4144136 4012298 4120974 4228453
15653 4228453 4238688 4181209 4069597 4159562 4195244 4170746 4194553 4097210 4131785 4159173 4151367
15642 4151367 4165919 4163597 4175766 4242030 4152240 4129914 4280670 4164591 4126546 4152914 4134998
15631 4134998 4151947 4120474 4185120 4227592 4202430 4091247 4041787 4041248 4123223 4094568 4016088
15620 4016088 4058892 4157723 4138890 4148906 4221660 4283772 4157148 4150945 4197726 4192552 4160167
15609 4160167 4147750 4164585 4141064 4128315 4072470 4046677 4048657 4058000 4282106 4279872 4196334 4221131
15597 4221131 4187671 4173939 4152347 4125895 4162612 4125441 4206830 4263882 4208193 4212811 4153932
15586 4153932 4147442 4213763 4179038 4104204 4214242 4156247 4141518 4140946 4195517 4251515 4155192 4065093
15574 4065093 4126091 4292196 4251489 4208266 4223143 4098297 4100307 4112739 4214042 4238836 4166308
15563 4166308 4207096 4281359 4239252 4345784 4248771 4201449 4085248 4055280 4055888 3978082 4023778
15552 4023778 4198683 4213138 4178433 4223053 4184967 4263318 4260719 4183359 4174759 4176501 4217426 4366634
15540 4366634 4264473 4159488 4125894 4191525 4204056 4181779 4109312 4188928 4349202 4335240 4259588
15529 4259588 4084463 3994560 4088587 4184123 4131204 4066054 4118216 4212632 4182672 4140360 4181642
15518 4181642 4148040 4199510 4210872 4267850 4280763 4141819 4137828 4192211 4131343 4123030 4109610
15507 4109610 4090535 4213874 4174963 4110723 4114455 4199468 4215455 4240569 4179570 4086918 4195113
15496 4195113 4197590 4108515 4103548 4211789 4207732 4095679 4129471 4131744 4197260 4205199 4225817 4075984
15484 4075984 4023012 4118726 4138296 4126931 4136615 4214662 4143766 4205675 4183442 4193445 4169426
15473 4169426 4194689 4135314 4093953 4078951 4183250 4255140 4222971 4266905 4177690 4147138 4148255
15462 4148255 4125109 4161869 4223648 4175570 4140484 4179625 4224661 4292172 4264223 4228082 4235972
15451 4235972 4195857 4257571 4268908 4123403 4091833 4029115 4123302 4210222 4180487 4218563 4273663
15440 4273663 4250476 4251735 4366477 4257440 4269122 4220043 4231177 4218332 4165303 4143443 4197160
15429 4197160 4266120 4231820 4204658 4207500 4271462 4306138 4343578 4201811 4147823 4090753 4185269
15418 4185269 4321866 4176879 4098552 4199306 4223298 4260774 4228925 4194997 4187466 4252956 4257263
15407 4257263 4217540 4265335 4301471 4388210 4328225 4374537 4309980 4333450 4326047 4276996 4284456 4262538
15395 4262538 4364958 4262431 4258093 4188337 4214715 4225757 4144984 4190795 4246072 4267920 4266916
15384 4266916 4235086 4232892 4271803 4163512 4186657 4364707 4304099 4264341 4176494 4188636 4251876
15373 4251876 4282726 4269821 4157498 4217905 4163965 4260470 4220101 4217770 4223784 4182675 4296253
15362 4296253 4315760 4235584 4226748 4224550 4262545 4283017 4316805 4285727 4244728 4206258 4187774 4266064
15350 4266064 4306700 4328277 4296547 4227511 4282269 4282570 4189032 4277370 4303262 4251557 4243136 4337638
15338 4337638 4333437 4367625 4313454 4328899 4294849 4289785 4338321 4302101 4325593 4270748 4307075 4310556
15326 4310556 4281855 4238307 4271656 4288229 4365488 4285063 4234004 4318125 4262590 4256590 4218223
15315 4218223 4257392 4214599 4171706 4262286 4213864 4218980 4330522 4241709 4210060 4281952 4315612
15304 4315612 4251543 4322148 4406885 4431775 4392109 4284438 4208053 4246040 4352337 4333096 4237052
15293 4237052 4188091 4227999 4274083 4361120 4381821 4345054 4351849 4283865 4266362 4277973 4266812
15282 4266812 4217794 4181710 4211447 4302483 4329306 4288433 4336418 4388116 4335684 4217340 4264471
15271 4264471 4263078 4300875 4261985 4316969 4365076 4273895 4233035 4320847 4323982 4314167 4265542 4260697
15259 4260697 4241333 4270606 4258668 4310895 4341335 4334028 4384583 4248868 4258099 4354593 4339899
15248 4339899 4264454 4243755 4298203 4292205 4320491 4275537 4342957 4363005 4311223 4316463 4375449 4370623
15236 4370623 4371308 4351971 4319543 4305237 4281436 4341411 4192879 4247994 4310884 4361935 4371183 4351750
15224 4351750 4287038 4303793 4404698 4329005 4206195 4193992 4327300 4334358 4333420 4380535 4369730
15213 4369730 4279478 4287670 4330600 4271769 4404914 4450765 4378543 4331450 4336146 4255815 4269071
15202 4269071 4322135 4356238 4387430 4356573 4282058 4261501 4386282 4358294 4310798 4401088 4295713
15191 4295713 4220089 4238478 4197624 4274415 4290923 4324522 4442618 4451572 4391528 4273872 4330102
15180 4330102 4349463 4385797 4311844 4299748 4282805 4189288 4245631 4249104 4332200 4364690 4379871
15169 4379871 4416977 4480644 4481286 4445032 4416131 4358479 4340255 4394476 4431856 4458274 4417391 4310230
15157 4310230 4259270 4298534 4305793 4277398 4240705 4291356 4401557 4391942 4349344 4365816 4391594
15146 4391594 4382850 4381356 4321434 4308295 4364997 4463314 4352397 4260123 4332262 4456635 4415234
15135 4415234 4367984 4200858 4235128 4359166 4406254 4379879 4335916 4347647 4273007 4289028 4344989
15124 4344989 4431573 4462687 4328392 4308380 4244691 4226840 4281622 4338742 4359231 4313718 4342632
15113 4342632 4250074 4313731 4413926 4312355 4282743 4390918 4409647 4379315 4395098 4329368 4343607
15102 4343607 4407184 4397467 4466159 4425951 4407487 4408490 4385337 4370935 4448107 4387601 4365678 4416344
15090 4416344 4476923 4448121 4471434 4330949 4344810 4423166 4453850 4380336 4362695 4357823 4460664
15079 4460664 4442801 4440753 4479742 4332657 4264088 4360925 4440792 4411098 4313981 4416380 4380515
15068 4380515 4323285 4402089 4416481 4466627 4433768 4463376 4479201 4523967 4562824 4470370 4482735
15057 4482735 4435895 4370650 4354232 4283116 4318566 4359822 4200747 4237531 4325629 4415452 4374205
15046 4374205 4295433 4304452 4377816 4410745 4441499 4443525 4450966 4479470 4460269 4456888 4372521 4443652
15034 4443652 4392284 4427888 4383973 4419302 4399632 4394483 4400197 4458727 4426053 4364519 4524213
15023 4524213 4583463 4499017 4550649 4360634 4377910 4321694 4335938 4381524 4339877 4369839 4399760
15012 4399760 4439793 4499454 4471256 4472344 4501309 4442173 4460884 4469653 4444051 4431162 4489709 4474450
15000 4474450 4481677 4445212 4350504 4484129 4469700 4498313 4415583 4423223 4508979 4477099 4455682
14989 4455682 4473449 4495394 4411504 4441647 4434773 4447250 4366112 4394517 4425263 4453563 4454620 4433879
14977 4433879 4415349 4389526 4410505 4404765 4428300 4414129 4429202 4409225 4341890 4306795 4405700
14966 4405700 4382763 4350956 4447447 4449754 4439649 4407104 4410617 4481379 4445461 4426107 4481812 4459775
14954 4459775 4413122 4388701 4268563 4328043 4346084 4352395 4434594 4464360 4425273 4396054 4475716
14943 4475716 4403266 4368841 4327514 4349641 4430402 4512263 4477814 4450545 4405277 4385076 4339798
14932 4339798 4360755 4350725 4389100 4406787 4434922 4511305 4449610 4440158 4489091 4425439 4426037 4403738
14920 4403738 4364166 4424242 4479336 4484657 4441663 4382557 4449336 4458934 4449130 4359843 4278682 4264810
14908 4264810 4334780 4430129 4460765 4466404 4475495 4492581 4410781 4439601 4468742 4410660 4347539 4384138
14896 4384138 4475750 4475870 4446873 4397309 4438789 4549159 4553036 4536294 4483318 4453248 4505978 4493516
14884 4493516 4476743 4472685 4541970 4473289 4480794 4504977 4544857 4494422 4423338 4541133 4528596
14873 4528596 4548404 4529097 4511401 4469258 4414885 4465688 4482995 4464733 4507195 4441909 4488295
14862 4488295 4532514 4612266 4628800 4480174 4417420 4528652 4582317 4408874 4321364 4429577
14852 4429577 4463269 4489525 4542124 4620309 4590359 4524460 4540667 4572812 4542435 4504819 4489785
14841 4489785 4409547 4339507 4415315 4510032 4590651 4615429 4487941 4491967 4532216 4452485 4390026
14830 4390026 4492173 4505026 4583777 4562773 4508345 4510267 4535313 4469770 4476665 4452518 4449111 4511576
14818 4511576 4477044 4414812 4420029 4515092 4504538 4453693 4531848 4593194 4487565 4473648 4470037
14807 4470037 4523122 4535086 4542368 4545803 4554175 4486853 4533763 4579271 4508094 4485917 4501007 4520818
14795 4520818 4603385 4562547 4511310 4525732 4503343 4542590 4502468 4565770 4502649 4477516 4509408
14784 4509408 4384166 4462813 4424576 4478784 4518948 4526037 4567250 4497385 4435166 4458383 4524747
14773 4524747 4480547 4445456 4452704 4468407 4489085 4612643 4549111 4417187 4474587 4388760 4367481
14762 4367481 4459574 4563578 4549301 4520123 4504180 4502321 4557228 4569269 4447189 4487042 4583042
14751 4583042 4585397 4617689 4639095 4608711 4504966 4529838 4494122 4505924 4485662 4480807 4618075
14740 4618075 4665644 4552820 4453212 4470298 4559643 4689076 4636948 4518122 4503578 4597838 4537634
14729 4537634 4488826 4472852 4491182 4567174 4575775 4573786 4658088 4676011 4663504 4560470 4527980
14718 4527980 4636377 4554927 4526421 4548982 4531285 4503983 4605179 4515283 4584244 4504619 4463154
14707 4463154 4532250 4529928 4452122 4507921 4640164 4655819 4581410 4498306 4525375 4531512 4575693
14696 4575693 4520425 4444246 4518853 4558005 4583305 4567357 4575665 4581583 4612097 4683934 4564573
14685 4564573 4516659 4600061 4641561 4693254 4675100 4613146 4556079 4544470 4604491 4610270 4563922
14674 4563922 4553060 4552029 4573760 4522143 4499230 4547528 4439872 4451093 4565060 4532777 4563738
14663 4563738 4575029 4570896 4595864 4655805 4561870 4466180 4646446 4608595 4550579 4590028 4600980
14652 4600980 4572623 4553714 4594316 4580164 4550479 4589740 4548875 4607824 4617508 4592035 4546105
14641 4546105 4611671 4678289 4639261 4591256 4599639 4589788 4632157 4592316 4563918 4553376 4517407 4456805
14629 4456805 4474669 4626241 4623098 4621353 4616417 4584996 4644414 4696883 4668881 4619270 4607518 4567883
14617 4567883 4580435 4600401 4573053 4577995 4599472 4731512 4691732 4563907 4558027 4576743 4640469
14606 4640469 4673825 4731889 4733240 4690075 4605089 4628123 4666283 4541725 4643562 4692628 4587765
14595 4587765 4509042 4603560 4628600 4643370 4605731 4670884 4581563 4636967 4634264 4652078 4592365
14584 4592365 4510953 4464360 4577668 4697169 4718370 4631856 4584010 4560138 4545619 4657675 4636244
14573 4636244 4692903 4646961 4705478 4688176 4653826 4511156 4576051 4537782 4570909 4643117 4619285
14562 4619285 4630204 4716624 4679429 4678177 4698817 4569436 4668243 4648120 4623250 4626547 4564355
14551 4564355 4617045 4651528 4649733 4601257 4615357 4559874 4649514 4757660 4745702 4680358 4650233
14540 4650233 4600251 4578866 4639147 4662395 4603503 4641632 4644520 4549802 4595586 4631062 4653874
14529 4653874 4648975 4531805 4493534 4478951 4544292 4650093 4613566 4557868 4512620 4627599 4676053
14518 4676053 4686712 4784218 4725628 4705379 4666092 4653369 4589195 4608428 4698784 4702263 4775121
14507 4775121 4740827 4636176 4661169 4751487 4680638 4708878 4727187 4717580 4668092 4587266 4555584
14496 4555584 4525551 4618192 4568331 4575275 4715328 4744773 4712149 4667828 4684037 4675273 4567053
14485 4567053 4656726 4745686 4784620 4789788 4678181 4662139 4687514 4723227 4742724 4701421 4634147
14474 4634147 4582895 4520767 4629936 4725621 4719591 4729603 4778637 4674520 4702359 4704010 4667845
14463 4667845 4679641 4649226 4577983 4642561 4740494 4759912 4710834 4754294 4724752 4694963 4622750
14452 4622750 4692127 4633997 4681086 4707195 4753398 4821541 4732091 4679546 4564838 4590636 4601693
14441 4601693 4592348 4614770 4555617 4529635 4615691 4640912 4605792 4625436 4629963 4604918 4643124 4606648
$$ [...]
##END NTUPLES=NMR SPECTRUM
##END=
