##TITLE=1H_CA-9007-1
 CDCl3
 8 sc, 
 6.05.2022
##JCAMPDX= 6.0         $$ Bruker NMR JCAMP-DX V2.0
##DATA TYPE= NMR SPECTRUM
##DATA CLASS= NTUPLES
##ORIGIN= UXNMR, Bruker Analytische Messtechnik GmbH
##OWNER= root
$$ XWIN-NMR		Version 3.5
$$ Fri May  6 11:13:52 2022 Russian Standard Time (UT+4h)  she@DPX200
##.OBSERVE FREQUENCY= 200.1313499996
##.OBSERVE NUCLEUS= ^1H
##.ACQUISITION MODE= SIMULTANEOUS
##.ACQUISITION SCHEME= undefined
##.AVERAGES= 8
##.DIGITISER RES= 18
##SPECTROMETER/DATA SYSTEM= spect
##.PULSE SEQUENCE= zg30
##.SOLVENT NAME= CDCl3
##.SHIFT REFERENCE= (INTERNAL, CDCl3, 0, 15.7304)
##AUDIT TRAIL= $$ (NUMBER, WHEN, WHO, WHERE, WHAT)
$$ ##TITLE= Audit trail, XWIN-NMR		Version 3.5
$$ ##JCAMPDX= 5.01
$$ ##ORIGIN= Bruker BioSpin GmbH
$$ ##OWNER= she
$$ F:/spectra/data/she/nmr/H-F/1/pdata/1/auditp.txt
$$ ##AUDIT TRAIL=  $$ (NUMBER, WHEN, WHO, WHERE, WHAT)
(   1,<2022-05-06 11:12:40.39 +0400>,<she>,<DPX200>,
      <created by zg, POWCHK disabled, PULCHK disabled
       configuration hash MD5:
       00 E9 B6 7A A2 85 ED C7 34 08 36 98 17 FE 4E 26
       data hash MD5: 16K
       0D D3 A9 5D EE 17 8B 8D 08 B0 FB 1B 2B 56 05 5A>)
(   2,<2022-05-06 11:12:41.82 +0400>,<she>,<DPX200>,
      <Start of raw data processing
       efp BC_mod = 2 LB = 0.24 FT_mod = 6 PKNL = 1 PHC0 = -18026.48 PHC1 = 0.8007483 SI = 16K 
       data hash MD5: 16K
       31 52 93 77 4A 67 42 B0 D6 DF 76 19 90 1C AE BE>)
(   3,<2022-05-06 11:13:05.21 +0400>,<she>,<DPX200>,
      <pk PHC0 = -2.880152 PHC1 = 9 
       data hash MD5: 16K
       50 96 F0 B2 5C 15 E6 A6 DC C1 75 FC 84 57 62 0C>)
(   4,<2022-05-06 11:13:08.64 +0400>,<she>,<DPX200>,
      <abs ABSG = 5 
       data hash MD5: 16K
       F5 44 F4 62 20 F0 50 C0 0C E8 46 9F CB 6F D1 4E>)
$$ ##END=
$$ 
$$ hash MD5
$$ 2C 29 5B A2 61 46 C6 C5 72 2E 5A E7 51 6E 32 FE
##$RELAX= 
##$RELAX= 
##$RELAX= 
##$RELAX= 
##$RELAX= 
##$RELAX= 
$$ Bruker specific parameters
$$ --------------------------
##$DU= <F:/spectra>
##$EXPNO= 1
##$NAME= <H-F>
##$PROCNO= 1
##$TYPE= <nmr>
##$USER= <she>
##$AMP= (0..31)
100 100 100 100 100 100 100 100 100 100 100 100 100 100 100 100 100 100 
100 100 100 100 100 100 100 100 100 100 100 100 100 100 
##$AQSEQ= 0
##$AQ_mod= 1
##$AUNM= <au_zg>
##$AUTOPOS= <>
##$BF1= 200.13
##$BF2= 200.13
##$BF3= 200.13
##$BF4= 200.13
##$BF5= 200.13
##$BF6= 200.13
##$BF7= 200.13
##$BF8= 200.13
##$BYTORDA= 1
##$CFDGTYP= 0
##$CFRGTYP= 5
##$CHEMSTR= <none>
##$CNST= (0..31)
1 1 145 1 1 1 1 1 1 1 1 1 1 1 1 1 1 1 1 1 1 1 1 1 1 1 1 1 1 1 1 1 
##$CPDPRG= <>
##$CPDPRG1= <>
##$CPDPRG2= <>
##$CPDPRG3= <>
##$CPDPRG4= <mlev>
##$CPDPRG5= <mlev>
##$CPDPRG6= <mlev>
##$CPDPRG7= <mlev>
##$CPDPRG8= <mlev>
##$CPDPRGB= <>
##$CPDPRGT= <>
##$D= (0..31)
0 1.2 0 0 0 0 0 0 0 0.06 0 0.03 0 0 0 0 0.0002 0 0 0 0 0 0 0 0 0 0 0 0 
0 0 0 
##$DATE= 1651821159
##$DBL= (0..7)
120 120 120 120 120 120 120 120 
##$DBP= (0..7)
150 150 150 150 150 150 150 150 
##$DBP07= 0
##$DBPNAM0= <>
##$DBPNAM1= <>
##$DBPNAM2= <>
##$DBPNAM3= <>
##$DBPNAM4= <>
$$ [...]
##$SUBNAM2= <"">
##$SUBNAM3= <"">
##$SUBNAM4= <"">
##$SUBNAM5= <"">
##$SUBNAM6= <"">
##$SUBNAM7= <"">
##$SUBNAM8= <"">
##$SUBNAM9= <"">
##$SW= 18.0517283424761
##$SWIBOX= (0..15)
0 0 2 0 0 0 0 0 0 0 0 0 0 0 0 0 
##$SW_h= 3612.71676300578
##$TD= 16384
##$TD0= 1
##$TE= 0
##$TE2= 300
##$TE3= 300
##$TEG= 300
##$TL= (0..7)
0 120 120 120 120 120 120 120 
##$TP= (0..7)
150 150 150 150 150 150 150 150 
##$TP07= 0
##$TPNAME0= <>
##$TPNAME1= <>
##$TPNAME2= <>
##$TPNAME3= <>
##$TPNAME4= <>
##$TPNAME5= <>
##$TPNAME6= <>
##$TPNAME7= <>
##$TPOAL= (0..7)
0.5 0.5 0.5 0.5 0.5 0.5 0.5 0.5 
##$TPOFFS= (0..7)
0 0 0 0 0 0 0 0 
##$TUNHIN= 0
##$TUNHOUT= 0
##$TUNXOUT= 0
##$USERA1= <user>
##$USERA2= <user>
##$USERA3= <user>
##$USERA4= <user>
##$USERA5= <user>
##$V9= 5
##$VALIST= <valist>
##$VCLIST= <CCCCCCCCCCCCCCC>
##$VD= 0
##$VDLIST= <DDDDDDDDDDDDDDD>
##$VPLIST= <PPPPPPPPPPPPPPP>
##$VTLIST= <TTTTTTTTTTTTTTT>
##$WBST= 1024
##$WBSW= 4
##$XGAIN= (0..3)
0 0 0 0 
##$XL= 0
##$YL= 0
##$YMAX_a= 392915
##$YMIN_a= -543486
##$ZGOPTNS= <>
##$ZL1= 120
##$ZL2= 120
##$ZL3= 120
##$ZL4= 120
##$ABSF1= 15.78104
##$ABSF2= -2.270809
##$ABSG= 5
##$ABSL= 3
##$ALPHA= 0
##$AQORDER= 0
##$ASSFAC= 0
##$ASSFACI= 0
##$ASSFACX= 0
##$ASSWID= 0
##$AUNMP= <proc_1d>
##$AZFE= 0.1
##$AZFW= 0.1
##$BCFW= 0
##$BC_mod= 2
##$BYTORDP= 0
##$COROFFS= 0
##$CY= -3
##$DATMOD= 1
##$DC= 0
##$DFILT= <>
##$DTYPP= 0
##$F1P= 0
##$F2P= 0
##$FCOR= 1
##$FTSIZE= 16384
##$FT_mod= 6
##$GAMMA= 0
##$GB= 0
##$INTBC= 1
##$INTSCL= 0
##$ISEN= 128
##$LB= 0.24
##$LEV0= 0
##$LPBIN= 0
##$MAXI= 10000
##$MC2= 0
##$MEAN= 0
##$ME_mod= 0
##$MI= 1.114404
##$NCOEF= 0
##$NC_proc= -6
##$NLEV= 6
##$NOISF1= 3.799351
##$NOISF2= 2.8
##$NSP= 0
##$NTH_PI= 0
##$NZP= 0
##$OFFSET= 15.73036
##$PC= 1
##$PHC0= -18029.36
##$PHC1= 9.800748
##$PH_mod= 1
##$PKNL= yes
##$PPARMOD= 0
##$PSCAL= 0
##$PSIGN= 0
##$REVERSE= no
##$SF= 200.130008240051
##$SI= 16384
##$SIGF1= 3
##$SIGF2= 2
##$SINO= 5.538805
##$SIOLD= 16384
##$SREGLST= <1H.CDCl3>
##$SSB= 0
##$STSI= 16384
##$STSR= 0
##$SW_p= 3612.71676300578
##$SYMM= 0
##$S_DEV= 0
##$TDeff= 16384
##$TDoff= 0
##$TI= <>
##$TILT= no
##$TM1= 0
##$TM2= 0
##$TOPLEV= 0
##$USERP1= <user>
##$USERP2= <user>
##$USERP3= <user>
##$USERP4= <user>
##$USERP5= <user>
##$WDW= 1
##$XDIM= 16384
##$YMAX_p= 316615818
##$YMIN_p= -338009
$$ End of Bruker specific parameters
$$ ---------------------------------
##NTUPLES= NMR SPECTRUM
##VAR_NAME=  FREQUENCY,     SPECTRUM/REAL,   SPECTRUM/IMAG
##SYMBOL=    X,             R,               I
##VAR_TYPE=  INDEPENDENT,   DEPENDENT,       DEPENDENT
##VAR_FORM=  AFFN,          ASDF,            ASDF
##VAR_DIM=   16384,         16384,           16384
##UNITS=     HZ,            ARBITRARY UNITS, ARBITRARY UNITS
##FACTOR=    0.220516191357247, 1,           1
##FIRST=     3148.1170826486, 0,             0
##LAST=      -464.599680357178, 0,           0
##MIN=       -464.599680357178, -338009,     0
##MAX=       3148.1170826486, 316615818,     0
$$ Real data points
##PAGE= N=1
##DATA TABLE= (X++(R..R)), XYDATA
$$ [...]
$$ plain form
6491 49419 42675 24172 18210 -13747 53581 55402 63723 86096 88471 95751 174058 85220 155580
6478 155580 80359 -43530 50663 54783 54257 157487 126270 49366 51054 116948 179191 157055
6466 157055 156497 -4677 111790 136011 68242 15488 -9681 134452 65128 -47471 96517
6455 96517 105327 4792 62977 67909 168391 181437 45095 78313 102220 -70042 -65350 -11211
6443 -11211 16156 44192 124175 67334 241003 129985 105337 152316 74080 -33330 57986
6432 57986 -15569 -14257 73407 1511 66444 56018 -99007 -61724 38372 -44191 -23770 21331
6420 21331 -16921 14645 33702 -5241 13841 11935 72699 33700 117326 81211 -28387 -85867
6408 -85867 -39850 -44484 -63844 -107831 38657 152413 81992 78851 33903 -68314 23462 82855
$$ packed form
6491D9419o744j8503n962l1957O7328J821Q321K2373K375P280P8307q8838P0360
6478A55580p5221j23889R4193M120n26J03230l1217p6904J688O5894O2243k2136
6466A57055n58j61174J16467K4221o7769n2754k5169J44133o9324j12599J43988
6455I6517Q810j00535N8185M932J00482J3046j36342L3218K3907j72262M692N4139
6443a1211K7367K8036P9983n6841J73669j11018k4648M6979p8236j07410R1316
6432E7986p3555J312Q7664p1896O4933j0426j55025L7283J00096q2563K0421M5101
6420B1331l8252L1566J9057l8943J9082j906O0764l8999Q3626l6115j09598n7480
6408h5867M6017m634j9360m3987J46488J13756p0421l141m4948j02217R1776N9393
$$ plain form
6396 82855 124807 202307 160232 131642 116579 1160 -88887 52764 64535 67034 145029 57435
6384 57435 53083 106968 -15946 35405 4017 -26832 129678 217229 228240 163605 129438 79399
6372 79399 96939 52703 99897 160641 157230 264044 187119 218558 296154 175271 104353 28974
6360 28974 -17692 -54463 6334 57047 142085 161422 154685 -2267 17065 97862 103462 236771
6348 236771 260901 47535 84895 23308 56353 169859 40899 24747 149817 172740 51669
6337 51669 68890 204455 10387 126650 180508 91173 169154 134979 79055 910 -82116
6326 -82116 -129698 20691 -95250 -53859 75839 143290 196526 163656 111444 161630 256284
6315 256284 148587 108002 88069 61552 129708 212830 156195 196375 93903 165019 250880
$$ packed form
6396H2855M1952P7500m2075k8590j5063j15419r0047J41651J1771K499P7995q7594
6384E7435m352N3885j22914N1351l1388l0849J56510Q7551J1011o4635l4167n0039
6372G9399J7540m4236M7194O0744l411J06814p6925L1439P7596j20883p0918p5379
6360B8974m6666l6771O0797N0713Q5038J9337o737j56952J9332Q0797N600J33309
6348B36771K4130k13366L7360o1587L3045J13506j28960j6152J25070K2923j21071
6337E1669J7221J35565j94068J16263N3858q9335P7981l4175n5924p8145q3026
6326h2116m7582J50389j15941M1391J29698O7451N3236l2870n2212N0186R4654
6315B56284j07697m0585j9933k6517O8156Q3122n6635M0180j02472P1116Q5861
$$ plain form
6304 250880 204971 229327 250669 171898 236422 201300 179335 192437 71956 216586 99501
6293 99501 27197 126843 65482 23517 180066 164748 214409 280573 141885 76882 80954 -3329
6281 -3329 261221 200837 176226 289836 279870 258593 292167 130784 182652 141243 74982 76755
6269 76755 -76143 -11221 118102 186284 219921 162656 57127 54250 157264 66578 72084
6258 72084 134601 131723 129831 110415 89562 113507 192487 117694 223927 336068 351876 271931
6246 271931 111434 87477 92008 78926 134713 240030 243054 274163 308657 288307 252223 199492
6234 199492 132451 184499 167055 181582 103549 193985 217792 119813 210302 169493 184871 290832
6222 290832 301834 190594 210024 117969 167323 269797 200002 196525 258031 212535 264834
$$ packed form
6304B50880m5909K4356K1342p8771O4524l5122k1965J3102j20481J44630j17085
6293I9501p2304R9646o1361m1965J56549j5318M9661O6164j38688o5003M072q4283
6281c329K64550o0384k4611J13610r966k1277L3574j61383N1868m1409o6261J773
6269G6755j52898O4922J29323O8182L3637n7265j05529k877J03014r0686N506
6258G2084O2517k878j892j9416k0853K3945P8980p4793J06233J12141J5808p9945
6246B71931j60497k3957M531j3082N5787J05317L024L1109L4494k0350l6084n2731
6234A99492o7041N2048j7444J4527p8033R0436K3807r7979R0489m0809J5378J05961
6222B90832J1002j11240J9430r2055M9354J02474o9795l477O1506m5496N2299
$$ plain form
6211 264834 134364 50597 77291 165932 186879 189884 193455 198153 54598 53645 36172 76415
6199 76415 49394 95872 148714 137280 101582 58090 113609 82448 109369 79623 200839 324636
6187 324636 377109 336713 327782 94728 110179 184317 220728 242119 134149 96921 241373
6176 241373 280836 134630 210558 207963 193685 208312 230733 196976 215962 251171 301144 163053
6164 163053 188975 309233 302371 310167 360086 249623 261652 301386 167433 179989 331313
6153 331313 318495 239848 384849 370911 270909 293586 268070 118747 358743 252923 172362
6142 172362 297344 221301 292954 419625 142768 135431 310655 125564 214414 192201 58671
6131 58671 258241 165328 148642 232889 188842 206396 270180 343121 403020 499561 256065
$$ packed form
6211B64834j30470q3767K6694Q8641K0947L005L571M698j43555r53j7473M0243
6199G6415k7021M6478N2842j1434l5698m3492N5519l1161K6921k9746J21216J23797
6187C24636N2473m0396q931k33054J5451P4138L6411K1391j07970l7228J44452
6176B41373L9463j46206P5928k595j4278J4627K2421l3757J8986L5209M9973j38091
6164A63053K5922J20258o862P796M9919j10463J2029L9734j33953J2556J51324
6153C31313j2818p8647J45001j3938j00002K2677k5516j49323K39996j05820q0561
6142A72362J24982p6043P1653J26671k76857p337J75224j85091Q8850k2213j33530
6131E8671J99570r2913j6686Q4247m4047J7554O3784P2941N9899R6541k43496
$$ plain form
6120 256065 256678 316582 200937 268460 334438 209092 382641 358974 416187 447163 453864 336160
6108 336160 228538 327428 394310 416100 471556 344349 260064 289175 268360 339906 369331
6097 369331 346030 376946 379923 428541 422821 274454 270831 282192 428566 491435 432048 420004
6085 420004 525355 479992 516147 494361 449657 401600 376738 539686 612269 509278 467542
6074 467542 439553 581336 613990 666177 786068 705310 767181 751545 728630 801421 807347
6063 807347 856333 882397 830732 919338 960140 876837 831866 716919 869148 1004961 979246
6052 979246 1021856 1192195 1097474 1133916 1132091 1088275 1166715 1218725 1158321 1227655 1325187 1274505
6040 1274505 1430437 1452070 1351906 1451587 1509375 1514233 1713891 1775023 1853002 1890803 1953137
$$ packed form
6120B56065O13N9904j15645O7523O5978j25346J73549k3667N7213L0976O701j17704
6108C36160j07622R8890O6882K1790N5456j27207q4285K9111k0815P1546K9425
6097C69331k3301L0916K977M8618n720j48367l623J1361J46374O2869n9387j2044
6085D20004J05351m5363L6155k1786m4704m8057k4862J62948P2583j02991m1736
6074D67542k7989J41783L2654N2187J19891q0758O1871j5636k2915P2791N926
6063H07347M8986K6064n1665Q8606M0802q3303m4971j14947J52229J35813k5715
6052I79246M2610J70339r4721L6442j825m3816P8440N2010o0404O9334R7532n0682
6040A274505J55932K1633j00164R9681N7788M858J99658O1132P7979L7801O2334
$$ plain form
6029 1953137 2083407 2068585 1922274 1864268 1931474 2004980 2016465 2016169 2032744 2027027 2001396 1922587
6017 1922587 1852314 1942841 1968521 1943446 2105249 2137253 2199075 2333116 2267301 2268015 2418090
6006 2418090 2379911 2421076 2491837 2503318 2714499 2847946 2810636 2867291 2907332 2778549 2741874
5995 2741874 2709909 2385753 2302053 2242604 2197326 2169387 2170227 2169417 2065224 2058794 2042520 1967783
5983 1967783 1937414 2045632 1961850 2007080 1956823 1987311 2103831 2119851 2116903 2209621 2092905
5972 2092905 2116136 2162583 2187275 2040528 1860429 1855192 1811366 1769792 1687429 1519580 1431498
5961 1431498 1458494 1448712 1571109 1537731 1562823 1489161 1338927 1213354 1226471 1182948 1111561
5950 1111561 1241950 1318857 1286183 1359280 1173817 1021210 1140967 990368 1103131 1245232
$$ packed form
6029A953137J30270j4822j46311n8006O7206P3506J1485k96J6575n717k5631p8809
6017A922587p0273R0527K5680k5075J61803L2004O1822J34041o5815P14J50075
6006B418090l8179M1165P0761J1481K11181J33447l7310N6655M0041j28783l6675
5995B741874l1965l24156q3700n9449m5278k7939Q40q10j04193o430j6274p4737
5983A967783l0369J08218q3782M5230n0257L0488J16520J6020k948R2718j16716
5972B092905K3231M6447K4692j46747j80099n237m3826m1574q2363j67849q8082
5961A431498K6996r782J22397l3378K5092p3662j50234j25573J3117m3523p1387
5950A111561J30389P6907l2674P3097j85463j52607J19757j50599J12763J42101
$$ plain form
5940 1245232 1203702 1126472 1077134 999878 838611 745266 758133 749834 859610 870125 743929
5929 743929 801373 803195 698384 630985 636552 692254 724361 688520 822547 832951 732854
5918 732854 604911 477357 511061 685273 579294 696784 785657 693923 649920 538553
5908 538553 470944 546280 670791 665401 735145 683725 649867 669601 651754 613759 666361 604548
5896 604548 535807 570588 683285 692689 751708 592711 504020 480724 460225 564360 649362
5885 649362 603157 588525 624943 585566 578897 659602 664352 627265 649993 638315 582664 537221
5873 537221 595333 620285 568689 702383 775464 697133 720658 622795 648435 676849 561160
5862 561160 616152 756877 681573 746097 682091 700946 628198 637785 709200 628366 596207 685158
$$ packed form
5940A245232m1530p7230m9338p7256j61267r3345J2867q299J09776J0515j26196
5929G43929N7444J822j04811o7399N567N5702L2107l5841J34027J0404j00097
5918G32854j27943j27554L3704J74212j05979J17490Q8873r1734m4003j11367
5908E38553o7609P5336J24511n390O9744n1420l3858J9734j7847l7995N2602o1813
5896F04548o8741L4781J12697R404N9019j58997q8691k3296k0499J04135Q5002
5885F49362m6205j4632L6418l9377o669Q0705M750l7087K2728j1678n5651m5443
5873E37221N8112K4952n1596J33694P3081p8331K3525r7863K5640K8414j15689
5862E61160N4992J40725p5304O4524o4006J8855p2748R587P1415q0834l2159Q8951
$$ plain form
5850 685158 762031 742041 735227 763157 725227 618918 780064 730892 811045 840204 699674
5839 699674 696456 684496 601572 665299 620529 594118 608982 607139 659132 598832 658016 615067
5827 615067 647244 642761 633535 689526 634646 734464 799412 724687 785684 787116 738941 831258
5815 831258 757006 651155 748503 683400 759670 711447 554638 647353 789320 749388 792956
5804 792956 776654 635189 747459 901611 875452 832630 793612 788843 832058 835096 767977
5793 767977 761291 696657 787518 863471 780014 735704 710340 782350 832526 791148 717221 739868
5781 739868 723412 856141 867243 915769 838216 789853 886569 842933 804695 819961 871170
5770 871170 935035 864625 842480 725991 694759 883284 739410 732649 860776 770933 775872
$$ packed form
5850F85158P6873j9990o814K7930l7930j06309J61146m9172Q0153K9159j40530
5839F99674l218j1960q2924O3727m4770k6411J4864j843N1993o0300N9184m2949
5827F15067L2177m483r226N5991n4880R9818O4948p4725O0997J432m8175R2317
5815H31258p4252j05851R7348o5103P6270m8223j56809R2715J41967l9932M3568
5804G92956j6302j41465J12270J54152k6159m2822l9018m769M3215L038o7119
5793G67977o686o4634R0861P5953q3457m4310k5364P2010N0176m1378p3927K2647
5781G39868j6456J32729J1102M8526p7553m8363R6716m3636l8238J5266N1209
5770H71170O3865p0410k2145j16489l1232J88525j43874o761J28127q9843M939
$$ plain form
5759 775872 1066480 909849 861441 895928 708286 823176 834200 776258 1017459 1005939 966458
5748 966458 939024 904383 992656 1055577 960955 1068213 1034833 936230 1034194 999779 908441
5737 908441 990431 991905 922135 1056765 925355 830637 909983 1028763 960252 1035703 1108226
5726 1108226 1071006 941601 981359 1038784 1056726 1151525 1127340 1143753 1217154 1084528 1023131
5715 1023131 1026212 1024380 1048375 1095493 1093877 1133494 1122465 1106422 1083123 1073549 1153692 1206538
5703 1206538 1254783 1319495 1312578 1321756 1310141 1208621 1284963 1340223 1312112 1477105 1435520
5692 1435520 1446091 1535246 1435379 1433161 1478077 1417904 1371398 1367963 1455526 1454499 1392114 1347355
5680 1347355 1331604 1367063 1297389 1391290 1530060 1416063 1471864 1408590 1294945 1378269 1358822
$$ packed form
5759G75872K90608j56631m8408L4487j87642J14890J1024n7942K41201j1520l9481
5748I66458k7434l4641Q8273O2921r4622J07258l3380r8603R7964l4415r1338
5737I08441Q1990J474o9770J34630j31410r4718P9346J18780o8511P5451P2523
5726A108226l7220j29405L9758N7425J7942R4799k4185J6413P3401j32626o1397
5715A023131L081j832K3995M7118j616L9617j1029j6043k3299r574Q0143N2846
5703A206538M8245O4712o917R178j1615j01520P6342N5260k8111J64993m1585
5692A435520J0571Q9155r9867k218M4916o0173m6506l435Q7563j027o2385m4759
5680A347355j5751L5459o9674R3901J38770j13997N5801o3274j13645Q3324j9447
$$ plain form
5669 1358822 1310084 1377617 1444547 1417938 1501578 1500172 1362371 1266324 1359002 1340626 1257497
5658 1257497 1314548 1378858 1345062 1508015 1445682 1417495 1486252 1520106 1437263 1576932 1613935
5647 1613935 1556067 1668816 1765621 1712215 1806619 1734446 1663424 1843279 1814140 1853274 1842945
5636 1842945 1932393 1892946 2023197 2084921 2056528 1986880 1970278 1994629 1960858 1986431 1978610
5625 1978610 1986649 2055439 2035674 2087626 2174000 2246827 2233135 2266276 2212157 2207399 2200287 2250304
5613 2250304 2316698 2327562 2379145 2359436 2345851 2344342 2374875 2337389 2304532 2267117 2207294 2300353
5601 2300353 2317078 2284952 2371921 2419013 2479087 2469207 2517287 2583887 2578099 2594899 2698095 2785897
5589 2785897 2788967 2710112 2820266 2902153 2873142 2817597 2986591 2998837 2959428 3021312 3078357
$$ packed form
5669A358822m8738O7533O6930k6609Q3640j406j37801r6047R2678j8376q3129
5658A257497N7051O4310l3796J62953o2333k8187O8757L3854q2843J39669L7003
5647A613935n7868J12749R6805n3406R4404p2173p1022J79855k9139L9134j0329
5636A842945Q9448l9447J30251O1724k8393o9648j6602K4351l3771K5573p821
5625A978610Q039O8790j9765N1952Q6374P2827j3692L3141n4119m758p112N0017
5613B250304O6394J0864N1583j9709j3585j509L0533l7486l2857l7415n9823R3059
5601B300353J6725l2126Q6969M7092O0074r880M8080O6600n788J6800J03196Q7802
5589B785897L070p8855J10154Q1887k9011n5545J68994J2246l9409O1884N7045
$$ plain form
5578 3078357 3125567 3213072 3287083 3268630 3321231 3390671 3403941 3543212 3680594 3695645 3690601
5567 3690601 3755426 3697310 3783274 3901399 4033453 4214528 4288780 4317041 4667333 4637159 4649616
5556 4649616 4873282 4905521 4978025 5115541 5199150 5306974 5561626 5744531 5883582 6197307
5546 6197307 6414813 6533653 6755754 6892992 7123519 7457635 7718374 8081364 8350009 8517623
5536 8517623 8965132 9250021 9499606 9704564 9788409 9998780 10260732 10351315 10643696 10859078
5526 10859078 11099346 11330361 11578186 11839007 12242427 12789751 13304806 13838681 14416716
5517 14416716 14897511 15557201 16011266 16355734 16945036 17401727 17785754 18179780 18486816
5508 18486816 18746542 18936035 19075745 19097870 19244326 19419426 19584689 19806825 20056059 20316258
$$ packed form
5578C078357M7210Q7505P4011j8453N2601O9440J3270J39271J37382J5051n044
5567C690601O4825n8116Q5964J18125J32054J81075P4252K8261L50292l0174J2457
5556D649616K23666L2239P2504J37516Q3609J07824K54652J82905J39051L13725
5546F197307K17506J18840K22101J37238K30527L34116K60739L62990K68645J67614
5536H517623M47509K84889K49585K04958Q3845K10371K61952R0583K92381K15382
5526A0859078K40268K31015K47825K60821M03420N47324N15055N33875N78035
5517A4416716M80795O59690M54065L44468N89302M56691L84027L94026L07036
5508A8486816K59726J89493J39710K2125J46456J75100J65263K22136K49234K60199
$$ plain form
5498 20316258 20773546 21010575 21328802 21781394 22217216 22604433 22993117 23309497 23625888
5489 23625888 23977854 24210642 24451818 24653892 24736524 24930493 24964649 24986703 25130959 25107734
5479 25107734 25109019 25156906 25231276 25265924 25274976 25248199 25224678 25094096 25065756 24843637 24725687
5468 24725687 24634110 24569820 24529209 24512836 24364457 24280762 24188630 24167271 24124934 24186318 24243273
5457 24243273 24320417 24446185 24465324 24509939 24545259 24391180 24088425 23848489 23343073 23039356
5447 23039356 22819226 22297918 21870564 21630585 21268850 21096512 20921199 20803427 20767187 20824839
5437 20824839 20958491 21399301 21711329 21983975 22355051 22590360 22774422 22975011 23010568 23104040
5427 23104040 23275193 23270544 23559833 23769313 24015432 24199514 24634217 25077857 25516226 26244240
$$ packed form
5498B0316258M57288K37029L18227M52592M35822L87217L88684L16380L16391
5489B3625888L51966K32788K41176K02074Q2632J93969L4156K2054J44256k3225
5479B5107734J285M7887P4370L4648R052k6777k3521j30582k8340k22119j17950
5468B4725687r1577o4290m0611j6373j48379q3695r2132k1359m2337O1384N6955
5457B4243273P7144J25768J9139M4615L5320j54079l02755k39936n05416l03717
5447B3039356k20130n21308m27354k39979l61735j72338j75313j17772l6240N7652
5437B0824839J33652M40810L12028K72646L71076K35309J84062K00589L5557R3472
5427B3104040J71153m649K89289K09480K46119J84082M34703M43640M38369P28014
$$ plain form
5417 26244240 27040692 27815574 28724651 29597196 30734330 31929263 33191387 34538458 36093815
5408 36093815 37850221 39689824 41669018 43878939 46340436 48928092 51748845 54750963
5400 54750963 57888389 61139081 64515057 67728613 70959861 74100667 76850891 79419322
5392 79419322 81818490 83593455 84838117 85452040 85308776 84464425 82942144 80707601 78001355
5383 78001355 74989193 71543465 68016781 64301135 60632349 57127033 53721816 50357051
5375 50357051 47343766 44535332 41783283 39530478 37607964 35661468 33963524 32509318
5367 32509318 31169311 30135541 29025899 28099767 27234146 26232399 25462848 24914750 24210191
5358 24210191 23633291 23270106 22853862 22410157 22075245 21764879 21415969 21058154 20817884
$$ packed form
5417B6244240P96452P74882R09077Q72545J137134J194933J262124J347071J555357
5408C6093815J756406J839603J979194K209921K461497K587656K820753L002118
5400E4750963L137426L250692L375976L213556L231248L140806K750224K568431
5392G9419322K399168J774965J244662O13923j43264q44351j522281k234543k706246
5383G8001355l012162l445728l526684l715646l668786l505316l405217l364765
5375E0357051l013285k808434k752049k252805j922514j946496j697944j454206
5367C2509318j340007j033770j109642r26132q65621j001747p69551n48098p04559
5358B4210191n76900l63185m16244m43705l34912l10366l48910l57815k40270
$$ plain form
5349 20817884 20479977 20417987 20455187 20239593 20214324 20258833 20109123 20172668 20253076 20201935 20314187
5338 20314187 20502008 20715722 20765607 21000868 21212175 21405632 21714035 22123559 22443133 22843699
5328 22843699 23367120 23863467 24360843 24994446 25586860 26318853 27232706 28048640 29175047
5319 29175047 30232297 31336013 32796010 34399905 36092989 37966022 39979676 42157446
5311 42157446 44457970 46981396 49789681 52995902 56429758 60139572 64036069 67942840
5303 67942840 71408526 74337928 76217965 76822578 76129623 74311124 71595883 68238889
5295 68238889 64638318 61346983 58407100 56039326 54137240 52645884 51611470 50967506
5287 50967506 50695860 50809424 51417112 52045089 53163212 54563799 56206128 57905516 59370311
$$ packed form
5349B0817884l37907o1990L7200k15594k5269M4509j49710O3545Q0408n1141J12252
5338B0314187J87821K13714M9885K35261K11307J93457L08403M09524L19574M00566
5328B2843699N23421M96347M97376O33603N92414P31993R13853Q15934J126407
5319B9175047J057250J103716J459997J603895J693084J873033K013654K177770
5311D2157446K300524K523426K808285L206221L433856L709814L896497L906771
5303F7942840L465686K929402J880037O04613o92955j818499k715241l356994
5295F8238889l600571l291335k939883k367774j902086j491356j034414o43964
5287E0967506k71646J13564O07688O27977J118123J400587J642329J699388J464795
$$ plain form
5278 59370311 60616803 61526968 61564435 60978486 59423277 57128987 54184320 50920542 47506320
5269 47506320 44165604 40896733 37941337 35377509 32817054 30647251 28872047 27199957
5261 27199957 25800895 24540059 23274816 22120615 21236259 20441933 19673228 18829958 18277911
5252 18277911 17679841 17098270 16639191 16125406 15623132 15224011 14799099 14375119 14002088
5243 14002088 13584934 13278013 12822957 12517416 12117260 11824871 11663571 11352235 11122717
5234 11122717 10985970 10646210 10415340 10252696 10154587 9998885 9824968 9609482 9605329 9453283
5224 9453283 9348686 9149307 8934589 8799487 8734842 8555457 8426271 8208920 8056280 7897304
5214 7897304 7895830 7869602 7812774 7817165 7647952 7606207 7638737 7448438 7560663 7565808 7555185
$$ packed form
5278E9370311J246492R10165L7467n85949j555209k294290k944667l263778l414222
5269D7506320l340716l268871k955396k563828k560455k169803j775204j672090
5261B7199957j399062j260836j265243j154201q84356p94326p68705q43270n52047
5252A8277911n98070n81571m59079n13785n02274l99121m24912m23980l73031
5243A4002088m17154l06921m55056l05541m00156k92389j61300l11336k29518
5234A1122717j36747l39760k30870j62644r8109j55702j73917k15486m153j52046
5224I453283j04597j99379k14718j35102o4645j79385j29186k17351j52640j58976
5214G897304j474k6228n6828M391j69213m1745L2530j90299J12225N145j0623
$$ plain form
5203 7555185 7625261 7661748 7770255 7857024 7838032 7752133 7816653 7821432 7915175 8042936 7984727
5192 7984727 8008436 8031617 7866783 8060042 7969774 7616366 7682075 7698652 7496640 7606912
5182 7606912 7546325 7528860 7581382 7510594 7505210 7641739 7670106 7655831 7699489 7814411 7862161
5171 7862161 8043751 8157525 8218056 8278676 8409594 8485022 8720889 8744187 8748425 8818340 8929998
5160 8929998 9005309 9066079 8916287 8786587 8832702 8791470 8810218 8630098 8463420 8276631
5150 8276631 8086616 7985144 7756570 7573422 7394459 7302482 7238372 7085272 7210474 7287159
5140 7287159 7092117 7102646 7116462 7045435 7165919 7188416 7088449 7109940 7072259 6932865 6912866
5129 6912866 6931655 6906698 6964091 6836530 6675371 6576798 6399918 6327213 6218936 5964290
$$ packed form
5203G555185P0076L6487J08507Q6769j8992q5899O4520M779R3743J27761n8209
5192G984727K3709K3181j64834J93259r0268l53408O5709J6577k02012J10272
5182G606912o0587j7465N2522p0788n384J36529K8367j4275M3658J14922M7750
5171G862161J81590J13774O0531O0620J30918P5428K35867K3298M238O9915J11658
5160H929998P5311O0770j49792j29700M6115m1232J8748j80120j66678j86789
5150H276631j90015j01472k28574j83148j78963r1977o4110j53100J25202P6685
5140G287159j95042J0529J3816p1027J20484K2497r9967K1491l7681j39394j9999
5129F912866J8789k4957N7393j27561j61159r8573j76880p2705j08277k54646
$$ plain form
5119 5964290 5831976 5733996 5494955 5398733 5265414 5166572 5005138 5048660 4934803 4820257
5109 4820257 4783065 4801294 4747414 4682148 4562180 4485670 4377418 4402276 4384382 4359540 4490013
5098 4490013 4541012 4473602 4433423 4447279 4351649 4437811 4543800 4529377 4512123 4502980 4324806
5087 4324806 4318346 4452377 4477565 4421080 4528341 4447137 4482698 4432107 4460356 4354359 4310018
5076 4310018 4307093 4402828 4367380 4309425 4375204 4255240 4280183 4344812 4183840 4123947 4169141
5065 4169141 4104568 4239192 4196011 4102229 4236056 4370405 4115974 4142359 4159820 4156930 4185860
5054 4185860 4123040 4011380 4051838 4114773 4152552 4170891 4218207 4207573 4286170 4243045 4135776
5043 4135776 4095208 4036445 4076442 4213345 4225921 4234723 4297951 4365831 4385499 4318296 4497183
$$ packed form
5119E964290j32314r7980k39041r6222j33319r8842j61434M3522j13857j14546
5109D820257l7192J8229n3880o5266j19968p6510j08252K4858j7894k4842J30473
5098D490013N0999o7410m0179J3856r5630Q6162J05989j4423j7254r143j78174
5087D324806o460J34031K5188n6485J07261q1204L5561n0591K8249j05997m4341
5076D310018k925R5735l5448n7955O5779j19964K4943O4629j60972n9893M5194
5065D169141o4573J34624m3181r3782J33827J34349k54431K6385J7461k890K8930
5054D185860o2820j11660M0458O2935L7779J8339M7316j0634P8597m3125j07269
5043D135776m0568n8763L9997J36903J2576Q802O3228O7880J9668o7203J78887
$$ plain form
5032 4497183 4442905 4418173 4471133 4451814 4532608 4375810 4332096 4444332 4346137 4419720 4491370
5021 4491370 4467601 4600815 4526938 4448758 4510426 4548863 4534485 4672200 4762860 4682180 4637933
5010 4637933 4894136 4785943 4811344 4811540 4662685 4838221 4908946 4903376 5043739 5042446 5043856
4999 5043856 5090609 4997715 5012451 5121992 5257774 5311444 5408788 5294236 5278278 5320987 5473085
4988 5473085 5535750 5656258 5608962 5753875 5777175 5737669 5705423 5827512 5866511 6028921 6090296
4977 6090296 6164372 6244892 6302819 6247320 6409299 6486655 6594254 6767561 6752047 6886593 6823509
4966 6823509 6860806 6971455 7099359 7203906 7496334 7441038 7499639 7664332 7811039 7787248
4956 7787248 8009055 8039928 8106444 8331308 8445752 8576248 8781555 8912782 8963342 9294517
$$ packed form
5032D497183n4278k4732N2960j9319Q0794j56798m3714J12236r8195P3583P1650
5021D491370k3769J33214p3877p8180O1668L8437j4378J37715R0660q0680m4247
5010D637933K56203j08193K5401J96j48855J75536P0725n570J40363j293J410
4999E043856M6753r2894J4736J09541J35782N3670R7344j14552j5958M2709J52098
4988E473085O2665J20508m7296J44913K3300l9506l2246J22089L8999J62410O1375
4977F090296P4076Q0520N7927n5499J61979P7356J07599J73307j5514J34546o3084
4966F823509L7297J10649J27904J04547K92428n5296N8601J64693J46707k3791
4956G787248K21807L0873O6516K24864J14444J30496K05307J31227N0560L31175
$$ plain form
4946 9294517 9518412 9701287 9969076 10210952 10464043 10637669 10694584 10925647 11044038 11173416
4936 11173416 11358632 11427055 11345396 11287391 11316650 11428598 11518138 11449445 11565598 11661340 11645293
4925 11645293 11767523 11790954 11846358 11962045 12020067 12216936 12368986 12584651 12679874 12915948
4915 12915948 13125831 13336682 13402500 13520979 13637810 13721922 13700676 13633381 13721373 13818286
4905 13818286 13764649 13652860 13613811 13609962 13749600 13563664 13512884 13369056 13301699 13129261
4895 13129261 13121307 12983150 12976758 12802682 12846543 12864672 12819151 12890326 12907165 12965376 13016358
4884 13016358 12956873 13035725 13202723 13203505 13380454 13396313 13530968 13613334 13617558 13507830 13501286
4873 13501286 13323618 13376266 13385173 13287013 13300874 13318544 13316017 13303823 13089475 12947549 12872154
$$ packed form
4946I294517K23895J82875K67789K41876K53091J73626N6915K31063J18391J29378
4936A1173416J85216O8423q1659n8005K9259J11948Q9540o8693J16153R5742j6047
4925A1645293J22230K3431N5404J15687N8022J96869J52050K15665R5223K36074
4915A2915948K09883K10851O5818J18479J16831Q4112k1246o7295Q7992R6913
4905A3818286n3637j11789l9049l849J39638j85936n0780j43828o7357j72438
4895A3129261p954j38157o392j74076M3861J8129m5521P1175J6839N8211N0982
4884A3016358n9485P8852J66998P82J76949J5859J34655Q2366M224j09728o544
4873A3501286j77668N2648Q907r8160J3861J7670k527j2194k14348j41926p5395
$$ plain form
4862 12872154 12898470 12889692 12983427 13049236 13128585 13186763 13091187 13150091 13172158 13132649 13157498
4851 13157498 13201128 13282568 13377643 13344021 13422522 13460559 13499642 13547597 13506752 13548185 13714234
4840 13714234 13811268 13795653 13839262 13802649 13870837 14017725 14109897 14030172 14191509 14348185 14404222
4829 14404222 14356204 14445523 14458670 14539224 14623252 14714695 14908651 14831053 14827289 14946995 14968011
4818 14968011 15079185 15221724 15222198 15338084 15424874 15462758 15456420 15471111 15479313 15606970 15617334
4807 15617334 15696387 15803366 15883080 15757617 15747461 15856263 15951444 15930156 15977016 16082092
4797 16082092 16041144 15984989 16119752 16122815 16111461 16101136 16126269 16210486 16334366 16080548 16220555
4786 16220555 16299620 16175863 16282912 16209447 16357248 16568644 16409046 16513055 16535825 16370623
$$ packed form
4862A2872154K6316q778R3735O5809P9349N8178r5576N8904K2067l9509K4849
4851A3157498M3630Q1440R5075l3622P8501L8037L9083M7955m0845M1433J66049
4840A3714234R7034j5615M3609l6613O8188J46888R2172p9725J61337J56676N6037
4829A4404222m8018Q9319J3147Q0554Q4028R1443J93956p7598l764J19706K1016
4818A4968011J11174J42539M74J15886Q6790L7884o338J4691Q202J27657J0364
4807A5617334P9053J06979P9714j25463j0156J08802R5181k1288M6860J05076
4797A6082092m0948n6155J34763L063j1354j0325K5133Q4217J23880k53818J40007
4786A6220555P9065j23757J07049p3465J47801K11396j59598J04009K2770j65202
$$ plain form
4776 16370623 16508431 16606282 16572557 16682115 16595513 16602590 16779166 16613931 16575103 16578741 16519603
4765 16519603 16527595 16610461 16607053 16724271 16695727 16767488 16684749 16698547 16759320 16656524 16666619
4754 16666619 16791116 16844419 16842165 16716296 16700229 16764044 16813084 16916394 16964227 16897006 16966380
4743 16966380 17052460 17029038 17177879 17209584 17184482 17338661 17290536 17311193 17385776 17436704 17455743
4732 17455743 17584583 17731849 17796424 17865674 17908761 17957064 18082827 18245922 18484553 18655168
4722 18655168 18680962 18686773 18797138 18799269 18892755 18969012 18975074 19148471 19377245 19615702 19768815
4711 19768815 19961401 20202792 20414563 20592701 20930962 21259848 21519689 21938871 22465966
4702 22465966 22818807 23428233 23956233 24560769 25276248 25900529 26652620 27450430 28184049
$$ packed form
4776A6370623J37808R7851l3725J09558q6602P077J76576j65235l8828L638n9138
4765A6519603P992Q2866l408J17218k8544P1761q2739J3798O0773j02796J0095
4754A6666619J24497N3303k254j25869j6067O3815M9040J03310M7833o7221O9374
4743A6966380Q6080k3422J48841L1705k5102J54179m8125K0657P4583N0928J9039
4732A7455743J28840J47266O4575O9250M3087M8303J25763J63095K38631J70615
4722A8655168K5794N811J10365K131R3486P6257O062J73397K28774K38457J53113
4711A9768815J92586K41391K11771J78138L38261L28886K59841M19182N27095
4702B2465966L52841O09426N28000O04536P15479O24281P52091P97810P33619
$$ plain form
4693 28184049 28911694 29599968 30237578 30594411 30742720 30803257 30616928 30370878 30198762 29904535
4683 29904535 29997727 30028051 30063351 30544353 30919697 31313465 31895160 32369898 32852080 33505904
4673 33505904 34032877 34361505 34606742 34602097 34370054 34153460 33949739 33814289 33883997 34015149
4663 34015149 34072561 34496640 34914061 35259268 35924848 36730397 37515640 38470136 39405855 40531542
4653 40531542 41629306 42888688 43989171 45066553 46326097 47621935 48953304 50313064
4645 50313064 51567060 52933192 54362575 55782579 57493256 59176633 60755373 62451662
4637 62451662 63766930 64989615 66059234 66824889 67529076 68072348 68484855 69004227 69641887
4628 69641887 70556437 71709167 72915824 74351816 75832819 77438499 78961597 80367934
$$ packed form
4693B8184049P27645O88274O37610L56833J48309O0537j86329k46050j72116k94227
4683B9904535R3192L0324L5300M81002L75344L93768N81695M74738M82182O53824
4673C3505904N26973L28628K45237m645k32043k16594k03721j35450O9708J31152
4663C4015149N7412M24079M17421L45207O65580Q05549P85243R54496R35719J125687
4653D0531542J097764J259382J100483J077382J259544J295838J331369J359760
4645E0313064J253996J366132J429383J420004J710677J683377J578740J696289
4637F2451662J315268J222685J069619P65655P04187N43272M12507N19372O37660
4628F9641887R14550J152730J206657J435992J481003J605680J523098J406337
$$ plain form
4620 80367934 81351153 81982067 81966740 81166091 79772020 77944285 75600928 72964612 70345129
4611 70345129 68074250 66004743 64323824 62954060 61840468 61084071 60681838 60392609 60293147
4602 60293147 60413980 60847628 61117154 61367064 61484795 61336197 60801287 60039175 58889421
4593 58889421 57522397 55948351 54105542 52127261 50117789 48222182 46278771 44470359
4585 44470359 42898027 41528879 40118506 38920628 37900985 36940504 36074858 35287611 34723396
4576 34723396 34275691 33663870 33276824 33054124 32764611 32590747 32647048 32567409 32529319 32617184
4566 32617184 32777351 32941658 33188598 33445894 33857176 34229704 34758471 35341116 35882438
4557 35882438 36597814 37437546 38410452 39425473 40366993 41408702 42614228 43844196 45215297
$$ packed form
4620H0367934R83219O30914j5327q00649j394071j827735k343357k636316k619483
4611G0345129k270879k069507j680919j369764j113592p56397m02233k89229r9462
4602F0293147J20833M33648K69526K49910J17731j48598n34910p62112j149754
4593E8889421j367024j574046j842809j978281k009472j895607j943411j808412
4585D4470359j572332j369148j410373j197878j019643r60481q65646p87247n64215
4576C4723396m47705o11821l87046k22700k89513j73864N6301p9639l8090Q7865
4566C2617184J60167J64307K46940K57296M11282L72528N28767N82645N41322
4557C5882438P15376Q39732R72906J015021R41520J041709J205526J229968J371101
$$ plain form
4548 45215297 46581201 47841481 49232592 50772506 52153223 53389648 54645049 55548352
4540 55548352 56360679 57208619 57706662 58172584 58653006 59033226 59206409 59395661 59515720
4531 59515720 59547533 59630593 59901706 60298064 60660578 61298378 61965367 62801593 63759961 64656460
4521 64656460 65701537 66823321 67866520 69078426 70344108 71534145 72471332 73321328
4513 73321328 74041866 74405591 74307937 73692213 72780671 71388551 69859004 67982077 65749384
4504 65749384 63634899 61533035 59565842 57946335 56577742 55150284 54007349 52913677
4496 52913677 51990281 51351000 50816572 50394933 50074418 49789699 49513408 49377626 49253012
4487 49253012 49251797 49408684 49508401 49615015 49833454 50084350 50330865 50755907 51158946 51537209
$$ packed form
4548D5215297J365904J260280J391111J539914J380717J236425J255401R03303
4540E5548352Q12327Q47940M98043M65922M80422L80220J73183J89252J20059
4531E9515720L1813Q3060K71113L96358L62514O37800O66989Q36226R58368Q96499
4521F4656460J045077J121784J043199J211906J265682J190037R37187Q49996
4513G3321328P20538L63725r7654o15724r11542j392120j529547j876927k232693
4504F5749384k114485k101864j967193j619507j368593j427458j142935j093672
4496E2913677r23396o39281n34428m21639l20515k84719k76291j35782j24614
4487D9253012j215J56887R9717J06614K18439K50896K46515M25042M03039L78263
$$ plain form
4477 51537209 51776953 51888411 51720239 51458526 50893358 50012318 49170877 48206298 47191176
4468 47191176 46313515 45693410 45338577 45145606 45050760 45283590 45572986 45977290 46620322 47078475
4458 47078475 47769161 48613961 49133334 49634529 50149222 50404808 50717839 51083521 51406803
4449 51406803 52029312 52455228 53208500 54251709 55304855 56675323 58366235 60447979 62755056
4440 62755056 65186517 67960683 71149539 74664550 78392713 82722839 87271825 92176882
4432 92176882 97773441 103773847 110484054 117733743 125341067 133342337 141167602 148568215
4424 148568215 154631215 158711378 159977343 158434090 153923644 146758560 137884994 127945263
4416 127945263 117748047 108230107 99510846 91542022 84638951 78245798 72668541 67850029
$$ packed form
4477E1537209K39744J11458j68172k61713n65168q81040q41441r64579j015122
4468D7191176q77661o20105l54833j92971r4846K32830K89396M04304O43032M58153
4458D7078475O90686Q44800N19373N01195N14693K55586L13031L65682L23282
4449E1406803O22509M25916P53272J043209J053146J370468J690912K081744K307077
4440F2755056K431461K774166L188856L515011L728163M330126M548986M905057
4432I2176882N596559O000406O710207P249689P607324Q001270P825265P400613
4424A48568215O063000M080163J265965j543253m510446p165084q873566r939731
4416A27945263j0197216r517940q719261p968824o903071o393153n577257m818512
$$ plain form
4408 67850029 63455654 59670409 56249995 52932353 50084984 47614157 45187872 43215596
4400 43215596 41276580 39532795 37998162 36460799 35025484 33710470 32381813 31235260
4392 31235260 30092156 29132763 28108036 27169409 26225494 25354488 24554636 23821672 23021935
4383 23021935 22288303 21800091 21150250 20580178 19939855 19283456 18757711 18333425 17673605
4374 17673605 17463442 17116683 16634962 16402599 16072644 15596536 15354324 14881677 14481221
4365 14481221 14200657 13956603 13508231 13298967 13049131 12807781 12362944 12042271 11847250
4356 11847250 11667857 11474078 11252713 11088116 10901005 10606972 10379730 10177071 10011564
4347 10011564 9768866 9605326 9549599 9277632 9161559 8992232 8665829 8401952 8405229 8135050
$$ packed form
4408F7850029m394375l785245l420414l317642k847369k470827k426285j972276
4400D3215596j939016j743785j534633j537363j435315j315014j328657j146553
4392C1235260j143104r59393j024727r38627r43915q71006p99852p32964p99737
4383B3021935p33632m88212o49841n70072o40323o56399n25745m24286o59820
4374A7673605k10163l46759m81721k32363l29955m76108k42212m72647m00456
4365A4481221k80564k44054m48372k09264k49836k41350m44837l20673j95021
4356A1847250j79393j93779k21365j64597j87111k94033k27242k02659j65507
4347A0011564k42698j63540n5727k71967j16073j69327l26403k63877L277k70179
$$ plain form
4337 8135050 8168699 8024151 7891349 7880210 7731392 7489144 7405421 7236497 7121641 7163593
4327 7163593 7078348 6952159 6910276 6792547 6679160 6582609 6488115 6366721 6230496 6200585
4317 6200585 6240350 6178130 6263297 6130570 6015388 6092767 6062230 5965976 5962908 5823111 5638558
4306 5638558 5678206 5611867 5478982 5512220 5432827 5455158 5560457 5528604 5350920 5333454 5487181
4295 5487181 5370089 5424405 5374563 5299855 5239330 5143202 5048436 5014946 4958078 4911865 4840679
4284 4840679 4858940 4884038 5014175 4862148 4874149 4695165 4671434 4682841 4695705 4471100 4585438
4273 4585438 4682921 4634547 4638546 4639016 4501325 4540051 4531448 4330690 4397564 4350168 4233511 4356249
4261 4356249 4330436 4161222 4204112 4152033 4120988 4126700 4177608 4113725 4097538 4084166 4009507
$$ packed form
4337H135050L3649j44548j32802j1139j48818k42248q3723j68924j14856M1952
4327G163593q5245j26189m1883j17729j13387r6551r4494j21394j36225k9911
4317F200585L9765o2220Q5167j32727j15182P7379l0537r6254l068j39797j84553
4306E638558L9648o6339j32885L3238p9393K2331J05299l1853j77684j7466J53727
4295E487181j17092N4316m9842p4708o0525r6128r4766l3490n6868m6213p1186
4284D840679J8261K5098J30137j52027J2001j78984k3731J1407J2864k24605J14338
4273D585438R7483m8374L999M70j37691L8726q603k00758O6874m7396j16657J22738
4261D356249k5813j69214M2890n2079l1045N712N0908o3883j6187j3372p4659
$$ plain form
4250 4009507 3907308 3938980 3796870 3895598 3778989 3804852 3873420 3727580 3667072 3658059 3619181
4239 3619181 3597555 3604341 3590701 3650359 3599547 3501173 3561866 3538387 3557330 3539825 3505078 3454174
4227 3454174 3474617 3423203 3335161 3441157 3399404 3413831 3599675 3451424 3482142 3450191 3377890
4216 3377890 3263090 3302594 3250349 3338626 3128519 3224510 3342720 3270522 3266355 3230707 3193464
4205 3193464 3196536 3109357 3248815 3286054 3208858 3236128 3190319 3247924 3264845 3265423 3137213 3169635
4193 3169635 3243670 3269061 3162963 3182702 2976460 2911324 3064178 3145209 3139384 3185299 3040811
4182 3040811 3148349 3165809 3085797 2923763 2940072 3052596 3053859 3059755 3168344 3120031 3143391
4171 3143391 3116831 3083418 3119280 3099699 3165476 3200248 3257747 3199172 3243834 3203756 3040992
$$ packed form
4250D009507j02199L1672j42110R8728j16609K5863O8568j45840o0508r013l8878
4239C619181k1626O786j3640N9658n0812r8374O0693k3479J8943j7505l4747n0904
4227C454174K0443n1414q8042J05996m1753J4427J85844j48251L0718l1951p2301
4216C377890j14800L9504n2245Q8277k10107R5991J18210p2198m167l5648l7243
4205C193464L072q7179J39458L7239p7196K7270m5809N7605J6921N78j28210L2422
4193C169635P4035K5391j06098J9739k06242o5136J52854Q1031n825M5915j44488
4182C040811J07538J7460q0012j62034J6309J12524J263N896J08589m8313K3360
4171C143391k6560l3413L5862j9581O5777L4772N7499n8575M4662m0078j62764
$$ plain form
4160 3040992 3057948 3067520 3048271 3142628 3234283 3163192 3170685 3217508 3138004 3175675 3215396 3260472
4148 3260472 3286847 3298600 3298597 3288602 3326152 3310543 3382327 3381384 3313477 3420259 3499851 3472698 3466663
4135 3466663 3378508 3485269 3698819 3619186 3706967 3799485 3729713 3915694 3938073 3814638 4044468
4124 4044468 4102626 4086037 4226897 4210685 4201059 4348224 4373675 4448331 4490109 4382281 4383948
4113 4383948 4265260 4371456 4392747 4261067 4418181 4330497 4298971 4449756 4324467 4319652
4103 4319652 4463353 4392222 4363978 4522721 4524664 4569742 4543668 4605442 4676382 4633468 4644196
4092 4644196 4810193 4934537 4938158 4912457 4950247 4934786 4989370 5031180 5235463 5456114 5524850
4081 5524850 5526174 5626440 5729417 5714900 5708131 5893954 6004648 6149191 6353334 6400222 6563875
$$ packed form
4160C040992J6956R572j9249R4357R1655p1091P493M6823p9504L7671L9721M5076
4148C260472K6375J1753lr995L7550j5609P1784r43o7907J06782P9592k7153o035
4135C466663q8155J06761K13550p9633Q7781R2518o9772J85981K2379j23435K29830
4124D044468N8158j6589J40860j6212r626J47165K5451P4656M1778j07828J667
4113D383948j18688J06196K1291j31680J57114q7684l1526J50785j25289m815
4103D319652J43701p1131k8244J58743J943M5078k6074O1774P0940m2914J0728
4092D644196J65997J24344L621k5701L7790j5461N4584M1810K04283K20651O8736
4081E524850J324J00266J02977j4517o769J85823J10694J44543K04143M6888J63653
$$ plain form
4070 6563875 6754250 6811085 6975988 6998815 7029293 7332338 7454029 7586003 7739145 7924356
4060 7924356 8067785 8203666 8321098 8604027 8726999 9006716 9163464 9450116 9725799 9947800
4050 9947800 10121019 10382445 10531658 10834868 11060900 11353950 11690170 12043151 12574652 12934218
4040 12934218 13291846 13709640 13997821 14412313 15003158 15488869 16101226 16781329 17411959
4031 17411959 18023071 18644437 19278877 20041814 20832799 21633021 22565229 23529825 24448594
4022 24448594 25490970 26531221 27643648 28868311 30199525 31455161 32770656 34183246
4014 34183246 35602920 37086552 38764626 40466238 42210050 44033443 45861323 47615349
4006 47615349 49575505 51521347 53489839 55522826 57648948 59738407 61847458 64002995
$$ packed form
4070F563875J90375N6835J64903K2827L0478L03045J21691J31974J53142J85211
4060G924356J43429J35881J17432K82929J22972K79717J56748K86652K75683K22001
4050I947800J73219K61426J49213L03210K26032K93050L36220L52981N31501L59566
4040A2934218L57628M17794K88181M14492N90845M85711O12357O80103O30630
4031A7411959O11112O21366O34440P62937P90985Q00222R32208R64596R18769
4022B4448594J042376J040251J112427J224663J331214J255636J315495J412590
4014C4183246J419674J483632J678074J701612J743812J823393J827880J754026
4006D7615349J960156J945842J968492K032987K126122K089459K109051K155537
$$ plain form
3998 64002995 66116480 68173018 70260326 72250394 74097105 76175986 78144133 79807937
3990 79807937 81606279 83130355 84780277 86281469 87589407 88930972 89919741 90937742
3982 90937742 91974219 92567871 93063939 93577354 93649442 93855612 93777843 93429713 93196880 92498550
3972 92498550 91585627 90909073 89841542 88617431 87436963 86219436 84846965 83424525
3964 83424525 81637495 79812637 77952026 75962561 73959037 71990646 69741731 67674918
3956 67674918 65720379 63515007 61478628 59344378 57305682 55323859 53111953 51122558
3948 51122558 49292368 47312660 45527974 43710235 41823656 40067824 38383978 36614455
3940 36614455 35223333 33804221 32318957 31023808 29664323 28424033 27410695 26271347
$$ packed form
3998F4002995K113485K056538K087308J990068J846711K078881J968147J663804
3990G9807937J798342J524076J649922J501192J307938J341565R88769J018001
3982I0937742J036477N93652M96068N13415P2088K06170p7769l48130k32833o98330
3972I2498550r12923o76554j067531j224111j180468j217527j372471j422440
3964H3424525j787030j824858j860611j989465k003524j968391k248915k066813
3956F7674918j954539k205372k036379k134250k038696j981823k211906j989395
3948E1122558j830190j979708j784686j817739j886579j755832j683846j769523
3940C6614455j391122j419112j485264j295149j359485j240290j013338j139348
$$ plain form
3932 26271347 25169049 24270395 23305050 22607845 21779223 20915652 20204205 19381821 18663594
3923 18663594 18083520 17497318 16925747 16360689 16005254 15499036 15051493 14578419 14084176
3914 14084176 13606768 13298081 12883173 12521048 12257100 12065795 11795594 11441328 11238813
3905 11238813 10988746 10667716 10508233 10331347 10067293 9979164 9696284 9648869 9430329 9274269
3895 9274269 9021644 8915009 8756360 8677980 8462873 8369287 8248988 8230762 7984512 7861089
3885 7861089 7672687 7605357 7542762 7434143 7318250 7182957 7107861 7077684 7069890 6943885 6933782
3874 6933782 6676455 6655597 6638962 6494316 6444954 6479296 6400516 6372059 6296631 6355919 6223871
3863 6223871 6271910 6212812 5970741 6060406 6109160 6123623 6060662 6028163 6154730 6087759 6037462
$$ packed form
3932B6271347j102298q98654r65345o97205q28622q63571p11447q22384p18227
3923A8663594n80074n86202n71571n65058l55435n06218m47543m73074m94243
3914A4084176m77408l08687m14908l62125k63948j91305k70201l54266k02515
3905A1238813k50067l21030j59483j76886k64054q8129k82880m7415k18540j56060
3895I274269k52625j06635j58649p8380k15107r3586j20299j8226k46250j23423
3885G861089j88402o7330o2595j08619j15893j35293p5096l0177p794j26005j0103
3874F933782k57327k0858j6635j44646m9362L4342p8780k8457p5428N9288j32048
3863F223871M8039n9098k42071Q9665M8754J4463o2961l2499J26567o6971n0297
$$ plain form
3852 6037462 6027933 6090918 6071769 6080804 6087043 6134763 6123750 6159938 6094643 6100145 5900896 5894569
3840 5894569 5895195 6010781 6111649 5989202 5867662 5640042 5616365 5507229 5394592 5332350
3830 5332350 5302462 5300920 5410416 5405974 5323443 5225307 5062460 4921304 5000627 5010329 4986346
3819 4986346 4990592 4949551 4941203 4913972 4857483 4908412 4841390 4740081 4643559 4629842 4551605 4565631
3807 4565631 4688690 4714352 4684608 4746749 4609523 4637520 4640625 4557044 4553461 4720774 4625255
3796 4625255 4651064 4691112 4584865 4702937 4825365 4740514 4818121 4847804 4828723 5015887 4980855
3785 4980855 4920444 4816405 4801460 4879401 4972653 4930719 5154659 5152376 5055913 5047999 5116802
3774 5116802 5006806 5114651 5064480 5152504 5187285 5251007 5354077 5322083 5318906 5558585 5452909
$$ packed form
3852F037462r529O2985j9149R035O239M7720j1013L6188o5295N502j99249o327
3840E894569O26J15586J00868j22447j21540k27620k3677j09136j12637o2242
3830E332350k9888j542J09496m442q2531r8136j62847j41156P9323R702k3983
3819D986346M246m1041q348k7231n6489N0929o7022j01309r6522j3717p8237J4026
3807D565631J23059K5662k9744O2141j37226K7997L105q3581l583J67313r5519
3796D625255K5809M0048j06247J18072J22428q4851P7607K9683j9081J87164l5032
3785D980855o0411j04039j4945P7941R3252m1934K23940k283r6463p914O8803
3774E116802j09996J07845n0171Q8024L4781O3722J03070l1994l177K39679j05676
$$ plain form
3763 5452909 5499054 5649812 5590492 5721659 5773662 5922451 5982609 6072965 6107543 6209941 6173494
3752 6173494 6221125 6372542 6406433 6419112 6570629 6612880 6627163 6678016 6717799 6751728 6825025
3741 6825025 6994480 7164203 7205140 7212759 7266162 7376423 7478292 7565448 7735664 7823705 7915468
3730 7915468 7969051 8109520 8152930 8293254 8499960 8556306 8844943 9007798 9133709 9402138
3720 9402138 9502242 9453125 9555959 9789473 9946980 10083761 10263233 10452810 10793741 10962281
3710 10962281 11124142 11293719 11542130 11725814 12087259 12274989 12335969 12605920 12913860 13156478
3700 13156478 13607127 13813249 14015211 14419071 14590056 15046632 15462363 15675023 16134423
3691 16134423 16560273 16861930 17281826 17628008 17955185 18427431 19022817 19606060 20185766
$$ packed form
3763E452909M6145J50758n9320J31167N2003J48789O0158R0356L4578J02398l6447
3752F173494M7631J51417L3891J2679J51517M2251J4283N0853L9783L3929P3297
3741F825025J69455J69723M0937P619N3403J10261J01869Q7156J70216Q8041R1763
3730G915468N3583J40469M3410J40324K06706N6346K88637J62855J25911K68429
3720I402138J00104m9117J02834K33514J57507J36781J79472J89577L40931J68540
3710A0962281J61861J69577K48411J83684L61445J87730O0980K69951L07940K42618
3700A3156478M50649K06122K01962M03860J70985M56576M15731K12660M59400
3691A6134423M25850L01657M19896L46182L27177M72246N95386N83243N79706
$$ plain form
3682 20185766 20766599 21465344 22162262 22742305 23437887 24351356 24981849 25811311 26810003
3673 26810003 27652899 28520973 29503736 30363282 31232815 32290291 33209281 34268688 35265851
3664 35265851 36162285 37210899 37971857 38650972 39534362 40433445 41288452 42168407 43003568
3655 43003568 43825358 44563832 45135264 45671627 46203566 46796850 47405965 47814988 48354445
3646 48354445 48794675 49345466 49868540 50279872 50843667 51488684 52112034 52902051 53637159
3637 53637159 54396329 55375829 56210791 57133552 58332366 59446065 60689914 62181926 63704785
3628 63704785 65357324 67066334 68947644 71054258 73365647 75638368 78232852 80948740
3620 80948740 83749002 86557608 89551048 92596324 95945201 99321180 102659044 106161754
$$ packed form
3682B0185766N80833O98745O96918N80043O95582R13469O30493Q29462R98692
3673B6810003Q42896Q68074R82763Q59546Q69533J057476R18990J059407R97163
3664C5265851Q96434J048614P60958O79115Q83390Q99083Q55007Q79955Q35161
3655D3003568Q21790P38474N71432N36363N31939N93284O09115M09023N39457
3646D8354445M40230N50791N23074M11332N63795O45017O23350P90017P35108
3637E3637159P59170R79500Q34962R22761J198814J113699J243849J492012J522859
3628F3704785J652539J709010J881310K106614K311389K272721K594484K715888
3620H0948740K800262K808606K993440L045276L348877L375979L337864L502710
$$ plain form
3612 106161754 109706516 113210924 116935589 120320420 123677943 127246086 130710695 134232639
3604 134232639 137756255 141170035 144570035 147870279 150962643 154007183 157042678 159880028
3596 159880028 162747866 165475737 168161388 170794773 173375894 175997159 178525535 181234841
3588 181234841 183988584 186830908 189914945 193140461 196390751 199733575 203257200 206898093
3580 206898093 210635079 214629813 218678371 223126325 227725175 232649566 238056533 243653435
3572 243653435 249339158 255616935 262034511 268544529 275215572 281842803 288306831 294525317
3564 294525317 300052691 305008919 309215289 312593831 314948456 316350136 316615818 316037381
3556 316037381 314446744 312169090 309247252 305581393 301357514 296595722 291140940 285097035
$$ packed form
3612A06161754L544762L504408L724665L384831L357523L568143L464609L521944
3604A34232639L523616L413780L400000L300244L092364L044540L035495K837350
3596A59880028K867838K727871K685651K633385K581121K621265K528376K709306
3588A81234841K753743K842324L084037L225516L250290L342824L523625L640893
3580B06898093L736986L994734M048558M447954M598850M924391N406967N596902
3572B43653435N685723O277777O417576O510018O671043O627231O464028O218486
3564B94525317N527374M956228M206370L378542K354625J401680K65682n78437
3556C16037381j590637k277654k921838l665859m223879m761792n454782o043905
$$ plain form
3548 285097035 278580242 271250606 263163423 254572930 245507278 236045142 226327685 216413675
3540 216413675 206620663 196809821 187406261 178403622 170034327 161965640 154649995 147901586
3532 147901586 141823309 136174884 130991074 126212003 121960313 118084474 114514017 111259350
3524 111259350 108148488 105257386 102605703 100157760 97813632 95778283 93704708 91890150
3516 91890150 90269702 88454873 86991628 85410160 83690321 82324715 80797899 79280239
3508 79280239 77877383 76369854 74910606 73505514 71856623 70387874 68805247 67279715
3500 67279715 65931066 64456787 63017857 61755083 60477020 59103826 57934901 56740699
3492 56740699 55487054 54460592 53254788 52075886 51175595 50306171 49484093 48738251 47997920
$$ packed form
3548B85097035o516793p329636q087183q590493r065652r462136r717457r914010
3540B16413675r793012r810842r403560r002639q369295q068687p315645o748409
3532A47901586o078277n648425n183810m779071m251690l875839l570457l254667
3524A11259350l110862k891102k651683k447943k344128k035349k073575j814558
3516I1890150j620448j814829j463245j581468j719839j365606j526816j517660
3508G9280239j402856j507529j459248j405092j648891j468749j582627j525532
3500F7279715j348649j474279j438930j262774j278063j373194j168925j194202
3492E6740699j253645j026462j205804j178902r00291q69424q22078p45842p40331
$$ plain form
3483 47997920 47421786 46926589 46383736 45937941 45638197 45481192 45403199 45405680 45424443 45462940
3473 45462940 45569143 45571931 45751341 45773724 45728970 45707022 45478373 45234661 45069284 44668242
3463 44668242 44150846 43688154 43090964 42452844 41904553 41134341 40276924 39575522 38676885
3454 38676885 37842881 36847645 35659870 34598125 33301305 32005197 30864906 29534824
3446 29534824 28378440 27151823 26029672 25077355 24098137 23088293 22271825 21285892 20597018
3437 20597018 19951622 19299861 18741719 18209382 17720209 17117282 16692196 16207141 15704195
3428 15704195 15431827 15114034 14779173 14428684 13996869 13564815 13270549 12949953 12546507
3419 12546507 12343439 12212215 12030043 11741679 11562794 11301429 11063729 10815839 10555707
$$ packed form
3483D7997920n76134m95197n42853m45795k99744j57005p7993K481J8763L8497
3473D5462940J06203K788J79410K2383m4754k1948k28649k43712j65377m01042
3463D4668242n17396m62692n97190o38120n48291p70212q57417p01402q98637
3454C8676885q34004r95236j187775j061745j296820j296108j140291j330082
3446B9534824j156384j226617j122151r52317r79218j009844q16468r85933o88874
3437B0597018o45396o51761n58142n32337m89173o02927m25086m85055n02946
3428A5704195k72368l17793l34861l50489m31815m32054k94266l20596m03446
3419A2546507k03068j31224j82172k88364j78885k61365k37700k47890k60132
$$ plain form
3410 10555707 10368020 10206186 9954096 9803092 9738952 9501702 9341710 9118738 8954544 8842460
3400 8842460 8760070 8678711 8670510 8430330 8186331 8118716 7978655 7764331 7773136 7632716 7663450
3389 7663450 7470712 7338573 7184817 7086009 6989971 6853143 6794821 6716534 6669961 6597946 6507132
3378 6507132 6376241 6351123 6204658 6176096 6051074 6077472 5942259 5924430 5817500 5754609
3368 5754609 5589996 5570320 5388992 5496204 5514435 5492209 5494579 5444429 5313528 5282908 5224583
3357 5224583 5147398 5164087 5053124 5057357 5007533 4879874 4897804 4833890 4779996 4752779 4718501
3346 4718501 4616454 4582489 4517938 4435038 4478928 4533460 4506659 4362844 4368506 4325122 4431077
3335 4431077 4517642 4501051 4438789 4429643 4346152 4355787 4322877 4288145 4120145 4208656 4225146 4300636
$$ packed form
3410A0555707j87687j61834k52090j51004o4140k37250j59992k22972j64194j12084
3400H842460q2390q1359q201k40180k43999o7615j40061k14324Q805j40420L0734
3389G663450j92738j32139j53756r8808r6038j36828n8322p8287m6573p2015r0814
3378F507132j30891k5118j46465k8562j25022K6398j35213j7829j06930o2891
3368E754609j64613j9676j81328J07212J8231k2226K370n0150j30901l0620n8325
3357E224583p7185J6689j10963M233m9824j27659J7930o3914n3894k7217l4278
3346D718501j02047l3965o4551q2900M3890N4532k6801j43815N662m3384J05955
3335D431077Q6565j6591o2262r146q3491R635l2910l4732j68000Q8511J6490P5490
$$ plain form
3323 4300636 4421368 4210744 4216142 4281347 4252125 4375946 4379887 4225601 4252047 4098324 4066896
3312 4066896 4172345 4208164 4308898 4354180 4337447 4300259 4246330 4201542 4286353 4189615 4128563
3301 4128563 4279129 4184089 4213370 4260598 4302195 4275245 4110652 4213383 4304639 4277029 4364496
3290 4364496 4274841 4286365 4362258 4277150 4271061 4332003 4309027 4330955 4402197 4434619 4663075
3279 4663075 4697284 4688032 4697149 4616445 4789770 4757500 4759458 4746968 4816135 4784872 4807587 4807789
3267 4807789 4807663 4900639 4928860 5094649 5063276 5015528 5064683 5046353 5065599 5169803 5032735
3256 5032735 5138914 5279580 5201354 5269426 5314607 5295996 5373476 5214956 5364219 5402559 5349322
3245 5349322 5386831 5258179 5057135 5069201 4826001 4714349 4553006 4375527 4287402 4191292
$$ packed form
3323D300636J20732k10624N398O5205k9222J23821L941j54286K6446j53723l1428
3312D066896J05449L5819J00734M5282j6733l7188n3929m4788Q4811r6738o1052
3301D128563J50566r5040K9281M7228M1597k6950j64593J02731R1256k7610Q7467
3290D364496q9655J1524P5893q5108o089O0942k2976K1928P1242L2422K28456
3279D663075L4209r252R117q0704J73325l2270J958j2490O9167l1263K2715K02
3267D807789j26R2976K8221J65789l1373m7748M9155j8330J9246J04204j37068
3256E032735J06179J40666p8226O8072M5181j8611P7480j58520J49263L8340n3237
3245E349322L7509j28652k01044J2066k43200j11652j61343j77479q8125r6110
$$ plain form
3235 4191292 4016151 3849686 3787291 3687368 3524199 3526233 3418958 3353762 3308870 3185959 3151436
3224 3151436 3218270 3188820 3101345 2990683 2807417 2778289 2751818 2794094 2686950 2719980 2536274
3213 2536274 2456245 2620326 2596356 2348439 2384897 2402846 2322954 2316787 2263183 2233189 2179668
3202 2179668 2177753 2167480 2049119 1978058 2031881 1906863 1891391 1917401 1766633 1906907 1864937
3191 1864937 1774597 1875555 1958353 1838353 1766784 1827143 1687757 1602565 1646556 1635142 1710532
3180 1710532 1751035 1696126 1696247 1643475 1542235 1546212 1516616 1462772 1598127 1630949 1582273 1487260
3168 1487260 1359860 1340513 1429141 1389121 1230097 1308979 1294829 1259033 1311299 1301017 1180157
3157 1180157 1113995 1119168 1327616 1311884 1218627 1146080 1172547 1253711 1187433 1094608 1124017
$$ packed form
3235D191292j75141j66465o2395r9923j63169K034j07275o5196m4892j22911l4523
3224C151436O6834k9450q7475j10662j83266k9128k6471M2276j07144L3030j83706
3213B536274q0029J64081k3970k47917L6458J7949p9892o167n3604k9994n3521
3202B179668j915j0273j18361p1061N3823j25018j5472K6010j50768J40274m1970
3191A864937r0340J00958Q2798j20000p1569O0359j39386q5192M3991j1414P5390
3180A710532M0503n4909J21n2772j01240L977k9596n3844J35355L2822m8676r5013
3168A487260j27400j9347Q8628m0020j59024P8882j4150l5796N2266j0282j20860
3157A180157o6162N173K08448j5732r3257p2547K6467Q1164o6278r2825K9409
$$ plain form
3146 1124017 1055826 1179081 1237959 1082113 1095806 1101037 880991 1014158 1046752 1015718 1074324
3135 1074324 955202 1111535 1101012 992063 1035542 1011748 854521 1018628 1004320 915359
3125 915359 1009266 911502 899531 926147 866950 868701 854149 922829 932227 892974 794246 780932
3113 780932 847927 736155 644312 738748 838811 857602 863376 694058 712468 663278 695072
3102 695072 742266 705515 687733 664082 844668 784722 853315 791415 753347 716357 714510 682855
3090 682855 590554 613584 522659 661160 689284 483811 340077 441166 622762 717374 668465
3079 668465 642244 657632 650904 670804 700732 629958 616710 602327 507916 697095 624329 630282
3067 630282 637951 704270 670823 671689 657619 610435 564715 573003 652255 817459 840854 868755
$$ packed form
3146A124017o8191J23255N8878j55846J3693N231k20046J33167L2594l1034N8606
3135A074324j19122J56333j0523j08949M3479k3794j57227J64107j4308q8961
3125I15359R3907r7764j1971K6616n9197J751j4552O8680R398l9253r8728j3314
3113G80932O6995j11772r1843R4436J00063J8791N774j69318J8410m9190L1794
3102F95072M7194l6751j7782k3651J80586n9946O8593o1900l8068l6990j847l1655
3090F82855r2301K3030r0925J38501K8124k05473j43734J01089J81596R4612m8909
3079F68465k6221J5388o728J9900K9928p0774j3248j4383r4411J89179p2766N953
3067F30282P669O6319l3447Q66j4070m7184m5720Q288P9252J65204K3395K7901
$$ plain form
3055 868755 754284 755200 772483 679999 657702 734535 718299 727233 856562 820864 799802 615047
3043 615047 607045 532247 504285 627241 634727 679683 861558 905274 885448 802856 666325
3032 666325 624196 529823 613074 708220 737657 792846 798773 772007 747451 712109 709306 797906
3020 797906 879149 897921 934167 987741 922420 885994 962041 913139 947659 996052 995379 1009638
3008 1009638 1127239 1220079 1139997 1320026 1289253 1228155 1199506 1308194 1232620 1236831 1171986
2997 1171986 1199954 1210908 1288371 1232059 1275173 1183662 1172708 1269718 1253373 1261965 1325908 1395298
2985 1395298 1414531 1424523 1454878 1452044 1456089 1560159 1470664 1654339 1541312 1668489 1705955
2974 1705955 1876349 1958302 1872908 1742024 1939557 2028580 1849740 1921808 1954633 1830776
$$ packed form
3055H68755j14471R16J7283r2484k2297P6833j6236Q934J29329l5698k1062j84755
3043F15047q002p4798k7962J22956P486M4956J81875M3716j9826q2592j36531
3032F66325m2129r4373Q3251R5146K9437N5189N927k6766k4556l5342k803Q8600
3020G97906Q1243J8772L6246N3574o5321l6426P6047m8902L4520M8393o73J4259
3008A009638J17601R2840q0082J80029l0773o1098k8649J08688p5574M211o4845
2997A171986K7968J0954P7463n6312M3114r1511j0954R7010j6345Q592O3943O9390
2985A395298J9233R992L0355k834M045J04070q9495J83675j13027J27177L7466
2974A705955J70394Q1953q5394j30884J97533Q9023j78840P2068L2825j23857
$$ plain form
2964 1830776 1928441 1983271 1808930 1831147 1753344 1711146 1565049 1504421 1447369 1469981 1407093
2953 1407093 1416470 1402757 1357757 1381347 1396575 1301770 1388455 1450255 1450227 1304814 1293592 1274976
2941 1274976 1379258 1416300 1313416 1419754 1461134 1356679 1440552 1523876 1490519 1479216 1323461
2930 1323461 1362990 1362657 1362739 1375690 1401171 1283432 1356720 1257938 1165498 1245090 1183498 1072843
2918 1072843 1107884 1135989 1039253 1089205 1081107 961404 964207 989128 872737 915618 912566 943161
2906 943161 982349 980524 900984 871323 836469 928779 841788 871134 896156 877613 867918 751073
2894 751073 824366 875191 1017569 930118 854962 797291 782281 793873 875538 819188 978395
2883 978395 975408 791395 788793 795476 706707 831748 873346 883696 837328 818505 721668 815770
$$ packed form
2964A830776R7665N4830j74341K2217p7803m2198j46097o0628n7052K2612o2888
2953A407093R377j3713m5000K3590J5228r4805Q6685O1800k8j45413j1222j8616
2941A274976J04282L7042j02884J06338M1380j04455Q3873Q3324l3357j1303j55755
2930A323461L9529l33Q2J2951K5481j17739P3288r8782r2440P9592o1592j10655
2918A072843L5041K8105r6736M9952q098j19703K803K4921j16391M2881l052L0595
2906I43161L9188j825p9540k9661l4854R2310q6991K9346K5022j8543r695j16845
2894G51073P3293N0825J42378q7451p5156n7671j5010J1592Q1665n6350J59207
2883I78395k987j84013k602O683q8769J25041M1598J0350m6368j8823r6837R4102
$$ plain form
2871 815770 734212 711084 844950 828372 876276 978787 988492 789639 778662 883769 822894
2860 822894 737820 768482 678647 689966 713054 736786 644889 715726 641247 535915 452880
2849 452880 569235 501640 624279 643711 423315 454397 355797 308811 397173 461532 273503
2838 273503 556299 617976 393727 447010 401294 203431 398692 402601 383424 464679 428923
2827 428923 359183 329191 269692 324746 342588 316160 322901 278952 270785 178425 230355 251330
2815 251330 193312 174085 206691 108250 262023 262541 338976 212530 187037 268951 229398 215652
2803 215652 403914 181287 138172 308135 191867 141407 93143 104604 214500 281494 320736
2792 320736 339774 273929 154514 32617 131668 133079 160299 149414 169105 236153 299796
$$ packed form
2871H15770q1558k3128J33866j6578M7904J02511R705j98853j0977J05107o0875
2860H22894q5074L0662q9835J1319K3088K3732r1897P0837p4479j05332q3035
2849D52880J16355o7595J22639J9432k20396L1082r8600m6986Q8362O4359j88029
2838B73503K82796O1677k24249N3283m5716j97863J95261L909j9177Q1255l5756
2827D28923o9740k9992n9499N5054J7842k6428O741m3949q167r2360N1930K0975
2815B51330n8018j9227L2606r8441J53773N18P6435j26446k5493Q1914l9553j3746
2803B15652J88262k22627m3115J69963j16268n0460m8264J1461J09896O6994L9242
2792C20736J9038o5845j19415j21897R9051J411K7220j0885J9691O7048O3643
$$ plain form
2781 299796 212670 249434 114956 62920 108367 62819 162366 203566 97597 122200 213
2770 213 -76117 56616 20457 -40095 -61368 -52592 23653 101098 75863 35137 72952 104178
2758 104178 -10683 78601 109393 87261 101519 196017 139895 37228 41364 31888 162608
2747 162608 273784 235069 191088 82312 -1207 94405 30255 90988 253745 254630 305939
2736 305939 131519 35727 49365 -65374 -45763 132772 24338 135524 237626 86644
2726 86644 119434 139294 49391 147410 31881 -5085 144179 49557 50134 138450 67595 92199
2714 92199 145003 135860 50077 15261 130644 11498 30118 -10556 57999 85693 127699 227968
2702 227968 204372 181967 157212 14049 100228 210480 296992 222209 101416 74783 115578
$$ packed form
2781B99796q7126L6764j34478n2036M5447m5548R9547M1200j05969K4603j21987
2770B13p6330J32733l6159o0552k1273Q776P6245P7445k5235m0726L7815L1226
2758A04178j14861Q9284L0792k2132J4258R4498n6122j02667M136r476J30720
2747A62608J11176l8715m3981j08776q3519R5612o4150O0733J62757Q85N1309
2736C05939j74420r5792J3638j14739J9611J78535j08434J11186J02102j50982
2726H6644L2790J9860q9903R8019j15529l6966J49264r4622N77Q8316p0855K4604
2714I2199N2804r143q5783l4816J15383j19146J8620m0674O8555K7694M2006J00269
2702B27968k3596k2405k4755j43163Q6179J10252Q6512p4783j20793k6633M0795
$$ plain form
2691 115578 114506 142254 225176 242157 220699 231111 293653 171192 158201 65974 6383 18965
2679 18965 81603 142194 163493 209120 200676 95993 149321 155371 202421 295864 276651 217813
2667 217813 245295 263303 238547 104004 57763 224355 255990 365741 361652 261214 213631
2656 213631 143565 106888 186114 200328 329357 482585 381015 362908 492849 386551 375990
2645 375990 330942 346275 482820 533602 597807 550457 524249 489830 447176 463064 420076
2634 420076 459222 547735 601286 529078 627567 496719 532587 603054 616515 597236 574425
2623 574425 582546 591212 608575 689959 655719 655829 579926 632513 689058 595535 710757 726334
2611 726334 707574 797600 715652 596969 651576 738742 744445 689348 581761 576081 569112 645811
$$ packed form
2691A15578j072K7748Q2922J6981k1458J0412O2542j22461j2991r2227n9591J2582
2679A8965O2638O0591K1299M5627q444j04683N3328O050M7050R3443j9213n8838
2667B17813K7482J8008k4756j34543m6241J66592L1635J09751m089j00438m7583
2656B13631p0066l6677P9226J4214J29029J53228j01570j8107J29941j06298j0561
2645C75990m5048J5333J36545N0782O4205m7350k6208l4419m2654J5888m2988
2634D20076L9146Q8513N3551p2208R8489j30848L5868P0467J3461j9279k2811
2623E74425Q121Q666J7363Q1384l4240J10p5903N2587N6545r3523J15222J5577
2611G26334j8760R0026q1948j18683N4607Q7166N703n5097j07587n680o969P6699
$$ plain form
2599 645811 854942 852355 800711 814740 917767 754415 800977 735672 752437 709483 799702
2588 799702 862481 971897 939105 795388 674899 662853 581437 635179 625615 614285 874065
2577 874065 841718 784451 910673 710049 596613 637912 518986 513564 551328 623347 629082
2566 629082 562386 600338 674908 704093 584129 626064 679993 646681 624357 624477 661250 626543
2554 626543 583390 551917 491122 573627 497445 444206 462360 457962 392100 366710 396112 376708
2542 376708 430160 528413 429369 376498 449124 249961 253727 179176 147376 258066 342098
2531 342098 264571 318086 367138 238909 196647 323350 152512 198300 434903 311473 349314
2520 349314 437992 290385 338793 388983 322651 244848 226182 267092 274119 316842 278480 336323
$$ packed form
2599F45811K09131k587n1644J4029J03027j63352M6562o5305J6765m2954R0219
2588G99702O2779J09416l2792j43717j20489j2046q1416N3742r564j1330K59780
2577H74065l2347n7267J26222k00624j13436M1299j18926n422L7764P2019N735
2566F29082o6696L7952P4570K9185j19964M1935N3929l3312k2324J20L6773l4707
2554F26543m3153l1473o0795Q2505p6182n3239J8154m398o5862k5390K9402j9404
2542C76708N3452R8253r9044n2871P2626j99163L766p4551l1800J10690Q4032
2531C42098p7527N3515M9052j28229m2262J26703j70838M5788K36603j23430L7841
2520C49314Q8678j47607M8408N0190o6332p7803j8666M0910P027M2723l8362N7843
$$ plain form
2508 336323 317930 255266 125762 61511 -5586 79051 131180 -3797 44238 129447 75701
2497 75701 65537 67558 260490 320536 49792 119305 64371 18086 124240 26275 20062 159062
2485 159062 78096 218293 97816 -61447 -78239 -55408 22427 135492 234391 260726 158010
2474 158010 169781 85597 10111 154571 120602 92079 264493 247356 178860 261587 26090
2463 26090 1988 77061 633 26373 126807 60420 109187 34502 -11402 44543 76212 27871
2451 27871 64285 98256 98240 187329 220805 126342 178571 161725 44602 85689 47413 48366 93822
2438 93822 137604 9906 97201 31416 171050 189005 197271 188516 126881 159549 171331 179973
2426 179973 168336 76510 58794 237229 216828 153942 191396 104991 58460 13290 -100482
$$ packed form
2508C36323j8393o2664j29504o4251o7097Q4637N2129j34977M8035Q5209n3746
2497G5701j0164K021J92932O0046k70744O9513n4934m6285J06154r7965o213J39000
2485A59062q0966J40197j20477j59263j6792K2831P7835J13065R8899K6335j02716
2474A58010J1771q4184p5486J44460l3969k8523J72414j7137o8496Q2727k35497
2463B6090k4102P5073p6428K5740J00434o6387M8767p4685m5904N5945L1669m8341
2451B7871L6414L3971j6Q9089L3476r4463N2229j6846j17123M1087l8276R53M5456
2438I3822M3782j27698Q7295o5785J39634J7955Q266q755o1635L2668J1782Q642
2426A79973j1637r1826j7716J78435k0401o2886L7454q6405m6531m5170j13772
$$ plain form
2415 -100482 -75445 76358 199522 157691 95266 21381 -62348 -165688 -98383 -79158 -16166
2404 -16166 89599 102430 135875 90181 10309 -26789 -29117 -14071 -71951 -16112 86693 118232
2392 118232 119802 148515 111682 -23737 2386 83314 165129 289170 304665 346010 210626
2381 210626 171797 83530 48686 52824 35688 20163 100144 63962 119374 157403 23192 45317
2369 45317 -61311 -89872 -45129 -31634 -43541 37059 10758 -22568 92769 108809 99075 27278
2357 27278 -33297 -41489 -24874 -78699 -11678 97072 129846 83147 -13085 3442 86346 67900
2345 67900 151753 172725 118086 88401 28355 33840 75609 73044 7442 4065 128242 41471
2333 41471 7432 84854 54624 75704 -67582 -118043 -53789 38202 -65676 -42984 -67522
$$ packed form
2415a00482K5037J51803J23164m1831o2425p3885q3729j03340O7305J9225O2992
2404a6166J05765J2831L3445m5694p9872l7098k328J5046n7880N5839J02805L1539
2392A18232J570K8713l6833j35419K6123Q0928Q1815J24041J5495M1345j35384
2381B10626l8829q8267l4844M138j7136j5525P9981l6182N5412L8029j34211K2125
2369D5317j06628k8561M4743J3495j1907Q0600k6301l3326J15337J6040r734p1797
2357B7278o0575q192J6615n3825O7021J08750L2774m6699r6232J6527Q2904j8446
2345F7900Q3853K0972n4639k9685o0046N485M1769k565o5602l377J24177q6771
2333D1471l4039P7422l0230K1080j43286n0461O4254R1991j03878K2692k4538
$$ plain form
2322 -67522 9735 45605 -79170 -20360 -3406 -84146 109586 141397 -18118 148266 103203
2311 103203 -57985 186835 157563 146780 207166 56899 189665 248766 -36770 -15247 118809
2300 118809 -101696 15662 24555 153370 36003 93918 61261 -66075 26310 66268 -110693
2289 -110693 85134 62962 60424 168564 105726 177837 192662 229559 281668 154604 -59396
2278 -59396 -38399 -23004 159562 261013 248669 197025 107350 35763 -21252 -12691 92438
2267 92438 139148 240899 171457 120131 138842 58651 43828 74564 4364 293515 184311
2256 184311 158028 128286 85911 164821 231194 53008 164081 218023 165285 239597 91101
2245 91101 843 194243 209654 163221 222778 209238 254540 333424 190444 277138 292120
$$ packed form
2322f7522P7257L5870j24775N8810J6954q0740J93732L1811j59515J66384m5063
2311A03203j61188K44820k9272j0783O0386j50267J32766N9101k85536K1523J34056
2300A18809k20505J17358Q893J28815j17367N7915l2657j27336R2385L9958j76961
2289a10693J95827k2172k538J08140o2838P2111J4825L6897N2109j27064k14000
2278e9396K0997J5395J82566J01451j2344n1644q9675p1587n7015Q561J05129
2267I2438M6710J01751o9442n1326J8711q0191j4823L0736p0200K89151j09204
2256A84311k6283k9742m2375P8910O6373j78186J11073N3942n2738P4312j48496
2245I1101r0258J93400J5411m6433N9557j3540M5302P8884j42980Q6694J4982
$$ plain form
2234 292120 271018 322530 386805 432785 336359 292510 334887 323272 435057 378142 311229
2223 311229 445137 412967 329757 291175 245964 242196 290922 220855 437831 451663 407358
2212 407358 504727 414043 273545 332034 418174 482184 570555 567273 470659 488311 418358 460717
2200 460717 507882 539358 362412 596176 625787 601431 642106 629650 569464 688639 793715
2189 793715 844129 805283 749270 671256 657215 644266 625383 804031 917343 952555 1097573
2178 1097573 1176401 1165456 1171664 1120206 1177298 1192484 1184304 1291008 1378541 1325221 1343725 1362038
2166 1362038 1389671 1368224 1428049 1426461 1530521 1571949 1471463 1580862 1709159 1834200 1894055
2155 1894055 1841278 1924357 1943958 1922512 2079366 2162714 2367420 2523199 2568647 2700864 2720942
$$ packed form
2234B92120k1102N1512O4275M5980r6426m3849M2377j1615J11785n6915o6913
2223C11229J33908l2170q3210l8582m5211l768M8726p0067K16976J3832m4305
2212D07358R7369r0684j40498N8489Q6140O4010Q8371l282r6614J7652o9953M2359
2200D60717M7165L1476j76946K33764K9611k4356M0675j2456o0186J19175J05076
2189G93715N0414l8846n6013p8014j4041j2949j8883J78648J13312L5212J45018
2178A097573P8828j0945O208n1458N7092J5186q180J06704Q7533n3320J8504J8313
2166A362038K7633k1447N9825j588J04060M1428j00486J09399J28297J25041N9855
2155A894055n2777Q3079J9601k1446J56854Q3348K04706J55779M5448J32217K0078
$$ plain form
2144 2720942 2761472 2934771 2949039 3189064 3475603 3442358 3784194 3930689 4087560 4333044
2134 4333044 4467198 4542947 4961297 5059663 5351503 5743455 6105679 6584626 7106479 7601923
2124 7601923 8133219 8655642 9111183 9679320 10326805 11152986 11897717 12915765 13824823
2115 13824823 15002053 16347832 17761713 19267707 20824443 22179369 23167135 23525871
2107 23525871 23294812 22573975 21411082 19665295 17817195 15960606 14288781 12887954
2099 12887954 11663360 10685942 9825905 9008030 8269820 7734064 7230119 6846457 6458735
2090 6458735 6026811 5662197 5307041 4948011 4741033 4486352 4289601 4094533 3909585 3764357
2080 3764357 3560244 3277137 3258064 3160432 3014969 3037306 2943344 2788346 2623486 2483651
$$ packed form
2144B720942M0530J73299J4268K40025K86539l3245L41836J46495J56871K45484
2134D333044J34154P5749M18350R8366K91840L91952L62224M78947N21853M95444
2124G601923N31296N22423M55541N68137O47485Q26181P44731J018048R09058
2115A3824823J177230J345779J413881J505994J556736J354926R87766L58736
2107B3525871k31059p20837j162893j745787j848100j856589j671825j400827
2099A2887954j224594r77418q60037q17875p38210n35756n03945l83662l87722
2090F458735m31924l64614l55156l59030k06978k54681j96751j95068j84948j45228
2080C764357k04113k83107j9073r7632j45463K2337r3962j54998j64860j39835
$$ plain form
2070 2483651 2326574 2418775 2306019 2082903 2005716 2048822 1861540 1803722 1806181 1819170 1803923
2059 1803923 1871624 1755856 1605818 1466460 1446583 1454860 1488556 1487178 1337685 1443989 1318255
2048 1318255 1252249 1241436 1061049 989550 1026943 922622 1080888 1018022 988645 861567 884099
2037 884099 935289 837337 710890 777349 733831 860533 840677 717370 858542 873637 766294
2026 766294 749651 642482 679951 722574 674741 634003 621680 641305 616603 572789 401273
2015 401273 477416 554988 400789 410595 562892 382033 496755 525644 411637 495772 452154
2004 452154 302827 386426 376536 350094 314545 345447 335582 426269 320376 297953 347476 223632
1992 223632 240379 294648 276371 330973 370978 258702 438392 392954 298254 266811 230966
$$ packed form
2070B483651j57077R2201j12756k23116p7187M3106j87282n7818K459J2989j5247
2059A803923O7701j15768j50038j39358j9877Q277L3696j378j49493J06304j25734
2048A318255o6006j0813j80387p1499L7393j04321J58266o2866k9377j27078K2532
2037H84099N1190r7952j26447O6459m3518J26702j9856j23307J41172J5095j07343
2026G66294j6643j07169L7469M2623m7833m0738j2323J9625k4702m3814j71516
2015D01273P6143P7572j54199R806J52297j80859J14722K8889j14007Q4135m3618
2004D52154j49327Q3599r890k6442l5549L0902r865R0687j05893k2423M9523j23844
1992B23632J6747N4269j8277N4602M0005j12276J79690m5438r4700l1443l5845
$$ plain form
1981 230966 334142 346757 354397 490919 328887 279804 267183 327479 449102 301094 287288
1970 287288 317896 186679 266437 382133 407133 432819 273115 120612 94451 3303 94359
1959 94359 158737 163599 197973 186519 52326 72072 3925 9201 15113 108967 217647 254516
1947 254516 209787 110104 19104 46544 150171 40158 112363 191511 197057 268971 249385
1936 249385 88624 207167 119185 112553 84715 98171 114433 118126 125973 245449 170787 143712
1924 143712 103841 139419 119294 157100 102014 116765 18888 18345 30000 72139 88968 123248
1912 123248 51494 18242 -8043 -20160 119740 257417 218477 59857 150815 -9295 -180463
1901 -180463 6640 38053 -26034 55199 38926 128402 90645 111503 155507 74323 -19332
$$ packed form
1981B30966J03176J2615P640J36522j62032m9083j2621O0296J21623j48008j3806
1970B87288L0608j31217P9758J15696K5000K5686j59704j52503k6161r1148R1056
1959I4359O4378M862L4374j1454j34193J9746o8147N276N912R3854J08680L6869
1947B54516m4729r9683r1000K7440J03627j10013P2205P9148N546P1914j9586
1936B49385j60761J18543q7982o632k7838J3456J6262L693P847J19476p4662k7075
1924A43712l9871L5578k0125L7806n5086J4751r7877n43J1655M2139J6829L4280
1912A23248p1754l3252k6285j2117J39900J37677l8940j58620R0958j60110j71168
1901a80463J87103L1413o4087Q1233j6273Q9476l7757K0858M4004q1184r3655
$$ plain form
1890 -19332 72761 106648 191669 96285 129694 95972 145643 52443 96989 92285 79394 116241
1878 116241 34234 -57895 49773 84954 138066 206530 73878 79934 83428 42440 5799 482
1866 482 17033 -24970 2460 -33742 7194 -10926 -113492 -44514 12405 9650 72681 164965
1854 164965 149368 101309 78043 -63955 11854 84691 59182 328502 196832 66970 155713
1843 155713 16863 -4843 104577 53240 109377 114019 261101 208944 56467 83210 157772
1832 157772 64673 160511 213140 137569 162440 177563 123463 99509 -44463 31297 122527
1821 122527 149174 60656 23655 8934 -51478 -123310 -103915 -7347 40682 44644 -14955 -69500
1809 -69500 -135058 -86032 -100784 -111546 -80313 -86820 -81039 -69966 -126396 -103383 -139380 -172279
$$ packed form
1890a9332R2093L3887Q5021r5384L3409l3722M9671r3200M4546m704j2891L6847
1878A16241q2007r2129J07668L5181N3112O8464j32652O056L494m0988l6641n317
1866D82J6551m2003K7430l6202M0936j8120j02566O8978N6919k755O3031R2284
1854A64965j5597m8059k3266j41998P5809P2837k5509K69320j31670j29862Q8743
1843A55713j38850k1706J09420n1337N6137M642J47082n2157j52477K6743P4562
1832A57772r3099R5838N2629p5571K4871J5123n4100k3954j43972P5760R1230
1821A22527K6647q8518l7001j4721o0412p1832J9395R6568M8029L962n9599n4545
1809f9500o5558M9026j4752j0762L1233o507N781J1073n6430K3013l5997l2899
$$ plain form
1797 -172279 -73290 -34585 30457 117175 -62396 -95324 -197950 -176610 -58263 -77993 -43087
1786 -43087 58240 -75294 -49987 5630 -89746 -45511 37198 -59540 28085 87876 20666
1775 20666 65496 71974 -29719 66573 -1616 30003 90393 -14624 -8544 124902 54554 108336
1763 108336 -11382 -15969 134581 59343 14525 101493 -45828 7884 13402 -34110 48553
1752 48553 93326 -77576 -71173 -50141 -63177 -27845 -50147 -56478 -130628 -24395 -110690 -129907
1740 -129907 -110556 -23514 -35760 55560 -82764 -182406 -237020 -264052 -270005 -144395 -80099
1729 -80099 83349 98593 64812 60454 23221 -170358 -138568 -200523 -37664 20670 29745 54939
1717 54939 2807 -169800 -64196 -7553 -32994 -340 91960 11259 7671 -52884 -136929 -64019
$$ packed form
1797a72279R8989L8705O5042Q6718j79571l2928j02626K1340J18347j9730L4906
1786d3087J01327j33534K5307N5617r5376M4235Q2709r6738Q7625N9791o7210
1775B0666M4830O478j01693R6292o8189L1619O0390j05017O080J33446p0348N3782
1763A08336j19718m587J50550p5238m4818Q6968j47321N3712N518m7512Q2663
1752D8553M4773j70902O403K1032j3036L5332k2302o331p4150J06233q6295j9217
1740a29907J9351Q7042j2246R1320j38324r9642n4614k7032n953J25610O4296
1729h0099J63448J5244l3781m358l7233j93579L1790o1955J62859N8334R075K5194
1717E4939n2132j72607J05604N6643k5441L2654R2300q0701l588o0555q4045P2910
$$ plain form
1705 -64019 -135940 -89811 -2812 52473 32330 -29970 19644 7643 -103584 -54742 -41073 27096
1693 27096 27348 92391 167839 166226 -28944 -190833 -208016 -34297 61826 80655 -7736 43675
1681 43675 -104419 -102659 -227218 -141354 -142212 -121909 -5180 98865 12327 -68350 -140786 -156024
1669 -156024 -108632 -192359 -205139 -30191 -47160 16815 -61567 -143903 -55166 -137460 -89835
1658 -89835 -80052 -107983 -38613 -18085 -30904 96707 -32544 8737 10647 -22817 49745 -52570
1646 -52570 -184015 -112469 -90472 6589 -31785 -124996 -144759 -164310 -147691 -24527 -153188
1635 -153188 -20802 -43255 16162 15495 -17638 -84934 -197366 -83139 -56137 -86049 -128189
1624 -128189 -146853 -149366 -128782 -116782 -73079 -35832 -36830 49391 14247 -54122 -71177 -12498
$$ packed form
1705f4019p1921M6129Q6999N5285k0143o2300M9614j2001j11227M8842J3669O8169
1693B7096K52O5043P5448j613j95170j61889j7183J73719R6123J8829q8391N1411
1681D3675j48094J760j24559Q5864q58K0303J16729J04045q6538q0677p2436j5238
1669a56024M7392q3727j2780J74948j6969O3975p8382q2336Q8737q2294M7625
1658h9835R783k7931O9370K0528j2819J27611j29251M1281J910l3464P2562j02315
1646e2570j31445P1546K1997R7061l8374r3211j9763j9551J6619J23164j28661
1635a53188J32386k2453N9417o67l3133o7296j12432J14227K7002k9912m2140
1624a28189j8664k513K0584J2000M3703L7247r98Q6221l5144o8369j7055N8679
$$ plain form
1612 -12498 -4628 17806 -70187 -61818 43901 18811 153721 31448 -96236 -35284 -29601 55007
1600 55007 68100 -36062 125631 15818 -167443 -117190 -109207 -256105 -144731 -57616 131381
1589 131381 68366 53193 88565 -51332 -97290 -97514 -108123 -51423 -81222 -27983 77577 -5330
1577 -5330 22635 1789 -96628 -51833 39902 -114616 -142549 -137548 -124561 -55707 -151582 -180270
1565 -180270 -138645 -133543 -113723 -29520 10478 -4202 -160435 -23571 -97841 -72917 37179
1554 37179 32141 3516 57460 -5765 12940 52175 -32587 1101 -27766 -94938 -120114 -44706
1542 -44706 37495 80165 105807 108563 66155 97007 -23413 38318 145824 23579 19065 91256
1530 91256 33819 -10615 6879 56378 72020 12982 25908 136368 66353 133233 183015 171612
$$ packed form
1612a2498P870K2434q7993Q369J05719k5090J34910j22273j27684O0952N683Q4608
1600E5007J3093j04162J61693j09813j83261N0253P983j46898J11374Q7115J88997
1589A31381o3015j5173L5372j39897m5958k24j0609N6700k9799N3239J05560q2907
1577e330K7965k0846r8417M4795R1735j54518k7933N001J2987O8854r5875k8688
1565a80270M1625N102J9820Q4203L9998j4680j56233J36864p4270K4924J10096
1554C7179n038k8625N3944o3225J8705L9235q4762L3688k8867o7172k5176P5408
1542d4706Q2201M2670K5642K756m2408L0852j20420O1731J07506j22245m514P2191
1530I1256n7437m4434J7494M9499J5642n9038J2926J10460p0015O6880M9782j1403
$$ plain form
1518 171612 59101 31043 -57384 117029 211685 88910 114229 148879 75745 48922 19773
1507 19773 28562 5045 8680 84613 134483 24308 -28659 -6823 -29928 45785 -16261 -69374
1495 -69374 102562 89633 30386 33870 10053 14616 -53813 -36645 -49768 -46434 -11727 51725
1483 51725 66654 65572 -33006 153883 12126 -112631 -49628 -44970 -56624 83982 21270
1472 21270 -51190 37199 -4989 -73367 -119868 -49092 -99583 -61699 34190 -18708 13119 67322
1460 67322 23921 56842 -12595 -149954 -193775 -54263 -87765 -68480 -46764 -772 -5301 40311
1448 40311 26506 -70950 -53822 -40295 -50448 128537 64093 -34009 -8558 -41243 -130540 -42866
1436 -42866 -117475 -151719 -85216 -30218 -23384 98329 47259 56947 142625 122533 94480 64804
$$ packed form
1518A71612j12511k8058q8427J74413R4656j22775K5319L4650p3134k6823k9149
1507A9773Q789k3517L635P5933M9870j10175n2967K1836k3105P5713o2046n3113
1495f9374J71936j2929n9247L484k3817M563o8429J7168j3123L334L4707O3452
1483E1725J4929j082r8578J86889j41757j24757O3003M658j1654J40606o2712
1472B1270p2460Q8389m2188o8378m6501P0776n0491L7884R5889n2898L1827N4203
1460F7322m3401L2921o9437j37359m3821J39512l3502J9285K1716M5992m529M5612
1448D0311j3805r7456J7128J3527j0153J78985o4444r8102K5451l2685q9297Q7674
1436d2866p4609l4244O6503N4998O834J21713n1070R688Q5678k0092k8053k9676
$$ plain form
1424 64804 51969 27676 -19686 92146 64148 141862 151131 44853 124086 107621 -35903
1413 -35903 -66540 20039 -100949 -11903 -27968 5166 17561 88537 -43821 24027 -93847
1402 -93847 -61744 -140906 -5610 29664 -5338 -50672 3510 30308 82628 86472 -7408 -31892
1390 -31892 28081 -57254 -101382 27443 -118967 -67690 -34183 -86455 -6383 66898 -24387
1379 -24387 -1144 19256 -23098 -28433 -1439 37053 -75375 -147844 -91664 -2258 65752 -6099
1367 -6099 -44736 -8992 22973 -13787 -19760 -105622 -98707 -90394 -103195 -99092 15132 -75737 -114683
1354 -114683 -53763 -75880 -84217 -112289 -42084 109335 55343 -69660 -51426 -470 -51188
1343 -51188 -7773 -88548 -10528 40989 -163834 -118848 -43180 -78056 -93467 -7134 -48634 -24628
$$ packed form
1424F4804j2835k4293m7362J11832k7998P7714R269j06278P9233j6465j43524
1413c5903l0637Q6579j20988Q9046j6065L3134J2395P0976j32358O7848j17874
1402i3847L2103p9162J35296L5274l5002m5334N4182K6798N2320L844r3880k4484
1390c1892N9973q5335m4128J28825j46410N1277L3507n2272Q0072P3281r1285
1379b4387K3243K0400m2354n335K6994L8492j12428p2469N6180Q9406O8010p1851
1367f099l8637L5744L1965l6760n973q5862O915Q313j2801M103J14224r0869l8946
1354a14683O0920k2117q337k8072P0205J51419n3992j25003J8234N0956n0718
1343e1188M3415q0775P8020N1517k04823M4986P5668l4876j5411Q6333m1500K4006
$$ plain form
1331 -24628 -37431 -35411 -66694 -154156 -117649 -102220 -129043 -58363 -46249 -143736 -68651 -42870
1319 -42870 -238484 -131225 -159476 -279542 22921 -55167 -117810 -104886 -105600 -29901 9360
1308 9360 -92116 -114410 -14552 14330 116174 100748 -101624 -132223 9507 19206 100397
1297 100397 -20165 -13714 -37911 62953 28649 -26067 23600 12832 -39439 61828 11007
1286 11007 -6309 88521 -100842 29313 112474 -68545 -43220 37461 -92436 -194889 -61358
1275 -61358 -90804 -47276 13925 -13785 19673 -64153 -106092 9077 -43617 -23725 72991 100566
1263 100566 32966 -114731 -41803 -62307 -76104 -52544 -28148 31329 172312 70465 60890
1252 60890 4021 14740 -31048 175889 90553 -33218 -82990 -119203 -128690 -55751 -38805 121625
$$ packed form
1331b4628j2803K020l1283q7462L6507J5429k6823P0680J2114r7487P5085K5781
1319d2870j95614J07259k8251j20066L02463p8088o2643J2924p14P5699L9261
1308I360j01476k2294R9858K8882J01844j5426k02372l0599J41730R699Q1191
1297A00397j20562O451k4197J00864l4304n4716M9667j0768n2271J01267n0821
1286A1007j7316R4830j89363J30155Q3161j81019K5325Q0681j29897j02453J33531
1275f1358k9446M3528O1201k7710L3458q3826m1939J15169n2694J9892R6716K7575
1263A00566o7600j47697P2928k0504j3797K3560K4396N9477J40983j01847r575
1252F0890n6869J0719m5788K06937q5336j23771m9772l6213r487P2939J6946J60430
$$ plain form
1240 121625 105153 12431 6801 145042 17917 11821 158204 116608 131507 153092 97999
1229 97999 5181 -115173 -196017 -76747 -6765 77066 111737 89020 54918 85314 -4776
1218 -4776 -52521 -58983 -89435 -62913 70631 72471 129883 139500 83245 -31912 -24512 -51018
1206 -51018 71744 -28480 72060 106291 40520 -25070 -78656 -101057 -48604 -185537 2657
1195 2657 89817 26996 -20817 -4777 35696 -53912 -16749 81136 66399 31030 32212 -51295
1183 -51295 -111577 21103 82738 167174 168550 35985 66651 -37588 -28891 -73297 -30506 -179575
1171 -179575 -106402 -16558 -49871 72832 54642 -137702 -112823 54736 -96524 30730 14544
1160 14544 -196400 -49126 14122 32593 49252 27118 74974 189294 50071 -50594 -130262
$$ packed form
1240A21625j6472r2722n630J38241j27125o096J46383m1596J4899K1585n5093
1229I7999r2818j20354q0844J19270O9982Q3831L4671k2717l4102L0396r0090
1218d776m7745o462l0452K6522J33544J840N7412R617n6255j15157P400k6506
1206e1018J22762j00224J00540L4231o5771o5590n3586k2401N2453j36933J88194
1195B657Q7160o2821m7813J6040M0473q9608L7163R7885j4737l5369J182q3507
1183e1295o0282J32680O1635Q4436J376j32565L0666j04239Q697m4406M2791j49069
1171a79575P3173Q9844l3313J22703j8190j92344K4879J67559j51260J27254j6186
1160A4544k10944J47274O3248J8471J6659k2134M7856J14320j39223j00665p9668
$$ plain form
1149 -130262 -62224 -137242 -39768 -8459 65730 -12809 -3191 64551 33704 30747 41015 42103
1137 42103 22941 140162 6044 30717 3707 -63529 -20042 -10693 -74054 -112153 -170782 -96559
1125 -96559 58798 64049 -19172 23779 -69117 -94600 -182468 -81905 -159202 -132384 12957
1114 12957 -34793 -57836 -45598 -153429 -55464 8239 -115884 -68518 16838 -56671 -82235
1103 -82235 -76094 -104361 -39146 -99161 -46679 31189 68394 54958 17740 -71805 -181140 -63127
1091 -63127 -29667 -138110 -102713 -81835 -43682 -5036 -1054 -44113 -29941 -66246 4134 -4504
1079 -4504 44406 117102 -83674 -6449 -28336 -206557 -41569 -12734 -29916 42665 43529 -56969
1067 -56969 -5980 -2641 59602 112444 154224 138861 98049 41365 21104 -97060 -25366 150310
$$ packed form
1149a30262O8038p5018R7474L1309P4189p8539R618O7742l0847k957J0268J088
1137D2103j9162J17221j34118K4673k7010o7236M3487R349o3361l8099n8629P4223
1125i6559J55357N251q3221M2951r2896k5483q7868J00563p7297K6818J45341
1114A2957m7750k3043J2238j07831R7965O3703j24123M7366Q5356p3509k5564
1103h2235O141k8267O5215o0015N2482P7868L7205j3436l7218q9545j09335J18013
1091f3127L3460j08443L5397K0878L8153L8646L982m3059J4172l6305P0380q638
1079d504M8910P2696k00776P7225k1887j78221J64988K8835j7182P2581Q64j00498
1067e6969N0989L339O2243N2842M1780j5363m0812n6684k0261j18164P1694J75676
$$ plain form
1055 150310 133592 81240 -26286 -134543 -94692 -28525 105993 125461 135870 263676 224244
1044 224244 137595 143451 -26147 -59082 -3760 8252 93311 25256 52240 72083 -6898 -144761
1032 -144761 -116128 -235137 -130551 -41981 -80375 -223555 -137839 -142159 -120659 -37270 -59048
1021 -59048 -55569 16731 -80082 -205503 -35495 -83012 -77939 -21940 11488 -84160 -86171 -194593
1009 -194593 -281446 -216430 -242437 -119013 -37114 -38603 30648 -5659 -55301 -68285 -77839 13832
997 13832 15502 49441 -31774 -25292 -3778 -13688 -128385 -34636 15976 56008 111127 54935
985 54935 -73589 -120052 -54679 -33257 -87509 -91322 122518 10511 -56910 -31046 -76427 -79236
973 -79236 -26151 -30424 23729 60270 172764 -34261 -20820 -24682 5591 -48348 32105 -41689
$$ packed form
1055A50310j6718n2352j07526j08257L9851O6167J34518J9468J0409J27806l9432
1044B24244q6649N856j69598l2935N5322J2012Q5059o8055K6984J9843p8981j37863
1032a44761K8633j19009J04586Q8570l8394j43180Q5716m320K1500Q3389k1778
1021e9048L479P2300r6813j25421J70008m7517N073N5999L3428r5648k011j08422
1009a94593q6853O5016k6007J23424Q1899j489O9251l6307m9642j2984r554R1671
997A3832J670L3939q1215O482K1514r910j14697R3749N0612M0032N5119n6192
985E4935j28524m6463O5373K1422n4252l813K13840j12007o7421K5864m5381k809
973g9236N3085m273N4153L6541J12494k07025J3441l862L0273n3939Q0453p3794
$$ plain form
961 -41689 -29349 -12749 -142825 -78309 -105544 -24645 2006 9360 24243 -12642 14127 72522
949 72522 62412 95786 -547 16981 2407 -105294 -214569 -140682 -161268 -146257 -8508
938 -8508 21459 25145 34530 -80926 -131498 -139129 -89317 -154896 -163099 -12132 -28342 63386 11920
925 11920 -132473 8034 73641 -60188 94765 85810 -48709 75113 19668 -3107 40458
914 40458 53568 23851 60497 37114 15291 13623 100540 4037 -18283 -78529 -29547 -107938
902 -107938 -170106 -80347 19209 32963 -29174 -172443 -48250 -52587 -144019 -39439 20925
891 20925 -54180 -8438 105224 49253 31276 -89205 -168360 -169328 5837 -144585 -72677 26894
879 26894 68304 20963 80520 -1509 -84617 -122884 -197144 -230119 -128565 -59042 -10532 -58796
$$ packed form
961d1689J2340J6600j30076O4516k7235Q0899K6651P354J4883l6885K6769N8395
949G2522j0110L3374r6333J7528j4574j07701j09275P3887k0586J5011J37749
938h508K9967L686R385j15456n0572p631M9812o5579q203J50967j6210R1728n1466
925A1920j44393J40507O5607j33829J54953q955j34519J23822n5445k2775M3565
914D0458J3110k9717L6646k3383k1823j668Q6917r6503k2320o0246M8982p8391
902a07938o2168Q9759R9556J3754o2137j43269J24193m337r1432J04580O0364
891B0925p5105M5742J13662n5971j7977j20481p9155r68J75165j50422P1908R9571
879B6894M1410m7341N9557q2029q3108l8267p4260l2975J01554O9523M8510m8264
$$ plain form
867 -58796 -132039 -229802 -209148 -84161 9707 -80108 -76552 -26531 -109623 -39607 -24385 -72627
855 -72627 -81035 -113816 -174402 -85724 -114006 -17679 -26583 5062 -41217 -97200 -110002 -50420
843 -50420 -141740 -225501 -23715 -17848 32495 73216 73777 -111575 -185812 -158942 -127047 -219345
831 -219345 -113466 87068 104302 12623 -97228 -220625 -214656 -161602 -169623 -25211 60177
820 60177 51980 10305 15021 -14633 -33938 -176859 -59807 -53340 113991 79958 5048 57759
808 57759 125456 -17944 52385 78482 -62293 -9133 57829 76071 74 -20807 -87007 -17162
796 -17162 1734 95264 129236 133800 75936 75027 37363 -93359 -85687 50180 56761 111865 19673
783 19673 49730 52600 677 -102855 -72145 14481 8950 -9915 -21619 120335 39620 -52745
$$ packed form
867e8796p3243r7763K0654J24987R3868q9815L556N0021q3092P0016J5222m8242
855g2627q408l2781o0586Q8678k8282R6327q904L1645m6279n5983j2802N9582
843e0420r1320q3761K01786N867N0343M0721N61j85352p4237K6870L1895r2298
831b19345J05879K00534J7234r1679j09851j23397N969N3054q021J44412Q5388
820F0177q197m1675M716k9654j9305j42921J17052O467J67331l4033p4910N2711
808E7759O7697j43400P0329K6097j40775N3160O6962J8242p5997k0881o6200O9845
796a7162J8896R3530L3972M564n7864r09l7664j30722P672J35867O581N5104r2192
783A9673L0057K870n1923j03532L0710Q6626n531j8865j1704J41954q0715r2365
$$ plain form
771 -52745 -42826 -8049 -59780 -41466 -38694 6891 61750 23292 -9468 42035 20029 -8649
759 -8649 41 30175 -97561 -83436 -79448 688 -3170 -41432 -60721 -191512 -147567 -83370
747 -83370 51949 13936 -80791 -93522 46503 -47574 43814 47563 8166 3244 -166452 -61243
735 -61243 -2549 -127724 -17548 44810 5305 23895 9200 -20573 11075 68261 22619 95022
723 95022 113122 10679 -3321 -49365 -53301 23306 46390 104532 171584 151242 63339 -62021
711 -62021 -103683 -136414 -208273 -81052 -82174 -72273 -31776 -91900 -131392 -132048 -115138 -170371 -139783
698 -139783 -82684 -32974 -5572 74675 44083 41507 26767 -69468 -45341 -31957 -6560 -2642
686 -2642 -101017 -49347 61728 -102979 -115607 -74807 -146285 123997 157276 -38471 19713
$$ packed form
771e2745R919L4777n1731J8314K772M5585N4859l8458l2760N1503k2006k8678
759h649Q690L0134j27736J4125L988Q0136l858l8262j9289j30791M3945O4197
747h3370J35319l8013r4727j2731J40025r4077R1388L749l9397m922j69696J05209
735f1243N8694j25175J10176O2358l9505J8590j4695k9773L1648N7186m5642P2403
723I5022J8100j02443j4000m6044l936P6607K3084N8142O7052k0342q7903j25360
711f2021m1662l2731p1859J27221j122R901M0497o0124l9492o56J6910n5233L0588
698a39783N7099M9710K7402Q0247l0592k576j4740r6235K4127J3384K5397L918
686b642r8375N1670J11075j64707j2628M0800p1478K70282L3279j95747N8184
$$ plain form
675 19713 58294 48853 93375 -155078 -159521 -1450 -120749 -63947 118970 106997 79373 41501
663 41501 47124 65693 9698 82738 151226 100898 118464 107437 54665 109721 25364 -38877
651 -38877 -47615 -119661 -69907 -26459 -50289 28996 9227 -31010 -111613 -122852 -156204 -100999
639 -100999 -125555 -29336 -64645 22162 -55864 -152896 -54864 -62165 -106125 59312 30232 -42516
627 -42516 -96767 -44073 -19786 -208066 -138652 37847 -33858 -47953 -127374 -118536 73083 32598
615 32598 78748 114354 23089 -38638 68342 -12475 60443 85469 -9302 -8059 107735 105395
603 105395 91125 136942 72655 125053 234289 102927 187204 108348 29190 142964 33686
592 33686 -57020 160620 103194 52182 47163 -3977 -42173 -61302 -5182 -75479 -16678 104491
$$ packed form
675A9713L8581r441M4522k48453m443J58071j19299N6802J82917j1973k7624l7872
663D1501N623J8569n5995P3040O8488n0328J7566j1027n2772N5056q4357o4241
651c8877q738p2046M9754M3448k3830P9285j9769m0237q0603j1239l3352N5205
639a00999k4556R6219l5309Q6807p8026r7032R8032p301m3960J65437k9080p2748
627d2516n4251N2694K4287j88280O9414J76499p1705j4095p9421Q838J91619m0485
615C2598M6150L5606r1265o1727J06980q0817P2918K5026r4771J243J15794k340
603A05395j4270M5817o4287N2398J09236j31362Q4277p8856p9158J13774j09278
592C3686r0706K17640n7426n1012n019n1140l8196j9129N6120p0297N8801J21169
$$ plain form
580 104491 90327 28997 -12634 24806 51555 107100 96820 51183 166683 116768 101670 82594
568 82594 -3269 -135308 -102262 -34859 62590 127959 21914 -3641 18728 -100026 -54753
557 -54753 18355 -8181 24655 143583 84235 36042 60155 34126 111010 55435 -5366 197595
545 197595 64193 35954 78969 -25309 58576 93259 22776 -34942 54352 -108653 -83122
534 -83122 -78004 -148484 -101209 60633 56896 65274 117449 128178 7672 -37890 -79122 31366
522 31366 16537 115097 196788 211882 65730 -86299 -39905 -5107 92774 97853 70659 40618
510 40618 2086 29165 91787 -20202 11400 -49077 -10606 -23341 -7249 77550 131872 123706
498 123706 143718 163833 165693 183911 147213 70412 -57607 -35501 20703 -32536 -94588 -146600
$$ packed form
580A04491j4164o1330m1631L7440K6749N5545j0280m5637J15500m9915j5098j9076
568H2594q5863j32039L3046O7403R7449O5369j06045k5555K2369j18754M5273
557e4753P3108k6536L2836J18928n9348m8193K4113k6029P6884n5575o0801K02961
545A97595j33402k8239M3015j04278Q3885L4683p0483n7718Q9294j63005K5531
534h3122N118p0480M7275J61842l737Q378N2175J0729j20506m5562m1232J10488
522C1366j4829R8560Q1691J5094j46152j52029M6394L4798R7881N079k7194l0041
510D0618l8532K7079O2622j11989L1602o0477L8471j2735J6092Q4799N4322q166
498A23706K0012K0115J860J8218l6698p6801j28019K2106N6204n3239o2052n2012
$$ plain form
486 -146600 -100352 38932 -60073 38829 55988 -26546 146046 -33506 27713 79631 -11581
475 -11581 3194 61580 66775 138424 47977 -48405 -93781 -104450 -150232 -84526 -33840 -78440
463 -78440 45754 -37458 58413 97841 -68553 -5645 53315 2161 132098 90098 98609 100714
451 100714 558 16429 111434 110515 162338 163885 51197 114069 150777 60461 153698 89942
439 89942 97526 -45272 -25209 99722 31208 159656 152401 144924 215109 104382 -13800 122579
427 122579 -32630 -24088 -49357 -39862 -27630 46060 45856 69516 55070 163483 59233 -5164
415 -5164 -27939 -100891 -15582 70586 59294 19683 66663 111481 86934 45876 121746 160797
403 160797 64934 72004 71147 46140 177231 3352 -83584 -9531 -39114 -74635 140057 29952
$$ packed form
486a46600M6248J39284r9005R8902J7159q2534J72592j79552O1219N1918r1212
475a1581J4775N8386N195P1649r0447r6382m5376j0669m5782O5706N0686m4600
463g8440J24194q3212R5871L9428j66394O2908N8960n1154J29937m2000Q511K105
451A00714j00156J5871R5005r19N1823J547j12688O2872L6708r0316R3237o3756
439H9942P584j42798K0063J24931o8514J28448p255p477P0185j10727j18182J36379
427A22579j55209Q542k5269R495J2232P3690k04K3660j4446J08413j04250o4397
415e164k2775p2952Q5309Q6168j1292l9611M6980M4818k4547m1058P5870L9051
403A60797r5863P070q57k5007J31091j73879q6936P4053k9583l5521K14692j10105
$$ plain form
391 29952 22075 97317 -68893 -52368 29709 -5104 1841 11069 1764 -136547 -142440 -53569 -51160
378 -51160 -108397 4617 81290 -38205 24700 56119 108851 77974 55658 16098 82389 35866
366 35866 22627 -27565 -18117 18783 56056 19019 119910 115184 47399 4189 -138014 49233
354 49233 201041 175464 139056 -3521 -93325 -28528 -51873 -23661 27033 130932 80993
343 80993 154172 53489 53389 -18430 27391 3487 31536 28161 -35279 37220 -2180 -3931 103197
330 103197 154328 99341 90243 209422 93613 115748 99575 -1414 75215 71712 74810 164103
318 164103 226616 236500 189941 192256 111989 72684 123486 105817 -12214 15185 20690 86429
$$ packed form
391B9952p877P5242j66210J6525Q2077l4813O945R228r305j38311n893Q8871K409
378e1160n7237J13014P6673j19495O2905L1419N2732l0877k2316l9560O6291m6523
366C5866j3239n0192R448L6900L7273l7037J00891m726o7785m3210j42203J87247
354D9233J51808k5577l6408j42577q9804O4797k3345K8212N0694J03899m9939
343H0993P3179j00683j00p1819M5821k3904K8049l375o3440P2499l9400j751J07128
330A03197N1131n4987r098J19179j15809K2135j6173j00989P6629l503L098Q9293
318A64103O2513R884m6559K315q0267l9305N0802j7669j18031K7399N505O5739
$$ [...]
##END NTUPLES=NMR SPECTRUM
##END=
