##TITLE=1H_CA-9004-1y
 DMSO
 8 sc, 
 6.05.2022
##JCAMPDX= 6.0         $$ Bruker NMR JCAMP-DX V2.0
##DATA TYPE= NMR SPECTRUM
##DATA CLASS= NTUPLES
##ORIGIN= UXNMR, Bruker Analytische Messtechnik GmbH
##OWNER= root
$$ XWIN-NMR		Version 3.5
$$ Fri May  6 10:10:55 2022 Russian Standard Time (UT+4h)  she@DPX200
##.OBSERVE FREQUENCY= 200.1313499996
##.OBSERVE NUCLEUS= ^1H
##.ACQUISITION MODE= SIMULTANEOUS
##.ACQUISITION SCHEME= undefined
##.AVERAGES= 8
##.DIGITISER RES= 18
##SPECTROMETER/DATA SYSTEM= spect
##.PULSE SEQUENCE= zg30
##.SOLVENT NAME= DMSO
##.SHIFT REFERENCE= (INTERNAL, DMSO, 0, 15.781)
##AUDIT TRAIL= $$ (NUMBER, WHEN, WHO, WHERE, WHAT)
$$ ##TITLE= Audit trail, XWIN-NMR		Version 3.5
$$ ##JCAMPDX= 5.01
$$ ##ORIGIN= Bruker BioSpin GmbH
$$ ##OWNER= she
$$ F:/spectra/data/she/nmr/H-F/1/pdata/1/auditp.txt
$$ ##AUDIT TRAIL=  $$ (NUMBER, WHEN, WHO, WHERE, WHAT)
(   1,<2022-05-06 10:09:40.12 +0400>,<she>,<DPX200>,
      <created by zg, POWCHK disabled, PULCHK disabled
       configuration hash MD5:
       00 E9 B6 7A A2 85 ED C7 34 08 36 98 17 FE 4E 26
       data hash MD5: 16K
       C0 FF 02 02 94 09 AC 98 0E 99 18 27 9F 97 0E 7D>)
(   2,<2022-05-06 10:09:49.43 +0400>,<she>,<DPX200>,
      <Start of raw data processing
       efp BC_mod = 2 LB = 0.24 FT_mod = 6 PKNL = 1 PHC0 = -18034.28 PHC1 = 8.00075 SI = 16K 
       data hash MD5: 16K
       81 97 89 11 B5 9A A2 B5 90 60 0F B2 44 D4 F7 4C>)
(   3,<2022-05-06 10:10:10.68 +0400>,<she>,<DPX200>,
      <pk PHC0 = 7.797362 PHC1 = -7.200001 
       data hash MD5: 16K
       D0 9A C2 12 55 CE E9 C4 B7 59 79 D9 8D 7A 09 5B>)
(   4,<2022-05-06 10:10:13.93 +0400>,<she>,<DPX200>,
      <abs ABSG = 5 
       data hash MD5: 16K
       1D CD 1F 8B CF 9D B1 2E 94 1A 37 C1 DA 4D 85 13>)
$$ ##END=
$$ 
$$ hash MD5
$$ 6D 7B 31 93 67 07 06 A5 67 D6 8B D9 EA B7 97 D2
##$RELAX= 
##$RELAX= 
##$RELAX= 
##$RELAX= 
##$RELAX= 
##$RELAX= 
$$ Bruker specific parameters
$$ --------------------------
##$DU= <F:/spectra>
##$EXPNO= 1
##$NAME= <H-F>
##$PROCNO= 1
##$TYPE= <nmr>
##$USER= <she>
##$AMP= (0..31)
100 100 100 100 100 100 100 100 100 100 100 100 100 100 100 100 100 100 
100 100 100 100 100 100 100 100 100 100 100 100 100 100 
##$AQSEQ= 0
##$AQ_mod= 1
##$AUNM= <au_zg>
##$AUTOPOS= <>
##$BF1= 200.13
##$BF2= 200.13
##$BF3= 200.13
##$BF4= 200.13
##$BF5= 200.13
##$BF6= 200.13
##$BF7= 200.13
##$BF8= 200.13
##$BYTORDA= 1
##$CFDGTYP= 0
##$CFRGTYP= 5
##$CHEMSTR= <none>
##$CNST= (0..31)
1 1 145 1 1 1 1 1 1 1 1 1 1 1 1 1 1 1 1 1 1 1 1 1 1 1 1 1 1 1 1 1 
##$CPDPRG= <>
##$CPDPRG1= <>
##$CPDPRG2= <>
##$CPDPRG3= <>
##$CPDPRG4= <mlev>
##$CPDPRG5= <mlev>
##$CPDPRG6= <mlev>
##$CPDPRG7= <mlev>
##$CPDPRG8= <mlev>
##$CPDPRGB= <>
##$CPDPRGT= <>
##$D= (0..31)
0 1.2 0 0 0 0 0 0 0 0.06 0 0.03 0 0 0 0 0.0002 0 0 0 0 0 0 0 0 0 0 0 0 
0 0 0 
##$DATE= 1651817379
##$DBL= (0..7)
120 120 120 120 120 120 120 120 
##$DBP= (0..7)
150 150 150 150 150 150 150 150 
##$DBP07= 0
##$DBPNAM0= <>
##$DBPNAM1= <>
##$DBPNAM2= <>
##$DBPNAM3= <>
##$DBPNAM4= <>
$$ [...]
##$SUBNAM2= <"">
##$SUBNAM3= <"">
##$SUBNAM4= <"">
##$SUBNAM5= <"">
##$SUBNAM6= <"">
##$SUBNAM7= <"">
##$SUBNAM8= <"">
##$SUBNAM9= <"">
##$SW= 18.0517283424761
##$SWIBOX= (0..15)
0 0 2 0 0 0 0 0 0 0 0 0 0 0 0 0 
##$SW_h= 3612.71676300578
##$TD= 16384
##$TD0= 1
##$TE= 0
##$TE2= 300
##$TE3= 300
##$TEG= 300
##$TL= (0..7)
0 120 120 120 120 120 120 120 
##$TP= (0..7)
150 150 150 150 150 150 150 150 
##$TP07= 0
##$TPNAME0= <>
##$TPNAME1= <>
##$TPNAME2= <>
##$TPNAME3= <>
##$TPNAME4= <>
##$TPNAME5= <>
##$TPNAME6= <>
##$TPNAME7= <>
##$TPOAL= (0..7)
0.5 0.5 0.5 0.5 0.5 0.5 0.5 0.5 
##$TPOFFS= (0..7)
0 0 0 0 0 0 0 0 
##$TUNHIN= 0
##$TUNHOUT= 0
##$TUNXOUT= 0
##$USERA1= <user>
##$USERA2= <user>
##$USERA3= <user>
##$USERA4= <user>
##$USERA5= <user>
##$V9= 5
##$VALIST= <valist>
##$VCLIST= <CCCCCCCCCCCCCCC>
##$VD= 0
##$VDLIST= <DDDDDDDDDDDDDDD>
##$VPLIST= <PPPPPPPPPPPPPPP>
##$VTLIST= <TTTTTTTTTTTTTTT>
##$WBST= 1024
##$WBSW= 4
##$XGAIN= (0..3)
0 0 0 0 
##$XL= 0
##$YL= 0
##$YMAX_a= 277722
##$YMIN_a= -439891
##$ZGOPTNS= <>
##$ZL1= 120
##$ZL2= 120
##$ZL3= 120
##$ZL4= 120
##$ABSF1= 15.7513
##$ABSF2= -2.30055
##$ABSG= 5
##$ABSL= 3
##$ALPHA= 0
##$AQORDER= 0
##$ASSFAC= 0
##$ASSFACI= 0
##$ASSFACX= 0
##$ASSWID= 0
##$AUNMP= <proc_1d>
##$AZFE= 0.1
##$AZFW= 0.1
##$BCFW= 0
##$BC_mod= 2
##$BYTORDP= 0
##$COROFFS= 0
##$CY= -3
##$DATMOD= 1
##$DC= 0
##$DFILT= <>
##$DTYPP= 0
##$F1P= 0
##$F2P= 0
##$FCOR= 1
##$FTSIZE= 16384
##$FT_mod= 6
##$GAMMA= 0
##$GB= 0
##$INTBC= 1
##$INTSCL= 0
##$ISEN= 128
##$LB= 0.24
##$LEV0= 0
##$LPBIN= 0
##$MAXI= 10000
##$MC2= 0
##$MEAN= 0
##$ME_mod= 0
##$MI= 1.114404
##$NCOEF= 0
##$NC_proc= -8
##$NLEV= 6
##$NOISF1= 3.799351
##$NOISF2= 2.8
##$NSP= 0
##$NTH_PI= 0
##$NZP= 0
##$OFFSET= 15.78105
##$PC= 1
##$PHC0= -18026.48
##$PHC1= 0.8007488
##$PH_mod= 1
##$PKNL= yes
##$PPARMOD= 0
##$PSCAL= 0
##$PSIGN= 0
##$REVERSE= no
##$SF= 200.129998098014
##$SI= 16384
##$SIGF1= 3
##$SIGF2= 2
##$SINO= 5.538805
##$SIOLD= 16384
##$SREGLST= <1H.CDCl3>
##$SSB= 0
##$STSI= 16384
##$STSR= 0
##$SW_p= 3612.71676300578
##$SYMM= 0
##$S_DEV= 0
##$TDeff= 16384
##$TDoff= 0
##$TI= <>
##$TILT= no
##$TM1= 0
##$TM2= 0
##$TOPLEV= 0
##$USERP1= <user>
##$USERP2= <user>
##$USERP3= <user>
##$USERP4= <user>
##$USERP5= <user>
##$WDW= 1
##$XDIM= 16384
##$YMAX_p= 436518898
##$YMIN_p= -4387047
$$ End of Bruker specific parameters
$$ ---------------------------------
##NTUPLES= NMR SPECTRUM
##VAR_NAME=  FREQUENCY,     SPECTRUM/REAL,   SPECTRUM/IMAG
##SYMBOL=    X,             R,               I
##VAR_TYPE=  INDEPENDENT,   DEPENDENT,       DEPENDENT
##VAR_FORM=  AFFN,          ASDF,            ASDF
##VAR_DIM=   16384,         16384,           16384
##UNITS=     HZ,            ARBITRARY UNITS, ARBITRARY UNITS
##FACTOR=    0.220516191357247, 1,           1
##FIRST=     3158.26145212807, 0,            0
##LAST=      -454.455310877714, 0,           0
##MIN=       -454.455310877714, -4387047,    0
##MAX=       3158.26145212807, 436518898,    0
$$ Real data points
##PAGE= N=1
##DATA TABLE= (X++(R..R)), XYDATA
$$ [...]
6400B601091L12267R84806p00049r43484j079128k4884J937764J195762j13660
6391D170485p66315r94376J438701L20306k554788K28870J254655J191192o85765
6382C602965j614145M43529p02327J21189J217496N3396J49948J024056k48618
6373D047489r90552j64004M06675j55787o22222l3107J073761N64734m54441m26154
6363C246392l36167O17144N20238l80587m34339K28662r26007N48093P60191L1463
6353C875083o17187j367413k58604L05751m3502K44843J164601P00971k30749
6344C773794o78956n31886m31311K08849Q35117M88721l53176J98529P11743n02527
6334C718897n66107R72225P28242n78506p0058M40665R02370L26688o82195m17147
$$ y = [2601091, 2913358, 3898164, 3198115, 2254631, 1175503, 1150619, 3088383, 4284145, 4170485, 3404170, 2409794, 3848495, 4168801, 1614013, 1842883, 3097538, 4288730, 3602965, 1988820, 2432349, 1730022, 1851211, 3068707, 3122103, 3272051, 4296107, 4047489, 3056937, 2892933, 3299608, 3143821, 2521599, 2488492, 3562253, 4126987, 3672546, 3246392, 2910225, 3527369, 4047607, 3667020, 3232681, 3461343, 2535336, 3083429, 3843620, 3875083, 3257896, 1890483, 1631879, 1937630, 1894128, 2138971, 3303572, 4004543, 3773794, 3094838, 2562952, 2131641, 2340490, 3175607, 3664328, 3311152, 3509681, 4221424, 3718897, 3152790, 4125015, 4853257, 4274751, 4204693, 4645358, 5547728, 5874416, 5192221, 4775074]
6324D775074M39690M45773m48274q69940M3871J216762L41283n16455L23015L05012
6314F055811P74309j193138j126908Q34949K60685j033734K36278R54633O21578
6305F384463N5656J740O79723N77609J75390p38626M60282l67276n06339K10369
6295F932991k08512K55031R6484N31574q6033j41178K13327L5244R85666J253746
6285I868340o98781j257129N59144P78741J57400J269779P03010J276049P38652
6276A3395205j080446j01415L16600k79322k09761l5607O48935J309573M93884
6267A4457646l94985n99041P57985J948302j1257p619J419020K11124j71969J038062
6257A8647268R26982l11772J024452M60175J616780O60680k14888O87448J335359
$$ y = [4775074, 5214764, 5660537, 5212263, 4342323, 4386194, 5602956, 5944239, 5427784, 5750799, 6055811, 6830120, 5636982, 4510074, 5345023, 5605708, 4571974, 4808252, 5762885, 6384463, 6440119, 6441859, 7121582, 7699191, 7874581, 7135955, 7596237, 7228961, 6722622, 6932991, 6724479, 6979510, 7075994, 7607568, 7521535, 7380357, 7593684, 7628928, 8614594, 9868340, 9169559, 7912430, 8471574, 9250315, 9407715, 10677494, 11380504, 12656553, 13395205, 12314759, 12213344, 12529944, 12250622, 12040861, 12005254, 12654189, 13963762, 14457646, 14062661, 13463620, 14221605, 16169907, 16158650, 16151031, 17570051, 17781175, 17609206, 18647268, 19574250, 19262478, 20286930, 20747105, 22363885, 23024565, 22809677, 23497125, 24832484]
6248B4832484R21995Q29245J178321J939058J033660K298566J724361k59159J379546
6239C5878077N13232J467112J689829K580157J771912J583545J190160Q58949
6231D7532973k99809J310486Q04290K231924K482435J55118J277070J31529j129145
6222E4496871J149715J457272j372463J395357Q33402K69150j007091j008798
6214E6213415q05312j197735j594529R45167L81230j068938j728696k077750K6814
6205D9093666j917348o70421L25703p17827j562532p13702r15932q6892p49255
6196D2085460o18987L39726j37041K27619j38669j062890N18778J329067R11684
6187D3454747R13164J70546J626809Q20864K13894M36465J077228K150952K379574
$$ y = [24832484, 25754479, 26583724, 27762045, 29701103, 30734763, 33033329, 34757690, 34498531, 35878077, 36391309, 37858421, 39548250, 42128407, 43900319, 45483864, 46674024, 47532973, 47233164, 48543650, 49347940, 51579864, 54062299, 54217417, 55494487, 55626016, 54496871, 55646586, 57103858, 55731395, 57126752, 57960154, 58229304, 57222213, 56213415, 55408103, 54210368, 52615839, 53561006, 53942236, 52873298, 51144602, 49066852, 49093666, 47176318, 46505897, 46831600, 46113773, 44551241, 43837539, 42921607, 42834715, 42085460, 41466473, 41806199, 41669158, 41896777, 41758108, 40695218, 41213996, 42543063, 43454747, 44367911, 44538457, 46165266, 46986130, 47200024, 47636489, 48713717, 50864669, 53244243]
6178E3244243j161540J553148K099051K240822L038568K157766J462014K596299
6170F7230371J428510K14581J215406J958780K762090J860890K85945Q58480J979484
6161G9794537R79243r48207o73999J571140O48797q88244o01170o01487k395j068317
6151G8209898l171957m63836l91513j137306k158625j371751j374793k456468
6143F5683649k937646k854850k008290m50765k742240k647024l134585j160633
6135D7747616j205259j857533j265738l165722k533391j96905K9507n04406j713524
6126C5334645k784725m79283o40829j704647r73800j39694j404913j961128M87688
6117B5733314k22376j400968j105393p4878j78842P21365J27467j372638l49921
$$ y = [53244243, 52082703, 53635851, 55734902, 57975724, 61014292, 63172058, 64634072, 67230371, 68658881, 68873462, 70088868, 72047648, 74809738, 76670628, 76956573, 77815053, 79794537, 80773780, 79825573, 79151574, 80722714, 81371511, 80483267, 79882097, 79280610, 79278215, 78209898, 75037941, 74574105, 74182592, 73045286, 70886661, 69514910, 68140117, 65683649, 62746003, 59891153, 57882863, 57432098, 54689858, 52042834, 48908249, 47747616, 46542357, 44684824, 43419086, 40253364, 37719973, 37523068, 37552575, 37048169, 35334645, 32549920, 32070637, 31429808, 29725161, 28751361, 28611667, 27206754, 25245626, 25733314, 25510938, 24109970, 23004577, 22929699, 22750857, 23472222, 23599689, 22227051, 21877130]
6108B1877130j288328l96955N74034j178082l55945J541773l00832j179799p56170
6099A8536826p28726K08406P29449l57860n21225j281956q40466k73648l70840
6090A5099960L87082Q47900O61383j011047O80182m6848j056889m87661M33390
6081A5507452J74585l33303K64302j77114O41872R1078Q72475m01861o91548j052433
6071A4895505k87115L92885M28851L41117o09589l28120N69655J688931k14193
6062A6877927j097117m44868r09219q0194o24911R45881J484015k191283j13258
6053A3846973P05327l45283K75141P62057R87920o36070p46806Q48333K53760
6044A5951352m07099k65494L714J114799r94230o20702J271568Q26659j46021
$$ y = [21877130, 20588802, 20191847, 20765881, 19587799, 19231854, 20773627, 20472795, 19292996, 18536826, 17808100, 18016506, 18745955, 18388095, 17866870, 16584914, 15744448, 15470800, 15099960, 15487042, 16334942, 16996325, 15985278, 16665460, 16618612, 15561723, 15074062, 15507452, 15682037, 15348734, 15613036, 15435922, 16077794, 16168872, 17041347, 16639486, 15947938, 14895505, 14608390, 15001275, 15430126, 15771243, 15161654, 14833534, 15403189, 17092120, 16877927, 15780810, 15335942, 14426723, 14346529, 13721618, 14667499, 16151514, 13960231, 13846973, 14552300, 14207017, 14482158, 15244215, 16232135, 15596065, 14849259, 15697592, 15951352, 15544253, 15278759, 15282473, 16397272, 15403042, 14782340, 16053908, 16880567, 16734546]
6035A6734546j096138o51558j034954N44394O50981l15889j65272L83719J601623
6026A6651452J698683j061242j662658J013717o7623r13751l38055J235145K138995
6017A8694663J18418j901461P50240N55089K0326J9375J051617o15702p5297N98968
6007A9216236L39644R25141J417501Q99659N66082j68350m18005J230060O26079
5998B4634047O73380P73285O94007l33315J199217J201416J292083J09559Q63230
5989C1106909J185221R7737J455911J358974P14309J689836J765466P34412J158587
5980D1267362R14788K578898K625426L78401M94040J415082J976398J915574K67226
5971E3833195J871359J875284J449765J679726j033663J296146J850298L22280
$$ y = [16734546, 15638408, 14986850, 13951896, 14496290, 15147271, 14831382, 14666110, 15049829, 16651452, 18350135, 17288893, 15626235, 16639952, 16572329, 15658578, 15320523, 16555668, 18694663, 18813081, 16911620, 17661860, 18216949, 18237275, 18256650, 19308267, 18692565, 18617268, 19216236, 19555880, 20481021, 21898522, 22798181, 23364263, 23195913, 22777908, 24007968, 24634047, 25307427, 26080712, 26774719, 26441404, 27640621, 28842037, 30134120, 30243679, 31106909, 32292130, 32389867, 33845778, 35204752, 35919061, 37608897, 39374363, 40108775, 41267362, 42182150, 44761048, 47386474, 47764875, 48258915, 49673997, 51650395, 53565969, 53833195, 55704554, 57579838, 59029603, 60709329, 59675666, 60971812, 62822110, 63144390]
5963F3144390j033310J20279j08315R67120o1863n35391o44451k92610q62237
5954F0693612m48663m89098P77704J23894K00070j066600j213008J545703o26623
5945E9496991J002106J533938r987M5999J382330M6932Q93883J604750N36718
5936F6533660l92774J810472q03555q32904R37607O94430Q06776O16163j745248
5927F7624627j779089L49223j9647o0227l72862M22422j174513j239643j065550
5918F2684741k246440M16175P77383m55101O19075j29951j458214n06107L16146
5909F0017707J181613n42936l35071o38478M15844Q19282J8150P33260K5559P89302
5899F2484232O01524L54991L3503K58229J85041n79646j573667N19833n02140
$$ y = [63144390, 62111080, 62231359, 62123044, 63090164, 63028301, 62492910, 61848459, 61555849, 60693612, 60244949, 59755851, 60533555, 60657449, 60857519, 59790919, 58577911, 60123614, 59496991, 60499097, 62033035, 62023048, 62069047, 63451377, 63498309, 64392192, 65996942, 66533660, 66140886, 67951358, 67147803, 66314899, 67252506, 67946936, 68753712, 69369875, 67624627, 65845538, 66194761, 66175114, 66114887, 65742025, 66164447, 64989934, 63750291, 62684741, 60438301, 60854476, 61631859, 61176758, 61795833, 61665882, 60207668, 59701561, 60017707, 61199320, 60656384, 60321313, 59682835, 60098679, 60917961, 60936111, 61669371, 61694930, 62484232, 63085756, 63440747, 63474250, 63732479, 63917520, 63337874, 61764207, 62284040, 61781900]
5890F1781900o57894o12428j82953J578014J311264J22756O91069j04204n26245
5881F3401279J135220J089769M75618P34081R52059M5149J320385J681112J57761
5872G0992433M65788J218711M62171J173743J286127m13716O18363P55146L7545
5863G6596311l71121J279l92275j53038O70001n72704k09502L16677j54331j359750
5853G4371547M85955N31127n27430l07003j499337j270404m14179o48284o47062
5844G0074930Q90919Q92008j252821q06934m20804j088613j377824p82303k25804
5835F5902754q23635O54501O19706j99484j058461k067764j6669P79801P47254
5826F4538003o05405K00494j041812j070570L42243l50714j440556K08800M54741
$$ y = [61781900, 61124006, 60511578, 60328625, 61906639, 63217903, 63340659, 64031728, 63927524, 63401279, 64536499, 65626268, 66101886, 66835967, 67788026, 67833175, 69153560, 70834672, 70992433, 71458221, 72676932, 73139103, 74312846, 75598973, 75185257, 75803620, 76558766, 76596311, 76225190, 76226469, 75834194, 75681156, 76351157, 75778453, 75568951, 75885628, 75731297, 74371547, 74857502, 75388629, 74861199, 74554196, 73054859, 71784455, 71370276, 70721992, 70074930, 70965849, 71857857, 70605036, 69798102, 69377298, 68288685, 66910861, 66128558, 65902754, 65079119, 65733620, 66353326, 66153842, 65095381, 63027617, 63010948, 63790749, 64538003, 63932598, 64133092, 63091280, 62020710, 62362953, 62012239, 60571683, 60780483, 61235224]
5817F1235224j30322J05977j491036j635334r84586o09753k42388M05671j050566
5808E5602887j451856j628241j108525m57872J095607j801324j563480j010259
5800D7676937j197245o88376j361712n90303j028647j682868l67807m84580j583320
5791C8692079k058828k84676J280393j615926j569603r8692n84793j378628j042312
5782C1339014n51259j67685j792659m04815o18112r40416j626007n38859n52180
5773B4147022j702520O6507m36341m70491q72710o67206p33412l27485j39082
5764A8864282j18295r10771j89166j255157k35395M90041j215314k19313k11203
5755A4999709j240449m62725L35545L98250M36311j448718J5616n58156q36508
$$ y = [61235224, 61104902, 61210879, 59719843, 58084509, 57099923, 56490170, 56247782, 56653453, 55602887, 54151031, 52522790, 51414265, 50956393, 52052000, 50250676, 48687196, 47676937, 46479692, 45791316, 44429604, 43839301, 42810654, 41127786, 40759979, 40275399, 38692079, 36633251, 36348575, 37628968, 36013042, 34443439, 34344747, 33759954, 32381326, 31339014, 30787755, 30620070, 28827411, 28422596, 27804484, 26864068, 25238061, 24699202, 24147022, 22444502, 22511009, 22074668, 21604177, 20731467, 20064261, 19330849, 19003364, 18864282, 18745987, 17835216, 17646050, 16390893, 16155498, 16645539, 15430225, 15210912, 14999709, 13759260, 13296535, 13632080, 14030330, 14466641, 13017923, 13033539, 12475383, 11638875]
5746A1638875j38658N33626J002060p73556j220121R03103j034074J6961Q10172
5737A1738388q46053l70735j627016N2350J31266k96984P4276J852290K74477
5728A0982259j48023l56513M80523j09226j168132l45058j171658O12417J138539
5719I915128j06245K76775O64213j181285J206288l01362j531901R70628m38398
5710I473841j662724J166492m58822p15350P63823N42574m51151q94672P83491
5701H547502L1899N51999k76349n92837r44411J334626K27437J63748J342930
5692A0386544K18171k25547N49842j444599J09608N03155j504031p82460O18114
5683H428797O75722j44887R40868j06775N9557J51531N78490j628039q09851n89037
$$ y = [11638875, 11500217, 12033843, 13035903, 12262347, 11042226, 11945329, 10911255, 10928216, 11738388, 10892335, 10521600, 8894584, 8946934, 9078200, 8781216, 8855492, 10707782, 10982259, 10834236, 10477723, 10958246, 10849020, 9680888, 9335830, 8164172, 8776589, 9915128, 9808883, 10085658, 10749871, 9568586, 10774874, 10473512, 8941611, 9912239, 9473841, 7811117, 8977609, 8518787, 7803437, 8567260, 9109834, 8658683, 7764011, 8547502, 8579401, 9131400, 8855051, 8262214, 7317803, 8652429, 8879866, 9043614, 10386544, 10604715, 10379168, 10929010, 9484411, 9594019, 10097174, 8593143, 7810683, 8428797, 9104519, 8959632, 9900500, 9793725, 9853282, 10004813, 10583303, 8955264, 8145413, 7556376]
5673G556376K05702N84226J151530J124989l88559J80122k85995l39975Q01888
5664A0590304k68663n04955P36684J044M4302j285232L53466L73877O40818N70870
5654A1252515k86975k57957O18761Q60878K94412O14109k59524l07622j5249K12110
5644A2725458n49176R93645Q43779j358113q6994N99403m64788J795252K003644
5635A6502110j89960J52321L10081P2440m05245J319775J055821N6474n93775
5626A8280042q20752O45245M42303P99899J271022J085389n51441q74221m6871
5617B0230615j43307p39512M59961N51678L51307o80209K68961J925898p75717
5608B1449675q88627J182721J731131m74238m65223P50626M03788R03219p40514
$$ y = [7556376, 7762078, 8346304, 9497834, 10622823, 10234264, 10414386, 10128391, 9788416, 10590304, 10321641, 9816686, 10553370, 10554414, 10598716, 9313484, 9666950, 10040827, 10681645, 11252515, 10965540, 10707583, 11326344, 12187222, 12481634, 13095743, 12836219, 12528597, 12513348, 12725458, 12176282, 13169927, 14013706, 12655593, 12568599, 13168002, 12703214, 14498466, 16502110, 16312150, 16464471, 16774552, 16846992, 16441747, 17761522, 18817343, 18873817, 18280042, 17459290, 18104535, 18546838, 19346737, 20617759, 21703148, 21151707, 20277486, 20230615, 20087308, 19347796, 19807757, 20359435, 20710742, 20030533, 20299494, 22225392, 21449675, 20561048, 21743769, 23474900, 23000662, 22535439, 23286065, 23689853, 24593072, 23852558]
5599B3852558o06759p6983j82436P41575R18495m6098O57950J238499O04220k16551
5589B6884470o97038J590762o6103j545354N01968Q06760j66343j787617k346179
5580B3175326P474O27169Q491j11064K5994K33908O25q66415o28890K55450p50978
5569B1977090q1300N60971J258107J368202M49035j951729N54828M66413j002776
5560B3598841N26126N00419R22295n64195m16152k86939j613025L58116o3616
5551B2961870j788461J651447N1039n60262J58346L33792R25202J170320r86814
5542B3916479n37956Q86418M08754j09189m4170P38452k24514N37296m7949N79375
5532B6102996K89015J046526l5942L74579R14124O7079K16322o17327n68247J515251
$$ y = [23852558, 23245799, 23168816, 22986380, 23727955, 24646450, 24600352, 25258302, 26496801, 27101021, 26884470, 26187432, 27778194, 27712091, 26166737, 26668705, 27475465, 27309122, 25521505, 23175326, 23182800, 23809969, 23818460, 23707396, 23733390, 23967298, 23967923, 23101508, 22472618, 22728068, 21977090, 21895790, 22456761, 23714868, 25083070, 25532105, 23580376, 24135204, 24601617, 23598841, 24124967, 24625386, 25547681, 24983486, 24567334, 24280395, 22667370, 23025486, 22961870, 21173409, 22824856, 22875895, 22315633, 22473979, 22807771, 23732973, 24903293, 23916479, 23378523, 24264941, 24673695, 24564506, 24520336, 25258788, 25034274, 25571570, 25523621, 26102996, 26392011, 27438537, 27402595, 27777174, 28691298, 28758377, 28974699, 28357372, 27789125, 29304376]
5522B9304376J811630J90193J584794J69871O77473K70436K98684j08520J433110
5513C5632047J549228J138119K113009Q35782j064979O08780O57700m55626J230194
5504D2244254J336006J796386J174909J070246P82179J64781O66952Q02476J367554
5495E1405743J974340J668361J658237P69940N01338J690679K702131K122113
5487F4492882M51999J957624L257252K967692J951197J243907K236088J894482
5479H0453123K181259K108705K499074L671546J792934J626351M954648L333283
5471A02620923L415517L193247L813657L542990L360248M895567N272657M888723
5463A35003529M176481M570270O187986N546719L807578M659015M895796M487652
$$ y = [29304376, 31116006, 31306199, 32890993, 33060864, 33738337, 34008773, 34307457, 34198937, 35632047, 37181275, 38319394, 40432403, 41268185, 40203206, 40811986, 41469686, 41014060, 42244254, 43580260, 45376646, 46551555, 47621801, 48403980, 48568761, 49235713, 50038189, 51405743, 53380083, 55048444, 56706681, 57476621, 57977959, 59668638, 62370769, 64492882, 64944881, 66902505, 70159757, 73127449, 75078646, 76322553, 78558641, 80453123, 82634382, 84743087, 87242161, 90913707, 92706641, 94332992, 99287640, 102620923, 106036440, 109229687, 113043344, 116586334, 119946582, 124842149, 130114806, 135003529, 139180010, 143750280, 149938266, 155484985, 159292563, 163951578, 168847374, 173335026]
5455A73335026N282649M543534K312878K403239J703343R90643J261732O37148
5447A92470192J283104L71311r2013Q0119k95530j358503j285487o3940m29741
5438A90679512j66325J554658m14784k498414n62119l8830N3702p55643j472171
5429A86379586k46880r95610k614889j531561j859562l547485l909671j433594
5421A70240334j508072l211189l368936l217309l535815n121735n123367l054526
5413A42099385k361542l267429k349355p98861k498533l605811k433787j439627
5405A23344440q94826j59419j103899j966605k080830o73529j644190k250762
5397A12570380k038080p23139Q6569j454140k262445j172409j239481l042830
$$ y = [173335026, 178617675, 183161209, 185474087, 187877326, 189580669, 190571312, 191833044, 192470192, 193753296, 194124607, 194032594, 194112713, 193817183, 192458680, 191173193, 191109253, 190679512, 190513187, 192067845, 191653061, 189154647, 188592528, 188553698, 188607400, 187851757, 186379586, 186132706, 185137096, 182522207, 180990646, 179131084, 175583599, 171673928, 170240334, 168732262, 165521073, 162152137, 158934828, 155399013, 150277278, 145153911, 142099385, 139737843, 136470414, 134121059, 133322198, 130823665, 127217854, 124784067, 123344440, 122449614, 122290195, 121186296, 119219691, 117138861, 116465332, 114821142, 112570380, 110532300, 109809161, 109895730, 108441590, 106179145, 105006736, 103767255, 100724425]
5389A00724425j928157n61977j28343j612934k649177j382624r38302k071874
5381H9451037k308687k220994o72990j034613j691876q78468k338367k992121
5373G5312921k425077j004346j405315k338827k210253q05661j588605k436778
5365F1098059j751477k244719j641902j700409j325748o80853j710865j491571
5357D8550515k75748j844380k151295q77683P0163j241290j885772n58993r01591
5348C8883926l1633L21804r99182o35312n54397j052197l75905n01447M00316
5339C5455973m07958o67495j408586r84678M00710j53211J427402L42228k622209
5330C1382176J45911J227441p5135N35534j249017P52602k2932j644963j75663
$$ y = [100724425, 98796268, 98234291, 98105948, 96493014, 93843837, 92461213, 91522911, 89451037, 87142350, 84921356, 84248366, 83213753, 81521877, 80643409, 78305042, 75312921, 72887844, 71883498, 70478183, 68139356, 65929103, 65123442, 63534837, 61098059, 59346582, 57101863, 55459961, 53759552, 52433804, 51752951, 50042086, 48550515, 48274767, 46430387, 44279092, 43401409, 43471572, 42230282, 40344510, 39785517, 38883926, 38852293, 39174097, 38174915, 37539603, 36985206, 35933009, 35557104, 35055657, 35455973, 35048015, 34380520, 32971934, 31987256, 32387966, 32234755, 33662157, 34004385, 31382176, 31528087, 32755528, 32680393, 33215927, 31966910, 32719512, 32696580, 31051617, 30875954]
5321C0875954J153020P93166N71386N6886L27008o30272J08299O58293K81637
5312C4195377p1969M08017k0638p5481J357339Q74103J020427k60562K49159J29730
5302C7805502K63613k03748K88059O74325o95796L13433J176635Q02794M74863
5293D0899680M93351o44256l72101N93722M48046J215976J860893k74259J309434
5284D5530486J022308J73152L89476R19163R49566Q91725P20232j864301j68328
5275D8563479J119377L86102k27685Q51921O08317J423714k53763n66906K6493
5266E1931049K620006J766891k12638J85184j41673N7479O97817P82507K03963
5257E7890585M08733K40223L79674j32157K45650k38057P50858O11358K78726
$$ y = [30875954, 32028974, 32822140, 33393526, 33450412, 33777420, 33147148, 33255447, 33913740, 34195377, 34123408, 34531425, 34510787, 34435306, 35792645, 36666748, 37687175, 37426613, 37675772, 37805502, 38069115, 37865367, 38153426, 38827751, 38131955, 38445388, 39622023, 40424817, 40899680, 41393031, 40748775, 40376674, 40970396, 41418442, 42634418, 44495311, 44221052, 45530486, 46552794, 46725946, 47115422, 48034585, 48984151, 49875876, 50596108, 48731807, 48563479, 49682856, 50068958, 49841273, 50693194, 51301511, 52725225, 52471462, 51904556, 51931049, 54551055, 56317946, 56105308, 56290492, 56148819, 56206298, 56904115, 57686622, 57890585, 58299318, 58539541, 58919215, 58787058, 59032708, 58794651, 59545509, 60156867, 60435593]
5248F0435593R35813N13784k10082k4744p62818O13981J743967O68101O7136r41589
5238F3039142M09293N53952L52698j463438r04336r40007N5005K03867o029k25223
5228F1074924m79510p84836P0245k33235J73857J256625j018493N18297p63091
5219E9814783o54741L1193j103173r67464j23467j25491J314602M01493m54875
5210E8132860j221171J077894O17419q15193r47670p50948P3035N50770P48771
5201E7465767j336789L42567M28751j212828j149225k44498j15033k95945j291730
5192E2591037j107212J45046j582o07811r94856n88153j234880L0593M21865p41148
5182D7912899q95849j64331q50974K28379P4322j438056m56469r95033n59310
$$ y = [60435593, 61371406, 61885190, 61675108, 61650364, 60887546, 61501527, 63245494, 63913595, 63980731, 63039142, 63448435, 64002387, 64355085, 62891647, 61987311, 61047304, 61102309, 61306176, 61300147, 61074924, 60595414, 59810578, 59880823, 59647588, 59821445, 61078070, 60059577, 60577874, 59814783, 59160042, 59191235, 58088062, 57120598, 56997131, 56871640, 58186242, 58587735, 58132860, 56911689, 57989583, 58607002, 57791809, 56844139, 56093191, 56166226, 56716996, 57465767, 56128978, 56471545, 56900296, 55687468, 54538243, 54293745, 54178712, 53882767, 52591037, 51483825, 51628871, 51627289, 51019478, 50024622, 49436469, 48201589, 48232182, 48654047, 47912899, 47017050, 46852719, 46001745, 46230124, 46304446, 44866390, 44409921, 43414888, 42855578]
5173D2855578O84084r46193j00007q79375j928628J14319L72166J349957j038780
5164D0483121j564545n75294O72015j8214p31185k38700k9301k433194j558294
5155C4006409J426230J20451o04381L15478k64927q4146L06799j159964j52890
5146C3909059K43333k09248n54423j541643m78000l00904L44707k90478j94123
5137C0928280L39638r14311J1545n75873m33082L46990j560087K71939O93551
5128B9108590R7233P23338m85010j223919k53799K35754l43583J437070J831160
5119C1126834P70256l56672j555532o48352L16720n44812N88310Q35464K298363
5110C2830579P95238j486876k6678J023869O15815M79239J006216J164086J007939
$$ y = [42855578, 43539662, 42593469, 42493462, 41614087, 39685459, 39799778, 40171944, 41521901, 40483121, 38918576, 38343282, 39015297, 38997083, 38265898, 38027198, 37997897, 35564703, 34006409, 35432639, 35553090, 34948709, 35264187, 34999260, 34915114, 35221913, 34061949, 33909059, 34152392, 33943144, 33388721, 31847078, 31369078, 31068174, 31412881, 31122403, 30928280, 31267918, 30353607, 30365152, 29789279, 29356197, 29703187, 28143100, 28415039, 29108590, 29205823, 29929161, 29444151, 28220232, 27966433, 28202187, 27858604, 29295674, 31126834, 31897090, 31540418, 29984886, 29336534, 29653254, 29108442, 29696752, 30532216, 32830579, 33625817, 32138941, 32112263, 33136132, 33751947, 34231186, 35237402, 36401488, 37409427]
5101C7409427l34020j565349j62197J136738J240733J270572R10767K124645L93889
5092D2425205p22507j066957n34453J078293q4031O64793N46766K05091j47196
5083D2365004k32459j6387K86844j10778J136799L86660j544760L12080K68622
5074D2851625r3966o27984L51373J733974J55442l87739J49987R32517k86240
5065D4778989m64878l07973R15698N1184j35964J239406O85704j135243q78067
5056D4748856O9024K20648m37064l35190R23396O35620P3583j048637M41634M17052
5046D5708922L30193n37380J757169J264372r16896J07441J442493L29070J53433
5037D9638817J33790j45451J699275P32379O12562M66733J612718L44649J395457
$$ y = [37409427, 37075407, 35510058, 35347861, 36484599, 37725332, 38995904, 39906671, 42031316, 42425205, 41702698, 40635741, 40101288, 41179581, 41095550, 41760343, 42307109, 42512200, 42365004, 42132545, 42116158, 42403002, 42292224, 43429023, 43815683, 42270923, 42583003, 42851625, 42757659, 42129675, 42481048, 44215022, 44370464, 43982725, 44132712, 45065229, 44778989, 44314111, 44006138, 44921836, 44973020, 44837056, 46076462, 46762166, 45626923, 44748856, 44817880, 45038528, 44601464, 44266274, 45189670, 45825290, 45898873, 44850236, 45291870, 45708922, 46039115, 45501735, 47258904, 48523276, 47606380, 47713821, 49156314, 49485384, 49638817, 49772607, 49627156, 51326431, 52058810, 52671372, 53138105, 54750823, 55095472, 56490929]
5028E6490929J335752j145962J266685J696167O12923J839741R29655J423065
5020F4448955Q98334K89669J141185J088365N03031j294150P20673K320989Q16192
5011G0933243l52122K27809j186448J138023m43347J49001P19863J00709J1497
5002G1298228K21385M68118P61151J142430k07178N36998N10373N15151o04445
4993G4642211M48573J906529J674514J846272L25995q79996J108830P99733Q30794
4984H2703455J170836K65859N65589l1799K45124J406794J230091J081086J48428
4975H8785463R81555J998575Q05409N81343m33379L31788J507347J793805P75262
4966I7127168J544734K001433P35897K03896J155182O06099K29613R42940O91342
$$ y = [56490929, 57826681, 56680719, 57947404, 59643571, 60256494, 62096235, 63025890, 64448955, 65347289, 65636958, 66778143, 67866508, 68369539, 67075389, 67796062, 70117051, 70933243, 70581121, 70808930, 69622482, 70760505, 70317158, 70466159, 71186022, 71286731, 71298228, 71519613, 71987731, 72748882, 73891312, 73684134, 74221132, 74731505, 75246656, 74642211, 75090784, 76997313, 78671827, 80518099, 80844094, 79964098, 81072928, 81872661, 82703455, 83874291, 84140150, 84705739, 84673940, 84919064, 86325858, 87555949, 88637035, 88785463, 89767018, 91765593, 92571002, 93152345, 92718966, 93050754, 94558101, 96351906, 97127168, 98671902, 100673335, 101409232, 101613128, 102768310, 103374409, 103604022, 104546962, 105238304]
4957A05238304J20038j342757k106504p27183j807644k656832j107111p70858
4949I4839453p39261j269950j074672l68762j470539k625779p67521j75440j01425
4940H6246104q70785o29317j166080q91663j238275p31373O25232j37551j56852
4931H1049440l24881m14659n13538r04052j0869J15902J228044P25800J548630
4922H2499817M38248k60109J411915q06592j184734N15773J137080K019309n8246
4913H5712461J260027K325287J027314J226182J452653N23781J044069o06552
4905I3965222J325823K449563P29447K148465N01223J473613J664481R84145K65059
4896A05507041J812045L004484J666279j22773M64604J432381M58821o06090Q67464
$$ y = [105238304, 105358342, 104015585, 101909081, 101181898, 99374254, 96717422, 95610311, 94839453, 94100192, 92830242, 91755570, 91386808, 89916269, 87290490, 86522969, 86347529, 86246104, 85375319, 84746002, 83579922, 82688259, 81449984, 80718611, 81343843, 81206292, 81049440, 80724559, 80309900, 79796362, 78892310, 78881441, 78997343, 80225387, 80951187, 82499817, 82938065, 82677956, 84089871, 83283279, 82098545, 82614318, 83751398, 85770707, 85712461, 86972488, 89297775, 90325089, 91551271, 93003924, 93527705, 94571774, 93965222, 95291045, 97740608, 98470055, 100618520, 101119743, 102593356, 104257837, 105241982, 105507041, 107319086, 110323570, 111989849, 111867076, 112331680, 113764061, 114222882, 113616792, 114484256]
4887A14484256K742796K778781Q32290q0444J648247J167420J242775l9041O37599
4878A25414679j5683O62135J205632k56734J085034J4704l61904Q70487L3541
4869A28651891L30832N11860o94821p93320j683940Q6836j300659k94744j26918
4860A24687017l19310j905754j221887j484265j361214j303004j781867J05106
4852A15414822p82769k094592k519168j972867k432056o21374j599971j046248
4844A02345777k148576j505939r42580j672236k445210n81876r29082j100923
4836I1019355j644959j433005j516p49675j681907j103730j94354l80534J155728
4827H4985403o52750M94596l41647J80809P45117J132865M12175J873706J145287
$$ y = [114484256, 117227052, 120005833, 120838123, 120757679, 122405926, 123573346, 124816121, 124777080, 125414679, 125398996, 126061131, 127266763, 127010029, 128095063, 128109767, 127747863, 128618350, 128651891, 128982723, 129494583, 128799762, 128006442, 126322502, 126409338, 125108679, 124813935, 124687017, 124367707, 122461953, 121240066, 119755801, 118394587, 117091583, 115309716, 115414822, 114632053, 112537461, 110018293, 108045426, 105613370, 104991996, 103392025, 102345777, 100197201, 98691262, 97748682, 96076446, 93631236, 93049360, 92120278, 91019355, 89374396, 87941391, 87939875, 87190200, 85508293, 84404563, 84210209, 83829675, 84985403, 84332653, 84827249, 84485602, 84666411, 85411528, 86544393, 86956568, 88830274, 89975561]
4818H9975561K82319M71169J767962L102018J413599J026387M48309N64516J116035
4809A00167875J104162J579575K576904K726623K009494J580904K208680J589649
4801A15543866K676258Q76959J406892K990617K725248K392897J939690L514851
4793A34067278K682519L864143L966448K251714J740415L347484L405518L961417
4785A59286936L402864M407786L914384L314192M255553N459419O939317O066889
4777A97047340N522511O687955P991880Q130879R408233P727855R012373Q949247
4769B60478273J0034672R038093R008429Q900990R074067Q870681P461982O953485
4761C29820672O310017N582662L346124K578796K95205l80356r43695j314696
$$ y = [89975561, 90257880, 90729049, 92497011, 95599029, 97012628, 98039015, 98487324, 99051840, 100167875, 101272037, 102851612, 105428516, 108155139, 110164633, 111745537, 113954217, 115543866, 118220124, 119097083, 120503975, 123494592, 126219840, 128612737, 130552427, 134067278, 136749797, 140613940, 144580388, 146832102, 148572517, 151920001, 155325519, 159286936, 162689800, 167097586, 171011970, 174326162, 178581715, 184041134, 190980451, 197047340, 202569851, 209257806, 217249686, 225380565, 234788798, 242516653, 251529026, 260478273, 270512945, 279551038, 288559467, 297460457, 306534524, 315405205, 322867187, 329820672, 336130689, 341713351, 345059475, 347638271, 347933476, 347553120, 346609425, 345294729]
4753C45294729k399043j377379j758122j084386r44105j120656K18539J291262
4745C38120839k72943O24972Q891j953596j545892l165199m111024o454779n714540
4736C15536729o759020p929320r376925j1477899j2779899j0414118j0132151
4729B46667397j0817851j0233952j0686417r679001q976008r365057p836321o025097
4721A73047693p320130o641280m717950m309207n599078n919315m441738l732728
4713A30366267l763589l680673k909833l262583l216073l421854k420731k009624
4705A05681307j371349j773488j863139k143558n91758j396750j623059n25194
4697I4393012o83659j448905j725044j306036k61964o32466q58569r54651j292668
$$ y = [345294729, 342895686, 341518307, 339760185, 338675799, 337731694, 336611038, 336829577, 338120839, 337847896, 338472868, 338481759, 336528163, 334982271, 331817072, 327706048, 321251269, 315536729, 308777709, 300848389, 291471464, 279993565, 267213666, 256799548, 246667397, 235849546, 225615594, 214929177, 205250176, 196274168, 186909111, 179072790, 173047693, 165727563, 159086283, 154368333, 150059126, 144460048, 138540733, 134098995, 130366267, 126602678, 122922005, 120012172, 116749589, 113533516, 110111662, 107690931, 105681307, 104309958, 102536470, 100673331, 98529773, 97938015, 96541265, 94918206, 94393012, 93709353, 92260448, 90535404, 89229368, 88967404, 88334938, 87476369, 86521718, 85229050]
4688H5229050r07004k16132L88470q90653j101641q81158q55678j462928r42162
4679G8360164j605126j872696o62263k73840J98106q36027o72846m36416q64216
4670G1334840j826257k491234q01533j64244n68511K22466k297478j659650J31683
4661F1880082j280306o8417k98950Q93222q35446j142056j354001p20992m44345
4652E6628791j41667j275864O23450n23438l65062L65716o89817m95953K0948
4643E4147104K34873n69929J70477o81803r18977q84190q95952m89800L04615
4634E0416418q08648j970166p92322j33677r50096m81403L40402p71887n65113
4625D4283508j930512j251712N14880q26274j795928j626791j092961O04899K94848
$$ y = [85229050, 84322046, 84105914, 84494384, 83603731, 82502090, 81620932, 80765254, 79302326, 78360164, 76755038, 74882342, 74220079, 73946239, 74144345, 73308318, 72635472, 72199056, 71334840, 69508583, 67017349, 66215816, 66051572, 65483061, 65705527, 63408049, 61748399, 61880082, 60599776, 60531359, 60232409, 61125631, 60290185, 59148129, 57794128, 57073136, 56628791, 56487124, 55211260, 55834710, 55311272, 54946210, 55311926, 54622109, 54126156, 54147104, 54381977, 53812048, 53982525, 53300722, 52381745, 51497555, 50601603, 50111803, 50416418, 49607770, 47637604, 46845282, 46711605, 45761509, 45280106, 45620508, 44848621, 44283508, 42352996, 41101284, 41616164, 40789890, 38993962, 37367171, 36274210, 36879109, 37173957]
4616C7173957j618488j566909l99311Q13670q45894j656496j309625J71596Q5871
4607C0848371j245442N00733K57520n15565j288404j836847R30742J068301n17700
4598B8201709j521872j478846J84272P42307n82161q37580P85763k6254o67645
4589B4799693j214464O93040K6826q84101j33618p56391m69933l19535p7229j165426
4579B0498862q0529o33636j194877j193356o91908O5566P18956j90253k81627
4570A7017198o8692j73332n10633k58133k63052M7060j030690k58658L03456J93148
4560A4997672J204380j216877j354493q65645n54313k53164M01277q73028Q39254
4551A2325063L93176k58888j180221q57651J92424O02674J542743J69516k84600
$$ y = [37173957, 35555469, 33988560, 33589249, 34402919, 33557025, 31900529, 30590904, 30762500, 30848371, 29602929, 30103662, 30361182, 29845617, 28557213, 26720366, 27651108, 28719409, 28201709, 26679837, 25200991, 25385263, 26127570, 25545409, 24707829, 25493592, 25467338, 24799693, 23585229, 24278269, 24305095, 23420994, 23287376, 22530985, 22061052, 21741517, 21664288, 20498862, 20418333, 19784697, 18589820, 17396464, 16704556, 16770122, 17489078, 17298825, 17017198, 16948506, 16775174, 16264541, 16006408, 15743356, 15790416, 14759726, 14501068, 14804524, 14997672, 16202052, 14985175, 13630682, 12765037, 12210724, 11957560, 12358837, 11485809, 12325063, 12718239, 12459351, 11279130, 10421479, 10613903, 11216577, 12759320, 12928836, 12644236]
4542A2644236j152900n25429j130208R66934k07222l28830l40335L39497o49681
4533I616062r72245k18769Q74349Q17216L84036p24971o98053J577042m81234
4524A0173433J70321K31906n64675p73325o50166j04564J473573j113576r08545
4515G934382N0530n7869M51197k27737O51372n51210o67119k4661P70421N00829
4505H830135N29612o61937K1429L94570K96718j025384j74308L58809N97748q84415
4495H282977p82358Q73261J077369n99939j096301K66216o0545J10219r3416J25419
4485H102902J92833J577935k76769j321693P60542R12055j237771n57510P48553
4476H901077J418115j116221o03882k51926n7565l69191l43610J853934R73613
$$ y = [12644236, 11491336, 10965907, 9835699, 10802633, 10595411, 10266581, 9926246, 10265743, 9616062, 8643817, 8425048, 9299397, 10116613, 10500649, 9775678, 9077625, 10654667, 10173433, 10343754, 10575660, 10010985, 9237660, 8587494, 8482930, 9956503, 8842927, 7934382, 7984912, 7927043, 8378240, 8150503, 8801875, 8250665, 7583546, 7558885, 8329306, 8830135, 9359747, 8697810, 8719239, 9113809, 9410527, 8385143, 8210835, 8569644, 9167392, 8282977, 7500619, 8373880, 9451249, 8851310, 7755009, 8021225, 7960680, 8070899, 7977483, 8102902, 8295735, 9873670, 9596901, 8275208, 9035750, 9947805, 8710034, 8152524, 8901077, 10319192, 9202971, 8599089, 8347163, 8289598, 7920407, 7576797, 9430731, 10404344]
4467A0404344j837002P26120O88239r35945J368809P32842m12665j351481o65739
4458H717522J218281l7850n73200P37034J67380j259160o90883K029382J040011
4449A1348517l55512K78347P95696j229468j363987N99189O20276J312807n49579
4440A1456286R98077J319338n98997n11093N39363k6582m55411K00895Q26656
4431A3748532M55082o41226J91712L96219J304912l04234J3972Q95649J05842
4422A6166460m93530J05156j40563n52404N26154J456531J542661Q65650k08284
4413A9267831o97361p403j96364N02987R01210Q81105l47797M77198J708929J097176
4403B3587511N52252J36041J026759J107469R56758N47278N45701O99295r33627
$$ y = [10404344, 8567342, 9293462, 9981701, 9045756, 10414565, 11147407, 10734742, 9383261, 8717522, 9935803, 9897953, 9324753, 10061787, 10229167, 8970007, 8279124, 10308506, 11348517, 10993005, 11271352, 12067048, 10837580, 9473593, 10072782, 10693058, 12005865, 11456286, 12454363, 13773701, 13174704, 12663611, 13202974, 13176392, 12720981, 12921876, 13748532, 14203614, 13562388, 13754100, 14150319, 15455231, 15150997, 15164969, 16060618, 16166460, 15672930, 15778086, 15637523, 15085119, 15611273, 17067804, 18610465, 19476115, 19267831, 18570470, 18563067, 18366703, 18869690, 19770900, 20652005, 20304208, 20781406, 22490335, 23587511, 24139763, 24275804, 25302563, 26410032, 27366790, 27914068, 28459769, 29159064, 28225437]
4394B8225437J202778K834811J540710J018728K270740L293588J713752M6013
4386D2146557J524875K651009J155504J650085K294567L519868K246391p0650
4378E7118206J981814K670013K066881K858091J711072P99381N09940J197420
4370G0912818K061937L63586K92114J107621R38879N77635j393194j495079l70344
4361G2995973j078736o36633p90448k307599l018649k256988j634589o51915k064597
4352E8555819l116335k526666k647538k338452j465869k266076k759969k602757
4344C8832157k459831m71860m50188j975982k269025j927576n10382q57732k596309
4335B5313272j078852j507319r78176o07740l56522P37834r1365k368662r72499
$$ y = [28225437, 29428215, 32263026, 33803736, 34822464, 37093204, 40386792, 42100544, 42146557, 43671432, 46322441, 47477945, 49128030, 51422597, 54942465, 57188856, 57118206, 59100020, 61770033, 63836914, 66695005, 68406077, 69205458, 69715398, 70912818, 72974755, 73338341, 73630455, 74738076, 75676955, 76254590, 74861396, 73366317, 72995973, 71917237, 71280604, 70490156, 68182557, 65163908, 62906920, 61272331, 60620416, 58555819, 55439484, 52912818, 50265280, 47926828, 46460959, 44194883, 41434914, 38832157, 36372326, 35900466, 35450278, 33474296, 31205271, 29277695, 28767313, 27909581, 25313272, 24234420, 22727101, 21748925, 21141185, 20784663, 21522497, 21431132, 19062470, 18089971]
4326A8089971J115883m04505j298232n52792K32120l26689j942726j225219Q6004
4317A3773815O88572K32006m71253L82493j33621j940598j19083K43521Q44549
4308A3500401K33069q74431M13345l71669r30694L97690k17459j85205m02227
4299A1562820O94666J31479n38836O81274q59061o64515o54547k36292O13096
4290A0730084J87302J22551P94824m0284p94853k10951L01368k91077L94647l00723
4280A0892888q59832P62409L90143r33271k246191q92389J832710J24584p77359
4271H293692N16388N15973O5311J27758L98504N98778p48143j660500M13630J130630
4261I652021j83440J38565K63478j399807o03655Q7083P18618j32767n30802P74402
$$ y = [18089971, 19205854, 18801349, 17503117, 16950325, 17182445, 16855756, 14913030, 13687811, 13773815, 14462387, 14694393, 14223140, 14605633, 14472012, 12531414, 12412331, 12655852, 13500401, 13733470, 12859039, 13272384, 12900715, 11970021, 12367711, 12150252, 11965047, 11562820, 12257486, 12388965, 11850129, 12531403, 11672342, 11007827, 10353280, 10116988, 10730084, 10917386, 11039937, 11834761, 11794477, 10999624, 10788673, 11090041, 10798964, 11193611, 10892888, 10033056, 10795465, 11185608, 10252337, 8006146, 7113757, 8946467, 9071051, 8293692, 8810080, 9326053, 9391364, 9519122, 9917626, 10516404, 9768261, 8107761, 8521391, 9652021, 9468581, 9607146, 9870624, 8470817, 7867162, 7954245, 8672863, 8540096, 8009294, 8783696]
4251H783696k90305M50703p65889r54094J477508L53364k06997R76703k34137
4242I590552n41525j308146L59985P58640K21871J3920p49932J052531k6530k821071
4232F550295p67971J388131P94538L18297J95240M65152l26134p12048l56193
4223G549307J204060J89885j72392n9629q7668o48409l01592L04847p712O89476
4213H660173J051702O86881j327132n39845j170940l20261P55251R25323N11412
4204I232564J90861p91372m28882l08455L52515J112517q16509j067570R10978
4195H386647M82580k64468N4358R40298j2679o32323j449303m31440Q86702M68302
4185H428674J289420M22824l90274J23634L40638l41195k99361J36469N18983
$$ y = [8783696, 8493391, 8944094, 8178205, 7224111, 8701619, 9054983, 8847986, 9824689, 9590552, 9049027, 7740881, 8100866, 8859506, 9081377, 9095297, 8345365, 9397896, 9371366, 6550295, 5782324, 7170455, 7964993, 8283290, 8478530, 8943682, 8617548, 7905500, 7549307, 8753367, 8943252, 8770860, 8711231, 8623563, 7975154, 7673562, 7978409, 7970697, 8660173, 9711875, 10398756, 9071624, 8531779, 7360839, 7040578, 7795829, 8721152, 9232564, 9423425, 8632053, 8203171, 7894716, 8247231, 9359748, 8543239, 7475669, 8386647, 8869227, 8604759, 8659117, 9599415, 9586736, 8954413, 7505110, 7073670, 7960372, 8428674, 9718094, 10140918, 9750644, 9874278, 10214916, 9873721, 9574360, 9710829, 10229812]
4176A0229812p45186K06431l90659M56233R40339M40208m0099M3678r48847L65004
4166A0556914O26902K4429N03462r04387M73071l68737l54755o9263M11636K97252
4156A1196524J231596r12450o38548R92770j6659n29941j060960L78801J768271
4147A2409404J600860n41656n64414n26126N68853j112204N2381O43529r83410
4138A1547217N42070N61961r35670K006676K56359n39903J65549n99861J108749
4129A4113147O92921j28207J372409J41029p09423q66079K829P27621j559493
4120A3786754J356706J734620J065545j24164q36294L16387J026710j529120j094043
4111A5703101J098644J219093J371278O05088r77482r43956M15691k26354P13718
$$ y = [10229812, 9484626, 9691057, 9300398, 9756631, 10696970, 11137178, 11097079, 11140757, 10191910, 10556914, 11183816, 11208245, 11711707, 10807320, 11280391, 10911654, 10556899, 10487636, 10899272, 11196524, 12428120, 11515670, 10877122, 11869892, 11853233, 11323292, 10262332, 10641133, 12409404, 14010264, 13468608, 12904194, 12378068, 12946921, 11834717, 11887098, 12530627, 11547217, 12089287, 12651248, 11715578, 13722254, 13978613, 13438710, 13604259, 13004398, 14113147, 14806068, 14677861, 16050270, 16191299, 15481876, 14615797, 14618626, 15346247, 13786754, 15143460, 16878080, 17943625, 17819461, 16983167, 17299554, 18326264, 16797144, 15703101, 16801745, 18020838, 19392116, 19997204, 19019722, 18075766, 18491457, 18265103, 18978821]
4102A8978821J154831J276854N01681o98996L9360J000622p34729m75348j72090
4093B0871006K842515J349547j942451l91519J156125J439435R88181J79671m74186
4084B6018324L92800J88778J99675J445951O27004L75768j54000n88698L62443
4075B8868045J844959J325751q67583N91030P60076j04398q2638k76333Q45916
4066C2904825K236065J473161M47766J122303N48977J47693J671592J042215l46078
4057D1248519L29624J400994J927081J515702n24576O44419M76406J658169J403092
4048E0079430J461191Q78181J364349J577474L68050Q02169K425958J912073J994129
4039F2863004K337048J351591N70876K196210J375300K000118K234631J350147
$$ y = [18978821, 20133652, 21410506, 21912187, 21213191, 21252551, 22253173, 21518444, 21043096, 20871006, 23713521, 25063068, 23120617, 22729098, 23885223, 25324658, 26312839, 26492510, 26018324, 26411124, 26599902, 26799577, 28245528, 28872532, 29248300, 29094300, 28505602, 28868045, 30713004, 32038755, 31171172, 31762202, 32522278, 32417880, 32335242, 32058909, 32904825, 35140890, 36614051, 37061817, 38184120, 38733097, 38880790, 40552382, 41594597, 41248519, 41578143, 42979137, 44906218, 46421920, 45897344, 46541763, 47018169, 48676338, 50079430, 51540621, 52418802, 53783151, 55360625, 55728675, 56530844, 58956802, 60868875, 62863004, 65200052, 66551643, 67122519, 69318729, 70694029, 72694147, 74928778, 76278925]
4031G6278925L224633K591685J005755J843764M376506L869774K132729K332661
4023I7656432M194122L107627K835398J976638K651099N007799N110022M050971
4015A26590108L694195K882227L211431N989190M533887L869727M536826L776173
4007A59083764M786982M381617M206246M241515M832246N083985M366386M818303
3999A95801044M037041L982120N038865L556835L539668K918379K797309K985518
3991B24656779L427670K323157K451909K635583J519955N01163J531286J025577
3983B40073079N68030P47569m17758q65533r42721j691610k956731j243856j515837
3974B31754632j872800k021882l092391l603749l065460l566250l161477k876397
$$ y = [76278925, 79503558, 82095243, 83100998, 84944762, 89321268, 93191042, 95323771, 97656432, 101850554, 104958181, 107793579, 109770217, 112421316, 117429115, 122539137, 126590108, 130284303, 133166530, 136377961, 142367151, 146901038, 150770765, 155307591, 159083764, 163870746, 168252363, 172458609, 176700124, 181532370, 186616355, 190982741, 195801044, 199838085, 203820205, 208859070, 212415905, 215955573, 218873952, 221671261, 224656779, 228084449, 230407606, 232859515, 235495098, 237015053, 237516216, 239047502, 240073079, 240641109, 241388678, 240970920, 240105387, 239162666, 237471056, 234514325, 233270469, 231754632, 229881832, 227859950, 224767559, 221163810, 218098350, 214532100, 211370623, 208494226]
3966B08494226n317188m488694k629391l424925l834838o281769n613509m319927
3958A72583985n105745n688693n379133l627859l749284n212023n239597m933929
3950A33647722l815424m102455l983902l327421l254044m693397m464128k387494
3942A03619457k233751k602681k593289k964043k070132k179420l473222j837736
3934H3665183j736415j898150j930149j983899m61334p06154j876132j307082
3926G1765868j530622k18622j004529r96821o67953k54851j28840p9978k152149
3917F4731503j492000P39260p62807m34956l72487P0832J136948r31972p26096
3908F1958225O97736j240232R42066J013721n50274o69311l1586J021859P38975
$$ y = [208494226, 203177038, 198688344, 196058953, 192634028, 188799190, 182517421, 176903912, 172583985, 167478240, 161789547, 156410414, 152782555, 149033271, 143821248, 138581651, 133647722, 129832298, 125729843, 121745941, 118418520, 115164476, 110471079, 106006951, 103619457, 101385706, 98783025, 96189736, 93225693, 91155561, 88976141, 85502919, 83665183, 81928768, 80030618, 78100469, 76116570, 75655236, 74949082, 73072950, 71765868, 70235246, 70016624, 69012095, 68015274, 67347321, 67092470, 66963630, 66883652, 64731503, 63239503, 63978763, 63215956, 62781000, 62408513, 62479345, 63616293, 62684321, 61958225, 62655961, 61415729, 62357795, 63371516, 62821242, 62151931, 62120345, 63142204, 63881179]
3899F3881179N18614l63179Q98135Q04428K272866J817966q07421k21609L00712
3890F9101691J516612J723557K93137K415883M47106l66639J416853K539751K979854
3881H2067805R92781J011270J983247K573601J689457R94199K091367J441776
3873I4845503Q69324J018504J678071L252693K114494M64097J926227K238277
3865A08407190J144432O52754J469364L388969J844306J830716J903971L375999
3857A24017701K584333J837234K809932K229246L317929L263663K748513L698917
3849A46507468K303498K541514K752437K097749M567561O165404N441107M656851
3841A77033589N937934N977495M653832N590312O554568O099018P641721Q052687
$$ y = [63881179, 64399793, 64036614, 64934749, 65739177, 68012043, 69830009, 69022588, 68800979, 69101691, 70618303, 72341860, 72634997, 75050880, 75497986, 75131347, 76548200, 79087951, 82067805, 83060586, 84071856, 86055103, 88628704, 90318161, 91312360, 93403727, 94845503, 95714827, 96733331, 98411402, 101664095, 103778589, 104242686, 106168913, 108407190, 109551622, 110204376, 111673740, 115062709, 116907015, 118737731, 120641702, 124017701, 126602034, 128439268, 131249200, 133478446, 136796375, 140060038, 142808551, 146507468, 148810966, 151352480, 154104917, 156202666, 160770227, 166935631, 172376738, 177033589, 182971523, 188949018, 193602850, 199193162, 205747730, 211846748, 219488469, 227541156]
3833B27541156P706375Q350778Q514321Q726822R046950R580391Q666466R957920
3825B98091179R859042J0778786J0552735J0862722J0065611J0356928R424404
3818C69991407Q629498R348596R195155Q314434P664977N302261M289081N158951
3810D27894360M164570L454166Q81914J23888j011867k773536l942561m629999
3802D24160935m668911o417102p949783p655270o569091q481137r854397q889210
3794C63676034j0788033j0598513j0353294j1152993j0377600j1311594j0824973
3787B88269034j0104825r976723j0080678j0563534r334322r039924q700513q045810
3779B12422705p818192p832117o323660p289225o428577o545136o121869n279667
$$ y = [227541156, 235247531, 243598309, 252112630, 260839452, 269886402, 279466793, 288133259, 298091179, 307950221, 318729007, 329281742, 340144464, 350210075, 360567003, 369991407, 378620905, 387969501, 397164656, 405479090, 413144067, 418446328, 422735409, 427894360, 432058930, 435513096, 436395010, 436518898, 435507031, 432733495, 428790934, 424160935, 419492024, 413074922, 405125139, 397469869, 390900778, 382419641, 372565244, 363676034, 352888001, 342289488, 331936194, 320783201, 310405601, 299094007, 288269034, 278164209, 268187486, 258106808, 247543274, 238208952, 229169028, 220468515, 212422705, 204604513, 196772396, 190448736, 183159511, 176730934, 170185798, 164063929, 158784262]
3771A58784262o000158m273332m115090l628587k945032m143346k256686l383408
3763A28038623l521770k459382k501660k403994l001594j554839p37626k560744
3755A09297014k311657j258320j211536j470385k144410k066522j353011j517132
3747I5964041j788674p85462j751142k881296j033839k183037j031372o53094
3739H3856125j153893r75543j910627j335993j080646j095789j239639m16076
3731G4647919j063231j972780j616712l18715l68721j088552j773016n70687p25564
3722F5149941j581123j611459K37155N35144n67725j180091l92220J43781r3074
3713F0640329Q60721q76614m49484j593838k52841J070764R01276l70488O9787
$$ y = [158784262, 152784104, 148510772, 144395682, 140767095, 137822063, 133678717, 131422031, 128038623, 124516853, 122057471, 119555811, 117151817, 114150223, 112595384, 111857758, 109297014, 106985357, 105727037, 104515501, 103045116, 100900706, 98834184, 97481173, 95964041, 94175367, 93389905, 91638763, 88757467, 87723628, 85540591, 84509219, 83856125, 82702232, 81726689, 79816062, 78480069, 77399423, 76303634, 75063995, 74647919, 73584688, 71611908, 69995196, 69676481, 69307760, 68219208, 66446192, 65875505, 65149941, 63568818, 61957359, 62194514, 62729658, 62161933, 60981842, 60589622, 60733403, 60640329, 61501050, 60624436, 60174952, 58581114, 58328273, 59399037, 60300313, 59929825, 59999612]
3704E9999612r4126m25207N71489l52305J034263J188558J810550J174910R46746
3695F5854490K5374J076918M20406O50840J297553K461833K562803L95775m90317
3686G4255675k58783J816966K870209J539073P16486O98095o29122k21082P08133
3677H1495650K67524J52171N78004j250589k72358L09554o38795R6596k76595
3668H0461162k033536p42689L72305k927435j078829o68634j122040j866839j013880
3659F9379585m97024o66015k055680k77118l06820L56204m20039j013340J065325
3650F5565078j653358j678033P10218J133954p67241n02606M64320J850722j789190
3641F3333864n81458J801334K541795P06582n84004J011625J713532l34018O83841
$$ y = [59999612, 59905486, 59480279, 60051768, 59699463, 60733726, 61922284, 63732834, 64907744, 65854490, 65879864, 66956782, 67377188, 68028028, 69325581, 71787414, 74350217, 74745992, 74255675, 73996892, 75813858, 78684067, 80223140, 80939626, 81637721, 81008599, 80787517, 81495650, 81763174, 81915345, 82493349, 81242760, 80970402, 81279956, 80641161, 80737757, 80461162, 78427626, 77684937, 78057242, 75129807, 74050978, 73382344, 72260304, 70393465, 69379585, 68882561, 68216546, 66160866, 65883748, 65576928, 65933132, 65513093, 64499753, 65565078, 63911720, 62233687, 62943905, 64077859, 63310618, 62808012, 63272332, 65123054, 63333864, 62752406, 64553740, 67095535, 67802117, 67218113, 68229738, 69943270, 69609252, 70293093]
3632G0293093J427153Q10662K367929P94025J664454J319172J354534J791457
3624H1822479J660558Q09039J704625J776716J204343J331320K165630J239685
3616I3714395K473089K184107J317342J427123J039217K338556J050077J762178
3608A07306084J131348R59079J339942J402175J227669K554426Q36430J545060
3600A18302213J665345J302124K002109L239186Q96455K010K168225K351514L080087
3591A35009268R54685K211454L194476K662340K367186K351354K445467L343185
3583A54539415M105747M788907L181366L385512N167155N112745N515442N708296
3575A91504585O280280N426672M943506N750257P135577O986137O557980O591771
$$ y = [70293093, 71720246, 72530908, 74898837, 75692862, 77357316, 78676488, 80031022, 81822479, 83483037, 84292076, 85996701, 87773417, 88977760, 90309080, 92474710, 93714395, 96187484, 98371591, 99688933, 101116056, 102155273, 104493829, 105543906, 107306084, 108437432, 109396511, 110736453, 112138628, 113366297, 115920723, 116757153, 118302213, 119967558, 121269682, 123271791, 126510977, 127407432, 127409442, 129577667, 131929181, 135009268, 135963953, 138175407, 141369883, 144032223, 146399409, 148750763, 151196230, 154539415, 158645162, 163434069, 166615435, 170000947, 175168102, 180280847, 185796289, 191504585, 197784865, 203211537, 208155043, 213905300, 221040877, 228027014, 234584994, 241176765]
3567B41176765P590929P518441P562123P436228P003528O406355O999740R027345
3559C00721454P111286O759336N973635N720571O912822P147447N815318N057727
3551C51219596N448187O029212K896291K621043K620513K061504M580461K945374
3543C80422181J106801L96143p60525j106622L27522n36121j073528j842433j962801
3534C74970617k285074k908462m427310k912863l900064m143121n855532o553120
3526C41985071n237909p573689p696469o349342n776556p148811q537777q318228
3518B85346290n986369p848753p536101q379277q568083p117792p590754p450455
3510B24868706o817121o251559p435101p086380o771307o866603o521943n950383
$$ y = [241176765, 248767694, 256286135, 263848258, 271284486, 278288014, 284694369, 291694109, 300721454, 307832740, 314592076, 320565711, 326286282, 333199104, 340346551, 346161869, 351219596, 356667783, 362696995, 365593286, 368214329, 370834842, 372896346, 377476807, 380422181, 381528982, 381925125, 381164600, 380057978, 380385500, 379849379, 378775851, 376933418, 374970617, 372685543, 369777081, 365349771, 362436908, 358536844, 354393723, 348538191, 341985071, 336747162, 329173473, 321477004, 315127662, 309351106, 302202295, 293664518, 285346290, 279359921, 271511168, 263975067, 255595790, 247027707, 239909915, 232319161, 224868706, 218051585, 211800026, 204364925, 197278545, 190507238, 183640635, 177118692, 171168309]
3502A71168309o231441n399180n011578m822071l311325m122219n511107l438793
3494A33320595k551013m270688k571191k187706k289139j473043k274795k613696
3486A13089324j145865k079891j952603k246131j604566j158625n34377j718414
3478A00648852k952298j360442n54238k334775l17843j498701k747575N34066
3470H9417046j830529j550818q34874k198366k615637j925008j461453r11443
3462G6088918j202808k970665l087413j031700j459972k422532j716419k01008
3454F1996401k145034k132964l52877k930578j868943j445383j897230k220525
3446D7002867k215064q37285m57240k481583l43083N69512j318140j613708j414464
$$ y = [171168309, 164936868, 159537688, 154526110, 149704039, 146392714, 142270495, 136759388, 133320595, 130769582, 126498894, 123927703, 121739997, 119450858, 117977815, 115703020, 113089324, 111943459, 109863568, 107910965, 105664834, 104060268, 102901643, 102367266, 100648852, 97696554, 96336112, 95781874, 93447099, 93129256, 91630555, 88882980, 89417046, 87586517, 86035699, 85200825, 83002459, 80386822, 78461814, 77000361, 76088918, 74886110, 71915445, 68828032, 67796332, 66336360, 63913828, 62197409, 61996401, 59851367, 57718403, 57365526, 54434948, 52566005, 51120622, 49223392, 47002867, 44787803, 43950518, 43493278, 41011695, 40668612, 41238124, 39919984, 38306276, 36891812]
3437C6891812J218089j088431k756900j062040O0137k177153l077102o90058K71885
3428B7590239P56089l42710j176612K52029j325216m82108p83170j3401J96318
3419B4671458j483423j239013P93354M97320r54364n87542j268160R49715j172552
3410B0206793q96986q78864j221017j88823n89490O55181K38780l97705j052508
3401A5875361r93587O67096O74056r3031j54813q35111l74026m85435K58319l53884
3391A4184945q91259j162341K05254P04233p28110j155103L76193P56710J09176
3382A2399698n13706k045584o45640O53152Q20605M17357l80465l58563p42258
3373I604596k45345n19587M37480J149845l85558j155831M81354q27039q72739
$$ y = [36891812, 38109901, 37021470, 34264570, 33202530, 33262667, 31085514, 28008412, 27318354, 27590239, 28346328, 28003618, 26827006, 27079035, 25753819, 25271711, 24488541, 24475140, 24671458, 23188035, 21949022, 22742376, 23239696, 22285332, 21697790, 20429630, 21379345, 20206793, 19309807, 18430943, 17209926, 17021103, 16431613, 17086794, 17325574, 16927869, 15875361, 14881774, 15548870, 16222926, 16129895, 15975082, 15139971, 14765945, 14280510, 14538829, 14184945, 13293686, 12131345, 12336599, 13040832, 12312722, 11157619, 11533812, 12290522, 12399698, 11885992, 9840408, 9194768, 9847920, 10668525, 11085882, 10705417, 10346854, 9604596, 9359251, 8839664, 9277144, 10426989, 10041431, 8885600, 9366954, 8539915, 7667176]
3364G667176o50860k53108J370625O54610J332080o27757j968640j529168J32004
3355F126962N70319K36085J13924R97524Q85j865963j084941N05995q4122P3742
3345E590410O85583J572170k51925j731856l2787k29862R06606n41896j66193
3336E800250J076403p71531J97769M51521n43717r0597j07020R02316n506j443045
3326E466843n37146J66466j94605o67090K52592L76386J36286n47226J184690
3317E637196k09157q83569M07800L64134J14968n09279q62710L25048N8404p79093
3307C663742L39099J40618K32655P15986J10845n1009j39546j124021o6678j070395
3297B751296p37697R06668l63986J569067K62662j016707L77826k85904l06820
$$ y = [7667176, 7016316, 6763208, 8133833, 8788443, 10120523, 9492766, 7524126, 5994958, 6126962, 6697281, 6933366, 7047290, 8044814, 8045699, 6179736, 5094795, 5600790, 5516668, 5590410, 6275993, 7848163, 7596238, 5864382, 5831595, 5601733, 6508339, 5966443, 5800250, 6876653, 6105122, 6302891, 6754412, 6210695, 6120098, 6013078, 6915394, 6909888, 5466843, 4929697, 5096163, 4901558, 4234468, 4487060, 4863446, 4999732, 4452506, 5637196, 5428039, 4544470, 4952270, 5316404, 5431372, 4922093, 4059383, 4384431, 4442835, 3663742, 4002841, 4143459, 4376114, 5092100, 5202945, 5151936, 5012390, 3888369, 3821691, 2751296, 2013599, 2920267, 2556281, 4125348, 4388010, 3371303, 3749129, 3463225, 3156405]
3288C156405P37534m4278J501795n53972j220998o00884o01230P63600Q64467
3279D002439N80534k48429O89619N94201K7815k181861r23716L44635J9846O13514
3269C518597J251020Q8963K07276m24680L91189K62946K87240L06892m34211p46552
3259D708680l73920N86557J84623j67248P28034K2869r27129l35009K41736q43516
3249C825677j210131O04740R94977K05946K26332l71904J365556p9621j682151
3240C879421N13391Q1238j91419n53101J67086L72476m33843K58946k62064p38568
3230C093563J558669L59486o32821j221209m33216q2584p77467j1370J127193
3221B980244J919421p40704j349084P74653J92142q8527j084680p18869Q37613
$$ y = [3156405, 3893939, 3849661, 5351456, 4797484, 3576486, 2975602, 2374372, 3137972, 4002439, 4582973, 4334544, 5024163, 5618364, 5646179, 3464318, 2540602, 2885237, 2905083, 3518597, 4769617, 4858580, 5065856, 4641176, 5032365, 5295311, 5582551, 5889443, 5455232, 4708680, 4334760, 4921317, 5105940, 4938692, 5666726, 5689595, 4762466, 4427457, 4669193, 3825677, 2615546, 3220286, 4215263, 4421209, 4647541, 4275637, 5641193, 5561572, 3879421, 4392812, 4474050, 4282631, 3729530, 3896616, 4269092, 3835249, 4094195, 3832131, 3093563, 4652232, 5011718, 4378897, 3157688, 2724472, 2641888, 1864421, 1853051, 2980244, 4899665, 4158961, 2809877, 3584530, 3776672, 3688145, 2603465, 1884596, 2722209]
3212B722209M76149n31793J21536P10292j91947j098291M62004N12479m35003
3203B747635n35165L98227J033518q24056k36571L99214O59058L4224Q6993n23157
3193C239920p07386o18119Q88093l41307l48585k24755j69650m28792N59996J186809
3183C036224m33510l99559J96944K76056m17778j89074m73386N05784j78559K5003
3173A948145J81556M15799n33937o60627j55843J90378j81553J87149o25682j80055
3163E85330R31096o98815o79407m54268Q22690J261801J16650q31877n51795K48650
3153G50055J85839R7160P85351n52602p33300N240n49060J62272L07067o64402
3143b06380J086189J619261p87118q39150M9326R74682J30001o2142l08050O26956
$$ y = [2722209, 3198358, 2666565, 2788101, 3498393, 3306446, 2208155, 2670159, 3182638, 2747635, 2212470, 2610697, 3644215, 2820159, 2583588, 2982802, 3641860, 3676084, 3763077, 3239920, 2532534, 1914415, 2802508, 2461201, 2112616, 1887861, 1718211, 1289419, 1849415, 3036224, 2602714, 2203155, 2400099, 2676155, 2258377, 2069303, 1595917, 2101701, 1923142, 1948145, 2129701, 2545500, 2011563, 1350936, 1195093, 1385471, 1203918, 1391067, 765385, 585330, 1516426, 817611, 138204, -316064, 506626, 1768427, 1885077, 1053200, 501405, 750055, 935894, 1033054, 1818405, 1265803, 532503, 537743, -11317, 150955, 458022, -206380, 879809, 2499070, 1711952, 872802, 922128, 1896810, 2026811, 1964669, 1656619, 2283575]
3133B283575p10597j742108J44675J757630J99168r89324r69429M6883J485503
3124A505976O25243l44555p48287j13227L89200K12757K73313R40475K03423O72022
3114C616340j381567j90920K64371p44743O9302o44896K6209O60842p82598n74969
3104C17371J055813j01292l10839j68076J68288m84108O99988j90329m05760M85684
3094A066740m82981M51249M40866j170378n18860Q07693l71806k25549O67535
3085F64509Q179j003319P39477K96410J30689K58666q77097p50806R57330l32448
3075I1590p57519J468532l02220O20723J048915j574269m63460M67097j339988
3066g40599q3158O37390p67055o29199Q62312J079908O64186O17075j096163j8610
$$ y = [2283575, 1572978, -169130, -24455, 1733175, 1932343, 943019, -26410, 20473, 1505976, 2131219, 1786664, 1038377, 925150, 1314350, 1527107, 1800420, 2740895, 2944318, 3616340, 2234773, 2043853, 2308224, 1563481, 1632783, 987887, 1014096, 1674938, 892340, 317371, 1373184, 1271892, 961053, 792977, 961265, 477157, 1177145, 986816, 581056, 1066740, 583759, 1035008, 1475874, 305496, -213364, 594329, 222523, -3026, 664509, 672688, -330631, 408846, 705256, 835945, 1094611, 217514, -533292, 424038, 91590, -665929, 802603, 500383, 1121106, 2170021, 595752, 132292, 599389, -740599, -823757, -186367, -953422, -1582621, -720309, 359599, 1023785, 1640860, 544697, 526087]
3056E26087R23450j436715j547107J051076N31977K06801K53757j92649P07147
3047A023824N0555q66891M66146M81059j54518r85901r74076n3122J109661J052678
3037A149415L0832l7104j90782M71156K44686j80221j348863r54701N46235J450813
3027A181466K03983J79277J149718j50812j707466j709059J28497Q13512p44647
3018f55531J252O87688j76736r90035n02891J732415P02783o34250J19351P74940
3008A058986m39731o87370j167956O86429l35812O4467O67015J266183j71239
2999I40972k63197o23436l85468J30760j307994N94010O41084k1790L23552L11582
2989C40075J9088L02488l31848N21300j328914L65794q39578K48386J1756k40664
$$ y = [526087, 1449537, 12822, -1534285, -483209, 48768, 255569, 509326, 316677, 1023824, 1074379, 207488, 673634, 1154693, 1000175, 14274, -959802, -1012924, 96737, 1149415, 1180247, 1143143, 952361, 1423517, 1668203, 1487982, 139119, -815582, -269347, 1181466, 1385449, 1564726, 2714444, 2563632, 856166, -852893, -724396, 89116, -655531, -654279, 33409, -143327, -1133362, -1636253, 96162, 798945, 164695, 284046, 1058986, 619255, -68115, -1236071, -549642, -885454, -820987, -153972, 1112211, 940972, 677775, 54339, -331129, -200369, -1508363, -914353, -273269, -295059, 28493, 340075, 359163, 661651, 329803, 851103, -477811, -112017, -951595, -703209, -691453, -932117]
2979i32117J799652M12850r64581J08813K31298L28612n52336o97047J19903N2105
2969i2848Q92044l60119l16260j555387K75695M71337p46658O12252J1645M22824
2959c85475Q63373j85063p36906o38324J4306l18570j105388J451592P94129j54184
2949d00510J8477k95286j87392j79231n07434L92906Q81835j553491M49529O85398
2939f95199r73800M61886K55403j18789O92651j41068Q52223q66010l56357J581203
2929F92143n28167p68942p43114N13958J213368p93999j106496N96730J38443
2920g86076M14224o5272m45611n4895o12936K17425k85834m8295J95644P87317
2910f84309J500276K15528r18292n51780l97315p18376n71244M82448M32066K0414
$$ y = [-932117, 867535, 1280385, 315804, 424617, 655915, 984527, 432191, -264856, -144953, -92848, 799196, 439077, 122817, -1432570, -1156875, -685538, -1432196, -819944, -808299, -385475, 477898, 292835, -444071, -1082395, -1068089, -1386659, -2492047, -1040455, -246326, -400510, -382033, -677319, -864711, -1043942, -1551376, -1158470, -276635, -1830126, -1380597, -695199, -1668999, -1207113, -951710, -1070499, -377848, -518916, 333307, -532703, -889060, 692143, 163976, -604966, -1348080, -834122, 379246, -414753, -1521249, -924519, -786076, -371852, -437124, -882735, -937630, -1550566, -1333141, -1618975, -1667270, -1471626, -684309, 815967, 1031495, 113203, -438577, -835892, -1554268, -2125512, -1643064, -1210998, -1190584]
2900a190584k73011k07269Q45933N51451O35205k22606L21837l9359r11568r10859
2890a400830o58530K56763k2551l46139J751322O06814m59304J04926m66026L02410
2880c31145P05767L86597n28877o25428m10148N00757O69456R18341K81504O5326
2870A632150k11288Q2477j522865j53441J75950m51245Q08173n41762P03036M21598
2860I42783p65632K82007j70338o92620N01077K5862P20817q15430q99493O04067
2850b66900L94005l47676m83754K04895O68859J20374r58255L24035p90440L59181
2840g75676N3721l51302m47950J313815n10036J19449Q41324J397352L49495k589415
2830e99223m84197M86888n76129J44256J124840J46932r71764n56936J906243
$$ y = [-1190584, -1463595, -1670864, -824931, -273480, 361725, 139119, 460956, 421597, -489971, -1400830, -2059360, -1802597, -1825148, -2171287, -419965, 186849, -272455, -167529, -633555, -331145, 374622, 761219, 232342, -393086, -803234, -302477, 366979, 1285320, 1566824, 1632150, 1420862, 1503339, -19526, -172967, 2983, -448262, 359911, -181851, 521185, 942783, 177151, 459158, 288820, -403800, 97277, 123139, 843956, 28526, -870967, -266900, 127105, -220571, -704325, -499430, 169429, 289803, -668452, -344417, -1134857, -775676, -721955, -1073257, -1521207, -207392, -717428, -597979, 243345, 1640697, 1990192, -599223, -1083420, -596532, -1172661, -1028405, 96435, 243367, -728397, -1285333, 620910]
2821F20910o68454r33432Q0829O96745q33340p91694n06271k85482m56217J151156
2811a925250P38809K51901N00141j43179N20184k38093j442487m13727L10895
2802a840806k42459J712857L91364o38070k8939J28848r00229L71923J052168
2793F657M69468l15003j87857P62025r39143n44042o40354R8509R00734n67382
2783i56388k1241J017427j182159N66035R26267N13790O6295j834722k64143o86329
2773a855168j3920P14907j1381M82832J67570j71388q69225j25117J023218q79833
2763a537505p8946O66566l3126J37181p51116r6394J844585P66271n16306j73330
2753B27880q26984p12225N96887J81407n70635J15162l5790P45961K88273r96165
$$ y = [620910, -47544, -980976, -900147, -203402, -1036742, -1828436, -2334707, -2620189, -3076406, -1925250, -1186441, -934540, -434399, -577578, -57394, -295487, -1737974, -2151701, -1840806, -2083265, -370408, 20956, -617114, -646053, -517205, -1417434, -1045511, 6657, 476125, 161122, -26735, 735290, -203853, -747895, -1388249, -1289740, -389006, -956388, -977629, 39798, -1142361, -576326, 349941, 863731, 930026, -904696, -1168839, -1855168, -1869088, -1154181, -1165562, -682730, -515160, -686548, -1555773, -1680890, -657672, -1537505, -1616451, -949885, -983011, -845830, -1596946, -1693340, 151245, 917516, 401210, 227880, -599104, -1311329, -714442, -533035, -1103670, -988508, -1024298, -278337, 9936, -986229]
2743i86229j90019R07572P24744k25757m65701m05664l01791m99150O33193Q31690
2733B2888L71787M4888j092141j2300J45450n93295j4053K43287j031479O91789
2723a223179R34556k47220j4119m51200k27781K75252m38004O22111J127024o20672
2713b63232O57710l23435l95210q96124l14956L88177j346093R45495K650281
2704A102613k26668K53954q40085o22128J329368m17699j021977J054797l26967
2695B85208j477622K52802j392013J382092P42999m49373M46269L76745n40062
2686c72955p51925K69113M15805j005554l18120P84808O40228J239648n73391
2677C27657o75565k84278N74191j56856K7864N8705o25540n65648k93439m45579
$$ y = [-986229, -1176248, -268676, 456068, 230311, -235390, -641054, -942845, -1441995, -808802, 22888, 394675, 439563, -652578, -664878, -519428, -1112723, -1126776, -883489, -1914968, -1223179, -288623, -535843, -549962, -1001162, -1228943, -953691, -1391695, -769584, 357440, -263232, 394478, 71043, -324167, -1220291, -1535247, -1147070, -2493163, -1547668, 1102613, 875945, 1129899, 289814, -332314, 997054, 579355, -442622, 612175, 285208, -1192414, -939612, -2331625, -949533, -206534, -655907, -209638, 167107, -372955, -1124880, -855767, -439962, -1445516, -1763636, -978828, -338600, 901048, 327657, -347908, -632186, -57995, -214851, -186987, -128282, -753822, -1319470, -1612909, -2058488]
2667b058488J285967R95182K6982r4743N5335k2790p71763o9242j046713l24353
2657b024626P57262K055307m15029o08110o2131K10585K39597j4577r51832r83860
2647a797414P51372L25278J105290l16449m46258m34275M18588k84268J575759
2638H97623K96852j221832k05273Q5937p03622m13095J40087J318525L89654j196791
2628f11935Q02876K30463l91996j320453j41240k59074J732284o38362p19395
2619a316832j72498J037932P51978r52149R1315J82794n93826l85181R85279k20746
2609e91934k31289K08666N28873k8079k49994j304517K89510P9287j12433N10012
2599i01898L71593n38454k81830J508859K39439m08922O45010p0843p28938O50266
$$ y = [-2058488, -772521, 222661, 249643, 154900, 210235, 187445, -584318, -653560, -1700273, -2024626, -1267364, 787943, 372914, -235196, -297327, -86742, 152855, 138278, -813554, -1797414, -1046042, -720764, 384526, 68077, -378181, -812456, -393868, -678136, 897623, 1194475, -27357, -232630, -146693, -850315, -1263410, -1123323, 195202, 584856, -611935, 190941, 421404, 29408, -1291045, -1432285, -1691359, 40925, -597437, -1316832, -1489330, -451398, 300580, -651569, -560254, -377460, -971286, -1356467, -371188, -591934, -823223, -614557, -85684, -113763, -363757, -1668274, -1378764, -1299477, -1411910, -901898, -530305, -1068759, -1350589, 158270, 397709, -11213, 633797, 562954, -165984, 484282]
2589D84282m09976O25751o3228o15659q66797m13067Q73960o45820n80643K43300
2579a367897J335601j64465k27684l44044m34989o64232l91885O18243K087652
2570D46300m66037l35622j6434K16336J157073m87324j325347p63464N21562M98899
2560e54058o45951l75611k26016m13915O44390P37721J039086j192284J77079
2551h09559O21757m07577r25188P8378L29260j10458o80445J26278J051210Q83345
2541A57001Q6992n50124k72825m80398J163494r99231j078925r1120M35135J224168
2531d05833J01888m29823O00932J87355p4294j90001j267566R15854J32195l07437
2521g36730K0332P31954M5674l70682j493186P72473P14885l16444j93092q02581
$$ y = [484282, 74306, 700057, 636829, 21170, -845627, -1258694, -384734, -1030554, -1611197, -1367897, -32296, -196761, -424445, -768489, -1203478, -1867710, -2259595, -1641352, 446300, -19737, -355359, -371793, -155457, 1001616, 514292, -811055, -1574519, -1052957, -554058, -1200009, -1575620, -1801636, -2215551, -1571161, -833440, 205646, -986638, -809559, -187802, -595379, -1520567, -1442189, -1112929, -1223387, -1903832, -1777554, -726344, 157001, 243993, -306131, -578956, -1059354, 104140, -895091, -1974016, -2065136, -1630001, -405833, -303945, -733768, -132836, 54519, -19775, -209776, -1477342, -561488, -429293, -736730, -716398, 15556, 61230, -309452, -1802638, -1030165, -315280, -631724, -824816, -1627397]
2511a627397O01382j016117O58273J306283J77291o94246j115377n56454Q73426
2502a392936M10374r56795J112952K251552l61720j390352j137663L32330J475991
2493C43733p66926n34870O43105N35343j509947o07139J429106R5082N31257O5136
2483B23880j099394R94140N14129k055678j276800J56354J115143J376677L7081
2474a4468n24058M75558K66995o44211M96304p47182p81837k37508J060540j35146
2464g85013k8734M44744r58486M27318K50229j95604O49898K83299n82635P58168
2454B63184K20094K3793j205738m55256q03884M68449J695506J43764J62019l21934
2444A89997q68324K27979L79840m20717k43493l56238O91918p65916q63731J43681
$$ y = [-1627397, -1026015, -2042132, -1383859, -77576, 99715, -594531, -1709908, -2266362, -1392936, -982562, -1939357, -826405, 1425147, 1063427, -326925, -1464588, -1132258, 343733, -423193, -958063, -314958, 220385, -1289562, -1896701, -467595, -372513, 158744, 223880, -875514, 118626, 632755, -1422923, -2699723, -2543369, -1428226, -51549, -14468, -538526, -62968, 204027, -440184, 56120, -691062, -1472899, -1710407, -649867, -785013, -813747, -369003, -1327489, -900171, -649942, -845546, -195648, 87651, -494984, 263184, 483278, 507071, -698667, -1153923, -1957807, -1489358, 206148, 349912, 511931, 189997, -678327, -450348, -70508, -491225, -734718, -1090956, -399038, -1164954, -2028685, -1885004]
2434a885004N23811L19073m89156j56643j18221N75893R40681M33842o47959n64462
2424a068145J07008m79005o92928N75708Q3996K29936Q8364J499386k88140j312512
2414a256332M9355N06768k21820k99651J282722j39378j360583l79063l6057K048213
2404A94174k26786p08146j61978P46370K32237l43749P68973m91743j166936Q0777
2394a076807P35404P30242J5285k238636K25548J110169m80273p12620L77181
2385a314507O75417k54707k84706J194352j018691p98039Q38337N84362o0574
2376d38756p77211J31859J048746n66780j82133J682630J45887j37494j488172
2367e81424l54560L19348O77198N98424l17888o90928n11337N88218O57047o19845
$$ y = [-1885004, -1361193, -1042120, -1531276, -1687919, -1806140, -1230247, -289566, 144276, -503683, -1068145, -961137, -1440142, -2133070, -1557362, -1473366, -1243430, -1155066, 344320, 56180, -1256332, -1206977, -700209, -922029, -1221680, 61042, -78336, -1438919, -1817982, -1854039, 194174, -32612, -740758, -902736, -156366, 75871, -267878, 501095, 9352, -1157584, -1076807, -341403, 388839, 404124, -1834512, -1608964, -498795, -979068, -1691688, -1314507, -639090, -893797, -1178503, 15849, -1002842, -1800881, -962544, -378182, -438756, -1215967, -1084108, -35362, -602142, -784275, 898355, 1044242, 906748, -581424, -935984, -616636, 60562, 658986, 341098, -349830, -861167, -272949, 384098, -235747]
2357b35747o35498M21026k53235Q04432o53162O41111r0119k47978r94456J4248
2347a229378R28400L04924k07757P45353j385340q05916L71827Q23685j49491
2338f03693j98838K07609l56892K65330n6531R1589M43887O79056o00943P82864
2328F53438n14696l86748O64116P74189J71365K96319m75695J8958p37094k038641
2318a574489j76450J064419M50014M5205O00880l66375o47139P401J229649M9442
2308F82557m75963J26807l13622o13864j27222p30237J051911J05969m28526R47999
2298B25809j053956j081771o87782Q61147M48656P88455J631035L83314j691863
2289a76956j471406k82628J716570o23029l07135K02387L17886Q12680M9098q8498
$$ y = [-235747, -871245, -450219, -703454, 100978, -552184, 88927, -1192, -249170, -1243626, -1229378, -300978, 3946, -203811, 541542, -843798, -1649714, -1277887, -454202, -603693, -802531, -594922, -951814, -686484, -743015, -651426, -207539, 471517, -129426, 653438, 138742, -248006, 416110, 1190299, 1361664, 1657983, 1182288, 1201246, 464152, -1574489, -1750939, -686520, -236506, -191301, 409579, 43204, -603935, -596534, 633115, 682557, 206594, 333401, 19779, -594085, -721307, -1451544, -399633, -293664, -722190, 225809, -828147, -1909918, -2597700, -1736553, -1287897, -499442, 1131593, 1514907, -176956, -1648362, -1930990, -214420, -837449, -1144584, -942197, -624311, 188369, 237467, 148969]
2279A48969K03165r38432j96738P68739O63405J53595k411811m38980N05024J297006
2269b46058N43484L51315q21953k00188m5219l51975o6121K33273K28551l07313
2259f82204J91192M82736J117538l73891j149925n95097j60697k70625k32069
2250a673042L77974J340313o7315L57827K43791n68340J90014j144723N72725
2241c70776P53692j250812n30387M45997J455551L53137j192439K79832J417806
2232A361601r69126J6815M15627j167295m05551p30535K02830Q93752O8331j35970
2222d49521j35239o04548N88377R03954m59598r76355k38096Q94345q68122l833
2212a348636J043748K70837q70963L29632J53466P74476m8018m28715Q20252J044648
$$ y = [148969, 352134, -586298, -783036, -14297, 649108, 802703, -1609108, -2048088, -1543064, -246058, 297426, 648741, -173212, -373400, -418619, -770594, -836715, -603442, -374891, -682204, -491012, -8276, 1109262, 735371, -414554, -1009651, -1170348, -1440973, -1673042, -1295068, 45245, -22070, 335757, 579548, 11208, 201222, -943501, -370776, 382916, -867896, -1398283, -952286, 503265, 856402, -336037, -56205, 1361601, 392475, 409290, 824917, -342378, -747929, -1478464, -1275634, -381882, -313551, -449521, -584760, -1189308, -600931, 303023, -156575, -1132930, -1371026, -476681, -1344803, -1348636, -304888, -34051, -905014, -575382, -421916, 352560, 304542, -124173, 696079, 1740727]
2202A740727j328447o99613O97348p26281N75912j36684r22779j72541J048828
2193G6470J58488N67534j69457M08791P18754n45405q10523N44094M98439j849312
2183d02127o53681R76523N39320p567m78944K0142K23809q81726j77379J46194
2173f95436K67860J69217o71491Q99514J219302L16821k39602j098950l52951
2164a85716Q65150j271793m62714L42231O01515M31866R3859o0859M27139j078408
2154b97730j85834P42440k70161R02482j53428M6196k97644j068208O006Q05599
2144B29718n52950K87674J50864q49247O70797K31454K64096J90053j90996j29136
2134C02327J07551N61971j01912j42709R09636Q55103q48359j72316q99793J60949
$$ y = [1740727, 412280, -287333, 410015, -316266, 259646, 122962, -799817, -972358, 76470, 234958, 802492, 633035, 1041826, 1760580, 1215175, 404652, 948746, 1447185, -402127, -1055808, -79285, 460035, 452468, -26476, -6334, 217475, -664251, -841630, -695436, -427576, -258359, -929850, -30336, 1188966, 1505787, 1266185, 167235, -185716, 679434, -592359, -1055073, -712842, -111327, 320539, 414398, 353539, 780678, -297730, -483564, 258876, -11285, 891197, 737769, 783965, 486321, -581887, -575881, 229718, -323232, -35558, 115306, -733941, -63144, 168310, 432406, 622459, 431463, 302327, 409878, 971849, 869937, 727228, 1636864, 2491967, 1643608, 1471292, 571499, 732448]
2124G32448K183075m1647n34670K17673o69478j436591K98037L80605M97733P65905
2114B393090l71123p85632M00479P27410k38225l51741O86196L0147Q13386K00153
2104C504140j657324l19502O39129O52514J37694l1800M21056J088768M69708
2095D904383K31637m26539P50603P63543N5083J91348o59726l65506N55851l06254
2085E694423N18137J652015N92071r32413M20253J113741J501738M09756k73375
2076A0696346K74652J328288J517891M87662R65701L01799J115076J78464O09256
2067A7475135K076197J457133j26353M97477R77109L83235K01733k514564j458777
2058A8968325j41758m4044j062225r10859m2536k195370k211371j975152j410822
$$ y = [732448, 2915523, 2873876, 2339206, 2556879, 1887401, 450810, 748847, 1129452, 1627185, 2393090, 2021967, 1236335, 1636814, 2364224, 2125999, 1774258, 2460454, 2490601, 3303987, 3504140, 1846816, 1527314, 2166443, 2818957, 2956651, 2924851, 3345907, 4434675, 4904383, 5136020, 4709481, 5460084, 6223627, 6278710, 6470058, 5810332, 5444826, 6000677, 5694423, 6212560, 7864575, 8456646, 7524233, 7944486, 9058227, 10559965, 10969721, 10696346, 10970998, 12299286, 13817177, 14304839, 15270540, 15572339, 16687415, 16865879, 17475135, 19551332, 21008465, 20882112, 21379589, 22356698, 22739933, 22941666, 20427102, 18968325, 18826567, 18782523, 17720298, 16809439, 16766903, 14571533, 12360162, 10385010, 8974188]
2049H974188P13354l45631r14562L33805l4442j039744j686934q95263j36313
2040D968458l22154n10688k045q41024m83786r7794q98990j06231L06482K14675
2030B226903k35777J19945Q62279J07780j87887r63544J67075l68857o45209J08007
2020A190715J82155M49458n43998l52170O84581p70055o95381J397698N13603
2011B056606N38540l11233j637035k94288N15181Q41663k80940j005775r5078
2002C27641O67838j1157k81426q40800R60085M23017r85765K0733R9578J14777
1992D94521k95290j25830o00506R47414J569951l95695j075315l39187j8397N09600
1982F71266O60166j191828q08876K40234j89139m97936l08883l4963J446190j38420
$$ y = [8974188, 9687542, 9341911, 8427349, 8761154, 8726712, 7686968, 6000034, 5104771, 4968458, 4646304, 4135616, 4133571, 3292547, 2808761, 2710967, 1811977, 1705746, 2012228, 2226903, 1991126, 2111071, 2973350, 3081130, 2893243, 1929699, 2096774, 1727917, 1082708, 1190715, 1372870, 1822328, 1278330, 926160, 1610741, 840686, 145305, 1543003, 2056606, 2595146, 2283913, 646878, 352590, 867771, 1709434, 1428494, 422719, 327641, 995479, 984322, 702896, -137904, 822181, 1245198, 259433, 280166, 379744, 494521, 199231, 73401, -527105, 420309, 1990260, 1594565, 519250, 180063, 161666, 671266, 1331432, 139604, -669272, -429038, -618177, -1116113, -1424996, -1459959, -13769, -152189]
1972a52189n4523O96020K48893Q48147j020735P7587p06987l95528j15444O94661
1962A19902R4903M8801J089647k81477j873416K13378k98030J06176P42450O55457
1952F17791j79805m49792r50298J00476O72762k65975M18203K37924J43683p80465
1942d35496J76666n44978K03563k89801L20198p491Q87033P34827j858362j485170
1932b299011J086030O38731K06737j179805j51181J262758m09581P66225p37945
1923h17042N97776N92763l72047r55575l58943L64715J065764m74703j156879
1914a514171K71787K080383o25474j186757P57985o02893K69208J28259J46115
1905b75558j029674J41606J38674O89329L84007j37320n42778M27340j675657
$$ y = [-152189, -206712, 489308, 738201, 1586348, 565613, 643200, -63787, -459315, -574759, 119902, 214805, 263606, 1353253, 1071776, -801640, -588262, -886292, -780116, -37666, 617791, 437986, -11806, -962104, -861628, -188866, -454841, -36638, 201286, 344969, -435496, -258830, -803808, -600245, -890046, -569848, -577339, 309694, 1044521, -813841, -2299011, -1212981, -574250, -367513, -1547318, -1698499, -435741, -845322, -79097, -817042, -219266, 373497, 1450, -954125, -1313068, -948353, 117411, -357292, -1514171, -1242384, 837999, 212525, -974232, -216247, -819140, -549932, -421673, -275558, -1305232, -1163626, -1024952, -335623, 48384, -88936, -631714, -204374, -1880031]
1896a880031L55242J762420R03675p3627o87253k33472o46234j328196m42402
1887b269878J407424k92268L23262O55210K006291J18645j485619j169316L45895
1878c60354J97063p61084k64390K36517m49695j12045N46628M91528j148918n28892
1868b153642Q60921M17717J575891l07874j055522m47926R1969N89066n55535
1859i84935j90060J226707m40860j285431p79352K262975J004544r53498J52174
1850A2264O30538l95751j488822l08825J414004N73822r54117k35728K72245j71950
1840f52320l94508O60800J656270Q94628j590082j439547K18490P51612l23207
1831b17864r70520j10669R40549q07656J200960O28279j068244N52722o76223
$$ y = [-1880031, -1524789, 237631, 1141306, 1067679, 380426, 146954, -499280, -1827476, -2269878, -862454, -1154722, -831460, -176250, 1830041, 1948686, 463067, -706249, -360354, -163291, -924375, -1188765, -952248, -1401943, -1513988, -967360, -475832, -1624750, -2153642, -1292721, -875004, 700887, 393013, -662509, -1110435, -1018466, -429400, -984935, -1174995, 51712, -389148, -1674579, -2453931, -190956, 813588, -139910, 12264, 642802, 247051, -1241771, -1550596, -136592, 437230, -516887, -752615, -480370, -652320, -1046828, -386028, 1270242, 2164870, 574788, -864759, -646269, 105343, -217864, -1188384, -1299053, -358504, -1166160, 34800, 663079, -405165, 147557, -528666]
1822e28666L31122n84461l31248J207879J96275r00579n26359J194526Q66564
1813I25053j228390n03331M5147k67168q53557m75013J41984P57849N75201o80983
1803a563208J87348P71732p54014o37528K90469L87580J177001J83127J35312
1794A77819K80891r14692j003624J68164J332418M50844o0060n27179p23609k1434
1784h40462q59987J322825J328241J059270n37539j208178k94240Q46114P88913
1775A604957J22559j179677k88691J31057j112400L48996j89285P16776P78400
1766I32692l37922n01731o2115J32257j51757j149322J092164J497553j082687
1757C69132q71123Q4339M58588L96370l68542p20109N6533m78170O16178k56675
$$ y = [-528666, -197544, -782005, -1113253, 94626, 290901, -609678, -1136037, 58489, 925053, -303337, -806668, -761521, -1028689, -1882246, -2357259, -2215275, -1457426, -882225, -1563208, -1375860, -604128, -1358142, -1995670, -1705201, -1317621, -140620, 42507, 177819, 458710, -455982, -1459606, -1291442, 40976, 491820, 431760, -95419, -819028, -840462, -1700449, -377624, 950617, 2009887, 1472348, 264170, -30070, 816044, 1604957, 1727516, 547839, 259148, 390205, -722195, -373199, -562484, 154292, 932692, 594770, 93039, 30924, 163181, 11424, -1137898, -45734, 1451819, 369132, -501991, -417652, 40936, 437306, 68764, -651345, -594812, -1072982, -456804, -713479]
1747g13479n10817K58212K48662O4288R1033L40078j2976j381943j50260P52960
1737a014242R05720M98968k28908O15091r05984J35065Q22082o58374j395071
1728a225653N39068l12767N99667p77575l97060N13472j280617P22839J245250
1719c73376K68450R3488j64729R78073K56636j666269L02235k0136r41565r8914
1709a366107J177252N85967K55276j411844p81615O32311J348794N08776o28401
1700C20409q00492Q5795j10739J02851q4256q79693J390234j04151j234291N02030
1690h12303O34986M57032Q51711J08812N37663l56741j770487j090002O22927
1681h16402O30101l09177K7039j42041l29236m38905l98420J555734J386012l14404
$$ y = [-713479, -1224296, -966084, -717422, -653134, -562101, -222023, -234999, -1616942, -1767202, -1014242, -108522, 390446, 161538, 776629, -129355, 5710, 827792, 169418, -1225653, -686585, -999352, -399685, -1177260, -1574320, -1060848, -2341465, -1618626, -373376, -104926, -11438, -176167, 801906, 1058542, -607727, -305492, -325628, -1267193, -1366107, -188855, 397112, 652388, -759456, -1541071, -908760, 440034, 948810, 320409, -480083, -394288, -505027, -402176, -486432, -1366125, 24109, -80042, -1314333, -812303, -177317, 279715, 1131426, 1240238, 1777901, 1421160, -349327, -1439329, -816402, -186301, -495478, -468439, -610480, -939716, -1378621, -1777041, -221307, 1164705, 850301]
1671H50301l30133n14430L74655j040590o58873J085245J079543j20798j213219
1662d88299o76539O65821O85721j017035J99572O79478l60391j168360J069557
1653d10475j9994j31366o10015O04559J751219O3370o58274R83751j44120p19359
1643G09296j047624k28404K03815q30369Q10507k53638j86221J48053o12520L41216
1633i45889J028535l97417j88518k4661L733R0346j43571n31773J87816R29710
1623H311J70881j397260K31992P97473n56085J92362P08267l46733K71704l34389
1613b53477N6622L87001p75266k26282J147356P54345n63804L37981K5026Q00628
1603A690130j046679k338157m91174J145878N31977j038732J29332J958977n293
$$ y = [850301, 520168, 5738, 380393, -660197, -1319070, -233825, 845718, 724920, -488299, -1164838, -499017, 186704, -830331, -630759, 48719, -311672, -1480032, -410475, -430469, -561835, -1171850, -567291, 1183928, 1247298, 589024, 1572775, 1428655, 709296, -338328, -566732, -362917, -1193286, -382779, -636417, -822638, -674585, -1287105, -945889, 82646, -314771, -503289, -527950, -524217, -433871, -577442, -1109215, -921399, 8311, 179192, -1218068, -986076, -188603, -744688, -552326, 155941, -190792, 80912, -253477, -196855, 190146, -585120, -811402, 335954, 1090299, 526495, 864476, 889502, 1690130, 643451, -1694706, -2185880, -1040002, -508025, -1546757, -1417425, 541552, 536259]
1594E36259n23834n0573l06005O75234j23946m7859l32021j060813L98214R70865
1584A35521j37257R74q80097k74727k31082P65501P19999k0844L13099L3183p48934
1573c24664J92516n34790J40518J024051M08857K54421j104413p08987k7026k93988
1563i73505r22855J731271K083257J1464j035577k93905K6212p74032q54680P51357
1553b50993j44466n90545M13835K165648J051869k576199j471675L95080R42068
1544f5378p7497m31687l82778O47384J97776M63173M7525L59081K32836L02632
1534A293067l07175l06776j61212P6599N32668m26256l06792Q4230J0073N10967
1524I99393m51181n34827O0593j09679k95633L85775l17343j66970J81620p53623
$$ y = [536259, 12425, -38148, -344153, 331081, 207135, 159276, -172745, -1233558, -835344, 135521, -1736, -762, -880859, -1155586, -1386668, -621167, 98832, 77988, 391087, 424270, -324664, -132148, -666938, -526420, 497631, 906488, 1160909, 56496, -652491, -679517, -973505, -1896360, -165089, 1918168, 1929632, 894055, 600150, 626362, -147670, -1002350, -250993, -395459, -986004, -572169, 1593479, 2645348, 69149, -1402526, -1007446, -65378, -142875, -574562, -957340, -309956, -112180, 350993, 398518, 757599, 990435, 1293067, 985892, 679116, 517904, 594503, 1127171, 700915, 394123, 478353, 488426, 999393, 548212, 13385, 73978, -35701, -331334, 54441, -262902, -429872, -248252, -1001875]
1514a001875K22764k40663J548420P83974j389319q43432M90302J164295l4286
1505G00180n90838P30362m6878j374890L53407J290148l09968n73996j71248K46499
1495B52778n61353n78012P79501K92900p1944m93995O24570M05425j159326N2881
1485d56575N26731j36979k43460R35953M61133p21649n8435L55276m75294N90393
1475G77094j002759l85627k15790n19533l13713O40330Q64538M33742L77570P32547
1465A388399j86603j164430p30588j191214M31253J48264N09999J62669J021166
1456C88915O53649L03330l70769j03198r88366j10531J35468p06877N75444n7294
1446b80229O43872J21709P48211J00478L72516q61959o68075r9354P06768o83540
$$ y = [-1001875, -779111, -1019774, 528646, 1312620, -76699, -920131, -429829, 734466, 700180, 109342, 839704, 792826, -582064, -228657, 1061491, 751523, 177527, 6279, 252778, -308575, -886587, -107086, 185814, 113870, -380125, 244445, 649870, -509456, -456575, 70156, -66823, -310283, 625670, 1086803, 365154, 306719, 661995, 186701, 777094, -225665, -611292, -827082, -1346615, -1660328, -1019998, -155460, 278282, 655852, 1388399, 1201796, 37366, -693222, -1884436, -1453183, -1304919, -794920, -632251, 388915, 1042564, 1345894, 975125, 871927, -116439, -226970, -91502, -798379, -222935, -280229, 363643, 485352, 1233563, 1334041, 1706557, 844598, 176523, 77169, 783937, 100397]
1436A00397n60931L51144p86913L85982J001022J097841r66999j92935N62330
1427I90938j96974j163923p9603P24547J204284j69182q13616J0656j60300j025855
1417f79028L82809J262186M33440L42150L0594o65714q83031j29041j07758R43827
1407I30434L90166j311226n67576P49295r42930L51476J504005J152448Q6435
1398B342527j5790k166125q56375k11390P78418J172551l63660p43210M54225
1389C91171N30171j796137m34954J05767O13065P09267L02843j449795P54374
1380b74228P64106L63868K71902o17620j260620R54841j43264j123535j16259
1371a180809J12115J055131K87426n77604j337295L16236J274489n47091o88159
$$ y = [100397, -460534, -109390, -896303, -510321, 490701, 1588542, 621543, 428608, 990938, 793964, -369959, -449562, 274985, 1479269, 1310087, 496471, 507127, 346827, -679028, -296219, 965967, 1399407, 1741557, 1772151, 1106437, 223406, 94365, -13393, 930434, 1320600, 9374, -558202, 191093, -751837, -400361, 1103644, 2256092, 2342527, 2326737, 160612, -695763, -907153, -128735, 1043816, 680156, -63054, 391171, 921342, -874795, -1309749, -1203982, -590917, 118350, 421193, -1028602, -274228, 489878, 853746, 1125648, 508028, -752592, 202249, 58985, -1064550, -1180809, -1068694, -13563, 273863, -303741, -1641036, -1324800, -50311, -597402, -1285561]
1362a285561J81948l60496N13023q4258J269731J330703j046628m87516P04467
1353G35413K84968k9652m06377q38950k30815o71309O78206J255951j79703p74203
1343a76471j204824M70683K129754J547032j088395j431922P61150M75959l54999
1334A127967m74541k46255l08464N5137O39088O39241M71400j4550j136252p26154
1324B6617m09848j74081R4375p83964j97217J012742K17323J171678J88352k19312
1314I26665N85553Q42483j72387j277716q76281k17464P775l778j67253J610008
1304A257605j58153j260196L84997J30121k43154m88342L33944L59849k04261
1295A12410n59693n36884N42235J181129j95226n7883k64493N04897K20700k55381
$$ y = [-1285561, -1103613, -1464109, -951086, -1035344, 234387, 1565090, 518462, 30946, 735413, 1020381, 990729, 584352, -254598, -485413, -1156722, -478516, 777435, 597732, -176471, -1381295, -910612, 1219142, 2766174, 1677779, 245857, 1007007, 1482966, 1127967, 653426, 407171, 98707, 153844, 792932, 1432173, 1903573, 1889023, 752771, 26617, -383231, -557312, -462937, -1246901, -1444118, -431376, -214053, 957625, 1145977, 926665, 1512218, 2354701, 2182314, 904598, 28317, -189147, -181372, -185150, -352403, 1257605, 1099452, -160744, 224253, 354374, 111220, -377122, -43178, 316671, 112410, -447283, -984167, -441932, 739197, 543971, 486088, 221595, 726492, 947192, 691811]
1285F91811q47841L98879j43928j043409j10393m71120M18209Q56154P6350K33631
1275E8343O7523N74603m63949m66381N35149Q21331l60745o90615l64304r97160
1265a286205N38503l96919P73436J098719j000737J60426j86282o86553N81587
1256d04025O57785M61498L67484j138824L99194k58373j72311p15701m31756O75511
1246e59518Q20694L63784N19292n02561r04078m88649n80786J9378N82408Q6824
1236f43212l50226K14543n5639J791196j333528p61451m47914J833015N24701
1227G71485j056037o68779l25253M63115O54381O79107j29463M00109l35864j53296
1217B99505j039626j193564n99216J67410L61710J315755N13641j05272q24434
$$ y = [691811, -156030, 242849, 98921, -944488, -1054881, -1526001, -1107792, -251638, -175288, 58343, 125866, 700469, 236520, -229861, 305288, 1126619, 765874, 75259, -289045, -1286205, -747702, -1144621, -371185, 727534, -273203, -112777, -299059, -985612, -404025, 253760, 715258, 1082742, -56082, 343112, 84739, -87572, -803273, -1235029, -559518, 261176, 624960, 1144252, 641691, -262387, -751036, -1331822, -1312444, -730036, -643212, -993438, -778895, -834534, 956662, -376866, -1138317, -1586231, 246784, 771485, -284552, -953331, -1278584, -815469, -161088, 518019, 388556, 788665, 452801, 299505, -740121, -1933685, -2532901, -2365491, -2003781, -688026, -174385, -279657, -1104091]
1208a104091M7412m43597K88927J177849J77252r30362m28453m73497l24664Q51095
1198a162129p90364L34314J110778N75842M27004k18157j246830o70217k71425
1189a911184P96613L22940Q46107R46578m90937n71010p92874M9909L30336k14416
1179f87938Q20711R21928l46425j009957o90575q32857j128190N37655R10507
1170a505141J244700K194012L38112n56690j745293p54782k51699j450226l12865
1161b799872J360604J677942k11109o69045l28342R9143L24451K89750N03688
1152B47210L19757q06224M85338j56784q16475l34701N10818m07288o1414n8666
1142a078429P42623K82214Q35503P19112j741765k81696K28773l17560p02017
$$ y = [-1104091, -1056679, -1500276, -1211349, -33500, 143752, -786610, -1215063, -1688560, -2013224, -1162129, -1952493, -1618179, -507401, 68441, 495445, 277288, -969542, -1639759, -1911184, -1114571, -791631, 54476, 1001054, 510117, -60893, -853767, -803858, -473522, -687938, 132773, 1054701, 708276, -301681, -992256, -1825113, -2953303, -2415648, -1505141, -260441, 1933571, 2271683, 1714993, -30300, -785082, -1036781, -2487007, -2799872, -1439268, 238674, 27565, -641480, -969822, -870679, -546228, -256478, 247210, 566967, -239257, 246081, 89297, -727178, -1061879, -551061, -958349, -1019763, -1078429, -335806, -53592, 781911, 1501023, -240742, -522438, -293665, -611225, -1313242]
1133a313242L10924P21853J044100j339168l63432N34313J013179l04548j041079
1124g37100k68284m47846M24869L68467J79888P35083Q62533q89171j02708m30258
1114c04527m1201j64186J049750K19369k24628J347705r20396q90939j65262k67993
1104c62308J176696M33631j395136K41203l07433O81311J14805j36427m39817
1095F525r07601Q46674P73522l04472Q21896o25593j832917p13784N29102J386708
1085a9940P79410O07072J17172j021361m55109J476669r40536k032732j334226
1076b823581J106609J204492K40166N59051N20549m44842q25951K17514L06506
$$ y = [-1313242, -1002318, -280465, 763635, -575533, -938965, -404652, 608527, 303979, -737100, -1005384, -1453230, -1028361, -659894, -480006, 255077, 1117610, 228439, 125731, -304527, -345728, -509914, 539836, 759205, 534577, 1882282, 961886, 70947, -94315, -362308, 814388, 1248019, -147117, 94086, -213347, 467964, 582769, 446342, 6525, -901076, -54402, 719120, 414648, 1236544, 610951, -1221966, -1935750, -1406648, -19940, 759470, 1366542, 1483714, 462353, 7244, 1483913, 543377, -1489355, -2823581, -1716972, -512480, -272314, 286737, 807286, 362444, -463507, -245993, 60513]
$$ [...]
##END NTUPLES=NMR SPECTRUM
##END=
